##TITLE=abcd
##JCAMPDX= 6.0         $$ Bruker NMR JCAMP-DX V2.0
##DATA TYPE= NMR SPECTRUM
##DATA CLASS= NTUPLES
##ORIGIN= UXNMR, Bruker Analytische Messtechnik GmbH
##OWNER= root
$$ XWIN-NMR		Version 3.5
$$ Thu Aug 13 16:25:15 2026 Russian Standard Time (UT+4h)  servis@DPX200
##.OBSERVE FREQUENCY= 200.131235884673
##.OBSERVE NUCLEUS= ^1H
##.ACQUISITION MODE= SIMULTANEOUS
##.ACQUISITION SCHEME= undefined
##.AVERAGES= 32
##.DIGITISER RES= 18
##SPECTROMETER/DATA SYSTEM= spect
##.PULSE SEQUENCE= zg
##.SOLVENT NAME= D2O
##.SHIFT REFERENCE= (INTERNAL, D2O, 0, 16.4885)
##AUDIT TRAIL= $$ (NUMBER, WHEN, WHO, WHERE, WHAT)
$$ ##TITLE= Audit trail, XWIN-NMR		Version 3.5
$$ ##JCAMPDX= 5.01
$$ ##ORIGIN= Bruker BioSpin GmbH
$$ ##OWNER= servis
$$ F:\spectra/data/av/nmr/H1/1/pdata/1/auditp.txt
$$ ##AUDIT TRAIL=  $$ (NUMBER, WHEN, WHO, WHERE, WHAT)
(   1,<2026-08-13 16:22:36.43 +0400>,<servis>,<DPX200>,
      <created by zg, POWCHK disabled, PULCHK disabled
       configuration hash MD5:
       00 E9 B6 7A A2 85 ED C7 34 08 36 98 17 FE 4E 26
       data hash MD5: 32K
       36 D3 85 D7 00 72 DE A6 59 58 43 91 F8 3E FF 39>)
(   2,<2026-08-13 16:24:45.23 +0400>,<servis>,<DPX200>,
      <Start of raw data processing
       efp BC_mod = 2 LB = 0.05 FT_mod = 6 PKNL = 1 PHC0 = -413.9518 PHC1 = 3.101563 SI = 16K 
       data hash MD5: 16K
       D3 41 EA 5B 00 C3 0A F0 A6 74 07 F5 29 28 42 CD>)
(   3,<2026-08-13 16:24:55.10 +0400>,<servis>,<DPX200>,
      <pk PHC0 = -4 PHC1 = 0 
       data hash MD5: 16K
       73 40 92 24 82 E5 56 1B 81 DB 74 A0 44 F1 53 D0>)
$$ ##END=
$$ 
$$ hash MD5
$$ 46 A6 0F 66 7D CB 48 BB 83 6B 77 C6 F7 02 73 3A
##$RELAX= 
##$RELAX= 
##$RELAX= 
##$RELAX= 
##$RELAX= 
##$RELAX= 
##$RELAX= 
##$RELAX= 
$$ Bruker specific parameters
$$ --------------------------
##$DU= <F:\spectra>
##$EXPNO= 1
##$NAME= <H1>
##$PROCNO= 1
##$TYPE= <nmr>
##$USER= <av>
##$AMP= (0..31)
100 100 100 100 100 100 100 100 100 100 100 100 100 100 100 100 100 100 
100 100 100 100 100 100 100 100 100 100 100 100 100 100 
##$AQSEQ= 0
##$AQ_mod= 1
##$AUNM= <au_zg>
##$AUTOPOS= <>
##$BF1= 200.13
##$BF2= 200.13
##$BF3= 200.13
##$BF4= 200.13
##$BF5= 500.13
##$BF6= 500.13
##$BF7= 500.13
##$BF8= 500.13
##$BYTORDA= 1
##$CFDGTYP= 0
##$CFRGTYP= 5
##$CHEMSTR= <none>
##$CNST= (0..31)
1 1 145 1 1 1 1 1 1 1 1 1 1 1 1 1 1 1 1 1 1 1 1 1 1 1 1 1 1 1 1 1 
##$CPDPRG= <>
##$CPDPRG1= <>
##$CPDPRG2= <>
##$CPDPRG3= <>
##$CPDPRG4= <mlev>
##$CPDPRG5= <mlev>
##$CPDPRG6= <mlev>
##$CPDPRG7= <mlev>
##$CPDPRG8= <mlev>
##$CPDPRGB= <>
##$CPDPRGT= <>
##$D= (0..31)
0 2 0 0 0 0 0 0 0 0.06 0 0 0 0 0 0 0.0002 0 0 0 0 0 0 0 0 0 0 0 0 0 0 
0 
##$DATE= 1786623756
##$DBL= (0..7)
120 120 120 120 120 120 120 120 
##$DBP= (0..7)
150 150 150 150 150 150 150 150 
##$DBP07= 0
##$DBPNAM0= <>
##$DBPNAM1= <>
##$DBPNAM2= <>
##$DBPNAM3= <>
##$DBPNAM4= <>
##$DBPNAM5= <>
##$DBPNAM6= <>
##$DBPNAM7= <>
##$DBPOAL= (0..7)
0.5 0.5 0.5 0.5 0.5 0.5 0.5 0.5 
##$DBPOFFS= (0..7)
0 0 0 0 0 0 0 0 
##$DE= 6
##$DECBNUC= <off>
##$DECIM= 32
$$ [...]
##$SUBNAM4= <"">
##$SUBNAM5= <"">
##$SUBNAM6= <"">
##$SUBNAM7= <"">
##$SUBNAM8= <"">
##$SUBNAM9= <"">
##$SW= 20.6817932712277
##$SWIBOX= (0..15)
0 0 3 0 0 0 0 0 0 0 0 0 0 0 0 0 
##$SW_h= 4139.07284768212
##$TD= 32768
##$TD0= 1
##$TE= 0
##$TE2= 300
##$TE3= 300
##$TEG= 300
##$TL= (0..7)
0 120 120 120 120 120 120 120 
##$TP= (0..7)
150 150 150 150 150 150 150 150 
##$TP07= 0
##$TPNAME0= <>
##$TPNAME1= <>
##$TPNAME2= <>
##$TPNAME3= <>
##$TPNAME4= <>
##$TPNAME5= <>
##$TPNAME6= <>
##$TPNAME7= <>
##$TPOAL= (0..7)
0.5 0.5 0.5 0.5 0.5 0.5 0.5 0.5 
##$TPOFFS= (0..7)
0 0 0 0 0 0 0 0 
##$TUNHIN= 0
##$TUNHOUT= 0
##$TUNXOUT= 0
##$USERA1= <user>
##$USERA2= <user>
##$USERA3= <user>
##$USERA4= <user>
##$USERA5= <user>
##$V9= 5
##$VALIST= <valist>
##$VCLIST= <CCCCCCCCCCCCCCC>
##$VD= 0
##$VDLIST= <DDDDDDDDDDDDDDD>
##$VPLIST= <PPPPPPPPPPPPPPP>
##$VTLIST= <TTTTTTTTTTTTTTT>
##$WBST= 1024
##$WBSW= 30
##$XGAIN= (0..3)
0 0 0 0 
##$XL= 0
##$YL= 0
##$YMAX_a= 633057
##$YMIN_a= -883696
##$ZGOPTNS= <>
##$ZL1= 120
##$ZL2= 120
##$ZL3= 120
##$ZL4= 120
##$ABSF1= 0
##$ABSF2= 0
##$ABSG= 0
##$ABSL= 0
##$ALPHA= 0
##$AQORDER= 0
##$ASSFAC= 0
##$ASSFACI= 0
##$ASSFACX= 0
##$ASSWID= 0
##$AUNMP= <proc_1d>
##$AZFE= 0.1
##$AZFW= 0.1
##$BCFW= 0
##$BC_mod= 2
##$BYTORDP= 0
##$COROFFS= 0
##$CY= 18.4799938201904
##$DATMOD= 1
##$DC= 0
##$DFILT= <>
##$DTYPP= 0
##$F1P= 9.9274215381318
##$F2P= -0.165520771350173
##$FCOR= 1
##$FTSIZE= 16384
##$FT_mod= 6
##$GAMMA= 0
##$GB= 0
##$INTBC= 1
##$INTSCL= 4.127829e-11
##$ISEN= 128
##$LB= 0.05
##$LEV0= 0
##$LPBIN= 0
##$MAXI= 10000
##$MC2= 0
##$MEAN= 0
##$ME_mod= 0
##$MI= 50
##$NCOEF= 0
##$NC_proc= -3
##$NLEV= 6
##$NOISF1= 3.799351
##$NOISF2= 2.8
##$NSP= 0
##$NTH_PI= 0
##$NZP= 0
##$OFFSET= 16.48848
##$PC= 4
##$PHC0= -417.9518
##$PHC1= 3.101563
##$PH_mod= 1
##$PKNL= yes
##$PPARMOD= 0
##$PSCAL= 4
##$PSIGN= 0
##$REVERSE= no
##$SF= 200.130005582386
##$SI= 16384
##$SIGF1= 3
##$SIGF2= 2
##$SINO= 400
##$SIOLD= 16384
##$SREGLST= <1H.CDCl3>
##$SSB= 0
##$STSI= 16384
##$STSR= 0
##$SW_p= 4139.07284768211
##$SYMM= 0
##$S_DEV= 0
##$TDeff= 32768
##$TDoff= 0
##$TI= <>
##$TILT= no
##$TM1= 0
##$TM2= 0
##$TOPLEV= 0
##$USERP1= <user>
##$USERP2= <user>
##$USERP3= <user>
##$USERP4= <user>
##$USERP5= <user>
##$WDW= 1
##$XDIM= 16384
##$YMAX_p= 523178781
##$YMIN_p= -247813
$$ End of Bruker specific parameters
$$ ---------------------------------
##NTUPLES= NMR SPECTRUM
##VAR_NAME=  FREQUENCY,     SPECTRUM/REAL,   SPECTRUM/IMAG
##SYMBOL=    X,             R,               I
##VAR_TYPE=  INDEPENDENT,   DEPENDENT,       DEPENDENT
##VAR_FORM=  AFFN,          ASDF,            ASDF
##VAR_DIM=   16384,         16384,           16384
##UNITS=     HZ,            ARBITRARY UNITS, ARBITRARY UNITS
##FACTOR=    0.252644378177508, 1,           1
##FIRST=     3299.83951724647, 0,            0
##LAST=      -839.233330435636, 0,           0
##MIN=       -839.233330435636, -247813,     0
##MAX=       3299.83951724647, 523178781,    0
$$ Real data points
##PAGE= N=1
##DATA TABLE= (X++(R..R)), XYDATA
$$ [...]
10548g2523j0529N892J5893q265O995q174j0866j253R622r154j6928J4240K627
10535h2423l28J0288J336q948K9479m154k5471j7580j4698M7574j3854r488R693
10522g8574p820N841O019J9660k6194K7397k0296k6163K4705j431J6641m068J1396
10509e2887j1460j4392j0836Q232j2006K735J4709o380J835o22P701M0524Q629
10496b4218m7912R761j8890k65j3128K0030L0570l8494J3992n359j2840j2743
10484i9496L6590m41j5519K684O935R670k0162q057K2718r144k767k3996J1965
10471h9020J8908j7797M6770m3470j1561J0082n041L804L1770k2409J3951q327
10459g2340j4343N695J7905l8278J0215J2277j720n317M946J0128q541R984j0809
$$ plain form
10548 -72523 -83052 -77160 -61267 -69532 -62537 -70711 -81577 -82830 -73208 -82362 -99290 -85050 -82423
10535 -82423 -82751 -72463 -71127 -80075 -50596 -54750 -80221 -97801 -112499 -64925 -78779 -88267 -78574
10522 -78574 -86394 -80553 -74534 -54874 -81068 -53671 -73967 -100130 -75425 -76856 -60215 -64283 -52887
10509 -52887 -64347 -78739 -89575 -81343 -93349 -90614 -75905 -82285 -80450 -81072 -73371 -32847 -24218
10496 -24218 -72130 -62369 -81259 -81524 -94652 -74622 -44052 -82546 -68554 -73913 -86753 -99496
10484 -99496 -62906 -63347 -78866 -76182 -69247 -59577 -79739 -87796 -65078 -74222 -76989 -100985 -89020
10471 -89020 -70112 -87909 -41139 -84609 -96170 -86088 -91129 -87325 -55555 -77964 -64013 -72340
10459 -72340 -86683 -80988 -63083 -101361 -91146 -78869 -80589 -85906 -80960 -70832 -79373 -69389 -80198
10446h0198j1719K620Q640J1847J7293j7739j5112j2075Q947O019j1714K8574
10434f4617l415J1195l1692P999o032n527J3205J9205k8741r002J2095j215K1006
10421f5536J1995j4080q033J0328k2960k2673J7976K2765k6156K4749Q286k3317
10409h6656j678J6918l688J8175k8102r23m684j4158L9687o658r722J7810n694
10396f9373j6118j3129J6127o348J1961L067q488J3026k1227L0684l740j155j2727
10383g7440k9162J5282q041K7884j3556L5072l0024m726j9866L1391r142J9411
10371f2917j3377j4886m878k6734L4126J8032r287J2646J5162k9843J4105j3702
10359h1553j832j0747K0239R896k2617J599J2264p35j2784L2283k4823j4312L0387
$$ plain form
10446 -80198 -91917 -89297 -80657 -68810 -51517 -69256 -84368 -96443 -87496 -81477 -93191 -64617
10434 -64617 -68032 -56837 -88529 -80530 -86562 -92089 -78884 -59679 -88420 -97422 -85327 -86542 -65536
10421 -65536 -53541 -67621 -75654 -65326 -88286 -110959 -92983 -70218 -96374 -71625 -63339 -86656
10409 -86656 -88334 -71416 -75104 -56929 -85031 -85954 -90638 -104796 -65109 -71767 -81489 -63679 -69373
10396 -69373 -85491 -98620 -82493 -88841 -76880 -73813 -82301 -69275 -90502 -59818 -63558 -64713 -77440
10383 -77440 -106602 -91320 -99361 -71477 -85033 -49961 -79985 -84711 -104577 -73186 -82328 -62917
10371 -62917 -76294 -91180 -96058 -122792 -88666 -70634 -79921 -67275 -52113 -81956 -67851 -81553
10359 -81553 -83385 -94132 -73893 -63997 -86614 -85015 -72751 -73486 -86270 -53987 -78810 -93122 -62735
10346f2735k5160L401q990M1633j0317k2517J2438N301J3474j4506j502k832l929
10333g6241l0409M2082k3871K5190l90k3488k404j0248K7202J0659j1133j4628
10321h7679m154l23J2970J9468j3397j283p157j1474k72P176J8046N731l203K6752
10307c8799n6105L0708p665k2135L0337j6461K0189k4978K5741k1280k218J5812
10295f6854j1763Q053l5207J6045P529J5026M2664l3564k5500K6481k0402l2161
10283a09653J6889K6120Q839p13k6946O956J2457k1334L9181l5499q151L871j6866
10270a04849J7237L1142j0624l092J3154j5463j7766J8446l971K4179p679r940
10258f9226J9j4961J2072K5290o170r699j6947k3768K9109m424Q737J5113k3370
$$ plain form
10346 -62735 -87895 -84494 -93484 -51851 -62168 -84685 -72247 -66946 -53472 -67978 -69480 -72312 -76241
10333 -76241 -106650 -64568 -88439 -63249 -63639 -87127 -89531 -99779 -72577 -61918 -73051 -87679
10321 -87679 -91833 -92156 -79186 -59718 -73115 -74398 -81555 -93029 -93301 -86125 -68079 -62348 -65551 -38799
10307 -38799 -94904 -64196 -71861 -93996 -63659 -80120 -59931 -84909 -59168 -80448 -82666 -66854
10295 -66854 -78617 -70564 -105771 -89726 -82197 -67171 -24507 -58071 -83571 -57090 -77492 -109653
10283 -109653 -92764 -66644 -57805 -58518 -85464 -78508 -66051 -87385 -48204 -83703 -91854 -87983 -104849
10270 -104849 -87612 -56470 -67094 -70186 -57032 -72495 -90261 -71815 -75786 -51607 -59286 -69226
10258 -69226 -69207 -84168 -72096 -46806 -52976 -62675 -79622 -103390 -74281 -78705 -69968 -54855 -78225
10245g8225J1262J1616k5901M313J4347j0363j2184q701M988k41J5267J0643j3344
10232g6523J4438n484n884o483J2302J9692l6276j3739K2059l5745N498M9943
10220e6202l7592J6328K0771k4438k918j3206J3744M556L55M694J2432p379k8998
10207i7853K994J0617J2246P404j4523J3911j1308K376J4471K2363l2138j6526
10195h5966M6J355K7778p785j4201M4733k8305J63j6387k49J7980J197n9289M1860
10181g7070K5190k8886J4752K0436l7408Q294k883j115M300N540N4376n6458q71
10168g1803J0471r801J1514k7116m464J0258L0466m2469O866J2435l109M139L825
10155f8788K647k7239K6498P105k5524K1151J119o899o784j8481l116L6416Q068
$$ plain form
10245 -78225 -66963 -55347 -81248 -76935 -62588 -72951 -85135 -93836 -88848 -89089 -73822 -63179 -76523
10232 -76523 -62085 -67569 -73453 -79936 -67634 -47942 -84218 -97957 -75898 -111643 -106145 -56202
10220 -56202 -93794 -77466 -56695 -81133 -84051 -97257 -83513 -78957 -78602 -73908 -61476 -68855 -97853
10207 -97853 -94859 -84242 -71996 -64592 -79115 -65204 -76512 -74136 -59665 -37302 -69440 -85966
10195 -85966 -85920 -84565 -56787 -64572 -78773 -34040 -62345 -62182 -78569 -78818 -60838 -59641 -118930 -77070
10181 -77070 -51880 -80766 -66014 -45578 -82986 -74692 -77575 -78690 -74390 -68850 -14474 -70932 -71803
10168 -71803 -61332 -71133 -59619 -86735 -91199 -80941 -50475 -92944 -86078 -73643 -76752 -72613 -68788
10155 -68788 -66141 -93380 -66882 -59777 -85301 -64150 -63031 -69930 -76714 -95195 -98311 -61895 -53827
10142e3827l7171K93K1937O580j3756O495r066J0526m866j2707K4427j2390K355
10129g1170l585J4852k1791Q35q398R925l2914K0253Q781J2235j0148J0333L516
10116f7276N115r885J9959l2172l959J2112j7322J3411L310K1872k1842K4971
10104e1706j5676j5398L2306j0238k3130m749M0842m9494K6117L3858j6366k4299
10092g7933M958M410k0658K585J7545k4628j7704M7422j2795J1707K2275l8210
10080h1026m305J4402j4161j3668J8451q908N011L416L2343k5133l92K8175k8962
10067g4757m238k1539K3116k8758M3539k701k2543J0151n294j9513L5725j7838
10055h4650N514j1257K0433j0464l150J1560j1107P495J1747k6133J0400j0031
$$ plain form
10142 -53827 -90998 -90705 -68768 -62188 -75944 -69449 -78515 -67989 -72855 -85562 -61135 -73525 -71170
10129 -71170 -74755 -59903 -81694 -80859 -89257 -79332 -112246 -91993 -83212 -70977 -81125 -70792 -67276
10116 -67276 -62161 -72046 -52087 -84259 -88218 -76106 -93428 -80017 -76707 -54835 -76677 -51706
10104 -51706 -67382 -82780 -50474 -60712 -83842 -88591 -47749 -97243 -71126 -37268 -53634 -77933
10092 -77933 -72975 -68565 -89223 -86638 -69093 -93721 -111425 -64003 -76798 -65091 -42816 -81026
10080 -81026 -85331 -70929 -85090 -98758 -80307 -89215 -84204 -80788 -48445 -73578 -73970 -45795 -74757
10067 -74757 -78995 -100534 -77418 -106176 -62637 -65338 -87881 -77730 -83024 -102537 -66812 -84650
10055 -84650 -79136 -90393 -69960 -80424 -83574 -72014 -83121 -75626 -63879 -90012 -79612 -89643
10043h9643K2407k155k5019J6110J0092j3569K4792l391J289o921R296l4548m737
10030i5997L3088j7231q272K1409j980j1530Q164k824j5001K9851P292k6243K2116
10017e7158J2864j8426j1408P857M424j1797K8960l1806L456K7148k8633j9361
10005i3880L0013j886j4038J4791N504j9479K221P461m04j8491K2879k0972j599
9992h7880L8665l8097J9421K9717j8353m8423N2263j5017O247j9457L0249k1110
9980g1775l0936M2122K539l2550K8826R15j7042k893L4640k8891L9602N905l8988
9967f8526l065j345m241j581K2259J040l0133J6375Q914j9676K0381q891N629
9954f2860j0710L9740l1528j4945K5269j6044J313R907J4331l455J461j0021k0121
$$ plain form
10043 -89643 -67236 -69391 -94410 -78300 -68208 -81777 -56985 -60376 -59087 -66008 -56712 -91260 -95997
10030 -95997 -62909 -80140 -88412 -67003 -68983 -80513 -72349 -75173 -90174 -60323 -53031 -79274 -57158
10017 -57158 -44294 -62720 -74128 -66271 -61847 -73644 -44684 -76490 -73034 -45886 -74519 -93880
10005 -93880 -63867 -65753 -79791 -65000 -59496 -78975 -76754 -69293 -69697 -88188 -65309 -86281 -87880
9992 -87880 -49215 -87312 -67891 -38174 -56527 -104950 -52687 -67704 -61457 -80914 -50665 -71775
9980 -71775 -102711 -60589 -58050 -90600 -61774 -60859 -77901 -80794 -46154 -75045 -35443 -29538 -68526
9967 -68526 -71591 -72936 -77177 -78758 -56499 -55459 -85592 -69217 -60303 -79979 -59598 -68489 -62860
9954 -62860 -73570 -33830 -65358 -80303 -55034 -71078 -69765 -59858 -45527 -48982 -47521 -57542 -77663
9941g7663J0698M995l3666J9421R172R309R501j7759m422j883R317J0464k6504
9928g9020K279Q027L777P925q160j6029K3055K3310j2135n111o554o507k109Q816
9914e8436j4257J8953l3931K6534k512l934N204L778k4780J0413p188L4406k997
9901d8747n7402M1328J5927j0982J5299l3674j0861L3344k5194K2945q529N274
9889f1272L306k5182J4264P803j8461J4480K6700k8483j7343K2224k062K3015
9877d1011m796o735p960Q348j0903K683J5572k1949O73j1839J0847J3483m401
9864e7988M188J5027l1747Q707K216J0906J2899k2321J3011j623o727l718J3431
9851d3739j7157r809J8262p209J9731l5567J5480m410J2071j8179K4411p429P466
$$ plain form
9941 -77663 -66965 -61970 -95636 -76215 -67043 -57734 -48233 -65992 -70414 -72297 -62980 -52516 -79020
9928 -79020 -76741 -68714 -64937 -57012 -65172 -81201 -58146 -34836 -46971 -52082 -58636 -65143 -67252 -58436
9914 -58436 -72693 -53740 -87671 -61137 -63649 -67583 -62379 -58601 -83381 -72968 -80156 -45750 -48747
9901 -48747 -106149 -64821 -48894 -59876 -44577 -78251 -89112 -55768 -80962 -58017 -66546 -61272
9889 -61272 -57966 -83148 -68884 -61081 -79542 -65062 -38362 -66845 -84188 -61964 -64026 -41011
9877 -41011 -45807 -52542 -60502 -52154 -63057 -60374 -44802 -66751 -66078 -77917 -67070 -53587 -57988
9864 -57988 -53800 -38773 -70520 -61813 -59597 -48691 -35792 -58113 -45102 -46725 -53452 -57170 -43739
9851 -43739 -60896 -70705 -52443 -59652 -39921 -75488 -60008 -64418 -52347 -70526 -46115 -53544 -46078
9838d6078q851l658J3267p800l813j517J9330l1624r166M0045l6701J4934K987
9825e8645R691n640l201J4053j1687P277K0478n4578L4167J0300q182K3470L418
9812a9079j7308j9727L0316k9454j5100K7789j1829j8148K5672j5388L2626m3418
9800g3048M7602k2473J0815o942J2570j9866J4172K7728k0349p73r421Q597j214
9787c2602j8120k1842K8862K3563l0128J17J8239k3065J7225m064P482o526M407
9774c6452p903j9870K5719j3205K6231k0478Q682p882K1854k450o792k7363K9792
9761c0117l7041J1111P848P443M348j4072J846o825l067J3716J8423l275J6760
9748a2902l0460j5035K0180J7667k0630J5912p211O960k1185K8306j6785J0657
$$ plain form
9838 -46078 -54929 -58587 -45320 -53120 -56933 -58450 -39120 -70744 -79910 -39865 -76566 -61632 -58645
9825 -58645 -48954 -54594 -57795 -43742 -55429 -48152 -27674 -82252 -48085 -37785 -45967 -22497 -19079
9812 -19079 -36387 -56114 -25798 -55252 -70352 -42563 -54392 -72540 -46868 -62256 -29630 -73048
9800 -73048 -25446 -47919 -37104 -44046 -31476 -51342 -37170 -9442 -29791 -30564 -39985 -31388 -32602
9787 -32602 -50722 -72564 -43702 -20139 -50267 -50150 -31911 -54976 -37751 -41815 -34333 -40859 -36452
9774 -36452 -44355 -64225 -38506 -51711 -25480 -45958 -37276 -45158 -23304 -25754 -32546 -59909 -30117
9761 -30117 -67158 -56047 -48199 -40756 -36408 -50480 -48634 -55459 -58526 -44810 -26387 -29662 -12902
9748 -12902 -43362 -58397 -38217 -20550 -41180 -25268 -32479 -25519 -46704 -18398 -35183 -24526
9736b4526J1699Q792k4067l5154K4152n0021P0083J004n971O303K712j5844l899
9723c4737J8272k9183p849J5963p995k1732M8859J1992k353j6032J4458o676l7550
9710e4563L5103N028j8036J9149o599j9999L916J9026j1647l703J8125m0671K7135
9697b7736j9506L0655j5837K8344k6321R183M152r476J8040q444J9779l6461M248
9684b9380K788J6262L71l4256L7208k0245K8117k7016K3460q445j7398J5088m361
9671a7807K0892k3887k633J2994P813l255O329K948R054j5068k0677M677L8958
9658B0338l171j4861K1510m183L6261J2035J0821j3338K1399k0173J4605j964
9646G9279L3436n8456J8000j6166l1497K0807J0592l0096J6115J083k7032l7345
$$ plain form
9736 -24526 -12827 -4035 -28102 -63256 -39104 -89125 -19042 -18038 -24009 -17706 -14994 -30838 -34737
9723 -34737 -16465 -45648 -53497 -37534 -45529 -67261 -18402 -6410 -8763 -24795 -10337 -17013 -54563
9710 -54563 -19460 -14432 -32468 -13319 -19918 -39917 -36001 -16975 -28622 -32325 -14200 -54871 -27736
9697 -27736 -47242 -16587 -32424 -4080 -30401 -21218 -17066 -26542 -8502 -16946 2833 -33628 -29380
9684 -29380 -26592 -10330 -9959 -44215 -7007 -27252 865 -26151 -2691 -11136 -28534 -13446 -17807
9671 -17807 3085 -20802 -23435 -10441 -2628 -5883 446 3394 12448 -2620 -23297 -18620 20338
9658 20338 17167 2306 23816 19633 55894 67929 78750 65412 86811 66638 81243 79279
9646 79279 112715 54259 72259 56093 24596 45403 55995 25899 42014 43097 16065 -21280
9634b1280N5382r733k2240K6462r768J8693l8380K3436j1969N484O839r354N660
9621A9232L3153J6950k6396K3351k6546K5006k9162o544l744k3049N4230j2276
9609D4205l6170M1198n396M57m172j0261j0051J5642l1601R205K0419j4540l918
9596A5017J9641R18q516J0307j5691l064K0555J3216K3009K2304M480Q933j3109
9583I8000J3258K4764J326j1622J6973k1802j602J1305j1934K194m1402O113j3017
9570G2554l2919J2203j1902j0838J2914j6508J32J5728J4860k0642j7412K4383
9558D2553k8587N181l4056R872J7716j9330o576K5391K081l4298n57J7081k3566
9545b7095J4238M830N806P226j1937l108M028J5349m2569J6287M280R404o848
$$ plain form
9634 -21280 34102 24369 2129 28591 18823 37516 -864 22572 10603 16087 22926 13572 19232
9621 19232 52385 69335 42939 66290 39744 64750 35588 29044 25300 2251 56481 44205
9609 44205 8035 49233 43837 44294 40122 29861 19810 35452 3851 13056 33475 18935 15017
9596 15017 34658 35576 27060 37367 21676 18612 39167 52383 75392 97696 102176 111109 98000
9583 98000 111258 136022 137348 125726 142699 120897 119295 130600 118666 120860 79458 85571 72554
9570 72554 39635 51838 39936 29098 42012 25504 25636 41364 56224 35582 18170 42553
9558 42553 13966 19147 -14909 -5037 12679 -6651 -13227 12164 14245 -20053 -20610 -3529 -27095
9545 -27095 -12857 -8027 -2221 5005 -6932 -10040 -6012 9337 -33232 -16945 -12665 -3261 -10109
9532a0109k4707J5083K671n486Q808k7572J5073m208l7821L4780K4759l5956R745
9519c4940n803R421J312J5044m3761K4415o219J5169j009n492m36q853J9339K8112
9505F299j5721k7572k992L416K0439J3479k5622J2687J4761l1685K7326j7971
9493b3156K553n0435N3987L396l8450O1322n3623R484O870o148q597Q232J4446
9480b0119k3542P906M242J1071J697J437k201K1953l4604K0164j317j7423K3053
9467g683l8291K2274m413O113R914k6385L058k0873J3881j337J4257P55M866J3120
9453a0744m5413M728l952J3148J283K8784m7748M5969l3469K6877j4112L306k6930
9440e8273M6569l2839J5287O939j3869K9207o123K833K0875j4380k1117L67N174
$$ plain form
9532 -10109 -34816 -19733 -17062 -22548 -13740 -41312 -26239 -30447 -68268 -33488 -8729 -44685 -34940
9519 -34940 -40743 -31322 -30010 -14966 -58727 -34312 -40531 -25362 -26371 -31863 -32299 -41152 -21813 6299
9505 6299 -9422 -36994 -39986 -36570 -16131 -2652 -28274 -15587 -826 -32511 -5185 -23156
9493 -23156 -20603 -71038 -17051 -13655 -52105 9217 -44406 -34922 -28052 -34200 -42797 -34565 -20119
9480 -20119 -43661 -35755 -31513 -20442 -18745 -17308 -19509 2444 -32160 -11996 -13313 -30736 -7683
9467 -7683 -45974 -23700 -28113 -22000 -12086 -38471 -35413 -56286 -42405 -43742 -29485 -28730 -23864 -10744
9453 -10744 -56157 -51429 -55381 -42233 -40950 -12166 -59914 -13945 -47414 -20537 -34649 -31343 -58273
9440 -58273 -11704 -44543 -29256 -22317 -36186 -6979 -13102 -10269 10606 -3774 -24891 -24524 -19350
9427a9350J680K171k7217n149K7216N252p365L6803m4445K5526m8408L6640M631
9414a2015k4800J0366Q837j0664Q560m410J4181k5860J1406k4774J828J9994o30
9401b7981k638l661Q859J211l447q696m0655L5598L2541k7034p21J3136r524J8111
9387a4901J0420q369j9657R588l466m6252K1857J8002K038P774J5577k2657J3273
9374a6773k9269j0842Q663J4312j4674p437L3456j695j2117K0719l3026J1133
9362c7550k7110J8651r310L847K5455j7542p016K0713j2736j3461l735K7637q445
9349d0602J1248J8432j9796P036r055N410k4639l92J6001l890k0397K2088j7646
9336e6202J9565K9058m8064R616j7837N0916k6276j823j207L015P949j1414r153
$$ plain form
9427 -19350 -17670 -15499 -42716 -47865 -20649 -15397 -22762 14041 -30404 -4878 -53286 -16646 -12015
9414 -12015 -36815 -26449 -17612 -28276 -19716 -24126 -9945 -35805 -24399 -49173 -47345 -27351 -27981
9401 -27981 -30619 -34280 -25421 -24210 -27657 -36353 -77008 -41410 -8869 -35903 -36624 -23488 -33012 -14901
9387 -14901 -4481 -12850 -32507 -22919 -26385 -72637 -50780 -32778 -30740 -22966 -7389 -30046 -16773
9374 -16773 -46042 -56884 -48221 -33909 -48583 -56020 -22564 -24259 -36376 -15657 -48683 -37550
9362 -37550 -64660 -46009 -55319 -51472 -26017 -43559 -50575 -29862 -42598 -56059 -59794 -32157 -40602
9349 -40602 -29354 -10922 -30718 -23682 -32737 -27327 -51966 -52358 -36357 -40247 -60644 -38556 -56202
9336 -56202 -36637 -7579 -55643 -46027 -63864 -12948 -39224 -41047 -42254 -39239 -31290 -42704 -51857
9323e1857J8691o99m33r661m694K2774k3387L0817j2446Q088l614j7905J4128
9310c0198j3193J103j0517J5853r090L3774m2987L506j686J3383L0840j1745l8588
9297e9545J6520J132j8496K0958k0768J8065r097K6291j1916J9675p815k1163
9285d6159J3376j7819J5973j5288L193j5694j5710N6703l4298K1662K518p602
9273c9145j0875j2251J1240l190Q359Q962j53J2758O182l1490L165P190k868J6383
9259b5733j9195R765o514J0865j1965J6338m552J4544l6303n432J3254o572Q162
9246d3338J3785n597P009J5489m1493N3723j5250k7095K1099q991j2089j639k6323
9233g0710J7283O515j652L662m547j5427M5731k6571R059r571k1354K2933n552
$$ plain form
9323 -51857 -33166 -33865 -34298 -43959 -48653 -25879 -49266 -18449 -30895 -22807 -26421 -44326 -30198
9310 -30198 -43391 -42288 -52805 -36952 -46042 -12268 -55255 -51749 -53435 -40052 -9212 -20957 -59545
9297 -59545 -43025 -41893 -60389 -39431 -60199 -42134 -51231 -24940 -36856 -17181 -24996 -46159
9285 -46159 -32783 -50602 -34629 -49917 -46724 -62418 -78128 -21425 -55723 -34061 -31543 -39145
9273 -39145 -50020 -62271 -51031 -54221 -45862 -36900 -37053 -24295 -18113 -49603 -46438 -39248 -42116 -25733
9259 -25733 -44928 -35163 -41677 -30812 -42777 -26439 -30991 -16447 -52750 -58182 -44928 -51500 -43338
9246 -43338 -29553 -35150 -28141 -12652 -54145 -422 -15672 -42767 -21668 -30659 -42748 -44387 -70710
9233 -70710 -53427 -46912 -48564 -44902 -49449 -64876 -19145 -45716 -36657 -46228 -67582 -44649 -50201
9220e0201k0388L1889k306k6797L6284k1181M636o407j3873L0570R087l3173J7566
9207d4294o948j7494K2036K481p112Q227K3910k5154q877j7961J5723j1295J1107
9194e5651M216R472p093J076J5790j3956J6329l5649k193K2102j805Q582J3578
9181b5202K413j9954j9208J1514k2622J3906K4566j404k0965L6850l0798N397
9169d5507o756R160j4964J1548k4729P07M0465K316l0314O626J6102j6358K4903
9156b6801l0239R208n612J2118l2232P664J0266J0074j2421J6251k8608R112P755
9143e3465N944p890M338o738N447L519L875o209j6038R780K621j0338J2671J6471
9129c6012J248j0011J1971l0852K5093l2666J0446J7407o877o152K009k9612M1808
$$ plain form
9220 -50201 -70589 -38700 -41006 -67803 -31519 -52700 -48064 -54471 -68344 -37774 -28687 -61860 -44294
9207 -44294 -51242 -68736 -46700 -44219 -51331 -43104 -19194 -44348 -53225 -71186 -55463 -66758 -55651
9194 -55651 -51435 -41963 -49056 -47980 -32190 -46146 -29817 -65466 -67659 -45557 -47362 -38780 -25202
9181 -25202 -22789 -42743 -61951 -50437 -73059 -59153 -34587 -35991 -56956 -20106 -50904 -45507
9169 -45507 -52263 -43103 -58067 -46519 -71248 -70541 -30076 -27760 -58074 -51448 -35346 -51704 -26801
9156 -26801 -57040 -47832 -53444 -41326 -73558 -65894 -55628 -45554 -57975 -41724 -70332 -61220 -53465
9143 -53465 -47521 -55411 -51073 -57811 -52364 -48845 -44970 -51179 -67217 -57437 -54816 -65154 -52483 -36012
9129 -36012 -34764 -44775 -32804 -63656 -38563 -71229 -60783 -43376 -50253 -56405 -54396 -84008 -42200
9116d2200k3858J6624J4591j3053J1557m926p614P211J3277j2196l1675M2979
9104b9283l7966J3310N825j6057J3267K6664k808o758J388k1909p980N837n649
9091f2119M928j0513J1289L8303j6527m137k7439J8021k7115L0128j7054R009
9079e3226l797J6600K0925l8089R967L0865k5837j4379J7937k1978J6031K2307
9067b2674J243j7879P010J074M107l662k6051M279J1385k536k8996m156L4530
9054d2326J8192m4491K4815j1231o551M952R913l8047K5768l9860L1367J8039
9042d9460L505j946P792l3035K8631j7187m834K6206j8006K2147q615j4982r072
9029f8856J5264J489L063m609M537r073M106j018r050L1913j6370k4723M3540
$$ plain form
9116 -42200 -66058 -49434 -34843 -47896 -36339 -41265 -48879 -41668 -28391 -40587 -72262 -29283
9104 -29283 -67249 -53939 -48114 -64171 -50904 -24240 -27048 -33806 -32418 -54327 -62307 -56470 -62119
9091 -62119 -57191 -67704 -56415 -18112 -34639 -38776 -66215 -48194 -75309 -45181 -62235 -53226
9079 -53226 -57023 -40423 -19498 -57587 -47620 -16755 -42592 -56971 -39034 -61012 -44981 -22674
9067 -22674 -21431 -39310 -32300 -31226 -27119 -30781 -56832 -52553 -41168 -43704 -72700 -76856 -42326
9054 -42326 -24134 -68625 -43810 -55041 -61592 -56640 -46727 -84774 -59006 -98866 -67499 -49460
9042 -49460 -45955 -47901 -40109 -73144 -44513 -61700 -66534 -40328 -58334 -36187 -44802 -59784 -68856
9029 -68856 -53592 -52103 -49040 -53649 -49112 -58185 -54079 -55097 -64147 -32234 -48604 -73327 -29787
9016b9787M447l3401K7659k2118K6173J154j7466M913M027j1523K292k6624N458
9003f4796j362P517K1339k5741j06p223R493J8170j4736J0208M902k3153J5005
8990e0483q078K827j8206K0393J7097j7209M021Q036o977K131l678p487L3210
8977b4403j1754j206k1166K3751k7712K6494j1186L954J3075r445M265q806L0409
8964a3730k0320k6552J681L5467m1303l697L6031M727O98k1989l164r971K0887
8951d1235k5060L4139J4467j4540m0335L9188j6186l838K592J438j4940K3995
8939d0315r4j7570K3946q947J6230k3446p462L027o523O349L1888k8444m133J5328
8925d0166j1365j948J2552n28k731J048j8437K121O271k3q658L3291j6758J0215
$$ plain form
9016 -29787 -25340 -58741 -31082 -53200 -27027 -25873 -43339 -38426 -34399 -45922 -43630 -70254 -64796
9003 -64796 -66158 -58641 -37302 -63043 -63149 -70372 -60879 -42709 -57445 -47237 -42335 -65488 -50483
8990 -50483 -58561 -55734 -73940 -53547 -36450 -53659 -49638 -41602 -48579 -46448 -50126 -57613 -24403
8977 -24403 -36157 -37363 -58529 -34778 -62490 -35996 -47182 -43228 -30153 -39598 -35333 -44139 -13730
8964 -13730 -34050 -60602 -58921 -23454 -64757 -68454 -32423 -27696 -26998 -48987 -52151 -62122 -41235
8951 -41235 -66295 -32156 -17689 -32229 -72564 -33376 -49562 -53400 -50808 -49370 -64310 -40315
8939 -40315 -40409 -57979 -34033 -42980 -26750 -50196 -57658 -54631 -61154 -54805 -22917 -51361 -55494 -40166
8925 -40166 -51531 -53479 -40927 -41455 -44186 -43138 -61575 -59454 -53183 -53206 -61864 -28573 -45331 -35116
8911c5116Q65K1350l3852K2531k7123R895q33M223j4058M925J6168P579o94k6871
8897e1011L3060l2384L8805k1881q06l020L1254k7257L848J7846k4191P328j5655
8884d4064L9591l1430O067r34J4650j0811r934q106p50L4054J621m1315M450J4329
8870c2582l2886J3513J1416o65J5262k0686J4143J5614k2033j1282J7889j5259
8858d7556J3604j1932j9208R582K0562J823m222r076J024N918j2824L4053j5504
8845c3756k0906L8687j7771j2425K0313k0833O075R89K9682k5458J0924j6242
8833d0721k365J8738l539J557j0322K2193R88j3278m888K3042l0297J3342j4271
8820c9821K029q756J6137K4011l1043j3126M360R692M363N163l4585K479J5531
$$ plain form
8911 -35116 -34251 -12901 -46753 -24222 -51345 -41450 -42283 -38060 -52118 -47193 -31025 -23446 -24140 -51011
8897 -51011 -17951 -50335 -11530 -33411 -34217 -37237 -5983 -33240 -29392 -11546 -35737 -28409 -44064
8884 -44064 -4473 -35903 -29836 -30770 -16120 -26931 -36865 -44971 -45721 -11667 -10046 -51361 -46911 -32582
8870 -32582 -65468 -51955 -40539 -41204 -25942 -46628 -32485 -16871 -38904 -50186 -32297 -47556
8858 -47556 -33952 -45884 -65092 -55510 -34948 -33125 -37347 -46423 -45399 -39481 -52305 -18252 -33756
8845 -33756 -54662 -15975 -33746 -46171 -25858 -46691 -40616 -39627 -9945 -35403 -24479 -40721
8833 -40721 -43086 -24348 -27887 -26330 -36652 -14459 -13471 -26749 -31637 -8595 -38892 -25550 -39821
8820 -39821 -37792 -46548 -30411 -6400 -37443 -50569 -46209 -36517 -32154 -26991 -61576 -59097 -43566
8807d3566K1468j5062K44Q629j3386J9127j9542K591J8469j3504j3990j3693J2252
8794d9963K6P463j1701K468j07J687o375q799k6660M7964k3J2520p021M055j4204
8779d8670k3743J3741J6051N022j3194O365J7610R57l0574K0495n87l1297J6170
8766e1654K6545l8334p362J5599M1326L925J3363l6778r003j4995K635j780J5978
8753d0535k7037M8790j7678o201J6109O030k5114J2616k752j8431j5535J3631
8741e6107J8242N477K8613k3946k1419n55O998O280O831k0434n294k003J2768
8728d4549L3595m539j3175j1214j7317N688m50K3478l2664K3885Q869k4358K2856
8715b9895k1235L6690j6908k6843R305O095l109P66J60o136O537m893L362N972
$$ plain form
8807 -43566 -22098 -37160 -36916 -28287 -41673 -22546 -42088 -39497 -21028 -34532 -48522 -62215 -49963
8794 -49963 -49937 -42474 -54175 -51707 -51814 -50127 -56502 -65301 -91961 -43997 -44020 -31500 -38521 -34466 -48670
8779 -48670 -72413 -58672 -42621 -37599 -50793 -44428 -26818 -25861 -56435 -35940 -36527 -67824 -51654
8766 -51654 -25109 -63443 -70805 -55206 -13880 -9955 3408 -33370 -42373 -57368 -54733 -56513 -40535
8753 -40535 -67572 -18782 -36460 -42661 -26552 -20522 -45636 -33020 -35772 -54203 -69738 -56107
8741 -56107 -37865 -32388 -3775 -27721 -49140 -49695 -42697 -36417 -29586 -50020 -55314 -57317 -44549
8728 -44549 -10954 -15493 -28668 -39882 -57199 -51511 -51961 -28483 -61147 -37262 -28393 -52751 -29895
8715 -29895 -51130 -14440 -31348 -58191 -48886 -42791 -45900 -45134 -44974 -51110 -44573 -49466 -46104 -40132
8701d0132j2195j7768R980L1047k9833n518p187L6386J974J1592m704n547Q082
8688b3823k2596L23L2741k5021J1638j6432J606J9690k1418L0154m9459M2844
8676a9753j3791R054j4370J2601l0102J5702q212j9917N0626j2574J0775k2278
8664d2239J0791n298M220q636J7093k4909K329J7255l483j4508J9066J5414l9722
8651e2627J2164l896j2723J9328J9402m929k5335M3832j7768k4569P453J6348
8639b3320k6143p274J0439j825P280j2603J6426j0889R499L845J3265j9158k7842
8626f8300K6028k0747K5296J3597k2185r93J8387j7416J6803L97k711J7762n8410
8613g2492M2238q774J1596l4884K9745K1875l1761L0483j4456j6630J1882q473
$$ plain form
8701 -40132 -52327 -70095 -60115 -29068 -58901 -64419 -71606 -35220 -33246 -21654 -26358 -31905 -23823
8688 -23823 -46419 -46096 -13355 -38376 -26738 -43170 -41564 -21874 -43292 -13138 -62597 -19753
8676 -19753 -33544 -24490 -38860 -26259 -56361 -40659 -48871 -68788 -18162 -30736 -19961 -42239
8664 -42239 -31448 -36746 -32526 -41162 -24069 -48978 -46649 -29394 -32877 -47385 -28319 -12905 -52627
8651 -52627 -40463 -44359 -57082 -37754 -18352 -23281 -48616 -4784 -22552 -47121 -39668 -23320
8639 -23320 -49463 -56737 -46298 -48123 -40843 -53446 -37020 -47909 -38410 -34565 -21300 -40458 -68300
8626 -68300 -42272 -63019 -37723 -24126 -46311 -47304 -28917 -46333 -29530 -29133 -31844 -14082 -72492
8613 -72492 -30254 -39028 -27432 -62316 -32571 -10696 -42457 -11974 -26430 -43060 -31178 -39651
8601c9651j0770M3440l3883R26q749K9971k3694N786P162k8230J446J4883L4582
8588f781k1331p188K6733j8018K1372l5259j5579L5762k5395k218J7008J6444
8576a4450j3291k5J3760M395k1896N682k623j2620J5025k9932M4980n0572L4561
8563b7006j1854J2411M174j0126j7120M3244j7461j8353K1528l968j7412K3286
8551a8657J8334l6419K7093l628J6108k3333k4552K8072m165k5423L1412K9334
8539A4176k5585M932p881J2145N3943r5181P799k0241k476J5647j7830K5592O731
8526b8229k5027K2264l194j0703N166J3894q509m1062M2571L5296o2786L1037
8514b9282J9773o894r169j5169J3925j7787J6522M941M914K553O843k2740K4K3272
$$ plain form
8601 -39651 -50421 -6981 -40864 -39938 -48687 -18716 -42410 -36624 -29462 -57692 -56246 -41363 -6781
8588 -6781 -28112 -35300 -8567 -26585 -5213 -40472 -56051 -20289 -45684 -47902 -30894 -14450
8576 -14450 -27741 -27766 -14006 -9611 -31507 -25825 -28448 -41068 -26043 -55975 -10995 -61567 -27006
8563 -27006 -38860 -26449 -22275 -32401 -49521 -6277 -23738 -42091 -20563 -24531 -41943 -18657
8551 -18657 -323 -36742 -9649 -13277 2831 -20502 -45054 -16982 -21147 -46570 -15158 14176
8539 14176 -11409 -6477 -14358 -2213 51730 -43451 -35652 -55893 -58369 -42722 -60552 -34960 -28229
8526 -28229 -53256 -30992 -34186 -44889 -39723 -25829 -34338 -75400 -32829 2467 -60319 -29282
8514 -29282 -9509 -16403 -25572 -40741 -26816 -44603 -28081 -23140 -18226 -15673 -8830 -31570 -31546 -8274
8500h274Q85j241m175r756K1880L196K702M162N906l2910Q423K9294m8434K6548
8486a794j4758R169j0733j8370L950N642N818R082j8876j0863J9781k3713n023
8473e0688K6178K1044l9945K1281M764l8113O546M4307l0922J899K2165l9746
8461e1230K5625J0163j5700m083Q099J758K96J1926j9304j006Q736R363l6406
8448e1763j129K7232l6695J8264K4321j4750j2300J8421n51k0164O2279n2975
8436c9810R65R562k1603L2099j1291O574K570k8716M921P784r178J9720j346m420
8422c2169j2167K0463l2354K1018K1885n7124N4177j3548j5637p204K6747k1544
8410d7457L6022l3440Q330j2194L2639r708k3579K7888J0020j9460P286j6948
$$ plain form
8500 -8274 -7389 -8630 -12805 -22561 -681 2515 5217 9379 15285 -17625 -9202 20092 -28342 -1794
8486 -1794 -16552 -7383 -18116 -36486 -32536 -26894 -21076 -11994 -30870 -41733 -21952 -45665 -50688
8473 -50688 -24510 -3466 -43411 -22130 -17366 -55479 -48933 -4626 -35548 -33649 -11484 -51230
8461 -51230 -25605 -15442 -31142 -35225 -27126 -25368 -25072 -13146 -32450 -33456 -24720 -15357 -51763
8448 -51763 -52892 -25660 -62355 -44091 -19770 -34520 -46820 -28399 -28950 -49114 13165 -39810
8436 -39810 -38845 -29283 -50886 -18787 -30078 -23504 -20934 -49650 -44729 -36945 -46123 -26403 -27749 -32169
8422 -32169 -44336 -23873 -56227 -35209 -13324 -70448 -16271 -29819 -45456 -52660 -25913 -47457
8410 -47457 -11435 -44875 -36545 -48739 -16100 -25808 -49387 -21499 -11479 -30939 -23653 -40601
8398d0601J2148l1589K3526p368m70O216J872j3545P839J1209k200J4312J2402
8385f249m3984k550K5180K1612l3800K1152k8219k4461N6164k3718J6696p302
8373b9479K987l2928P306K0706k051P078J9699j8708p510m45r652n777k61K7503
8359b1532k1964K3815J6798j7105R563K454j8957J3365q54p600k8205K2953K7814
8346E45o213m341k9355k169J4167J1036o646r099M718K524j173j2938J1294J3924
8332a3726r637N457k6105K761K2675k7407M4683q150j1532P289l2021n209L3783
8319a7139K535j4656J213j8681M1115K858o643J6878N089j8324k6479L620O389
8306b2225J644n006p94k448K4734j5395o038k1967K7352L525k336j7350J0183
$$ plain form
8398 -40601 -28453 -60042 -36516 -43884 -44354 -38138 -36266 -49811 -41972 -30763 -32963 -18651 -6249
8385 -6249 -50233 -52783 -27603 -5991 -39791 -18639 -46858 -71319 -15155 -38873 -22177 -29479
8373 -29479 -26492 -59420 -52114 -31408 -33459 -26381 -6682 -25390 -32900 -33345 -42997 -48774 -49035 -21532
8359 -21532 -43496 -19681 -2883 -19988 -10425 -7971 -26928 -13563 -14417 -22017 -50222 -27269 545
8346 545 -5668 -10009 -39364 -41533 -27366 -16330 -22976 -32075 -27357 -24833 -26006 -38944 -27650 -13726
8332 -13726 -23363 -17906 -44011 -41250 -18575 -45982 -1299 -9449 -20981 -13692 -45713 -50922 -17139
8319 -17139 -14604 -29260 -28047 -46728 -5613 -2755 -9398 7480 12569 -5755 -32234 -28614 -22225
8306 -22225 -20581 -25587 -26381 -28829 -4095 -19490 -25528 -47495 -20143 -16618 -18954 -36304 -26121
8293b6121J4152Q565K191m3619L0988l4093O508k662O93k4733L6117l023p351
8280d2388K2550j744Q680j1146j7908J327J2079m008J2721N067L3143k2517J695
8267b449L0978o090Q565l3050L3358l2892M914q958N457O114J545j6344o260J928
8253a3184J389l1975J8274J0249L120l2692K2978k1943L0848K204n636m60k1045
8240c7873L713l4855J4904J4759K3374j8827J641l529L082k3885K2950k4755M3915
8227a5386m8907L266K9294q369K397k6527K8380L220P00l2598J6608l009P974
8214d2957K4669k3986l490k5412K1001J5478j8497j6458J0108K1519k274L2109
8202h190O502n0000P977L4677m4882J2105r810N7442j02335L0779j82078J70243
$$ plain form
8293 -26121 -11969 -3404 -1213 -44832 -13844 -47937 -41429 -44091 -43398 -68131 -32014 -35037 -42388
8280 -42388 -19838 -21582 -12902 -24048 -41956 -40629 -28550 -32558 -19837 -14770 18373 -4144 -2449
8267 -2449 28529 22439 31004 -2046 31312 -1580 3334 -5624 -167 5947 7492 -8852 -15112 -13184
8253 -13184 -11795 -43770 -25496 -15247 -12127 -44819 -21841 -43784 -12936 -10732 -16368 -16828 -37873
8240 -37873 -34160 -69015 -54111 -39352 -15978 -34805 -33164 -36693 -33611 -57496 -34546 -59301 -15386
8227 -15386 -64293 -61027 -31733 -40102 -37705 -64232 -35852 -32632 -31932 -64530 -47922 -50931 -42957
8214 -42957 -18288 -42274 -45764 -71176 -50175 -34697 -53194 -69652 -59544 -38025 -40299 -8190
8202 -8190 -1688 -51688 -43711 -9034 -53916 -41811 -51621 5821 -96514 -65735 -247813 -77570
8190g7570N6683L0590k5391k9565j1535L229l6097K8441J5894j4945M5853j5659
8178c0072J0779n961k7124P435J124k6599M0933q476R307J9852m3169L0940p352
8165b8383j4598j2359j3791J1022P299J1437j2685P312K3514k1972O042q028k3048
8152f8238J2824J3417J4505k0790J0607J339k23L251K949j4721k3325J1186J7261
8139c9958J1834L307N836k8188R464k3403K8877k1362n69l839l522K5202j7764
8126e4085K1627P364j7132j2659K060J7899l0742J3797N625L457J8953k0409k8281
8113g2526M1504L280j8111m542k4745K2352J0140K348j1160L2119m984k0938N7
8100d5206p715k0334l940L7150k7359K1142O61J973l204O974R419l2333j7137
$$ plain form
8190 -77570 -20887 9703 -15688 -45253 -56788 -53559 -89656 -61215 -45321 -60266 -14413 -30072
8178 -30072 -19293 -25254 -52378 -44943 -43819 -70418 -29485 -37961 -28654 -8802 -51971 -21031 -28383
8165 -28383 -42981 -55340 -69131 -58109 -50810 -39373 -52058 -44746 -21232 -43204 -37162 -45190 -68238
8152 -68238 -55414 -41997 -27492 -48282 -37675 -36336 -36559 -33308 -30359 -45080 -68405 -57219 -39958
8139 -39958 -28124 -24817 -18981 -47169 -37705 -61108 -32231 -53593 -54162 -58001 -61523 -36321 -54085
8126 -54085 -32458 -25094 -42226 -54885 -52825 -34926 -65668 -51871 -46246 -42789 -23836 -44245 -72526
8113 -72526 -31022 -27742 -45853 -50395 -75140 -52788 -42648 -40300 -51460 -19341 -24325 -45263 -45206
8100 -45206 -52921 -73255 -77195 -40045 -67404 -46262 -45601 -43628 -46832 -39858 -30439 -62772 -79909
8087g9909K438K5237j9882L3799j5039J2133J8809n905k6620p099J9790j1373
8075e3621j2564K2319J4507k6717L1732q810o479K962m09k1789M462J6110p260
8062d5557l168K8980n1390l207K3694m309J4793m2152K0556J9185l114p615p863
8049f1167J562K4628N095k9137L047J4664j1627K6323m5504K6234J6674l1764
8037f0972R467p089P278O192J830j4573j0989K784J8048J7550j0694L095j0476
8024d8549l2392l307R741M226J4779k5377K8949K489J0580P012J119k9317J0983
8011d9064m647J871J7933q149k343K6365l5469L644J6417k9729K9676J0088p382
7998c0789k9366K8256l7933P578K2042j3476Q856j3353k4312K3472N892J6020
$$ plain form
8087 -79909 -77471 -52234 -72116 -38317 -53356 -41223 -22414 -28319 -54939 -62038 -42248 -53621
8075 -53621 -66185 -43866 -29359 -56076 -24344 -33154 -39633 -36671 -37080 -58869 -54407 -38297 -45557
8062 -45557 -48725 -19745 -71135 -74342 -50648 -54957 -40164 -82316 -61760 -42575 -45689 -53304 -61167
8049 -61167 -59605 -34977 -29882 -59019 -55972 -41308 -52935 -26612 -72116 -45882 -29208 -60972
8037 -60972 -51505 -58594 -51316 -45124 -43294 -57867 -68856 -66072 -48024 -30474 -41168 -38073 -48549
8024 -48549 -80941 -84248 -74507 -70281 -55502 -80879 -51930 -49441 -38861 -31849 -30730 -60047 -49064
8011 -49064 -53711 -51840 -33907 -42056 -44399 -18034 -53503 -49859 -33442 -63171 -33495 -23407 -30789
7998 -30789 -60155 -31899 -69832 -62254 -40212 -53688 -44832 -58185 -82497 -59025 -53133 -37113
7986c7113Q505r507M050j4812j3415K7362j5680K0568j339l0320J683L2039q846
7973c6825J7793l8906J7124l625R723j8147L578K7703l9079J0752K2434l3660
7961f1135N0930k1990o456j0641N175j1058j9452M508J2229K8742k3207K7616
7949b4739M647j7084K9735o100k2696m425N062J85J3125K0104r9O18J3114l386
7935H061J218m0695K6912j2267J6047l6871K4889K3289j3956j7705q617R158m2382
7922f2919J4846J4753k5710J1160J0415J1788p092Q71J747j8350o652N136M575
7909d5432J6213j6783P625j4772J3952o133K0836k9620K6831n6488J6810K168
7897f4793K3952j3421J9152q256k1661J5716K3712o3062L7854J8400k2499L2103
$$ plain form
7986 -37113 -28608 -38115 -34065 -48877 -62292 -34930 -50610 -30042 -31381 -61701 -60018 -27979 -36825
7973 -36825 -19032 -57938 -40814 -44439 -34716 -52863 -49285 -21582 -60661 -49909 -27475 -61135
7961 -61135 -10205 -32195 -38651 -49292 -44117 -55175 -74627 -70119 -57890 -29148 -52355 -24739
7949 -24739 -20092 -37176 -7441 -13541 -36237 -40662 -35600 -35415 -22290 -2186 -2285 -1667 11447 8061
7935 8061 9279 -31416 -4504 -16771 -724 -37595 -12706 10583 -3373 -21078 -29695 -20537 -62919
7922 -62919 -48073 -33320 -59030 -47870 -37455 -25667 -32759 -31888 -30141 -48491 -55143 -50007 -45432
7909 -45432 -29219 -46002 -38377 -53149 -39197 -45330 -24494 -54114 -27283 -83771 -66961 -64793
7897 -64793 -40841 -54262 -35110 -43366 -65027 -49311 -25599 -88661 -50807 -32407 -54906 -22803
7885b2803m2300J7600Q590K6145j718l0281K9978j1148M056N216k3005j1166Q079
7872d2757M555J2302P150k1876L4764l1330n586K419p415J2837k6968n991L1423
7859c6473O984p655k4057J8124k3519J3765j2164k0379J8909j8959P844L8667
7847c8913Q974p35m2800O248K3343k4365J7911j3928L0792q572J0915j6952J25
7834d7957K640O532k0744m01J2109K929r549K3038p083n000j230J0212m4906L1486
7820d7924M22k4445K3055J289K080j0071K081K4307Q360m1558j9122K9286r210
7807f1450M447L250o929L2417j018p561J5922k0926P607l34m329K469R402l2142
7793e9175J5236N297j2602O201o201N37K831o585j622L3582j0708m618k005l2986
$$ plain form
7885 -22803 -65103 -47503 -38913 -12768 -14486 -44767 -14789 -25937 -21881 -16665 -39670 -50836 -42757
7872 -42757 -38202 -25900 -18750 -40626 -5862 -37192 -42778 -40359 -47774 -34937 -61905 -67896 -36473
7859 -36473 -29489 -37144 -61201 -43077 -66596 -52831 -64995 -85374 -66465 -85424 -77580 -38913
7847 -38913 -29939 -30674 -73474 -67226 -43883 -68248 -50337 -64265 -33473 -42045 -31130 -48082 -47957
7834 -47957 -45317 -38785 -59529 -59930 -47821 -44892 -54441 -31403 -38486 -43486 -44716 -34504 -79410 -47924
7820 -47924 -47502 -71947 -48892 -47603 -45523 -55594 -53513 -29206 -20846 -62404 -81526 -52240 -61450
7807 -61450 -57003 -53753 -60682 -28265 -29283 -36844 -20922 -41848 -34241 -34575 -38904 -36435 -27033 -59175
7793 -59175 -43939 -38642 -51244 -45043 -51244 -50707 -47876 -54461 -56083 -22501 -33209 -37827 -39832 -72818
7779g2818K9599j8142J4949r37N841m616r850j7411M0928j0735j9394j305J7564
7766d6327q88j7978K3293R249n40M230k1160k865k088o261j0716L7263k8590M061
7752e9317P126K1143j7085k2678K6336k0932j4426L5529N172o967R055o268j3357
7739e6669L259j4059J2571q965J8602k3253J1193N284K6381l9322K4863j7432
7727e7547j3099L4728j3780l1040J846L1012o998P043j3458J4849m1546L0571
7715e7419k3870K7230j7180J498J2694j6757n300K8904q098l992n997q229N36
7702g5980L647p052M6742l6073J4854j3517l0104L4382L2392l2233J946J698N474
7689e3824N12L811m2717K8289J0781j9417O697n398J383K3947L217l4335K3334
$$ plain form
7779 -72818 -43219 -61361 -46412 -47349 -41508 -46124 -55974 -73385 -32457 -43192 -62586 -63891 -46327
7766 -46327 -47215 -65193 -41900 -32651 -33191 -28961 -50121 -52986 -55074 -61335 -72051 -34788 -63378 -59317
7752 -59317 -52191 -31048 -48133 -70811 -44475 -65407 -79833 -44304 -39132 -46099 -37044 -43312 -56669
7739 -56669 -53410 -67469 -54898 -63863 -45261 -68514 -57321 -52037 -25656 -64978 -40115 -57547
7727 -57547 -70646 -35918 -49698 -80738 -78892 -47880 -54878 -47835 -61293 -46444 -87990 -57419
7715 -57419 -81289 -54059 -71239 -69741 -57047 -73804 -79104 -50200 -58298 -62290 -68287 -76516 -75980
7702 -75980 -72333 -79385 -32643 -68716 -53862 -67379 -97483 -63101 -30709 -62942 -60996 -59298 -53824
7689 -53824 -53312 -49501 -92218 -63929 -53148 -72565 -65868 -71266 -69883 -45936 -42719 -77054 -53720
7676e3720l051K528k1017J082P048Q931O996R408l0156K3242O165p773j1002L689
7662e7630k8214K7084K1862l0146L4474o358j4477j7361j7080J2582K6772R176
7650c9316j5817O393j414K1258k6719J8270J5002m2098J6109J6834k2526n801
7638e9825L0666L333J8934m4278k3165M7172n5904L2569m750N014K6424k2521
7626d6331q36J5341q708j1787K5772l179k2153k0220J9768j0561L3089j5156P988
7613c6973J352J6433j5762j2165j9569n751J3000J1606K933m8281K7513K6056
7601c9608m0462L9563J1002o361j5147R313k9423K298K7567R050j8085J9850k6458
7588e6901L5092k3881P151k7102p682K1414j0844K4650J3472l7307K1353j601
$$ plain form
7676 -53720 -56771 -54243 -75260 -74178 -67130 -58199 -51203 -41795 -71951 -48709 -42544 -50317 -61319 -57630
7662 -57630 -85844 -58760 -36898 -67044 -32570 -38928 -53405 -70766 -87846 -75264 -48492 -39316
7650 -39316 -55133 -48740 -50154 -28896 -55615 -37345 -22343 -64441 -48332 -31498 -54024 -59825
7638 -59825 -29159 -25826 -6892 -51170 -74335 -27163 -83067 -50498 -55248 -50234 -23810 -46331
7626 -46331 -47167 -31826 -40534 -52321 -26549 -29728 -51881 -72101 -52333 -62894 -29805 -44961 -36973
7613 -36973 -35621 -19188 -34950 -47115 -66684 -72435 -59435 -47829 -44896 -93177 -65664 -39608
7601 -39608 -80070 -40507 -29505 -35866 -51013 -41700 -71123 -68825 -41258 -32208 -50293 -30443 -56901
7588 -56901 -21809 -45690 -38539 -65641 -73323 -51909 -62753 -38103 -24631 -61938 -40585 -42186
7576d2186J216k5668K6944Q844m2277L2462o018L259K624j5790J9041j0128J3405
7563c4272k2198K364k4459K2272L923q87J2305L352P948J0380l4237M5401k9157
7550c7265j7292q830J1135J1865J2142k1711J8481K2305l1865L4716n7347M0765
7538b2901j5821K0552j3753L2855j4792K0760L7429j1624k5703q978K4943k4805
7526a838l944J1301N169j211j7225j2020k326L8732j9104k5168j2987K2069k5365
7513d3917K1476j1139K1252k4969K4844m195l1783Q190N518j1805P701m873k389
7500d6089L587l460j0918L3576r969j3188q960l956j0492j235J0686K1396k6344
7487f5366O68J2940p319J568J1188J1352k7870K013J1635r334L3524q444J2118
$$ plain form
7576 -42186 -40970 -66638 -39694 -30850 -73127 -40665 -46683 -43424 -40800 -56590 -37549 -47677 -34272
7563 -34272 -56470 -54106 -78565 -56293 -52370 -53257 -40952 -37600 -29652 -19272 -53509 -8108 -37265
7550 -37265 -54557 -63387 -52252 -40387 -28245 -49956 -31475 -9170 -41035 -6319 -63666 -22901
7538 -22901 -38722 -18170 -31923 932 -13860 6900 44329 32705 7002 -1976 22967 -1838
7526 -1838 -5782 5519 10688 9477 -7748 -19768 -22094 16638 -2466 -27634 -40621 -18552 -43917
7513 -43917 -22441 -33580 -12328 -37297 -12453 -16648 -48431 -40241 -34723 -46528 -38827 -43700 -46089
7500 -46089 -42502 -45962 -56880 -23304 -33273 -46461 -55421 -59377 -69869 -71104 -60418 -39022 -65366
7487 -65366 -64698 -51758 -59077 -57509 -46321 -34969 -62839 -60826 -49191 -58525 -25001 -33445 -21327
7474b1327k7415P577j5345Q995j5331L5956r876j943R469j4715J3753j888J5103
7461a6987k3516J9721m481K3732l4319M735K4932J654l502q558l1410K5068J7281
7448e650l1374L9003l1377K1504k0108l177J9150K4393l528k7138K174q712n74
7435b5414j555L2733k5780Q532m9L130j0971K0462K552k0402O617J8180k0945
7422a2910J4914P190P972k9195M0361l4871J6637j0633J4899J6549q106R228l229
7409B8806L2344k9151k0182M006K1653k3546K9678j6571J8515m241j6442k38l8136
7396a3505J7008o065O119J9219J8153j7592L3988p472j2351J9171r881J1843j6923
7383D1712k897O186j1708L5231L2637k9963m823o08n819n831L1589j5130r541
$$ plain form
7474 -21327 -48742 -41165 -56510 -47515 -62846 -26890 -36766 -38709 -29240 -43955 -30202 -32090 -16987
7461 -16987 -40503 -20782 -25263 -1531 -35850 -31115 -6183 -4529 -8031 -16589 -47999 -22931 -5650
7448 -5650 -37024 1979 -29398 -7894 -28002 -31179 -12029 12364 8836 -18302 -16128 -24840 -25414
7435 -25414 -26969 5764 -20016 -11484 -11533 -8403 -19374 1088 3640 -16762 -10145 8035 -12910
7422 -12910 2004 9194 17166 -12029 28332 -6539 10098 -535 14364 30913 22807 32035 28806
7409 28806 61150 31999 11817 15823 37476 13930 43608 27037 45552 41311 24869 24631 -13505
7396 -13505 3503 -2562 3557 22776 40929 23337 57325 49853 37502 56673 46792 58635 41712
7383 41712 38815 45001 33293 68524 101161 71198 66375 65767 59948 54117 85706 70576 61035
7370F1035K6189J2083J276L903Q567k7917j0560L555K3437p562J6401j1271Q683
7357A07819J1516P482J3657j1388O13P330l3144J8155K0430M402K0295k0060K4111
7344A71218K574K605o078J8160m287R212n943K1501M9093L4069k6677j8750j5679
7331B31018m7418Q067q0427m325o5365O72l9216j154L6175L3442J761j1259J9418
7318H1389O71J8865M567l614j3906J7219n6R176J2043K0670J5294j1543K0712
7305A71487l261n472k73K3483m189P000k375P295K0003J5505K0959q596j6694
7292B24872N330K5595k928J1437M423q882J6293K6040j2015K2160k1650K5535
7280C16210J1368j4061j6693K9763j2922K4906k041q609J9582L490J7120J907
$$ plain form
7370 61035 87224 99307 100583 104486 113053 85136 74576 78131 101568 94006 110407 99136 107819
7357 107819 119335 126817 140474 129086 129699 137029 103885 122040 142470 146872 167167 147107 171218
7344 171218 173792 176397 170319 188479 184192 193404 187461 208962 258055 292124 265447 246697 231018
7331 231018 183600 191667 111240 106915 41550 42222 3006 1852 38027 71469 73230 61971 81389
7318 81389 82060 100925 105492 101878 87972 105191 105135 114311 126354 147024 162318 150775 171487
7305 171487 168226 162754 162481 185964 181775 188775 186400 193695 213698 229203 250162 241566 224872
7292 224872 230202 255797 252869 264306 268729 259847 276140 302180 290165 312325 290675 316210
7280 316210 327578 313517 296824 326587 313665 338571 336530 327921 347503 350993 368113 370020
7268C70020Q665l904j2665J969J6773l564J6562K1323L2368n0793K3068L520Q681
7255D32023J6438k5849j4419J9337J3880r504O0999k5551J6155O888J3778K1878
7243E26053n235j3956K2766N145J2395K1486M474L5124j8553M968L3595j776l0741
7230E95745K6454K4171M430K0229l4528J8443L0106k1980R686L9065R067L6547
7218G57435k2512P5598K5536L4835l6768Q7870o5169K2974K0340j0657j3089O5497
7206I41890l5481O399L5162l9922N4835k6464J3770L2814j3463N6676J9091K4196
7194A069503L6973N8356J0811M4050J8173M875M5031L8996j8059O8263J0756N1492
7182A439220K1753M5583L6136L9984M850P415L5822J2643J7717K7366N3643O845
$$ plain form
7268 370020 378685 374781 362116 364085 380858 377294 393856 415179 447547 396754 419822 423342 432023
7255 432023 448461 422612 408193 427530 441410 431906 492905 467354 483509 490397 504175 526053
7243 526053 520818 506862 529628 534773 547168 568654 573128 608252 589699 594667 628262 626486 595745
7230 595745 622199 646370 650800 671029 636501 654944 685050 663070 672756 711821 720888 757435
7218 757435 734923 810521 836057 870892 834124 921994 856825 879799 900139 889482 876393 941890
7206 941890 906409 912808 947970 908048 962883 936419 950189 983003 969540 1026216 1045307 1069503
7194 1069503 1106476 1164832 1175643 1219693 1237866 1242741 1287772 1326768 1308709 1376972 1387728 1439220
7182 1439220 1460973 1506556 1542692 1582676 1587526 1594941 1630763 1643406 1661123 1688489 1742132 1748977
7170A748977R418P432M782j1982J0761K0978j1810o249J6747J3852l029M1645
7158A841522R111j6882N5241K6669P9366P1383N7606Q8935N9147J00940R6441
7147B469479N3957R0090J16231K6165J06413M3047Q9453L8790J14592R3998L3401
7136C275616J00234K4810L7114M4536K3899M6123N4767N3302L5412N6848N4689
7125C807350O8034Q9907Q4128P6173R3116J09573O4842P2802J24126M1402Q9305
7114D720758M6590O3807L1633R1945P2390K9554P2806O2150N6848J10656R0985
7103E450122J03706R4864J11157J07723J22690J25217J48932J52596J67904J58921
7093F743832J56395J94668J55617J90278K21207J69982K02668K02834K38708K43971
$$ plain form
7170 1748977 1758395 1765827 1770609 1758627 1769388 1790366 1778556 1772307 1789054 1802906 1799877 1841522
7158 1841522 1850633 1833751 1888992 1915661 1995027 2066410 2124016 2212951 2272098 2373038 2469479
7147 2469479 2523436 2613526 2729757 2755922 2862335 2905382 2994835 3033625 3148217 3242215 3275616
7136 3275616 3375850 3400660 3437774 3482310 3506209 3552332 3607099 3660401 3695813 3752661 3807350
7125 3807350 3875384 3965291 4049419 4125592 4218708 4328281 4393123 4465925 4590051 4631453 4720758
7114 4720758 4767348 4831155 4862788 4954733 5027123 5056677 5129483 5191633 5248481 5359137 5450122
7103 5450122 5553828 5648692 5759849 5867572 5990262 6115479 6264411 6417007 6584911 6743832
7093 6743832 6900227 7094895 7250512 7440790 7661997 7831979 8034647 8237481 8476189 8720160
7083H720160K49707J99048K04395K85680K27090K64637K87940K90387L18636L24709
7073A1372389L51758L27103L30332M21971L89342M48162N17205N48187M93490
7064A5199939N33196N70285N84149O24088O07047P39027Q56425J020721J238017
7055B1972894J518080J857373K146925K333305K696903L059398L642091M173421
7047D3400390M597144N304266O493362P786445R735813J2823305J8050901K8449951
7039A36641577N2665909R4042213R6525929P0648610M0621796K7156895M875852
7032E23178781l0564610l5047773m9603309o5352398o9629268o3509315m7368835
7025A62103273l1775738k1941843j5318105j1391198r503611q606773p653696
$$ plain form
7083 8720160 8969867 9168915 9373310 9658990 9886080 10150717 10438657 10729044 11047680 11372389
7073 11372389 11724147 12051250 12381582 12803553 13192895 13641057 14158262 14706449 15199939
7064 15199939 15733135 16303420 16887569 17511657 18118704 18857731 19714156 20734877 21972894
7055 21972894 23490974 25348347 27495272 29828577 32525480 35584878 39226969 43400390
7047 43400390 47997534 53301800 59795162 67581607 77317420 90140725 108191626 136641577
7039 136641577 189307486 283349699 379875628 450524238 491146034 518302929 523178781
7032 523178781 492614171 457566398 407963089 342610691 272981423 209472108 162103273
7025 162103273 130327535 108385692 93067587 81676389 72172778 63566005 55912309
7018E5912309o265867m568178l809607l063901k385011k138979j847600j573049
7010C0260117j349164j186759j082308r67862q42873q12166q72186q43400q28028
7001B1475371q14877o92776o76781o62761o05174o31550n21303n43501m35765
6992A5890883m25462m62576m37632l51576l21293l74614l37937l09241l16441
6983A2554111k95529l09755k60038k79726k55921k23772k35165k74337k24524
6974A0195344k60310k37211k06759k04184k26230j77756k05936k29196j85980
6965H261782j80020j58475j72862j66916j27295j84911j96427j68556j70378j67785
6955F568157j20061j49905j23515j09793j21398p8145p6538p5126q7513j02846
$$ plain form
7018 55912309 49646442 45078264 41268657 38204756 35819745 33680766 31833166 30260117
7010 30260117 28910953 27724194 26641886 25674024 24831151 24018985 23146799 22303399 21475371
7001 21475371 20660494 19967718 19290937 18628176 18023002 17391452 16870149 16326648 15890883
6992 15890883 15465421 15002845 14565213 14213637 13892344 13517730 13179793 12870552 12554111
6983 12554111 12258582 11948827 11688789 11409063 11153142 10929370 10694205 10419868 10195344
6974 10195344 9935034 9697823 9491064 9286880 9060650 8882894 8676958 8447762 8261782
6965 8261782 8081762 7923287 7750425 7583509 7456214 7271303 7074876 6906320 6735942 6568157
6955 6568157 6448096 6298191 6174676 6064883 5943485 5865340 5788802 5713676 5626163 5523317
6945E523317j37147j61290j43186j33155j30427j17656j22342j39911j48789j24359
6935D165055j03726j21682j12557r9196r8273o6554n3838j01346p6947o9697r7626
6924C163613o8311k9555r5683R387o2536m9642j4301j2319q663j4011n1627P89
6912B767141r1394k7528p3855l3019k7200l6039l7508p4544o4963n3066n7032
6901B190993n3684k5208o8196o1495o0167m7678n4797p0989l0566l5237p2557
6890A610419m1084m7554n230n4557l1982n3122J4219m3039l086l0784n3826l3143
6878A227231P815l0452j6546k5552p188j1406M0260K1770l0990J84k0322l4209
6866A120595l7187j5949k2025p2943j5962j8078l5190J8270k4109o983q507k3889
$$ plain form
6945 5523317 5386170 5224880 5081694 4948539 4818112 4700456 4578114 4438203 4289414 4165055
6935 4165055 4061329 3939647 3827090 3727894 3629621 3563067 3509229 3407883 3330936 3261239 3163613
6924 3163613 3095302 3065747 2970064 2979451 2916915 2867273 2852972 2840653 2831990 2817979 2766352 2767141
6912 2767141 2675747 2648219 2574364 2541345 2514145 2478106 2440598 2366054 2301091 2248025 2190993
6901 2190993 2137309 2112101 2043905 1982410 1922243 1874565 1819768 1748779 1718213 1682976 1610419
6890 1610419 1569335 1521781 1516551 1461994 1430012 1376890 1391109 1348070 1344984 1314200 1260374 1227231
6878 1227231 1235046 1204594 1188048 1162496 1155308 1143902 1184162 1205932 1174942 1175126 1154804 1120595
6866 1120595 1083408 1067459 1045434 972491 956529 938451 903261 921531 897422 890439 881932 858043
6854H58043n9161K0852l9939l229k260J462K5l7755q61j6128m1091J6222l9418
6841F56762m1422n389J1922k6453J0555m8846j6243j905k969l3751Q375K04j0002
6828E00838l1720J5464j4677k0828q695L1237k3564l0724K9418n0510r978K5166
6816D11427k8615m0J3962j0309n9548Q961K4504k1806r151J1298j2571k981k1793
6803C03338N836r69k6137j364J6054k4730n548j4504L3998k3526M299j3729j3181
6790B39837R477j3269j8075j8147M121m541K250j1083K4363l0625k4727L0184
6778A89765k8844j578n62r424M206J2013R602l529Q08M340P73k433o718N062M64
6763A73945J6041J9962l9764L466M0506j0647l3405K2275k7346o8J1019J6967
$$ plain form
6854 858043 798882 819734 779795 776566 774306 775768 775793 738038 737177 721049 679958 696180 656762
6841 656762 615340 609951 621873 595420 605975 557129 540886 538981 536012 502261 510636 510840 500838
6828 500838 469118 484582 469905 449077 440382 471619 448055 417331 446749 396239 386261 411427
6816 411427 382812 382772 396734 386425 326877 335838 360342 338536 329385 340683 328112 325131 303338
6803 303338 309174 308205 282068 280704 296758 272028 266480 251976 285974 262448 266747 253018 239837
6790 239837 249314 236045 217970 199823 203944 199403 201653 190570 214933 184308 159581 189765
6778 189765 160921 159343 158781 149357 153563 165576 175178 171649 172457 176797 177570 175137 168419 173481 173945
6763 173945 189986 209948 170184 173650 214156 203509 170104 192379 165033 164965 175984 192951
6751A92951K7100L3488n6192K6910p453J1432J5046q58k0232P1981k2323k5595
6739B46255j3316n6065j2458q3250k8069l4646j5486l9900L9939l10n814M7775
6727D4655l435J2584N280j4264J5815J7797j9408J200L0373J3568k7769n738K7793
6714I8451q223q973L300J1461l1358L2390Q537l2451k125N118L1280j8327J661
6701I0741J0776K122Q008J8958J3951k1764j5308J2234k3905L267J3692R267p810
6688A14229Q532L142l473j1626L843m287j4581K1758p595k7121J8226o500J4863
6675A09410J3687Q922K311M368O895j6181J9799n645J9299j0402k6913O036o10
6662A30976J050j3788m618J4654J4288k1788J0107P58J8179L394l0314K6675J49
$$ plain form
6751 192951 220051 253539 197347 224257 216804 228236 243282 242424 222192 294173 271850 246255
6739 246255 232939 176874 164416 81166 53097 18451 2965 -36935 3004 2694 -3120 44655
6727 44655 41220 53804 59084 44820 60635 78432 59024 60224 90597 104165 76396 70658 98451
6714 98451 90228 81255 84555 96016 64658 97048 105585 73134 71009 76127 107407 89080 90741
6701 90741 101517 103639 111647 130605 144556 122792 107484 119718 95813 99080 112772 122039 114229
6688 114229 122761 125903 122430 110804 114647 110360 95779 117537 109942 82821 101047 94547 109410
6675 109410 123097 132019 134330 138698 145593 129412 149211 143566 162865 152463 125550 131586 130976
6662 130976 132026 118238 113620 128274 142562 120774 130881 131639 149818 153212 122898 149573 149722
6649A49722J2758N513k7104L5032J8923j0614k93j7685p940J9889J6905k1476
6637A73630J1614J6225j8734K6086j0060j1421r241J3761P787M267J4914K496
6625B21324O326j6758K9196J566J8625k0664J0093j6906k559K1905l0212N9000
6613B80936J5728R687o485n51M6864L006Q6365K2263R9858J14440J27786J60861
6601I60758Q4861Q6263J5685J0958n9825m9889j02887r4896r6833n2736n4423
6590F47036n7719o2504J6020K0389J1441K9326n03j6349Q1256M9817N1268J11356
6578H80834J17055K16683K98957M36889M66803L15177K30429J40447p6125j21506
6568B905643k02540k93092l18342l23869k73464k69007j33011j01851p2587m1116
$$ plain form
6649 149722 162480 167993 140889 175921 194844 184230 183937 166252 158312 178201 195106 173630
6637 173630 185244 201469 182735 208821 198761 187340 178099 191860 199647 203914 218828 221324
6625 221324 227650 210892 240088 241654 260279 239615 249708 232802 230243 252148 221936 280936
6613 280936 296664 306351 299866 299315 346179 349185 435550 457813 557671 672111 799897 960758
6601 960758 1045619 1131882 1147567 1158525 1098700 1048811 945924 851028 754195 701459 647036
6590 647036 589317 526813 542833 563222 574663 603989 603486 587137 668393 718210 769478 880834
6578 880834 997889 1214572 1513529 1950418 2417221 2732398 2962827 3103274 3027149 2905643
6568 2905643 2703103 2410011 2091669 1767800 1494336 1225329 1092318 990467 917880 876764
6558H76764m5965K867m2965K5500K8262J2088L6685L7439R0751J82032K88282
6547A491740M14568N16648L56839K34142J59948k1462j44800j91318l03867l24186
6537B188252l17004l36140k32922k01247j07608q6200q0362l4731m6578n8842
6527F86618k9003J8660m6023M1263N438J7975K9801Q5976J04493J36462J12952
6516A164612N7393N5872J753n3624p4692o9458q2859j29306j38400r1867l2869
6505F06555q1071k0233p2297j9358J9499n509j7933k2281k2306P853l075j0543
6493C59301j2546L890j650l0199j1994M5910K155j9824n673J3417k0367K4799
6481C47219j1959l4150L3018j4815p706K455m0014M899J0964j8350j9650q887
$$ plain form
6558 876764 830799 833666 790701 816201 844463 856551 893236 930675 1021426 1203458 1491740
6547 1491740 1906308 2422956 2779795 3013937 3173885 3152423 3007623 2816305 2512438 2188252
6537 2188252 1871248 1535108 1302186 1100939 993331 907131 826769 792038 745460 686618
6527 686618 657615 676275 630252 671515 676953 694928 724729 810705 915198 1051660 1164612
6516 1164612 1222005 1277877 1279630 1226006 1151314 1081856 998997 869691 731291 639424 606555
6505 606555 525484 505251 432954 413596 433095 427586 409653 387372 365066 372919 369844 359301
6493 359301 346755 350645 348995 318796 306802 352712 354867 335043 329370 342787 322420 347219
6481 347219 335260 301110 334128 319313 311607 314062 274048 278947 289911 271561 251911 243024
6469B43024K2343j2545j0564m572O899N00l0198N5371k6741M778K6129j8245j7492
6456B38687K2381q587K3323L069k2762K6514k3918Q235j9496J3829j6009K5952
6444B71218q833L2981K8572j9457L9213j1760J31J1812j257j4885j0503l6737
6432B80495m67R314j577J8544n667P033K7067M291J221N1832j1505N9969N9715
6419E00265J03649J16313J08183N2953M7820j1614m5871m6992l9170n3876q4872
6408F46788j6356k6660L1948l2357K8684k157J4948j1448K1450K1320K3280O3352
6396G62792R1257K12733K83840K59092J93357P0971O7783p9211j24665r5028k06590
6385A436331k16006j56926j77823j09942m7636n7395j0013l723Q298k1309N7261
$$ plain form
6469 243024 265367 252822 242258 237686 244585 245085 214887 270258 243517 248295 274424 256179 238687
6456 238687 261068 252481 275804 278873 256111 282625 258707 266942 247446 261275 245266 271218
6444 271218 262385 295366 323938 304481 343694 331934 332065 343877 342620 327735 317232 280495
6432 280495 280028 289342 287765 306309 300642 307675 334742 339033 340254 392086 380581 440550 500265
6419 500265 603914 720227 828410 881363 929183 917569 871698 824706 785536 731660 646788
6408 646788 630432 603772 635720 603363 632047 629890 644838 633390 654840 676160 699440 762792
6396 762792 854049 1066782 1350622 1609714 1803071 1874042 1941825 1862614 1737949 1642921 1436331
6385 1436331 1220325 1063399 885576 775634 727998 670603 660590 656867 665165 643856 701117
6374G01117M1474N6078R2351J97422L75945M34305L25653J60110R8172J7681j35329
6363B364979j61925k45053k36540k87991k79593j84494j54447k1368p5747j1763
6353G06058m8334j65j6536J7112K9649K1368J36044K04740L02271K89694K15541
6342A857442R6825N1540n9078j21668j65957j73231k39599k00187j82492j48734
6332G14861o4352p2224k4006m7160k541k2143l5666O734J4130J8905N3608J12469
6320F52615J32914R4412O5765K1660K3149p0798n7620p9097r6319o2927q7995
6309E35759o0630p7084P462n5465j4076j5201l0929J1000k6793J4099j3436M6264
6297C20970L34n58K1108L1197j2669J295l304K843j9386j3442k9300k3765K417
$$ plain form
6374 701117 742591 798669 891020 1088442 1464387 1898692 2224345 2384455 2482627 2500308 2364979
6363 2364979 2203054 1958001 1721461 1433470 1153877 969383 814936 793568 717821 706058
6353 706058 657724 657559 641023 658135 687784 709152 845196 1049936 1352207 1641901 1857442
6342 1857442 1954267 2005807 1946729 1825061 1659104 1485873 1246274 1046087 863595 714861
6332 714861 650509 578285 554279 507119 504578 482435 446769 453503 467633 486538 540146 652615
6320 652615 785529 879941 945706 967366 990515 919717 862097 783000 686681 623754 535759
6309 535759 475129 398045 405507 350042 335966 320765 289836 300836 274043 288142 274706 320970
6297 320970 321304 320746 341854 373051 360382 361677 358373 361216 341830 328388 299088 275323 277740
6284B77740k1500J0927l7976K3292J8625j9661j4746L9053J3430K0696k5475r814
6272B74591O284n589L6929l0482L4334k0987J3421r014L8548K725j5482J6227
6260C41505k1343j1099j1418K2161m1426l313k1638R117j264K5430N756J2003
6248C04471K867K3016J2119n92K6876K1304J5919K0610J5344J3686J3805J5302
6236D84727k9306K5483n6268k1167o250k7391K5178n4915l4805Q666M278o146
6224C12084q659L445m525M6904q502q187L1753K5543K6148k449Q626L1097m723
6211D48555q392R156l7844K679m911r170m3091J9278l9981K4485k7441k1Q487
6198C41789j7269n828N065j6576M097N2174k3289J0918J7806k0247L8712M0914
$$ plain form
6284 277740 256240 267167 229191 252483 271108 251447 236701 275754 289184 309880 284405 274591
6272 274591 280875 275286 312215 281733 316067 295080 308501 299487 338035 340760 325278 341505
6260 341505 320162 309063 297645 319806 278380 275067 253429 262546 261282 286712 292468 304471
6248 304471 307338 330354 342473 341881 368757 390061 405980 426590 441934 455620 469425 484727
6236 484727 455421 480904 424636 403469 397219 369828 395006 340091 305286 313952 318230 312084
6224 312084 303425 306870 302345 349249 340747 332560 364313 389856 416004 413555 422181 453278 448555
6211 448555 440163 449319 411475 414154 409243 400073 356982 376260 336279 360764 333323 333302 341789
6198 341789 324520 318692 323757 307181 311278 363452 340163 351081 368887 348640 387352 428266
6186D28266o387M8295K6891l1656L3404k6148K5044K83J374L486J2443K272o942
6173E10625N06l5579k442O641k6766o396O645J3634k509k5006J5761K8448k8913
6160D54649J5991Q290K2751L2414o923N3443K308L5068M4133J8135m982q922l1947
6147F34408k4738J5283n1969m6210j6194j9924l2678k2783J2397k3636k367k6622
6135C94967L58m147K4844m289L4871J7609L2136L081k383L6764Q292L396R351
6122E54850M561m5874J8463k6233o4930J6228m2636o925j4695Q669j3711l617
6110C84150K2158j8958k7497L0548J1085r583K9661l829j1748M0501l729k8975
6098D13784K1938j9313J3062Q975K0424r713j263K0304k4348j0002K5625P274
$$ plain form
6186 428266 421879 470174 497065 465409 498813 472665 497709 497992 499366 502852 515295 517567 510625
6173 510625 511131 475552 473110 479751 452985 446589 453234 466868 464359 439353 455114 483562 454649
6160 454649 470640 478930 501681 534095 527172 580615 582923 617991 662124 680259 675277 666355 634408
6147 634408 609670 624953 572984 526774 510580 490656 457978 435195 447592 423956 421589 394967
6135 394967 395325 391178 416022 411733 446604 464213 496349 499430 497047 533811 542103 545499 554850
6122 554850 559411 513537 532000 505767 440837 457065 414429 407504 392809 401478 387767 384150
6110 384150 406308 387350 359853 390401 401486 391903 421564 417735 405987 446488 442759 413784
6098 413784 435722 416409 429471 438446 458870 449157 447894 468198 443850 433848 459473 466747
6086D66747J6228j9305LN272J5891M0175m3275j2807K8902r477J8967l397J1688
6073E15612R133L2331M44q858J541M4574k0077j3497J8479k103k1735N6194k0968
6060E91070k6936M7745o591j0353p702K0254k6341o900K6942q269O211J6372K9000
6047F44502P872N5215K0922J0955N5532N2114K4207L6502N1423J3195R605l5806
6035I46238j1673j3852P763j8224n7715L896k6467m0982K0329l9149K3784K681
6023G96629M1903k0091P3556O0922O0318O6185P7149L3684P2511M9121j5641J3825
6011A310071k9008o1340m0522k5083o3319l9610o0621l5580n0326O186j534k9425
5999H79889j7270J2577L4109L718N4532J8681M542P0792p90J7074R085L5323j5332
$$ plain form
6086 466747 482975 463670 463673 468945 484836 525011 481736 468929 497831 488354 507321 503924 515612
6073 515612 524745 557076 557520 548662 550203 594777 574700 561203 579682 577579 555844 612038 591070
6060 591070 564134 611879 605288 594935 587233 607487 581146 574246 601188 592919 599130 615502 644502
6047 644502 652374 707589 728511 739466 794998 847112 871319 907821 959244 972439 982044 946238
6035 946238 934565 920713 928476 910252 852537 856433 829966 788984 809313 770164 793948 796629
6023 796629 838532 818441 891997 952919 1013237 1079422 1156571 1190255 1262766 1311887 1296246 1310071
6011 1310071 1281063 1219723 1179201 1154118 1090799 1051189 990568 954988 904662 910848 909314 879889
5999 879889 862619 875196 909305 913023 967555 986236 990778 1061570 1060780 1077854 1086939 1122262 1106930
5986A106930J4695j2026l304L4596j0934j2982P759m764J820j1389k1857j7115
5974A071429m5341K5494l1375q011j0787j1755M895N7524Q077J6965P0666L5106
5962A182887O8366Q6066P9498Q5661K6744M6752k1912Q759K80n3317m6090o8202
5950A395492j9715k5791o4232q397N010k2393O502j5142l752M9727L6160J8776
5938A352245K5076O2999J3110Q6827L3127o143n798l0416l80m7880Q849k5099
5926A466517n1404J623p782k5107J2999J8780o911P521J1877L1033J0534J5145
5914A484825K6063J2834M6445N429P027M5149N892K6664L2400J8107M9670M0717
5902A801222M4716M5193L9922N158N4855L1556L4513O9808M8002O2182N4757O6163
$$ plain form
5986 1106930 1121625 1109599 1106295 1140891 1129957 1116975 1124734 1119970 1121790 1110401 1088544 1071429
5974 1071429 1026088 1051582 1020207 1012196 1001409 989654 994549 1052073 1060150 1077115 1147781 1182887
5962 1182887 1251253 1337319 1416817 1502478 1529222 1575974 1554062 1562821 1563101 1509784 1463694 1395492
5950 1395492 1375777 1349986 1285754 1277357 1282367 1259974 1266476 1251334 1247582 1297309 1333469 1352245
5938 1352245 1377321 1440320 1453430 1540257 1573384 1567241 1561443 1531027 1530647 1482767 1491616 1466517
5926 1466517 1415113 1416736 1408954 1383847 1396846 1415626 1408715 1416236 1428113 1459146 1469680 1484825
5914 1484825 1510888 1523722 1570167 1575596 1582623 1627772 1633664 1660328 1692728 1710835 1760505 1801222
5902 1801222 1845938 1891131 1931053 1936211 1991066 2022622 2057135 2126943 2174945 2237127 2291884 2358047
5890B358047O9116P0959J09067J14328R2539J13786J66202J58658K11801K25809
5880C690312K47364K98900L58633L75991N13147N40238O90842Q48987J053645
5871H618059J379283J915630K778594M005868N124872N349452M502306L101769
5863C6775833J632290k4551j540858k578649l478576m106985m264740l906297
5855A8507467l238589k487954j820453j373731j027860q49516p36233o23152n47892
5846E802087m39914l76283l24873k80943k55662j84597k35986j69273j37286j52898
5836C244372j37495j07732r8424j12367p2200q4572n8638m7379p1939J5921p1469
5825B398078P23k6546j4204K806j3482k1239l2233l9606m1527n8128n9971p6696
$$ plain form
5890 2358047 2427163 2498122 2607189 2721517 2814056 2927842 3094044 3252702 3464503 3690312
5880 3690312 3937676 4236576 4595209 4971200 5484347 6024585 6715427 7564414 8618059
5871 8618059 9997342 11912972 14691566 18697434 23822306 29171758 33674064 36775833
5863 36775833 38408123 38383572 36842714 34264065 30785489 26678504 22413764 18507467
5855 18507467 15268878 12780924 10960471 9586740 8558880 7709364 6973131 6349979 5802087
5846 5802087 5362173 4985890 4661017 4380074 4124412 3939815 3703829 3534556 3397270 3244372
5836 3244372 3106877 2999145 2900721 2788354 2716154 2631582 2572944 2525565 2453626 2469547 2398078
5825 2398078 2398801 2372255 2358051 2360857 2347375 2326136 2293903 2254297 2212770 2154642 2094671 2017975
5813B017975o6944n5662o8157n9856n4873j9195n0866j9956m4224n499j9536j6449
5801A536758o474k599J3473j0437q016J9830J6449N675j1106J225j8731j2029
5789A524018n272k3068k3127m3872k0989k6031n9379j1067l0883m6470L6722k1364
5777A249218Q092L9397n261J7048m679K3591J1729J9622O655L7497j2816K3856
5765A413949O8278O686L2280j081K3586m263R722J7932L7728K5002O9661K2460
5753A721940J07197J33212J05126J61549J39051J33954J55822J44127Q4197O3544
5743B949719N7209J3929j9587m1497n9522q5507k7885m6986n7831k945j0107k4688
5731B644302J6680N4372j3909L8506K5127M9798P2772J18697J44394J95497K34240
$$ plain form
5813 2017975 1951031 1895369 1827212 1767356 1712483 1693288 1642422 1622466 1578242 1572743 1553207 1536758
5801 1536758 1530284 1527685 1541158 1530721 1522705 1542535 1558984 1564659 1553553 1554778 1536047 1524018
5789 1524018 1518746 1495678 1472551 1428679 1407690 1381659 1322280 1311213 1280330 1233860 1270582 1249218
5777 1249218 1257310 1296707 1291446 1308494 1303815 1327406 1339135 1358757 1365412 1402909 1390093 1413949
5765 1413949 1482227 1488913 1521193 1520112 1543698 1539435 1549157 1567089 1604817 1629819 1699480 1721940
5753 1721940 1829137 1962349 2067475 2229024 2368075 2502029 2657851 2801978 2886175 2949719
5743 2949719 3006928 3020857 3001270 2959773 2900251 2814744 2786859 2739873 2682042 2679097 2668990 2644302
5731 2644302 2660982 2715354 2701445 2739951 2765078 2814876 2887648 3006345 3150739 3346236 3580476
5720C580476K25532K74781K60743K60804J88760J19995P2079j3172r3200j00133
5710D776665j57731k10363k13958k03473j91929j12784j43209q4132n4852j01662
5700C302572j6374Q791n4037l2593k473k8178l8313L4303R541N8357Q0820Q8415
5688C410831O1054R5401J07892P6245J4922K821j2360p5279o6040j22461j24148
5677C368878j10823j54068j42434j18259j16624j18368r1157p6607r8470p9758
5667B262310n4376n2014m9221o8118m3118m8275j5323j3387n4971k052K5694J5655
5655A902804k3041O1265j1248k0265m6852q411l3000n7866k5036o7285m6130n3211
5643A571724j0030r5401n1841m0989k8983l6962j3436k2102k013k6635k6109K1804
$$ plain form
5720 3580476 3806008 4080789 4341532 4602336 4791096 4911091 4983170 4969998 4876798 4776665
5710 4776665 4618934 4408571 4194613 3991140 3799211 3686427 3543218 3459086 3404234 3302572
5700 3302572 3286198 3294989 3240952 3208359 3205886 3177708 3139395 3173698 3183239 3241596 3322416 3410831
5688 3410831 3471885 3567286 3675178 3751423 3766345 3769166 3756806 3681527 3615487 3493026 3368878
5677 3368878 3258055 3103987 2961553 2843294 2726670 2608302 2517145 2440538 2342068 2262310
5667 2262310 2207934 2155920 2106699 2038581 1995463 1947188 1931865 1918478 1863507 1861455 1887149 1902804
5655 1902804 1879763 1941028 1929780 1909515 1862663 1854252 1821252 1763386 1738350 1671065 1624935 1571724
5643 1571724 1561694 1466293 1414452 1373463 1344480 1307518 1294082 1271980 1269967 1243332 1217223 1239027
5631A239027k772m9039m144P5K945k5049K791J1430J7381n294j4792j3558N077
5618A164078J0094L133J6272k6136L9185r340K4340K1907K2606l275J5822M2168
5606A320854o498J7513J8118K6425M3009N031N167L5300K2252L2373N2981J5830
5594A588355Q6431K0790O2382J20972J08396J02619J04780J33661J05592J28348
5584B562326Q7513Q2102P3918P5575N0120K1060N3545o50L6756J3668L4621l3711
5572C056843L2468M8860J4696L9418Q0621N9797J10186J04645J30186J71320J82827
5561D031867J60376K20506J44324J70278J48479P1323M4675Q667l5743j08751
5551D856001o7755j53139j27227j39647j32579j32859j21280l9186j1387l6240
$$ plain form
5631 1239027 1236255 1187216 1183072 1183147 1186092 1161043 1163834 1175264 1192645 1187351 1172559 1159001 1164078
5618 1164078 1174172 1177305 1193577 1167441 1206626 1197286 1221626 1243533 1266139 1262864 1278686 1320854
5606 1320854 1314356 1331869 1349987 1376412 1419421 1424452 1429619 1464919 1487171 1519544 1572525 1588355
5594 1588355 1674786 1695576 1757958 1878930 1987326 2089945 2194725 2328386 2433978 2562326
5584 2562326 2649839 2731941 2805859 2881434 2931554 2952614 3006159 3005509 3042265 3055933 3090554 3056843
5572 3056843 3089311 3138171 3152867 3192285 3272906 3332703 3442889 3547534 3677720 3849040 4031867
5561 4031867 4192243 4412749 4557073 4727351 4875830 4947153 4991828 5000495 4964752 4856001
5551 4856001 4788246 4635107 4507880 4368233 4235654 4102795 3981515 3942329 3930942 3894702
5541C894702L9618P8347M0089J13268Q4459R7150N1425O3860l6274k663j04521
5530D319460m8488j02303j21328o3289j04882j03797q3264r2350p2364p8451o9863
5519C379081p2936n5780j6292m749K7771L2121Q8940J31271J22959J42896J46952
5508C922234J03902J19074O5346L2439k8776r7138j24548j66406j79068j88559
5498C458500k10690k20410j60286j43756j42339j12414p5658k9430l4287j8388
5488B310842n708N7908M4835N7076L9002Q6261P1061O1122M6596J01833K6791
5477B897619K3536l3378l5325r1631r0767j18313j13580j39557j64648r6693j36946
5466A900317p4504j33491q4331p3050o9586j2998n5539k1908l2988m669q442l7385
$$ plain form
5541 3894702 3934320 4012667 4052756 4166024 4250483 4347633 4399058 4462918 4426644 4423981 4319460
5530 4319460 4270972 4168669 4047341 3984052 3879170 3775373 3692109 3599759 3527395 3448944 3379081
5519 3379081 3306145 3250365 3234073 3229324 3257095 3289216 3378156 3509427 3632386 3775282 3922234
5508 3922234 4026136 4145210 4210556 4242995 4214219 4117081 3992533 3826127 3647059 3458500
5498 3458500 3247810 3027400 2867114 2723358 2581019 2468605 2392947 2363517 2329230 2310842
5488 2310842 2305134 2363042 2407877 2464953 2503955 2590216 2661277 2722399 2768995 2870828 2897619
5477 2897619 2921155 2887777 2852452 2760821 2670054 2551741 2438161 2298604 2133956 2037263 1900317
5466 1900317 1825813 1692322 1607991 1534941 1465355 1452357 1396818 1374910 1341922 1337253 1328811 1291426
5454A291426j8328j0088l4959k5972j4844j2092k1887k7547j2851l3655k1893
5443A057310l9408J3343l8770R00Q256j9084J8909j2877J6394j1960R582j8770
5431I83825K2240j4182K0213J1019k2889J9016O615j1916j9737j7650K891J0374
5419I89819m36j1936N081J1737J4822o801J2406k9730L4208j1213K3282Q914K6142
5406A066295M1959J8320K9809L1426L9598L6436M0894P2785L7195O9789L7380
5395A521886O3842N3335K4324K2576J6486n877q546M5883l1399N291Q92K9046
5383A737739O966O096L4955L3576J9119L2818O5690N6189N6816R5228P8518P1693
5371B295403J02294Q3117R2582J16122P3536N8250O8063J6704J1446J1436p6612
$$ plain form
5454 1291426 1273098 1263010 1228051 1202079 1187235 1175143 1153256 1125709 1112858 1079203 1057310
5443 1057310 1017902 1031245 992475 993375 1001631 982547 1001456 988579 1004973 993013 1002595 983825
5431 983825 1006065 991883 1012096 1023115 1000226 1019242 1025857 1013941 994204 976554 979445 989819
5419 989819 989383 977447 982528 994265 1009087 1002286 1014692 984962 1019170 1007957 1031239 1040153 1066295
5406 1066295 1108254 1126574 1156383 1187809 1227407 1263843 1304737 1377522 1414717 1484506 1521886
5395 1521886 1585728 1639063 1663387 1685963 1702449 1696572 1688026 1733909 1702510 1707801 1708693 1737739
5383 1737739 1744705 1750801 1785756 1819332 1838451 1871269 1936959 1993148 2049964 2145192 2223710 2295403
5371 2295403 2397697 2480814 2573396 2689518 2763054 2821304 2889367 2906071 2917517 2928953 2852341
5360B852341m1506p3067p2310o6853p9081n7467m2319r379L476M5087l681L6295
5348B491536K7580N0940O8010P9772M2671Q8542N2022P7561O7504J3490M8344
5337C107972J5659l5415k9237l4944j8894o5296m5418k4303l177n294J5506M1414
5325B918573L6693Q9252R3432P3055J08603O3180J03242M1667L6702M2898K7929
5314C635226l3096l2397o3614r7002p4387r1387q1446o8700l6052q4469l9505
5303B933171k6713k5426n0593l3259k7364k9506j9863m0417n0961l7752r4905
5292B496412p0532j06043j10479j06476r6326j31556o3105j19443o8171p7786
5282A546495o3593n1695o5504p8697n0621o7801m190p4743k020j9862m5064J362
$$ plain form
5360 2852341 2810835 2737768 2665458 2598605 2519524 2462057 2419738 2410359 2413835 2458922 2455241 2491536
5348 2491536 2519116 2570056 2638066 2717838 2760509 2849051 2901073 2978634 3046138 3059628 3107972
5337 3107972 3123631 3088216 3058979 3024035 3005141 2939845 2894427 2870124 2866947 2861653 2877159 2918573
5325 2918573 2955266 3044518 3137950 3211005 3319608 3382788 3486030 3527697 3564399 3607297 3635226
5314 3635226 3602130 3569733 3506119 3409117 3334730 3243343 3161897 3093197 3057145 2972676 2933171
5303 2933171 2906458 2881032 2830439 2797180 2769816 2740310 2720447 2680030 2629069 2591317 2496412
5292 2496412 2425880 2319837 2209358 2102882 2006556 1875000 1811895 1692452 1624281 1546495
5282 1546495 1482902 1431207 1365703 1287006 1236385 1168584 1164394 1089651 1087631 1067769 1022705 1024067
5270A024067l5275n0393m553m4773l1951j9137l5075J152j5550M050k0431k1246
5258G50885k1469m771l8761K0656o677q249J4306l0496L1884l2111J9366n2750
5246F41813m840l9862k1335J6008l1893J8645k1616K492o719k5008J7188r949
5234E34924m2851K3105k4921q295R34J6814r264j6646M6368l0063J1700J0174
5222E11979j2645M0247Q024M3966N7658K4321J2259n222j2822J0921k9645m8888
5210F00153l0334m278k6831n1388K7058k8972o756j0914j117j2047n950J5340
5198D63964K8101l3480n570K5758J6811m3102K6212k7928J0711J190r119P142
5186D60690J6089j671J7308k1325N080j4457J0764R180k4920J6890k3673J5317
$$ plain form
5270 1024067 988792 938399 933846 889073 857122 837985 802910 804062 788512 792562 772131 750885
5258 750885 729416 724645 685884 706540 699863 691614 705920 675424 707308 675197 694563 641813
5246 641813 636973 597111 575776 591784 559891 578536 556920 559412 552693 527685 544873 534924
5234 534924 492073 515178 490257 481962 482896 499710 490446 473800 520168 490105 501805 511979
5222 511979 499334 539581 547605 591571 649229 673550 685809 680587 667765 678686 649041 600153
5210 600153 569819 565541 538710 487322 514380 485408 478652 467738 466621 454574 448624 463964
5198 463964 492065 458585 453015 478773 495584 452482 478694 450766 461477 462667 453548 460690
5186 460690 476779 475108 492416 471091 476171 461714 472478 481658 456738 473628 449955 465272
5174D65272k5062J5170r69o686Q516j9805k2316M484k3435M505K8381l658l339
5161D21058r043K6199O692q129p221L1514R599N803K3626m2766L9876O316n210
5148D98314k907J883k5851M0205j1482J2179K635q091K268l718j9573R481k1788
5135D73555K3127K6746j1184k0537N4568m496L9194j1385J7306k4409M9804M217
5123F16506Q276Q618J4155K4431K0427j5889K2972k9353M0543M152J2428M3468
5111G70734n175Q245M6547M416K6371M5182l350J1793L7016L5582O856M5183K2799
5098A052199M0751j5663K9873J0710Q192K8490k9765M0469M1297N219N1742N1089
5086A314603L1978K0604L8523K2780J1428l2488L7545j6427k2710p985j4192j6396
$$ plain form
5174 465272 440210 455380 454411 447725 456241 436436 414120 418604 395169 399674 428055 424397 421058
5161 421058 412015 438214 444906 436777 429556 461070 470669 476472 500098 457332 497208 503524 498314
5148 498314 495407 497290 471439 511644 500162 512341 514976 506885 509153 505435 485862 495343 473555
5135 473555 496682 523428 512244 491707 546275 541779 580973 569588 586894 562485 612289 616506
5123 616506 624782 633400 647555 671986 692413 676524 699496 670143 710686 714838 727266 770734
5111 770734 765559 773804 820351 824767 851138 896320 892970 904763 941779 977361 984217 1029400 1052199
5098 1052199 1092950 1077287 1107160 1117870 1126062 1154552 1124787 1165256 1206553 1211772 1263514 1314603
5086 1314603 1346581 1367185 1405708 1428488 1439916 1407428 1444973 1428546 1405836 1397851 1383659 1367263
5074A367263k7248l6705l1032l1132j5978k5124j927l2887J1712J1236l4893P408
5062A160693m1881K3006m2451k7694o55m203r193L393j291l3517j5027k1768m9957
5049I39455q090k1867k8288k1310J2614l971N725K5985j3802k9034l590m840l391
5036H45596q294Q015O774M3428J2432M385n599O5013q127M4668K3037L4164N2788
5023A118280N3519Q599O5872K7374j8306j2269l431n1767M722L2055J3746K1598
5011A259992q983L5815K1243o991L9933k0065N345N9948P989N3500R5880M5188
4999A588794Q8301J49124J25234J47600J93914J82620J58325J46441R8996M2250
4989B921599m8126p0047j01490r1493r9567j16502j03492o9569m1577l7677K5471
$$ plain form
5074 1367263 1340015 1303310 1272278 1241146 1225168 1200044 1198117 1165230 1176942 1188178 1153285 1160693
5062 1160693 1118812 1141818 1099367 1071673 1071018 1066815 1057622 1061015 1059724 1026207 1011180 989412 939455
5049 939455 931365 909498 881210 859900 872514 868543 874268 900253 886451 857417 853827 848987 845596
5036 845596 837302 845317 852091 895519 907951 912336 906737 971750 963623 1008291 1031328 1065492 1118280
5023 1118280 1171799 1180398 1246270 1273644 1255338 1243069 1239638 1187871 1192593 1224648 1238394 1259992
5011 1259992 1251009 1286824 1308067 1301076 1341009 1320944 1326289 1386237 1394226 1447726 1543606 1588794
4999 1588794 1677095 1826219 1951453 2099053 2292967 2475587 2633912 2780353 2879349 2921599
4989 2921599 2873473 2803426 2701936 2610443 2510876 2394374 2290882 2221313 2179736 2142059 2167530
4978B167530r805m6204K6723J3446K6735K8391P3855M6694J14203J53683J58317
4967B753568J70795J87897K03392J65114J73454J34307P2033l8244m5153j09710
4957C667453j46077j49367j79401o7086m775M4034N1829J5504L782n4839r7713
4946C083344j22515j12379j42022j49098j27325o4901J7662o926N4664Q6341Q9785
4935B606630J32035J08685P7254K6225Q664j6936j16683r2842j57974j41657j71765
4924B261636j47066j14499j19367q0120j07910n7483m6285n7372n8930l3776n5128
4913A383700o1400j8872j6010l4227J0880R03L6422O344N2206K5214J0965J2961
4901A409086K6911l7263q303m8240m5692o7912m1311o4928o1718l9019l0520q670
$$ plain form
4978 2167530 2157725 2111521 2138244 2151690 2178425 2206816 2280671 2327365 2441568 2595251 2753568
4967 2753568 2924363 3112260 3315652 3480766 3654220 3788527 3860560 3822316 3777163 3667453
4957 3667453 3521376 3372009 3192608 3125522 3120747 3164781 3216610 3232114 3235896 3181057 3083344
4946 3083344 2960829 2848450 2706428 2557330 2430005 2365104 2382766 2375840 2430504 2516845 2606630
4935 2606630 2738665 2847350 2924604 2950829 2959493 2942557 2825874 2733032 2575058 2433401 2261636
4924 2261636 2114570 2000071 1880704 1800584 1692674 1635191 1588906 1531534 1472604 1438828 1383700
4913 1383700 1322300 1303428 1287418 1253191 1264071 1264974 1301396 1307740 1359946 1385160 1396125 1409086
4901 1409086 1435997 1398734 1390431 1342191 1296499 1228587 1187276 1122348 1060630 1021611 991091 982421
4889I82421k0215J7352J9170q030p846p24n4963K3690M379n9637J1655l3507j6028
4876H57717j4001j5142k9774m402k2637n6717r76k4955j7283k4892k2500j6461
4864F07977j2476n612j5092n0297k6201K9139j4141j8347K7325j8507Q981L996
4852E16745j0923j0577O996O870m573l4940J9153n762K0905j4625M7156m3833
4840D92592q333K4554l2807K1258q097j2841M324K7149O69k5957r26K0876k2746
4827D79715L1879j0008K993k5711R575K805J6145j7188j3545l309j4162N779J4954
4814D79922N968k8457L7897p03K0703K316j1489K7792J1471M1254K3330P368M3308
4801F60680M814M3647L5887P8978L3652O3463J56402K77851M32421N22507M56874
$$ plain form
4889 982421 962206 979558 998728 990698 982852 982128 927165 950855 955234 895597 907252 873745 857717
4876 857717 843716 828574 798800 794398 771761 715044 714068 689113 671830 646938 624438 607977
4864 607977 595501 589889 574797 524500 498299 527438 513297 494950 522275 503768 512749 516745
4852 516745 505822 495245 502241 509111 504538 469598 488751 482989 503894 489269 536425 492592
4840 492592 484259 508813 476006 497264 489167 476326 480650 507799 508468 482511 481585 502461 479715
4827 479715 511594 501586 504579 478868 488443 491248 507393 490205 476660 473351 459189 464968 479922
4814 479922 485890 457433 495330 494627 515330 517646 506157 533949 545420 586674 610004 617372 660680
4801 660680 665494 709141 745028 824006 857658 921121 1077523 1355374 1787795 2310302 2767176
4790B767176L40545K18422N4903j08622j37610l04207l04049l67985l21473k91301
4780A545799k23544j22499p7691r5512m0185m8584k4495o6508j6819m333J200
4769H26829o340r044K3978k2689J1229J6169J3219j4757K4112r374r44J1209J5635
4756H79232p749j581K4691l8888N6933l2795J5428K0070K0546Q921L9946L4826
4744A019580j7713M4990L8088L6079l27N6095R783P3450K7179K9570K4048M0981
4732A381803L5275M0093M0321L4994J2733q676N9694J7114O7899N5526J2865L0519
4720A780160M0807L7029N7090r055Q0680K9170o544N0666J6512M3708Q7592J5698
4708B223513R725P7120O5389K5397Q4922M7276J11062P6778O3868R6723O1770
$$ plain form
4790 2767176 3107721 3326143 3381046 3272424 3134814 2830607 2526558 2158573 1837100 1545799
4780 1545799 1322255 1199756 1122065 1026553 986368 937784 913289 846781 829962 825629 826829
4769 826829 820489 811445 835423 812734 823963 840132 853351 838594 862706 853332 852388 863597 879232
4756 879232 871483 869902 894593 855705 912638 879843 895271 915341 935887 944808 984754 1019580
4744 1019580 1001867 1046857 1084945 1121024 1120697 1176792 1186575 1260025 1287204 1316774 1340822 1381803
4732 1381803 1417078 1457171 1497492 1532486 1545219 1536543 1596237 1613351 1681250 1736776 1749641 1780160
4720 1780160 1820967 1857996 1915086 1906031 1986711 2015881 2009337 2060003 2076515 2120223 2207815 2223513
4708 2223513 2233238 2310358 2375747 2401144 2486066 2533342 2644404 2721182 2785050 2881773 2943543
4697B943543J02289J06593K2318P9266P1673J3133M1806R2920N3912J2900N1470
4686C591823O2737M0984P3558O5935Q6902J19529Q3297J76229J55670J85918K29043
4675D871625K05201J85657J82786J27337J05297P1055J3014M5065L57l3624M5385
4664E819155k1752K7476j2229R348J9636J2565K0053J4771L4193o011M3942L4862
4652E996009j8081P2347J5930k0082K0434o1464o2821j05741j26798j23038j39070
4641E447625j67046j63187j44243j47133j00110j00021r3418j050l731j7721P849
4630D517814k8517k682m3220m6617n3916r3238j13159j19178j27692j36331r2389
4619C660875r3009j59986p4071j21527m3210j29323q4548r2339j28492r6291j02921
$$ plain form
4697 2943543 3045832 3152425 3174743 3254009 3325682 3338815 3380621 3473541 3527453 3540353 3591823
4686 3591823 3654560 3695544 3769102 3835037 3921939 4041468 4124765 4300994 4456664 4642582 4871625
4675 4871625 5076826 5262483 5445269 5572606 5677903 5748958 5761972 5807037 5807394 5773770 5819155
4664 5819155 5797403 5824879 5812650 5821998 5841634 5854199 5874252 5889023 5923216 5917205 5961147 5996009
4652 5996009 5977928 6050275 6066205 6046123 6066557 6005093 5942272 5836531 5709733 5586695 5447625
4641 5447625 5280579 5117392 4973149 4826016 4725906 4625885 4532467 4531417 4527686 4509965 4517814
4630 4517814 4489297 4486615 4443395 4396778 4342862 4249624 4136465 4017287 3889595 3753264 3660875
4619 3660875 3567866 3407880 3333809 3212282 3169072 3039749 2955201 2862862 2734370 2638079 2535158
4608B535158r7790q4372l0688p3057o2228k9254o3406q4603k3383p0768n9841
4597A855768n2551r8430p9271m3690q0528o6692k7086n3161l9928k6118o6123
4586A222190k7078j5408m3224l8058k4660n8862k1851K4911l3073k1822l9339
4575I23726j3157n3435J0588j6241j0078p047l6517k1489j2394r523j3618l0073
4563G10742K4631j5658j830j1618Q332j5519M762l5741K4663j6895P345j0539
4551F72675J9173j9455K2272K095k2676k3901K0042p77o242J7902o769O470M2933
4538G23742k5338L3418M7515J4403K8866J7975K4451L2096K1841J0101j144K7558
4526I55484m5219k8899l1923k6360n4975l9676P068n4092r383j6175J0091l6113
$$ plain form
4608 2535158 2437368 2352996 2322308 2249251 2187023 2157769 2094363 2009760 1986377 1915609 1855768
4597 1855768 1803217 1704787 1625516 1581826 1501298 1434606 1407520 1354359 1314431 1288313 1222190
4586 1222190 1195112 1179704 1136480 1098422 1073762 1014900 993049 1017960 984887 963065 923726
4575 923726 910569 857134 867722 851481 841403 834356 797839 776350 763956 754433 740815 710742
4563 710742 735373 719715 717885 706267 714599 699080 703842 668101 692764 675869 683214 672675
4551 672675 691848 672393 694665 696760 674084 650183 670225 669448 663206 681108 674339 680809 723742
4538 723742 698404 731822 779337 793740 822606 840581 865032 897128 918969 929070 927926 955484
4526 955484 910265 881366 849443 823083 768108 728432 735500 681408 672025 655850 665941 629828
4514F29828k0859r58l7575k5598n883Q448L2245J077k4439K1032q708j9638j3895
4501E35077J5210k8565k224J3080l4058K6683k0654L4852k1497j4275p009J3513
4489E10133m2183L3974O790p76K3474K0068J1837j2922l600Q687L5475l4469J5983
4476E72471M059K3093K2003J397o881k024l3809K1243k5307j2012J8466l2047
4464E50652j1255M9870m4591J6785j2655J358k5124R202l4972K9695K6159k3564
4452E31560L1102m6809M924L4522r943m213J4153k4194K2535J3378k2731K7400
4440E71684L1845k4510R249K1540l5652M5409n160J8050K8015n394K5863k650
4428F78289O708q898K3183l4618M0323N397N181K1793J3881L618L1461n294K7357
$$ plain form
4514 629828 608969 608011 570436 544838 538955 547403 579648 580725 556286 577318 568610 548972 535077
4501 535077 550287 521722 519498 532578 498520 525203 504549 539401 517904 503629 496620 510133
4489 510133 467950 501924 508714 507938 531412 551480 563317 550395 546795 555482 590957 556488 572471
4476 572471 576530 599623 621626 623023 616142 614118 580309 601552 576245 564233 582699 550652
4464 550652 539397 589267 544676 561461 548806 550164 525040 534242 499270 528965 555124 531560
4452 531560 562662 515853 520777 555299 545356 541143 555296 531102 553637 567015 544284 571684
4440 571684 603529 579019 588268 609808 574156 619565 614405 632455 660470 655076 680939 678289
4428 678289 684997 676099 699282 664664 704987 710384 715565 737358 751239 754857 786318 781024 808381
4415H08381L3071K1291K3985K0139J3233R260k3357Q129P891l6809j2070j1763
4403H61381p908L0197o719K6545L8008L6582N7847J0939K9263K7275N8093K8462
4391A189965J8083P0076K9819J3962j0258k0809j4101l9833k8200m8049o0815
4380A099840m1657n7715m1972r801m4458q556J026k7263j7063J6864k7668L466
4368H45043j7549l1467L374k6411j0309l8746r650l5735k175l7820l4310M3795
4356F48040k5592K6546j3099N977K6261J3707l8113J1529L1233P187O8107j0421
4344G51362j1952L4142O097r878J0304n3570K0859j5516J9345K1504K0494J5637
4332H08828N2827M9303M1735L2048P8210N7417R5046P9045J10875P1211K5689
$$ plain form
4415 808381 841452 862743 886728 906867 920100 929360 906003 914132 922023 885214 873144 861381
4403 861381 853473 883670 876951 903496 941504 978086 1035933 1046872 1076135 1103410 1161503 1189965
4391 1189965 1208048 1278124 1307943 1321905 1311647 1290838 1276737 1236904 1208704 1160655 1099840
4380 1099840 1058183 1000468 958496 948695 904237 895681 896707 869444 852381 869245 841577 845043
4368 845043 827494 796027 799401 772990 762681 723935 714285 678550 676375 638555 604245 648040
4356 648040 622448 648994 635895 641872 668133 681840 643727 655256 686489 693676 761783 751362
4344 751362 739410 773552 779649 769771 780075 726505 747364 731848 751193 772697 793191 808828
4332 808828 861655 910958 952693 984741 1062951 1120368 1215414 1294459 1405334 1476545 1502234
4321A502234K6629L8672k4774l5794k2166o7811p3154n6545m9595n0747o2447
4310A124502J0534m5339o6252k8870k8069m3809k7921m181m593J1588j5545J007
4298H83052Q956k9785J9467k0506j8251k8113o977l2080n337J7778K0374m1982
4286G66596J1937J156m26n28k13K744J2397j8021M7392R649L2185R486M4208K7935
4272I46497M9075J920L1466M6624K4037K8668K7473M1711P2315L8036M5668R6519
4260A450009Q0666J17524K14877L53500M97118M95630M02674K48959J61597J6973
4250D039527q2512j09297j57814j46238p8715n4876m2696k6018n6574o7176r7802
4239C119809j18417r9431j23485j31831p3470l0184L5710P3450J35833L03639
$$ plain form
4321 1502234 1528863 1567535 1542761 1506967 1484801 1416990 1343836 1287291 1237696 1186949 1124502
4310 1124502 1135036 1089697 1023445 994575 966506 922697 894776 890595 886002 897590 882045 883052
4298 883052 892008 862223 881690 861184 842933 814820 807843 775763 770426 788204 808578 766596
4286 766596 778533 779689 779263 778735 778522 781266 793663 775642 823034 832683 864868 874354 918562 946497
4272 946497 995572 997492 1028958 1075582 1099619 1128287 1155760 1197471 1269786 1307822 1353490 1450009
4260 1450009 1530675 1648199 1863076 2216576 2713694 3209324 3611998 3860957 4022554 4039527
4250 4039527 3957015 3847718 3689904 3543666 3464951 3410075 3367379 3341361 3284787 3217611 3119809
4239 3119809 3001392 2901961 2778476 2646645 2573175 2542991 2578701 2652151 2787984 3091623
4229C091623N36691R51554J032525Q03640N43139L52423J04562j04409j59723
4220G152025l79484n38339o79637o11520n42893m24103l11000l21767k43359k70100
4210B829823k02479j71180j17572n4873n2090k1113M063L9469J13060K28828L70881
4199B966817M80494L73526K66005J53029J4290q3114k37835k01468l35138l02856
4189C093750l13764k47872k04738r7684p4267q5582m6785k5481k8394o562n3200
4178A909421K2023P599M2428J18481J56075K10114J72222R2944M6938k3171q0067
4167B675007p9522r3509j56294j77559j35595o4657n0020o0120K630k5112j3982
4156A821267k50J863l930P371K6318M8439K5616L6471Q1346J8605N3746R1362
$$ plain form
4229 3091623 3628314 4579868 5612393 6416033 6959172 7311595 7416157 7311748 7152025
4220 7152025 6772541 6234202 5554565 4943045 4400152 3976049 3665049 3343282 3099923 2829823
4210 2829823 2627344 2456164 2338592 2283719 2231629 2210516 2214579 2254048 2367108 2595936 2966817
4199 2966817 3447311 3820837 4086842 4239871 4254161 4171047 3933212 3731744 3396606 3093750
4189 3093750 2779986 2532114 2327376 2229692 2155425 2069843 2023058 1997577 1969183 1962621 1909421
4178 1909421 1931444 1939043 1981471 2099952 2256027 2466141 2638363 2731307 2778245 2755074 2675007
4167 2675007 2595485 2501976 2345682 2168123 2032528 1967871 1917851 1857731 1860361 1835249 1821267
4156 1821267 1821017 1822880 1818950 1826321 1852639 1901078 1926694 1963165 2044511 2063116 2116862 2208224
4144B208224R6087L9450J27790J35139J36466J56523K09461K03031K33606K60775
4134C806552L31926L92459L85057N26367O50642R06349J494505K995998N620183
4125A7110038O535175M974522K893923J737181J24467j992439j931584l310941
4117B6140342l912032m169945l861822k737608j733100j033897n69498l59936
4109G762504k04640j14496J9067J08671M32449Q55518J718474L936132O109690
4100B0623369N754474L961271J960171J265616j293641j909697k625625l670139
4092B4065799m195119m193979l541044k438359j585343j025204p76989n89687
4084E720075n46948n48217m68463l59532k94472k43966j90092j40980j27759j15306
$$ plain form
4144 2208224 2304311 2343761 2471551 2606690 2743156 2899679 3109140 3312171 3545777 3806552
4134 3806552 4138478 4530937 4915994 5442361 6093003 6999352 8493857 11489855 17110038
4125 17110038 23645213 28619735 31513658 33250839 33375306 31382867 29451283 26140342
4117 26140342 22228310 18058365 14196543 11458935 9725835 8691938 8122440 7762504
4109 7762504 7557864 7443368 7462435 7571106 8003555 8859073 10577547 14513679 20623369
4100 20623369 26377843 30339114 32299285 33564901 32271260 30361563 27735938 24065799
4092 24065799 19870680 15676701 12135657 9697298 8111955 7086751 6309762 5720075
4084 5720075 5173127 4624910 4156447 3796915 3502443 3258477 3068385 2927405 2799646 2684340
4074B684340r0429o3782n2952o0846m2957P757n272r367K3646k0148k7084k6247
4062B316659k9515r1741l4522p1465j01321r5089o4621p0915m8240n6019m671
4051A648540m5777p302o119k5240J2963P063J9969m6464k334j1018j9688m2850
4039A481743n4792k7944n7558k3690l1171o6571j6109m4808m9863j5541m3124
4028A050572j0123n9671Q32l1528K7188m0669L0267L9872L8657L2766J880K0453
4016A100496N72l0966k4130o1103l728n9072l7452p8200m1070k7174j7927j4502
4004G05744j4917l8652j6160j9850J863l4957K1133l2041l9993K9498j8542j6388
3992E26738n667j8117r232j8831K1676j1688M824M854J1284j7894K1191M5968
$$ plain form
4074 2684340 2593911 2530129 2477177 2416331 2373374 2381131 2375859 2366492 2390138 2369990 2342906 2316659
4062 2316659 2287144 2195403 2160881 2089416 1988095 1893006 1828385 1757470 1709230 1653211 1648540
4051 1648540 1602763 1595461 1589342 1564102 1577065 1584128 1604097 1557633 1555299 1544281 1524593 1481743
4039 1481743 1426951 1399007 1341449 1317759 1286588 1220017 1203908 1159100 1109237 1093696 1050572
4028 1050572 1040449 980778 981610 950082 977270 936601 966868 1006740 1045397 1078163 1080043 1100496
4016 1100496 1101068 1070102 1045972 984869 981141 922069 884617 806417 765347 738173 720246 705744
4004 705744 690827 652175 636015 616165 618028 583071 604204 572163 532170 561668 543126 526738
3992 526738 521071 502954 493722 474891 496567 484879 489703 494557 505841 487947 509138 555106
3980E55106J7302J5723M9574M165j5063j1213j0851k4891k7053l1605k4368n0873
3968D45953k0237m444J0307q612k7217j4796o346N495j1380o867k85k8443q64
3955C32264j8074J636J280j1413M402N173r896q917j1243J1540m1107J2201l139
3942B64707J1480J9974j7252K6682j5222o840K7505l4303P183K3550k983J1705
3930C16186J5681k2357j3854M947j8963r659J3333j361n52J2432J1132q867K0244
3917C18342j4301n575r917oK7425l2473R357k1111j7260k686r443j6692J1566
3904B37226O089l6561J0704K8742l8059M353O154k1644K2033q134j659j7006J0272
3891B02510K553L344J3813J377j5736L5411l0271J3649m153J778M982j4877K1337
$$ plain form
3980 555106 572408 588131 637705 641870 626807 615594 604743 579852 552799 521194 496826 445953
3968 445953 425716 421272 431579 422967 395750 380954 374608 380103 368723 361856 361571 333128 332264
3955 332264 314190 315826 317106 305693 310095 315268 305372 296455 285212 296752 255645 267846 264707
3942 264707 276187 296161 278909 305591 290369 283529 311034 276731 283914 307464 304481 316186
3930 316186 331867 309510 295656 300603 281640 271981 285314 283953 283401 295833 306965 298098 318342
3917 318342 304041 298466 288549 288543 315968 283495 292852 271741 254481 251795 242352 225660 237226
3904 237226 243315 206754 217458 246200 208141 212494 218648 197004 219037 210903 209244 192238 202510
3891 202510 205063 208407 222220 223597 207861 243272 213001 226650 222497 224275 229257 214380 235717
3878B35717j8981L6671L0857O0943j698L5843R757l2080J7063j9734j2234k536
3866C39588j1018n2549O427k8967o271j4305P716l2225M1718l2467J5177K2045
3854B54869j357L491N218L3716Q453K5323Q660J0162l9867R984l2225j9260k6886
3841B40281j3033k4115k5116j3758j247l4912K8571k449j8292P453l07j0211k4859
3828A08006M3726l3814k3134J6020j9061j2001J4851o979l7178K4735J0634l4910
3816E0895J9816J8882j0091j4838J7153k3572j320Q730r948J6161l9818K3419
$$ plain form
3878 235717 216736 253407 284264 345207 343509 379352 389109 357029 374092 354358 342124 339588
3866 339588 328570 276021 282448 253481 247210 232905 240621 208396 250114 217647 232824 254869
3854 254869 253512 257003 262221 295937 304390 329713 338373 348535 308668 318652 286427 267167 240281
3841 240281 227248 203133 178017 164259 163012 128100 156671 154222 135930 143383 143076 132865 108006
3828 108006 151732 117918 94784 110804 91743 79742 94593 87614 50436 75171 85805 50895
3816 50895 70711 89593 79502 64664 81817 58245 56925 65655 55707 71868 32050 55469
$$ [...]
##END NTUPLES=NMR SPECTRUM
##END=
