##TITLE=abcd
##JCAMPDX= 6.0         $$ Bruker NMR JCAMP-DX V2.0
##DATA TYPE= NMR SPECTRUM
##DATA CLASS= NTUPLES
##ORIGIN= UXNMR, Bruker Analytische Messtechnik GmbH
##OWNER= root
$$ XWIN-NMR		Version 3.5
$$ Thu Aug  6 17:05:05 2026 Russian Standard Time (UT+4h)  servis@DPX200
##.OBSERVE FREQUENCY= 200.131235884673
##.OBSERVE NUCLEUS= ^1H
##.ACQUISITION MODE= SIMULTANEOUS
##.ACQUISITION SCHEME= undefined
##.AVERAGES= 16
##.DIGITISER RES= 18
##SPECTROMETER/DATA SYSTEM= spect
##.PULSE SEQUENCE= zg
##.SOLVENT NAME= CDCl3
##.SHIFT REFERENCE= (INTERNAL, CDCl3, 0, 16.4885)
##AUDIT TRAIL= $$ (NUMBER, WHEN, WHO, WHERE, WHAT)
$$ ##TITLE= Audit trail, XWIN-NMR		Version 3.5
$$ ##JCAMPDX= 5.01
$$ ##ORIGIN= Bruker BioSpin GmbH
$$ ##OWNER= servis
$$ F:\spectra/data/av/nmr/H1/1/pdata/1/auditp.txt
$$ ##AUDIT TRAIL=  $$ (NUMBER, WHEN, WHO, WHERE, WHAT)
(   1,<2026-08-06 17:04:34.23 +0400>,<servis>,<DPX200>,
      <created by zg, POWCHK disabled, PULCHK disabled
       terminated by command 'halt'
       configuration hash MD5:
       00 E9 B6 7A A2 85 ED C7 34 08 36 98 17 FE 4E 26
       data hash MD5: 32K
       DD 4C C2 D2 B4 61 F3 9F E2 D3 22 5D C8 D3 CF C8>)
(   2,<2026-08-06 17:04:35.95 +0400>,<servis>,<DPX200>,
      <Start of raw data processing
       efp BC_mod = 2 LB = 0.05 FT_mod = 6 PKNL = 1 PHC0 = -415.5518 PHC1 = 3.101563 SI = 16K 
       data hash MD5: 16K
       FA A3 AA 11 58 4C 45 02 14 F2 73 AD 8D 5A B9 EB>)
(   3,<2026-08-06 17:04:46.75 +0400>,<servis>,<DPX200>,
      <pk PHC0 = 3.6 PHC1 = 0 
       data hash MD5: 16K
       AC E6 D6 24 7B 43 A2 85 31 8A 35 13 DB ED FC 0C>)
$$ ##END=
$$ 
$$ hash MD5
$$ 66 95 92 A5 7C C8 56 B9 9A DA 08 8A F5 B5 EB 41
##$RELAX= 
##$RELAX= 
##$RELAX= 
##$RELAX= 
##$RELAX= 
##$RELAX= 
##$RELAX= 
##$RELAX= 
$$ Bruker specific parameters
$$ --------------------------
##$DU= <F:\spectra>
##$EXPNO= 1
##$NAME= <H1>
##$PROCNO= 1
##$TYPE= <nmr>
##$USER= <av>
##$AMP= (0..31)
100 100 100 100 100 100 100 100 100 100 100 100 100 100 100 100 100 100 
100 100 100 100 100 100 100 100 100 100 100 100 100 100 
##$AQSEQ= 0
##$AQ_mod= 1
##$AUNM= <au_zg>
##$AUTOPOS= <>
##$BF1= 200.13
##$BF2= 200.13
##$BF3= 200.13
##$BF4= 200.13
##$BF5= 500.13
##$BF6= 500.13
##$BF7= 500.13
##$BF8= 500.13
##$BYTORDA= 1
##$CFDGTYP= 0
##$CFRGTYP= 5
##$CHEMSTR= <none>
##$CNST= (0..31)
1 1 145 1 1 1 1 1 1 1 1 1 1 1 1 1 1 1 1 1 1 1 1 1 1 1 1 1 1 1 1 1 
##$CPDPRG= <>
##$CPDPRG1= <>
##$CPDPRG2= <>
##$CPDPRG3= <>
##$CPDPRG4= <mlev>
##$CPDPRG5= <mlev>
##$CPDPRG6= <mlev>
##$CPDPRG7= <mlev>
##$CPDPRG8= <mlev>
##$CPDPRGB= <>
##$CPDPRGT= <>
##$D= (0..31)
0 2 0 0 0 0 0 0 0 0.06 0 0 0 0 0 0 0.0002 0 0 0 0 0 0 0 0 0 0 0 0 0 0 
0 
##$DATE= 1786021473
##$DBL= (0..7)
120 120 120 120 120 120 120 120 
##$DBP= (0..7)
150 150 150 150 150 150 150 150 
##$DBP07= 0
##$DBPNAM0= <>
##$DBPNAM1= <>
##$DBPNAM2= <>
##$DBPNAM3= <>
##$DBPNAM4= <>
##$DBPNAM5= <>
##$DBPNAM6= <>
##$DBPNAM7= <>
##$DBPOAL= (0..7)
0.5 0.5 0.5 0.5 0.5 0.5 0.5 0.5 
##$DBPOFFS= (0..7)
0 0 0 0 0 0 0 0 
##$DE= 6
$$ [...]
##$SUBNAM4= <"">
##$SUBNAM5= <"">
##$SUBNAM6= <"">
##$SUBNAM7= <"">
##$SUBNAM8= <"">
##$SUBNAM9= <"">
##$SW= 20.6817932712277
##$SWIBOX= (0..15)
0 0 3 0 0 0 0 0 0 0 0 0 0 0 0 0 
##$SW_h= 4139.07284768212
##$TD= 32768
##$TD0= 1
##$TE= 0
##$TE2= 300
##$TE3= 300
##$TEG= 300
##$TL= (0..7)
0 120 120 120 120 120 120 120 
##$TP= (0..7)
150 150 150 150 150 150 150 150 
##$TP07= 0
##$TPNAME0= <>
##$TPNAME1= <>
##$TPNAME2= <>
##$TPNAME3= <>
##$TPNAME4= <>
##$TPNAME5= <>
##$TPNAME6= <>
##$TPNAME7= <>
##$TPOAL= (0..7)
0.5 0.5 0.5 0.5 0.5 0.5 0.5 0.5 
##$TPOFFS= (0..7)
0 0 0 0 0 0 0 0 
##$TUNHIN= 0
##$TUNHOUT= 0
##$TUNXOUT= 0
##$USERA1= <user>
##$USERA2= <user>
##$USERA3= <user>
##$USERA4= <user>
##$USERA5= <user>
##$V9= 5
##$VALIST= <valist>
##$VCLIST= <CCCCCCCCCCCCCCC>
##$VD= 0
##$VDLIST= <DDDDDDDDDDDDDDD>
##$VPLIST= <PPPPPPPPPPPPPPP>
##$VTLIST= <TTTTTTTTTTTTTTT>
##$WBST= 1024
##$WBSW= 30
##$XGAIN= (0..3)
0 0 0 0 
##$XL= 0
##$YL= 0
##$YMAX_a= 750264
##$YMIN_a= -1241752
##$ZGOPTNS= <>
##$ZL1= 120
##$ZL2= 120
##$ZL3= 120
##$ZL4= 120
##$ABSF1= 0
##$ABSF2= 0
##$ABSG= 0
##$ABSL= 0
##$ALPHA= 0
##$AQORDER= 0
##$ASSFAC= 0
##$ASSFACI= 0
##$ASSFACX= 0
##$ASSWID= 0
##$AUNMP= <proc_1d>
##$AZFE= 0.1
##$AZFW= 0.1
##$BCFW= 0
##$BC_mod= 2
##$BYTORDP= 0
##$COROFFS= 0
##$CY= 18.4799938201904
##$DATMOD= 1
##$DC= 0
##$DFILT= <>
##$DTYPP= 0
##$F1P= 9.9274215381318
##$F2P= -0.165520771350173
##$FCOR= 1
##$FTSIZE= 16384
##$FT_mod= 6
##$GAMMA= 0
##$GB= 0
##$INTBC= 1
##$INTSCL= 4.127829e-11
##$ISEN= 128
##$LB= 0.05
##$LEV0= 0
##$LPBIN= 0
##$MAXI= 10000
##$MC2= 0
##$MEAN= 0
##$ME_mod= 0
##$MI= 50
##$NCOEF= 0
##$NC_proc= -3
##$NLEV= 6
##$NOISF1= 3.799351
##$NOISF2= 2.8
##$NSP= 0
##$NTH_PI= 0
##$NZP= 0
##$OFFSET= 16.48848
##$PC= 4
##$PHC0= -411.9518
##$PHC1= 3.101563
##$PH_mod= 1
##$PKNL= yes
##$PPARMOD= 0
##$PSCAL= 4
##$PSIGN= 0
##$REVERSE= no
##$SF= 200.130005582386
##$SI= 16384
##$SIGF1= 3
##$SIGF2= 2
##$SINO= 400
##$SIOLD= 16384
##$SREGLST= <1H.CDCl3>
##$SSB= 0
##$STSI= 16384
##$STSR= 0
##$SW_p= 4139.07284768211
##$SYMM= 0
##$S_DEV= 0
##$TDeff= 32768
##$TDoff= 0
##$TI= <>
##$TILT= no
##$TM1= 0
##$TM2= 0
##$TOPLEV= 0
##$USERP1= <user>
##$USERP2= <user>
##$USERP3= <user>
##$USERP4= <user>
##$USERP5= <user>
##$WDW= 1
##$XDIM= 16384
##$YMAX_p= 344436993
##$YMIN_p= -212526
$$ End of Bruker specific parameters
$$ ---------------------------------
##NTUPLES= NMR SPECTRUM
##VAR_NAME=  FREQUENCY,     SPECTRUM/REAL,   SPECTRUM/IMAG
##SYMBOL=    X,             R,               I
##VAR_TYPE=  INDEPENDENT,   DEPENDENT,       DEPENDENT
##VAR_FORM=  AFFN,          ASDF,            ASDF
##VAR_DIM=   16384,         16384,           16384
##UNITS=     HZ,            ARBITRARY UNITS, ARBITRARY UNITS
##FACTOR=    0.252644378177508, 1,           1
##FIRST=     3299.83951724647, 0,            0
##LAST=      -839.233330435636, 0,           0
##MIN=       -839.233330435636, -212526,     0
##MAX=       3299.83951724647, 344436993,    0
$$ Real data points
##PAGE= N=1
##DATA TABLE= (X++(R..R)), XYDATA
$$ [...]
7589F242789J27357J01580R7724J09096Q1020P9089L9701K3984M7359j1714j3309
$$ 6242789 6370146 6471726 6569450 6678546 6759566 6838655 6878356 6902340 6949699 6937985 6924676
7578F924676l3187o4422m8107j04229r5310j02599j07402r0445j40223r2360r3907
$$ 6924676 6891489 6827067 6778960 6674731 6579421 6476822 6369420 6278975 6138752 6046392 5952485
7567E952485j08922j05119q0793j06181q9698p9489j00540j04621p8347j08557
$$ 5952485 5843563 5738444 5657651 5551470 5461772 5382283 5281743 5177122 5098775 4990218
7557D990218j07757j09354j16191j26085j30275j44881j27956j54871j44874j35636
$$ 4990218 4882461 4773107 4656916 4530831 4400556 4255675 4127719 3972848 3827974 3692338
7547C692338j30821j55645j21926j27918j35850j06758j02043j25288j08992p6836
$$ 3692338 3561517 3405872 3283946 3156028 3020178 2913420 2811377 2686089 2577097 2500261
7537B500261r9409r8499q8583p7339p1081o5157q5935n5495o0727o9388m9141
$$ 2500261 2400852 2302353 2213770 2136431 2065350 2000193 1914258 1858763 1798036 1728648 1679507
7526A679507o2990m1749m8488n2774k9084m6365m2236l8458m5779j7221k6540
$$ 1679507 1616517 1574768 1526280 1473506 1444422 1398057 1355821 1317363 1271584 1254363 1227823
7515A227823o7449o483k8707m2333k4905k3651j3142l9934j7847k5455k1239k5850
$$ 1227823 1160374 1153891 1125184 1082851 1057946 1034295 1021153 981219 963372 937917 916678 890828
7503H90828k8238M780l3467k6615j6297p265l4285j2470j9147k8879O264n725
$$ 890828 862590 867370 833903 807288 790991 783726 749441 736971 717824 688945 695209 689484
7491F89484k1742N986j4539k3828j5544j1386N892q679k1918l535j2895k6416
$$ 689484 667742 673728 659189 635361 619817 608431 614323 605644 583726 580191 567296 540880
7479E40880J6326k5653j0813j4070N95j6362R214j6678m000q674j6952j3735j498
$$ 540880 557206 531553 520740 506670 507265 490903 500117 483439 479439 470765 453813 440078 438580
7466D38580m399P631o750l0077P165o169O717j1496l713l5614J6418L473M216
$$ 438580 434181 441812 435062 404985 412150 405981 412698 401202 397489 361875 378293 381766 385982
7453C85982r527j1062j5661J0916j9077J6941j4251k0194L3663k6749l906K464
$$ 385982 376455 365393 349732 360648 341571 358512 344261 324067 357730 330981 327075 329539
7441C29539j578o098K2379k3079j0872K2612j5342j4886L137k3272O645L505j55
$$ 329539 327961 321863 344242 321163 310291 332903 317561 302675 305812 282540 289185 292690 292535
7428B92535J1325k634j0182n992n432K3395l3744j7589L8119k1882P76n188n501
$$ 292535 303860 301226 291044 285052 279620 303015 269271 251682 289801 267919 268695 263507 258006
7415B58006k738O22j071P02L736j101j0013K125j8395K7059j8147N647j7251J0797
$$ 258006 255268 255890 254819 255521 259257 258156 248143 250268 231873 258932 240785 246432 229181 239978
7401B39978k0m240j1587M525M680j4999J933j6934R909K275n900j5002Q363j7461
$$ 239978 239958 235718 224131 228656 233336 218337 220270 203336 213245 215520 209620 194618 202981 185520
7387A85520r798J6112O966j4825q561R206o546O843n632j7965J7323n206j5217
$$ 185520 175722 191834 198800 183975 175414 184620 178074 184917 179285 161320 178643 173437 158220
7374A58220K135J0932j4388o857J0806r035j1921Q814o792l752p601L951j6335
$$ 158220 160355 171287 156899 150042 160848 151813 139892 148706 141914 138162 130561 134512 118177
7361A18177K04K3001q609J825p102j5402L580o66k362Q753o351j2845J0621L923
$$ 118177 118381 141382 132773 134598 127496 112094 115674 115008 112646 121399 115048 102203 112824 116747
7347A16747q914P192k4376J2247m102J6154k3784J7113n045r248q51J3729j9115
$$ 116747 107833 115025 90649 102896 98794 114948 91164 108277 103232 93984 93133 106862 87747
7334H7747j6588K4169j4533j753J192R4j3122J5741j6779J1672J257j6455K551
$$ 87747 71159 95328 80795 79042 80234 80328 67206 82947 66168 77840 79097 62642 65193
7321F5193o884o967r172K5292o807J559j1432J2815p138R180m042o688j0349R529
$$ 65193 58309 51342 42170 67462 60655 62214 50782 63597 56459 65639 61597 54909 44560 54089
7307E4089J449n455n508J947j465P081M323q406o105L569J3751j9796m47J1834
$$ 54089 55538 50083 44575 46522 45057 52138 56461 48055 41950 45519 59270 39474 39027 50861
7293E0861k0710N260r562J189J5326j0442K352m576K3482j9729Q636j9938J3608
$$ 50861 30151 35411 25849 27038 42364 31922 34274 29698 53180 33451 42087 22149 35757
7280C5757P547q967j1990K0107p287O188j0746m223L890j1209J7189r540J6002
$$ 35757 43304 34337 22347 42454 35167 41355 30609 26386 30276 19067 36256 26716 42718
7267D2718k4353K0684j5299J5725j1736K1166l575j3248m522M468k447J1982l6932
$$ 42718 18365 39049 23750 39475 27739 48905 45330 32082 27560 32028 29581 41563 4631
7254D631J9665O785J2491j3981n861J604K689o817J699K1172k0152R746o005J1915
$$ 4631 24296 31081 43572 29591 23730 25334 28023 21206 22905 44077 23925 33671 27666 39581
7240C9581k651j4646q58J1069R553j2625j7256J1081R691k1521K7528j1227M082
$$ 39581 36930 22284 21426 32495 42048 29423 12167 23248 32939 11418 38946 27719 31801
7227C1801j536j898P734J1291j4082J832l2172K9254j2203J6872j3164P579J3429
$$ 31801 30265 28367 36101 47392 33310 35142 2970 32224 20021 36893 23729 31308 44737
7214D4737j3013P634j6730K1263K587k8443K2710j9345K0534p345J1540j6499
$$ 44737 31724 39358 22628 43891 46478 18035 40745 21400 41934 34589 46129 29630
7202B9630m607J5596j373Q050n033J0010k4633K1888P58P357j0432J5938r410
$$ 29630 25023 40619 39246 47296 42263 52273 27640 49528 50286 57643 47211 63149 53739
7189E3739r6q53K347j2802q178J4307P608p464l45J5660n69P711r853J0627j6808
$$ 53739 53643 52790 55137 42335 34157 48464 56072 48608 48263 63923 63354 71065 61212 71839 55031
7174E5031K2377J656o340J4414k28N812l949j2948K6994k0714L1620m968O499
$$ 55031 77408 79064 72724 87138 86910 92722 88773 75825 102819 82105 113725 108757 115256
7161A15256M310J8372L941R452q799J3242N610K805J6326J577l811Q175J6375
$$ 115256 119566 137938 141879 151331 142532 155774 161384 164189 180515 182092 178281 186456 202831
7148B02831J7393J7888l043J0596o377N535R14J5290o62J5938N390q683R902J4140
$$ 202831 220224 238112 235069 245665 239288 244823 245737 261027 260365 276303 281693 273010 282912 297052
7134B97052m2253j488J6781r205j942j0239k5914J6524j1058J7431j0868p776
$$ 297052 254799 253311 270092 260887 258945 248706 222792 239316 228258 245689 234821 227045
7122B27045J1441P295j1410j5118j7000R601j7994n847k4361j1763k0306P129
$$ 227045 238486 245781 234371 219253 202253 211854 193860 188013 163652 151889 131583 138712
7110A38712p79r110K496j2245l049j1779J927M107k5064K548P888n181Q203l0932
$$ 138712 137933 128823 131319 119074 116025 104246 106173 110280 85216 87764 95652 90471 98674 67742
7096F7742M05J9025q396j12o274P98j543k517l112q472l009n816Q906j1287q86
$$ 67742 68147 87172 78776 78664 72390 73188 71645 69128 66016 57544 54535 48719 57625 46338 45452
7081D5452n353J0955l508Q110p328P847r238k4063K4538K519l3664p4K0812q889
$$ 45452 40099 51054 47546 55656 48328 56175 46937 22874 47412 49931 16267 16193 37005 28116
7067B8116M546l750p997N782k080j814k785N154K084k0682L2540k3922J7126j1029
$$ 28116 32662 28912 20915 26697 24617 22803 20018 25172 27256 6574 39114 15192 32318 21289
7053B1289l407O801k0352N699J3029j0751K6511m274k2620J7683j0555Q306j5197
$$ 21289 17882 24683 4331 10030 23059 12308 38819 34545 11925 29608 19053 27359 12162
7040A2162M486j0441n308K0675o998r466J4247R63N787j4721J512j1547J842L022
$$ 12162 16648 6207 899 21574 14576 5110 19357 20320 26107 11386 12898 1351 3193 6215
7026F215q22M142n828J8469j2311M739p507k459P582P406k2509R786q477K0777
$$ 6215 5393 9535 3707 22176 9865 14604 7097 4638 12220 19626 -2883 6903 -1574 19203
7012A9203j009j1025J3580q401o740k154J2100q985J851P937O153k6538J3114
$$ 19203 18194 7169 20749 12348 5608 3454 15554 6569 8420 16357 22510 -4028 9086
6999I086J7957j9235K177J1734j0230J3302j5726Q587K045j8283K6723j2018P815
$$ 9086 27043 7808 9985 21719 11489 24791 9065 17652 19697 1414 28137 16119 23934
6986B3934p754n422K0476k0798J3704k2407Q347J6150o983n374J3466r556j0707
$$ 23934 16180 10758 31234 10436 24140 1733 10080 26230 19247 13873 27339 17783 7076
6973G076J5993P461r058j337Q005P894k8708P419J9999j6890R286K964Q701J420
$$ 7076 23069 30530 21472 20135 28140 36034 7326 14745 34744 17854 27140 30104 38805 40225
6959D0225k2058J8037p250j1138J6658N49k090o911l470l619K8711j238K196o779
$$ 40225 18167 36204 28954 17816 34474 35023 32933 26022 22552 18933 47644 46406 48602 41823
6945D1823j754k464N102o684L295L942L56J2179o338j0945m480O725k6444J1725
$$ 41823 40069 37605 42707 36023 39318 43260 43616 55795 49457 38512 34032 40757 14313 26038
6931B6038J233J8007R434k1626Q881j362O303j4294J054J5663o061j0085M776
$$ 26038 27271 45278 54712 33086 41967 40605 46908 32614 33668 49331 43270 33185 37961
6918C7961K4980j0520j0593K7454K3880J587k6394K0025n796j0120n474p88q696
$$ 37961 62941 52421 41828 69282 93162 94749 68355 88380 82584 72464 66990 66202 57506
6905E7506j0331L66J835j8318K4387k875p918q818K3433K205k1124N346n673N038
$$ 57506 47175 47541 49376 31058 55445 52570 44652 35834 59267 61472 40348 45694 40021 45059
6891D5059L316o912Q224R715l89K0179O159K024n568M67n400j4402R57j5187K367
$$ 45059 48375 41463 49687 59402 59013 79192 85351 87375 81807 82274 76874 62472 63429 48242 50609
6876E0609O206j5664K6689j0098J088O283m696R094o11k9856K4198j4473r384
$$ 50609 56815 41151 67840 57742 58830 65113 60417 69511 68900 39044 63242 48769 39385
6863C9385o658L4957k2966J0594J4104j6707K0102J296o667J176j3439q925J1479
$$ 39385 32727 67684 44718 55312 69416 52709 72811 74107 67440 68616 55177 46252 57731
6850E7731o768j1559K9765n233P038L597K3320j2343j9723K2481R759J345p998
$$ 57731 50963 39404 69169 63936 70974 74571 97891 85548 65825 88306 98065 99410 91412
6837I1412j4916P410j6579R420p397j4224J5541r162j2949K1487J245j337J150
$$ 91412 76496 83906 67327 76747 69350 55126 70667 61505 48556 70043 71288 69951 71101
6824G1101k1359K6899K062k3130J1654J0756R292j4289K19J9689l19m385L621
$$ 71101 49742 76641 78703 55573 67227 77983 87275 72986 73205 92894 92575 88190 91811
6811I1811N109j8800J8644j0772k235j6039J2892j812m40l777O697k890J432J3641
$$ 91811 96920 78120 96764 85992 83757 67718 80610 78798 78358 74581 81278 78388 79820 93461
6797I3461j645o561o598O01N816q890J4375q278K0804j2196K2629j1121J5003
$$ 93461 91816 85255 78657 79258 85074 76184 90559 82281 103085 90889 113518 102397 117400
6784A17400j7935P258O551l276j8028j0963m29P577k370P424R664R11N830q479
$$ 117400 99465 106723 113274 109998 91970 81007 80578 88155 85785 93209 102873 103784 109614 101135
6770A01135k0m138q181L4078j2165J1670P934n472j7497K0395j830l527L267K0611
$$ 101135 101115 96977 88796 122874 110709 122379 130313 124841 107344 127739 125909 122382 125649 146260
6756A46260j2409o000J1586J1014r767Q55J6875j0909k726o201J0554K4507j0465
$$ 146260 133851 127851 139437 150451 140684 141539 158414 147505 144779 138578 149132 173639 163174
6743A63174n108n285J5015M318j0777N334J8442q841J8347j3639K664J3521M24
$$ 163174 158066 152781 167796 172114 161337 166671 185113 176272 194619 180980 183644 197165 197589
6730A97589l353N559j2378L2929j3615L302j928n694J3836p204J6404K936k3275
$$ 197589 194236 199795 187417 220346 206731 210033 208105 202411 216247 209043 225447 228383 205108
6717B05108J1023N70j1840J4390J0665K1707n800j5840J2390M231L963q440J5519
$$ 205108 216131 216701 204861 219251 229916 251623 245823 229983 242373 246604 250567 242127 257646
6704B57646n648M894K9070l4853K4934n76m63l407J0587J7877q615J0214R980
$$ 257646 251998 256892 285962 251109 276043 275467 275004 271597 282184 300061 291446 301660 311640
6691C11640R787P307r068L2964n729J0063J6056j8286K0689K2122j9444Q495K0019
$$ 311640 321427 328734 319666 352630 346901 356964 373020 354734 375423 397545 378101 386596 406615
6678D06615K423P114J2557K0751O897P649Q073K5389J2925R882K8961K0020K3352
$$ 406615 409038 416152 428709 449460 456357 464006 472079 497468 510393 520275 549236 569256 592608
6665E92608J0313M2971M6550K5531N9062P2209P2416J01179J39801K25487L98299
$$ 592608 602921 645892 692442 717973 777035 849244 921660 1022839 1162640 1388127 1786426
6654A786426O11203O16234M31602J49895k9643j32126k82575l20198l15942l04262
$$ 1786426 2397629 3013863 3445465 3595360 3565717 3433591 3151016 2830818 2514876 2210614
6644B210614k63983k09856j48959q4828l2657j5800l0441K4771L6499M4935J00583
$$ 2210614 1946631 1736775 1587816 1502988 1470331 1454531 1424090 1448861 1485360 1530295 1630878
6633A630878J09804J67919J68274K44767L44419N96065J133452J830038K067547
$$ 1630878 1740682 1908601 2076875 2321642 2666061 3262126 4395578 6225616 8293163
6624H293163J516246M79591j09947m23234r64757j049273j099532j052532r21660
$$ 8293163 9809409 10289000 10179053 9755819 8791062 7741789 6642257 5589725 4668065
6615D668065p56352o15324l70075k40440j80652j30764j00970o9230k3434K1605
$$ 4668065 3911713 3296389 2926314 2685874 2505222 2374458 2273488 2204258 2180824 2202429
6605B202429N0039J13921J51989K00291K95985N37292J046444J698800K113600
$$ 2202429 2252468 2366389 2518378 2718669 3014654 3551946 4598390 6297190 8410790
6596H410790J684908O45030r7967l90952r70822j090037j137773j099664r84724
$$ 8410790 10095698 10740728 10642761 10251809 9280987 8190950 7053177 5953513 4968789
6587D968789p99689n62906k58772k4992j3094p4719j21705j74766j52641j82481
$$ 4968789 4169100 3606194 3347422 3322430 3309336 3234617 3112912 2938146 2785505 2603024
6577B603024j50071j35871p7674o0626n040J20752K48762N07400O10774N59807
$$ 2603024 2452953 2317082 2239408 2178782 2173742 2294494 2543256 3050656 3661430 4221237
6567D221237K65906n434j26154k67243l29275l52533l35341k86732j98727p417
$$ 4221237 4487143 4481709 4355555 4088312 3759037 3406504 3071163 2784431 2585704 2578287
6557B578287L18766N98628O07550L39967n916j51166k83709m12608m08674l87270
$$ 2578287 2897053 3495681 4103231 4443198 4437282 4286116 4002407 3589799 3181125 2793855
6547B793855l98473l04598k63746j73907j13013o9812m9780m3521l2792m7632
$$ 2793855 2395382 2090784 1827038 1653131 1540118 1470306 1420526 1377005 1344213 1296581
6537A296581M069O146J5570K2573L5283M2657P0515K03271L99672O78279P41276
$$ 1296581 1300650 1306796 1322366 1344939 1380222 1422879 1493394 1696665 2096337 2774616 3515892
6526C515892N03366J51011o2631k07570l59909m08323m11823l60873l24053k88397
$$ 3515892 4019258 4170269 4107638 3900068 3540159 3131836 2720013 2359140 2035087 1746690
6516A746690j84920j51356o2103p3201m8717l0220l1550k6137o018n783n048p595
$$ 1746690 1561770 1410414 1348311 1275110 1226393 1196173 1164623 1138486 1132468 1126685 1121637 1114042
6504A114042J0471K2623N0233J03526K15785K39506K21806J08177l3930n7437
$$ 1114042 1124513 1147136 1197369 1300895 1516680 1756186 1977992 2086169 2052239 1994802
6494A994802j06842j53369j36166j50157j04452j25052p4848p0550l6803j3927
$$ 1994802 1887960 1734591 1598425 1448268 1343816 1218764 1143916 1073366 1036563 1022636
6484A022636l1548q114j6083j514k9172j414j8131P417Q88J8541k1872p792O498
$$ 1022636 991088 982974 966891 965377 936205 934791 916660 924077 924965 943506 921634 913842 920340
6471I20340N242j2391m302P754q838N455k399Q160l438M293R705N660j5410O048
$$ 920340 925582 913191 908889 916643 907805 913260 910861 919021 915583 919876 929581 935241 919831 925879
6457I25879j3262P092M047N359l775m516J7900n697R282J363L05J821J6798P538
$$ 925879 912617 919709 923756 929115 925340 920824 938724 933027 942309 943672 943977 945798 962596 970134
6443I70134r395k721K4801J1626M719M061J3359j1745K3288J8706j5897J9918
$$ 970134 960739 958018 982819 994445 999164 1003225 1016584 1004839 1028127 1046833 1030936 1050854
6431A050854L56M46j1967J4343J8954J3828n185O176R755K0808n582j0436L4825
$$ 1050854 1051210 1051656 1039689 1054032 1072986 1086814 1081629 1087805 1097560 1118368 1112786 1102350 1137175
6418A137175j042J8499L12K3486r29Q765P673J0035L2379j0753L8402l684Q704
$$ 1137175 1136133 1154632 1154944 1178430 1177501 1186266 1193939 1203974 1236353 1225600 1264002 1260318 1269022
6405A269022J1539J3204J7097J080J2822J9732R358J9414J9053R810J592L2436
$$ 1269022 1280561 1293765 1310862 1311942 1324764 1344496 1353854 1373268 1392321 1402131 1403723 1436159
6393A436159J7790O908r27J9514K4230R704J9527K6166k739K0855K4019J9706
$$ 1436159 1453949 1460857 1459930 1479444 1503674 1513378 1532905 1559071 1556332 1577187 1601206 1620912
6381A620912K6908J8917K522K9238J5450Q357J7685M7890J1477J3819K4053L4230
$$ 1620912 1647820 1666737 1669259 1698497 1713947 1722304 1739989 1787879 1799356 1813175 1837228 1871458
6369A871458J3111L0722K4782L340L9747n771M1353K3390J1320M6075J0521J6317
$$ 1871458 1884569 1915291 1940073 1943413 1983160 1977389 2018742 2042132 2053452 2099527 2110048 2126365
6357B126365N4795J1071L3459K1392J7419M6849J6664L8903K2234L1055J1673
$$ 2126365 2181160 2192231 2225690 2247082 2264501 2311350 2328014 2366917 2389151 2420206 2431879
6346B431879L9156K7431L8229L2547K6595N5536K4578K0268O4852K4845M0248
$$ 2431879 2471035 2498466 2536695 2569242 2595837 2651373 2675951 2696219 2761071 2785916 2826164
6335B826164L1015N6799M5243L2771O1084L0345N9730N6704K2560M1755N2925
$$ 2826164 2857179 2913978 2959221 2991992 3053076 3083421 3143151 3199855 3222415 3264170 3317095
6324C317095L3069K9454M5132O3536L5975M9567N3246N3051N3724M9032N5461
$$ 3317095 3350164 3379618 3424750 3488286 3524261 3573828 3627074 3680125 3733849 3782881 3838342
6313C838342N8627M0825O9279P6438L7819P7300N8947O5652P8288N9143R1052
$$ 3838342 3896969 3937794 4007073 4083511 4121330 4198630 4257577 4323229 4401517 4460660 4551712
6302D551712P0339P2389O8616Q3094N2546P6917O7472N1767R8734N6364P9447
$$ 4551712 4622051 4694440 4763056 4846150 4898696 4975613 5043085 5094852 5193586 5249950 5329397
6291E329397Q7149Q3554P5959O6625Q4530Q0368Q9501R2640Q7235R0802J14080
$$ 5329397 5416546 5500100 5576059 5642684 5727214 5807582 5897083 5989723 6076958 6167760 6281840
6280F281840O7115R0476J07747R6036R9238R8734J04608R0336R9489R5836R7511
$$ 6281840 6348955 6439431 6547178 6643214 6742452 6841186 6945794 7036130 7135619 7231455 7328966
6269G328966J14652R9265R3136Q4528J09304R8719J07163Q2452R9484J15443R5089
$$ 7328966 7443618 7542883 7636019 7720547 7829851 7928570 8035733 8118185 8217669 8333112 8428201
6258H428201J12266Q1931Q4636Q8618J06358O9156R3526O6252Q3051P8312P0487
$$ 8428201 8540467 8622398 8707034 8795652 8902010 8971166 9064692 9130944 9213995 9292307 9362794
6247I362794N9760Q2777Q0786L2002P7194N9689N5770M3936L4511K4812N8303
$$ 9362794 9422554 9505331 9586117 9618119 9695313 9755002 9810772 9854708 9889219 9914031 9972334
6236I972334J0359N4063J1861J5498k22J2020J1928k5058J967k7896j5024m3251
$$ 9972334 9982693 10036756 10048617 10064115 10063893 10075913 10087841 10062783 10064750 10036854 10021830 9978579
6224I978579k1583l6403l3929n5248n7482n7184m7736n4674n6139o7813n3525
$$ 9978579 9956996 9920593 9886664 9831416 9773934 9716750 9669014 9614340 9558201 9490388 9436863
6213I436863q2200l2837o2277r3143r7198q7246p3768j08080q4480p9946r5040
$$ 9436863 9354663 9321826 9259549 9166406 9069208 8981962 8908194 8800114 8715634 8635688 8540648
6202H540648j09859r9315p9238j10424q4294j00005j04082j14079p9973j07875
$$ 8540648 8430789 8331474 8252236 8141812 8057518 7957513 7853431 7739352 7659379 7551504
6192G551504r5671j06463q8093r3344j03758r0733q7246q2620o7928q9796r2452
$$ 7551504 7455833 7349370 7261277 7167933 7064175 6973442 6886196 6803576 6735648 6645852 6553400
6181F553400r4174j11650q5175r6026q0835j03522o7015r0389q7242o9853p2381
$$ 6553400 6459226 6347576 6262401 6166375 6085540 5982018 5915003 5824614 5737372 5667519 5595138
6170E595138q7612o9036j10313n4455p8986o7954q1224o6866q0140o4864n8791
$$ 5595138 5507526 5438490 5328177 5273722 5194736 5126782 5045558 4978692 4898552 4833688 4774897
6159D774897o5805n7934m4547p8764n0698p2267m2349o7373o5205n7435m8203
$$ 4774897 4709092 4651158 4606611 4527847 4477149 4404882 4362533 4295160 4229955 4172520 4124317
6148D124317n8267n7300n9459m4822m4727n0635m9176k3963n0327o6575m2884
$$ 4124317 4066050 4008750 3949291 3904469 3859742 3809107 3759931 3735968 3685641 3619066 3576182
6137C576182l1521n4266m0610j9839n9573k4189l4820k8197n0021l3636m6817
$$ 3576182 3544661 3490395 3449785 3429946 3370373 3346184 3311364 3283167 3233146 3199510 3152693
6126C152693j5032j303o3028k5208k9785m1631k7618l1799l7488k5563l6077k7655
$$ 3152693 3137661 3136358 3073330 3048122 3018337 2976706 2949088 2917289 2879801 2854238 2818161 2790506
6114B790506l2344k3889m0810k3375j8330r186l4203k7905q272j1285k9651k2738
$$ 2790506 2758162 2734273 2693463 2670088 2651758 2642572 2608369 2580464 2572192 2560907 2531256 2508518
6102B508518n680l9782K171k6893l0928l3939j1724j6753k4193k1988k9293m7795
$$ 2508518 2502838 2463056 2465227 2438334 2407406 2373467 2361743 2344990 2320797 2298809 2269516 2221721
6090B221721j004j0896k8381j7476k0878j9160j0854j2632k6838p640j4739n266
$$ 2221721 2220717 2209821 2181440 2163964 2143086 2123926 2113072 2100440 2073602 2065962 2051223 2045957
6078B045957j2667K498l037j5124l885j1270J3652j4794q88J3284K8705j4530
$$ 2045957 2033290 2035788 2032751 2017627 2013742 2002472 2016124 2001330 2000442 2013726 2042431 2027901
6066B027901j1184q179j7606r919j5518k0167m6327R42k3033k3849n246j7861
$$ 2027901 2016717 2008538 1990932 1981013 1965495 1945328 1899001 1899943 1876910 1853061 1847815 1829954
6054A829954R14j1784M426j9665j262j0000l316o067q256j8470J1966l9561k951
$$ 1829954 1830868 1819084 1823510 1803845 1802583 1792583 1789267 1783200 1774944 1756474 1768440 1728879 1725928
6041A725928j9933J2477j4410j1988j3826K266j0873k3318M30j2032l304j2231
$$ 1725928 1705995 1718472 1704062 1692074 1678248 1680514 1669641 1646323 1646753 1634721 1631417 1619186
6029A619186J0547j6967O42q181M769J1286j044M39j412J6940j5777m811J5350
$$ 1619186 1629733 1612766 1613408 1605227 1609996 1621282 1620238 1620677 1619265 1636205 1620428 1615617 1630967
6016A630967m078j2348J1569J5916j2037Q33l480O736N290j2218J9349J1692P250
$$ 1630967 1626889 1614541 1626110 1642026 1629989 1630822 1627342 1634078 1639368 1627150 1646499 1658191 1665441
6003A665441j700l61L7857J5884j3903L3518k55L359N216J7448L465k17K6346
$$ 1665441 1663741 1663380 1701237 1717121 1703218 1736736 1736481 1739840 1745056 1762504 1765969 1765752 1792098
5990A792098m015N670J9098J4635J1151J3453J0785J5568L0982k634K4765J6845
$$ 1792098 1788083 1793753 1812851 1827486 1838637 1852090 1862875 1878443 1909425 1906791 1931556 1948401
5978A948401K53K3476J1007K4833J522L5764J6212N4172K4301K7611J5790L2215
$$ 1948401 1948654 1972130 1983137 2007970 2009492 2045256 2061468 2115640 2139941 2167552 2183342 2215557
5966B215557J3756k620K5333J2522J2638Q931J0037J4249O126j175K7343J6468
$$ 2215557 2229313 2226693 2252026 2264548 2277186 2286117 2296154 2310403 2316529 2315354 2342697 2359165
5954B359165M4001j356K0223L3372J8614J8594L2564L4757J0677L5340J8897L7300
$$ 2359165 2403166 2401810 2422033 2455405 2474019 2492613 2525177 2559934 2570611 2605951 2624848 2662148
5942B662148K123K2242P598O20n89m590r626j8709L796K5396o888J0480J5340
$$ 2662148 2664271 2686513 2694111 2694731 2694142 2689552 2679926 2661217 2665013 2690409 2683521 2694001 2709341
5929B709341O373L3424K7458L7580N9200M0479L3507K3509N5085j13K881J7137
$$ 2709341 2715714 2749138 2776596 2814176 2873376 2913855 2947362 2970871 3025956 3025843 3028724 3045861
5917C045861J6327k6393J2413K1224m890K0685J3362K2576K4377L3132L6413N1554
$$ 3045861 3062188 3035795 3048208 3069432 3064542 3085227 3098589 3121165 3145542 3178674 3215087 3266641
5905C266641O4040L2914N7765O0454P3991R1362O0639P6790P2332Q8688R4959
$$ 3266641 3330681 3363595 3421360 3481814 3555805 3647167 3707806 3784596 3856928 3945616 4040575
5894D040575P5140R3101R8199J09358R9405J41160J19457J60804J76588K27592
$$ 4040575 4115715 4208816 4307015 4416373 4515778 4656938 4776395 4937199 5113787 5341379
5884E341379K41636K52141L06232L66493L93657M33072M70773M85094M51077M49749
$$ 5341379 5583015 5835156 6141388 6507881 6901538 7334610 7805383 8290477 8741554 9191303
5874I191303L97177L45829K72106K10754J88768J16254R9630J23923J41038J76908
$$ 9191303 9588480 9934309 10206415 10417169 10605937 10722191 10821821 10945744 11086782 11263690
5864A1263690K08089L03194L87710M47751N52647O43645P54532Q20386R20558
$$ 11263690 11471779 11774973 12162683 12610434 13163081 13806726 14561258 15381644 16302202
5855A6302202R60881R71267R19977Q03552O62262M79842K70768J20365j01604
$$ 16302202 17263083 18234350 19154327 19957879 20620141 21099983 21370751 21491116 21389512
5846B1389512k12178l28196l32793l95630l66639l11708k02131j27566N9909J79464
$$ 21389512 21177334 20849138 20516345 20120715 19754076 19442368 19240237 19112671 19172580 19352044
5836A9352044L07929M48789N45813O43610O67673O69773O04616M68681K88233
$$ 19352044 19659973 20108762 20654575 21298185 21965858 22635631 23240247 23708928 23997161
5827B3997161O8216j41638l72021n75270p31492q48996q96609r50356r33139q67496
$$ 23997161 24065377 23923739 23551718 22976448 22244956 21395960 20499351 19548995 18615856 17748360
5817A7748360q27275p30861o39423n16150m44081l33165k51759j30153j13561
$$ 17748360 16921085 16190224 15550801 15034651 14590570 14257405 14005646 13875493 13761932
5808A3761932p5332p9273j31172j78330k63528l57968m61530n28871n86779o18833
$$ 13761932 13686600 13607327 13476155 13297825 13034297 12676329 12214799 11685928 11099149 10480316
5798A0480316o06375n84029n78994n10900m76717m41215m18497l27431l32866
$$ 10480316 9873941 9289912 8710918 8200018 7723301 7282086 6863589 6536158 6203292
5789F203292k60914k67888k33647k51853j71225j98421j88879j70222j36556j31528
$$ 6203292 5942378 5674490 5440843 5188990 5017765 4819344 4630465 4460243 4323687 4192159
5779D192159j28284j27472j04618q7869r9784r4968o9057o6231o1056l5410m9485
$$ 4192159 4063875 3936403 3831785 3743916 3644132 3549164 3480107 3413876 3352820 3317410 3267925
5768C267925k3988m2840m9474n1667m7786o5229p1320k8127n5790l7324l4760
$$ 3267925 3243937 3201097 3151623 3099956 3052170 2986941 2915621 2887494 2831704 2794380 2759620
5757B759620n9577m8348o3867k7972m8495l1937m2443k6607j8399j7299k375j6058
$$ 2759620 2700043 2651695 2587828 2559856 2511361 2479424 2436981 2410374 2391975 2374676 2372301 2356243
5745B356243r567Q119o119j0075r537n148J2469J7507r973k984k2341j1382k6675
$$ 2356243 2346676 2354795 2348676 2338601 2329064 2323916 2336385 2353892 2343919 2340935 2318594 2307212 2280537
5732B280537l6249j8784j7379m4977k1722l4666j9200l196j4157j7648r639j8709
$$ 2280537 2244288 2225504 2208125 2163148 2141426 2106760 2087560 2084364 2070207 2052559 2042920 2024211
5720B024211L0051j5794K1723J9885K5445K4311K6622J0024P2431L5175L6468
$$ 2024211 2054262 2038468 2060191 2080076 2105521 2129832 2156454 2166478 2238909 2274084 2310552
5709B310552L6483L8515L2733r117J9507r04j1744k1260Q56n9941P64k9515k234
$$ 2310552 2347035 2385550 2418283 2409166 2428673 2427769 2416025 2394765 2395621 2335680 2336444 2306929 2304695
5696B304695k0087j6167J1195N095L0356J4347L8392L9724M0446N1625P5031N3379
$$ 2304695 2284608 2268441 2279636 2284731 2315087 2329434 2367826 2407550 2447996 2499621 2574652 2628031
5684B628031P9266P8913J05009O6828J10909N7364J00836L6987N3952M2615L504
$$ 2628031 2707297 2786210 2891219 2958047 3068956 3126320 3227156 3264143 3318095 3360710 3364214
5673C364214J6108J190k2009p148l131n05j1860K1442L6387M1576M8145P4867
$$ 3364214 3380322 3381512 3359503 3352355 3349224 3348719 3336859 3358301 3394688 3436264 3484409 3559276
5661C559276R5748J28271J75031K19607K72391L10949M22890M38621M93903N25393
$$ 3559276 3655024 3783295 3958326 4177933 4450324 4761273 5184163 5622784 6116687 6642080
5651F642080N29593M79913L80071K60658J53325J0911j06658j75901k51429k95436
$$ 6642080 7171673 7651586 8031657 8292315 8445640 8456551 8349893 8173992 7922563 7627127
5641G627127k92903l24967k29449k64144j58318j39962j05127l2140q954L4128
$$ 7627127 7334224 7009257 6779808 6515664 6357346 6217384 6112257 6080117 6071163 6105291
5631F105291J11370J66616K14358L28081M34722N12902O55128P43041Q42905Q71265
$$ 6105291 6216661 6383277 6597635 6925716 7360438 7873340 8528468 9271509 10114414 10985679
5621A0985679Q58970P70129O17232M17452J98699p4666k69060m29500n79083o57573
$$ 10985679 11844649 12614778 13232010 13649462 13848161 13773495 13504435 13074935 12495852 11838279
5611A1838279o51287o39985n79288m60119m03161k97137k15602j40500m4229j8516
$$ 11838279 11186992 10547007 9967719 9507600 9104439 8807302 8591700 8451200 8406971 8388455
5601H388455Q1597J00124J79988K32111K77171L80581M54332N50001N94093O80132
$$ 8388455 8470052 8570176 8750164 8982275 9259446 9640027 10094359 10644360 11238453 11918585
5591A1918585O99796O77698O59775N76270M68239L84604K90633K54419J97381
$$ 11918585 12618381 13296079 13955854 14532124 15000363 15384967 15675600 15930019 16127400
5582A6127400J96510K67552K90164M40425O08283P85006J017941J308203J549630
$$ 16127400 16323910 16591462 16881626 17322051 17930334 18715340 19733281 21041484 22591114
5573B2591114J800089J923099J909824J738464J422521J098560P54161L96243
$$ 22591114 24391203 26314302 28224126 29962590 31385111 32483671 33237832 33634075
5565C3634075J07919j46271l48755m86376n34841n23414m39918k82637q6990J58923
$$ 33634075 33741994 33595723 33246968 32760592 32225751 31702337 31262419 30979782 30892792 31051715
5555C1051715L64337O29472R27780J145678J334821J479547J513346J380036J130313
$$ 31051715 31416052 32045524 32973304 34118982 35453803 36933350 38446696 39826732 40957045
5546D0957045P72571L04509j10551m81144p36473q55591r09776q56359q14722
$$ 40957045 41729616 42034125 41923574 41442430 40705957 39850366 38940590 38084231 37269509
5537C7269509q13122q25314q67515r60912r91503j018754r79064q49752p22336
$$ 37269509 36456387 35631073 34763558 33802646 32811143 31792389 30813325 29963573 29241237
5528B9241237n11278l15203k21504j97496k51299m30901o78166q54877j035804
$$ 29241237 28729959 28414756 28193252 27995756 27744457 27313556 26635390 25780513 24744709
5519B4744709j165698j217153j174725j151936r74792q57379p21119n56582m24172
$$ 24744709 23579011 22361858 21187133 20035197 19060405 18203026 17481907 16925325 16501153
5510A6501153l27868k65728k31256k29550k82775l53160m47188n00840n85962
$$ 16501153 16173285 15907557 15676301 15446751 15163976 14810816 14363628 13862788 13276826
5501A3276826o09698o47510o24328o17548n69378n22902m63234m08975l74408
$$ 13276826 12667128 12019618 11395290 10777742 10208364 9685462 9222228 8813253 8438845
5492H438845l08025k89362k22827k15798j98289j80793j40477j50434j65076r6935
$$ 8438845 8130820 7841458 7618631 7402833 7204544 7023751 6883274 6732840 6567764 6470829
5482F470829j26107j10450j11018j20966j11714j12432j33467j15756j21847j07866
$$ 6470829 6344722 6234272 6123254 6002288 5890574 5778142 5644675 5528919 5407072 5299206
5472E299206j21224j01554r6396j08855r9960p2461n8190p3790k9848k6108m1440
$$ 5299206 5177982 5076428 4980032 4871177 4771217 4698756 4640566 4566776 4536928 4510820 4469380
5461D469380l747n810K701L0959Q636M9554N0768L9292M2575K0816M1256J0002
$$ 4469380 4465633 4459823 4462524 4493483 4502119 4551673 4602441 4641733 4684308 4705124 4746380 4756382
5449D756382k748j5402k0742m1919m1623o7354n9106o7138o0827p2391o2253m0091
$$ 4756382 4753634 4738232 4717490 4675571 4633948 4566594 4507488 4440350 4379523 4307132 4244879 4204788
5437D204788n5109n6980l4407n193l3573J0204j0483j3998L1042K3578L2899J8030
$$ 4204788 4149679 4092699 4058292 4053099 4019526 4029730 4019247 4005249 4036291 4059869 4092768 4110798
5425D110798N4113N2084M5208J7746M3020K5664J598j8783j6088o1346l7185o3921
$$ 4110798 4164911 4216995 4262203 4279949 4322969 4348633 4350231 4331448 4315360 4254014 4216829 4152908
5413D152908n9940p0443o6659p2339n8217p5615n2106m6181n0382n6045k5633
$$ 4152908 4092968 4022525 3955866 3883527 3825310 3749695 3697589 3651408 3601026 3544981 3519348
5402C519348n5310l7262m5292k7363k4209n73l0156k46j703J0133N549L3877L3678
$$ 3519348 3464038 3426776 3381484 3354121 3329912 3329339 3299183 3298937 3297234 3307367 3312916 3346793 3380471
5389C380471L4977P0346R2541N4911J22982J22882J57849K00515J94947J73261
$$ 3380471 3415448 3485794 3578335 3633246 3756228 3879110 4036959 4237474 4432421 4605682
5379D605682J76352J91471J74266J33703J07167Q7730M6110L2260k6194k0293
$$ 4605682 4782034 4973505 5147771 5281474 5388641 5476371 5522481 5554741 5528547 5508254
5369E508254l6564m5156o754J347J6543Q7267J00954J50500K20086K59702K93411
$$ 5508254 5471690 5426534 5419780 5421127 5437670 5524937 5625891 5776391 5996477 6256179 6549590
5358F549590L42088L57185L55458L70199L49086K94768K63095J74631J03176O385
$$ 6549590 6891678 7248863 7604321 7974520 8323606 8618374 8881469 9056100 9159276 9165661
5348I165661o4043j47360j87838k53562k73561k74134k67943k56292k30004j60089
$$ 9165661 9101618 8954258 8766420 8512858 8239297 7965163 7697220 7440928 7210924 7050835
5338G050835j48173j34003p2740l9468m1726j0670m0116j3421l2615q6086q9826
$$ 7050835 6902662 6768659 6695919 6656451 6614725 6604055 6563939 6550518 6517903 6431817 6341991
5327F341991j42780j97351j99666k59788k30776k67651k69967k89810k38173k49249
$$ 6341991 6199211 6001860 5802194 5542406 5311630 5043979 4774012 4484202 4246029 3996780
5317C996780k12872j78429j98694j59064j27919j20520j25281q6451q1873q6088
$$ 3996780 3783908 3605479 3406785 3247721 3119802 2999282 2874001 2787550 2705677 2619589
5307B619589o1660o9728p4135n3950o1625m1877n4554l0590m6339n9376k6757
$$ 2619589 2557929 2488201 2414066 2360116 2298491 2256614 2202060 2171470 2125131 2065755 2038998
5296B038998m8837m6850k2177o3350k4412l0905l8373l0568l7008k4492l9073
$$ 2038998 1990161 1943311 1921134 1857784 1833372 1802467 1764094 1733526 1696518 1672026 1632953
5285A632953k1560l0839j2327r190j4650j9582k0316N031j156k8803j0826p243
$$ 1632953 1611393 1580554 1568227 1559037 1544387 1524805 1504489 1509520 1508364 1479561 1468735 1461492
5273A461492l2870R781k6581k5393j3253l0446m9584M425m7499M30k4990j8337
$$ 1461492 1428622 1438403 1411822 1386429 1373176 1342730 1293146 1297571 1250072 1250502 1225512 1207175
5261A207175j8258P178l5704k637J187k1369n739J1082j6514Q169k4521K5991
$$ 1207175 1188917 1196095 1160391 1157754 1158941 1137572 1131833 1142915 1126401 1134570 1110049 1136040
5249A136040j9367o996J4662r419j8730L918J6749j7622K992k0560j2163J1378
$$ 1136040 1116673 1109677 1124339 1114920 1096190 1100108 1116857 1099235 1102227 1081667 1069504 1080882
5237A080882N310o349J5195k9590L8117J4057K8863J3653J6251K1708L8444P773
$$ 1080882 1086192 1079843 1095038 1065448 1103565 1117622 1146485 1160138 1176389 1198097 1236541 1244314
5225A244314M5308J2213N4161K5847K3523M1316K0230K9456P923L6303K9241J3910
$$ 1244314 1289622 1301835 1355996 1381843 1405366 1446682 1466912 1496368 1504291 1540594 1569835 1583745
5213A583745K8632K5923M1593J855M0355R644N8369J8725O0038L8528L4278M3525
$$ 1583745 1612377 1638300 1679893 1681748 1722103 1731747 1790116 1808841 1868879 1907407 1941685 1985210
5201A985210L0810K7230K3331L0498j2491J2332k9821k7575j7697o0607k9534
$$ 1985210 2016020 2043250 2066581 2097079 2084588 2096920 2067099 2039524 2021827 1961220 1931686
5190A931686l6584m4845l1711o5684k8275m0156l3281l2203j1667k5481k3906
$$ 1931686 1895102 1850257 1818546 1752862 1724587 1684431 1651150 1618947 1607280 1581799 1557893
5179A557893k7036j8091j5194k7356n974j3927k3764l3982m8698j5612l8727o3509
$$ 1557893 1530857 1512766 1497572 1470216 1464242 1450315 1426551 1392569 1343871 1328259 1289532 1226023
5167A226023k4122l3819m5377m3092l5103l0911l8505l4137j5500k3505m131m400
$$ 1226023 1201901 1168082 1122705 1079613 1044510 1013599 975094 940957 925457 901952 897821 893421
5155H93421p973k4615p931l0705k6640k4829k0223k1160j3805k7289m122k0249
$$ 893421 885448 860833 852902 822197 795557 770728 750505 729345 715540 688251 684129 663880
5143F63880M475k2711M493j7396k1096M568k4261L960j9430k738r160M554j4524
$$ 663880 668355 645644 650137 632741 611645 616213 591952 595912 576482 573744 564584 569138 554614
5130E54614M55o244j2849J3103j3263M791j4182Q743r270r736L71m12M032j0812
$$ 554614 555069 548825 535976 549079 535816 540607 526425 535168 525898 516162 516533 516121 520153 509341
5116E09341q540R260j8281J8709o66o758M070p315K843K242N226l10j3142O166
$$ 509341 500801 510061 491780 510489 509823 503065 507135 499820 502663 504905 510131 509821 496679 502845
5102E02845O555M205j8143N028n165K2819j740k0807J580l791J4112J3114m458
$$ 502845 509400 513605 495462 500490 495325 518144 516404 495597 497177 493386 507498 520612 516154
5089E16154j1102K1495J85p045J6390n533N779J1346K0688p534m558L624j4385
$$ 516154 505052 526547 526732 519687 536077 530544 536323 547669 568357 560823 556265 559889 545504
5076E45504K819J4321j4580K0591j3355p354O231K130l823J3389Q681J2891J3333
$$ 545504 548323 562644 548064 568655 555300 547946 554177 556307 552484 565873 574554 587445 600778
5063F00778J6058K4042J0290K7638J9801J9403k575K5256O959J9549Q66J6491
$$ 600778 616836 640878 651168 678806 698607 718010 715435 740691 747650 767199 768065 784556
5051G84556O451j2102P072R287j5118J357M648J954m137k932J0773M036L253O496
$$ 784556 791007 778905 785977 795264 780146 781503 786151 788105 783968 781036 791809 795845 799098 805594
5037H05594K409M2733j2001K9726K6643L4443K3652J9341K1460M9300M5353L3890
$$ 805594 808003 850736 838735 868461 895104 929547 953199 972540 994000 1043300 1088653 1122543
5025A122543J7041L8031L6635L835M3800M617j883J1412P439k150o963k1490L902
$$ 1122543 1139584 1177615 1214250 1218085 1261885 1266502 1264619 1276031 1283470 1281320 1274357 1252867 1256769
5012A256769r755r960J0068R09j989K7244L285J4673M2553K7668M1085L3313N0560
$$ 1256769 1247014 1237054 1247122 1248031 1246042 1273286 1276571 1291244 1333797 1361465 1402550 1435863 1486423
4999A486423M1912M6920M4271N3796P7763O2073N9036O9656M4604P0830L8714
$$ 1486423 1528335 1575255 1619526 1673322 1751085 1813158 1872194 1941850 1986454 2057284 2095998
4988B095998M0585M1368L005R255K1486L4880K9638N0466N7079Q3051J19857J33840
$$ 2095998 2136583 2177951 2180956 2190211 2211697 2246577 2276215 2326681 2383760 2466811 2586668 2720508
4976B720508J45335J34973J22000J12518M0884K0514j5325n5571m2169l3310l1999
$$ 2720508 2865843 3000816 3122816 3235334 3276218 3296732 3281407 3225836 3183667 3150357 3118358
4965C118358k8234j142M0623P292M5706M8639J5923K9718L5137L8824J8839O6806
$$ 3118358 3090124 3088982 3129605 3136897 3182603 3231242 3247165 3276883 3312020 3350844 3369683 3436489
4953C436489O3892R7534J62881K26386L11461L61064M09837M51471M34010M12156
$$ 3436489 3500381 3597915 3760796 3987182 4298643 4659707 5069544 5521015 5955025 6367181
4943F367181K74422J02352m6322j45787k64390k99882l44875k77348k52254k23521
$$ 6367181 6641603 6743955 6697633 6551846 6287456 5987574 5642699 5365351 5113097 4889576
4933D889576j49956j19382p7656n3187n9357l2830Q604J4373K5743O8667J02992
$$ 4889576 4739620 4620238 4542582 4489395 4430038 4397208 4405812 4420185 4445928 4514595 4617587
4922D617587J73960K95694L33183M24358M96883N69290N86291N93649N17140L50190
$$ 4617587 4791547 5087241 5420424 5844782 6341665 6910955 7497246 8090895 8608035 8958225
4912H958225J47077r8518k21595l07858l40274l63837k90321j67146K31174J136189
$$ 8958225 9105302 9006784 8785189 8477331 8137057 7773220 7482899 7315753 7546927 8683116
4902H683116K595298L536619K915109J013226j92837o05268j573247j834567j847427
$$ 8683116 11278414 14815033 17730142 18743368 18550531 17945263 16372016 14537449 12690022
4893A2690022j760002j496075j209059q69143l81982m2324J17361J66579J31411
$$ 12690022 10930020 9433945 8224886 7355743 6973761 6931437 7048798 7215377 7346788
4884G346788J5694p9302j71392k53549l63017m07143l85798l80502l65210k97181
$$ 7346788 7362482 7283180 7111788 6858239 6495222 6088079 5702281 5321779 4956569 4659388
4874D659388k53456j93465j60191j01145q4540r7103n4916o6781n5647o7957o7075
$$ 4659388 4405932 4212467 4052276 3951131 3866591 3769488 3714572 3647791 3592144 3524187 3457112
4863C457112l9018n9681n5750l0142k2696R981J5186L7979K3699j4479k4361m1613
$$ 3457112 3418094 3358413 3302663 3272521 3249825 3259806 3274992 3312971 3336670 3322191 3297830 3256217
4851C256217r4392q0043j04291j05688r2383q8876n4358m9306J2009Q67L7069
$$ 3256217 3161825 3081782 2977491 2871803 2779420 2690544 2636186 2586880 2598889 2599756 2636825
4840B636825O6056O5203L1820L2000k6893n5979o4312r1115q6546r3940p3191
$$ 2636825 2702881 2768084 2799904 2831904 2805011 2749032 2684720 2593605 2507059 2413119 2339928
4829B339928j03588n9758n9394l2657k7919m067m92k303r246O730l3056j3239
$$ 2339928 2236340 2176582 2117188 2084531 2056612 2052545 2052053 2049750 2040504 2047234 2014178 2000939
4817B000939l3768j2533l2836k9037k1225j2679l1767N710o760m345l306K543
$$ 2000939 1967171 1954638 1921802 1892765 1871540 1858861 1827094 1832804 1826044 1821699 1818393 1820936
4805A820936J4731j0498J7659L696K5572M981J3127L5563K3924K483J3520M0372
$$ 1820936 1835667 1825169 1842828 1846524 1872096 1877077 1890204 1925767 1949691 1952174 1965694 2006066
4793B006066K0553L6449M5364M5547M1811M3486P8957Q7775O4114Q8655Q0375
$$ 2006066 2026619 2063068 2108432 2153979 2195790 2239276 2318233 2406008 2470122 2558777 2639152
4782B639152P2724Q9814R6389P5399Q4763Q2957P5148Q1399P0962Q6706Q5015
$$ 2639152 2711876 2801690 2898079 2973478 3058241 3141198 3216346 3297745 3368707 3455413 3540428
4771C540428P8575J07591R9022J00662N7566P5857P0340M6087L2127M4059N2852
$$ 3540428 3619003 3726594 3825616 3926278 3983844 4059701 4130041 4176128 4208255 4252314 4305166
4760D305166N9950N2093O4854Q6766P5693J22269J08141J17864J09670R3792J15239
$$ 4305166 4365116 4417209 4482063 4568829 4644522 4766791 4874932 4992796 5102466 5196258 5311497
4749E311497J20739J30247J70387K16802K33643K42916K32934K02577K04675J65848
$$ 5311497 5432236 5562483 5732870 5949672 6183315 6426231 6659165 6861742 7066417 7232265
4739G232265J44511J32441J18702J46157J49663J37178J81232J98035J96447K39609
$$ 7232265 7376776 7509217 7627919 7774076 7923739 8060917 8242149 8440184 8636631 8876240
4729H876240K68055L56446M36747M90883O15599O67488O38755O10841N13427M06007
$$ 8876240 9144295 9500741 9937488 10428371 11043970 11711458 12350213 12961054 13474481 13880488
4719A3880488L06291J86721J15894P5766Q2821J10885J13323J24432J38085J54002
$$ 13880488 14186779 14373500 14489394 14565160 14647981 14758866 14872189 14996621 15134706 15288708
4709A5288708J32959J40502J13630M5628n210j7192j3924k0002j2284J5759L1145
$$ 15288708 15421667 15562169 15675799 15721427 15716217 15699025 15685101 15665099 15652815 15668574 15699719
4698A5699719L2943K1889o2121j67510k81590m19134m90848n29542n43289n18059
$$ 15699719 15732662 15754551 15692430 15524920 15243330 14824196 14333348 13803806 13260517 12742458
4688A2742458m89999m05176l62558k94471k66246k01394j88851j34661j12622
$$ 12742458 12252459 11847283 11484725 11190254 10924008 10722614 10533763 10399102 10286480
4679A0286480j01770n9727l6758m4271m4713j00367j14634r6388j34200q6981
$$ 10286480 10184710 10124983 10088225 10043954 9999241 9898874 9784240 9687852 9553652 9466671
4669I466671p1443o5780l5780l7746o3495r1076j28751j57603k22152k33141k70283
$$ 9466671 9395228 9329448 9293668 9255922 9192427 9101351 8972600 8814997 8592845 8359704 8089421
4658H089421k60390k49164k10341j92621j83466j77497j39036j43390j64680j72784
$$ 8089421 7829031 7579867 7369526 7176905 6993439 6815942 6676906 6533516 6368836 6196052
4648F196052j44084j95620j90940j51399j28346j55197j52715j56720j56808j68161
$$ 6196052 6051968 5856348 5665408 5514009 5385663 5230466 5077751 4921031 4764223 4596062
4638D596062j51324j54544j35498j28639j29604j15375j18729r1235j18435j01277
$$ 4596062 4444738 4290194 4154696 4026057 3896453 3781078 3662349 3571114 3452679 3351402
4628C351402q3261q2778j00545p5483o9651q3796p6633p2095p8778m2541o0269
$$ 3351402 3268141 3185363 3084818 3009335 2939684 2855888 2779255 2707160 2628382 2585841 2525572
4617B525572p4017m5407n1754m6233m0604n7780k1168l8816j4098n0955l8219
$$ 2525572 2451555 2406148 2354394 2308161 2267557 2209777 2188609 2149793 2135695 2084740 2046521
4606B046521j2440m2119k2012j9589k3610m3741k4115l4877p155j7684k0710j6324
$$ 2046521 2034081 1991962 1969950 1950361 1926751 1883010 1858895 1824018 1816863 1799179 1778469 1762145
4594A762145k4066j3426k7741m874m876Q658j941m238q315k9155j1748j1102m6577
$$ 1762145 1738079 1724653 1696912 1692038 1687162 1695820 1693879 1689641 1681326 1652171 1640423 1629321 1582744
4581A582744j824l4664J710l5000k2394l5350k2011l1654k0375k8349k8687j2644
$$ 1582744 1580920 1546256 1547966 1512966 1490572 1455222 1433211 1401557 1381182 1352833 1324146 1311502
4569A311502j6255O603J286N167J5357J886J1381K6827L7146M5799M654K0897
$$ 1311502 1295247 1301850 1303136 1308303 1323660 1325546 1336927 1363754 1400900 1446699 1451353 1472250
4557A472250J7923K8297p44K2684p603K6168L73J1762j2441N73J9959j5456N495
$$ 1472250 1490173 1518470 1517726 1540410 1532807 1558975 1559348 1571110 1558669 1559242 1579201 1563745 1569240
4544A569240O74k299O286J0031j917J1220R788M1774K3183L6282K2479M7398M6605
$$ 1569240 1569914 1567615 1573901 1583932 1582015 1593235 1603023 1644797 1667980 1704262 1726741 1774139 1820744
4531A820744L8870N2365N7253N6600O0896P1455Q7187K4381M0993K8295p6L1237
$$ 1820744 1859614 1911979 1969232 2025832 2086728 2158183 2245370 2269751 2310744 2339039 2338963 2370200
4519B370200J2250J550L2556N720J5750J3218J9873K9604L4286M0369M1262L9414
$$ 2370200 2382450 2384000 2416556 2422276 2438026 2451244 2471117 2500721 2535007 2575376 2616638 2656052
4507B656052Q2382L9116N9861L6314M1918M8991J0025M4062M9931P2880O1839
$$ 2656052 2738434 2777550 2837411 2873725 2915643 2964634 2974659 3018721 3068652 3141532 3203371
4496C203371O3064O1993N0744R3354Q5391J02297P6536Q4963Q0466P2361J07540
$$ 3203371 3266435 3328428 3379172 3472526 3557917 3660214 3736750 3821713 3902179 3974540 4082080
4485D082080Q9092J19766J17730J87949K24859K57054K01525J68224J23255J22973
$$ 4082080 4171172 4290938 4408668 4596617 4821476 5078530 5280055 5448279 5571534 5694507
4475E694507O5198R0020R9937J05379J60285J67205K37188K82538K64401K64610
$$ 5694507 5759705 5849725 5949662 6055041 6215326 6382531 6619719 6902257 7166658 7431268
4465G431268K24312K10790K35831J93823K55952K61526L02481L31171L63524M08544
$$ 7431268 7655580 7866370 8102201 8296024 8551976 8813502 9115983 9447154 9810678 10219222
4455A0219222M53664M91563N25725N55082N89836O24010O32275O65672O64752
$$ 10219222 10672886 11164449 11690174 12245256 12835092 13459102 14091377 14757049 15421801
4446A5421801O79475P40368Q37839R94660J265668J513788J566024J424292J168158
$$ 15421801 16101276 16841644 17679483 18674143 19939811 21453599 23019623 24443915 25612073
4437B5612073J223032J254275J330805J635991J947580K337973K750706L210351
$$ 25612073 26835105 28089380 29420185 31056176 33003756 35341729 38092435 41302786
4429D1302786L806745M569359N495911O653113Q223108J0305588J2817297J5403428
$$ 41302786 45109531 49678890 55174801 61827914 70051022 80356610 93173907 108577335
4421A08577335J8628247K3501177L0939980L8465900M2709318L9503418K8427133
$$ 108577335 127205582 150706759 181646739 220112639 262821957 302325375 330752508
4414C30752508J3684485l67887j2450080k1657519k7527677l0402508l0657099
$$ 330752508 344436993 344069106 331619026 309961507 282433830 252031322 221374223
4407B21374223k8974073k5939328k2098251j8086477j4726692j2152318j0236118
$$ 221374223 192400150 166460822 144362571 126276094 111549402 99397084 89160966
4400H9160966q676945p370287o196096n259295m471334l857082l423697l070606
$$ 89160966 80484021 73113734 66917638 61658343 57187009 53329927 49906230 46835624
4392D6835624k807967k626086k406800k207109k061003j882447j755120j604595
$$ 46835624 44027657 41401571 38994771 36787662 34726659 32844212 31089092 29484497
4384B9484497j473516j361304j238358j146647j019806r42264q83454q23112p73392
$$ 29484497 28010981 26649677 25411319 24264672 23244866 22302602 21419148 20596036 19822644
4375A9822644p17085p07267o28849o36680n58756n30552m78161m52783m18178
$$ 19822644 19105559 18398292 17769443 17132763 16574007 16043455 15565294 15112511 14694333
4366A4694333l98845l64950l59652l50174l44735l42761l01318k93358k49342
$$ 14694333 14295488 13930538 13570886 13220712 12875977 12533216 12231898 11938540 11689198
4357A1689198k64947k13825k28196k04972j62045j89552j43219j25141r8000o6580
$$ 11689198 11424251 11210426 10982230 10777258 10615213 10425661 10282442 10157301 10059301 9992721
4347I992721k9166P659N928O0174K24916N58227J186650J889739J942842J195355
$$ 9992721 9963555 9971214 9977142 10037316 10262232 10820459 12007109 13896848 15839690 17035045
4337A7035045J97311j91450p06677j126242j212200j240220j171096j005156q62203
$$ 17035045 17232356 17040906 16334229 15207987 13995787 12755567 11584471 10579315 9717112
4328I717112o50439m35747l30061k35317j98152j24090p9860j5740L3671J48704
$$ 9717112 9066673 8630926 8300865 8065548 7867396 7743306 7663446 7647706 7681377 7830081
4318G830081J76802K28689K97364N49751J098565K377648L979898M367170K980610
$$ 7830081 8006883 8235572 8532936 9082687 10181252 12558900 16538798 20905968 23886578
4309B3886578O60370j83536q54812j603747j286292j486959j773743j930987j688859
$$ 23886578 24546948 24363412 23508600 21904853 20618561 19131602 17357859 15426872 13738013
4300A3738013j572356j209661r75466q35075o99122o17423m92211l10389j59207
$$ 13738013 12165657 10955996 9980530 9145455 8446333 7828910 7336699 7026310 6867103
4291F867103o1711k3952J6944J03670J90928M94944R84569J700600K046476J588503
$$ 6867103 6805392 6781440 6798384 6902054 7092982 7587926 8572495 10273095 12319571 13908074
4281A3908074N97232P3709j6221N8809P87477Q90533K44907q03938p74868j010899
$$ 13908074 14505306 14579015 14562794 14621603 15409080 16299613 16544520 15740582 14965714 13954815
4271A3954815j333582j202774j262212j180508j012525r20537p12881m39847l32523
$$ 13954815 12621233 11418459 10156247 8975739 7963214 7042677 6329796 5889949 5557426
4262E557426k69821k47207k15537k10680j69446j29110j30600j35477q0555r9943
$$ 5557426 5287605 5040398 4824861 4614181 4444735 4315625 4185025 4049548 3968993 3869050
4252C869050m9017N2225K85667O89802R30413O80182J04457j16728j44028n17042
$$ 3869050 3820033 3872258 4157925 4847727 5778140 6458322 6562779 6446051 6302023 5784981
4242E784981m78479n16542n37072m12578m01333k98302j88061j28854r2998r8767
$$ 5784981 5306502 4789960 4252888 3840310 3438977 3140675 2952614 2823760 2730762 2631995
4232B631995o0884o4025n2276p8455m7451q6309n1754m8232o0497n5379l8875
$$ 2631995 2571111 2507086 2454810 2376355 2328904 2242595 2190841 2142609 2082112 2026733 1987858
4221A987858n1838k62m4714j8963k8928k2249O274m9806n217n7054j0855l9255
$$ 1987858 1936020 1935758 1891044 1872081 1843153 1820904 1827178 1777372 1772155 1715101 1704246 1664991
4209A664991l9130l5027k6191k1503j6776l451j6023k4421O909j7171n944j5171
$$ 1664991 1625861 1590834 1564643 1543140 1526364 1522913 1506890 1482469 1489378 1472207 1466263 1451092
4197A451092K0860L0970K2018L9312K8302l636j0966l8042k6866n1978l8531l2598
$$ 1451092 1471952 1502922 1524940 1564252 1592554 1588918 1577952 1539910 1513044 1461066 1422535 1389937
4185A389937l3915l3679j7957j2736k3052p790j76j625K899L1099K5454L0292
$$ 1389937 1356022 1322343 1304386 1291650 1268598 1260808 1260632 1259007 1261906 1293005 1318459 1348751
4173A348751M6313P4140O7136J25578J55377K15908K38130K55596J97658J54430
$$ 1348751 1395064 1469204 1536340 1661918 1817295 2033203 2271333 2526929 2724587 2879017
4163B879017R5795K0541n7637j18433j14148j82327j69529j71311j84648j43445
$$ 2879017 2974812 2995353 2937716 2819283 2705135 2522808 2353279 2181968 1997320 1853875
4153A853875j52181j38652q7313j18097o3922o6774n6214l9147l4342k0417j652
$$ 1853875 1701694 1563042 1475729 1357632 1293710 1226936 1170722 1131575 1097233 1076816 1075164
4142A075164j6845L7784J5202J3718L3765M64j8569r142n2387k9989n1567l5665
$$ 1075164 1058319 1096103 1111305 1125023 1158788 1159252 1140683 1131541 1079154 1049165 997598 961933
4130I61933l3465k8054m4159l8004j6983k3908k5389k3517k3816k7512k2243k1950
$$ 961933 928468 900414 856255 818251 801268 777360 751971 728454 704638 677126 654883 632933
4118F32933j3644l4105n279L682J0397n194K2913m600j4369P061j2668Q364j9877
$$ 632933 619289 585184 579905 583587 593984 588790 611703 607103 592734 599795 587127 595491 575614
4105E75614j1887L848j7448k3833K1473p616j4959j986M627k6506J721r871K013
$$ 575614 563727 567575 550127 526294 547767 540151 525192 523206 527833 501327 503048 493177 495190
4092D95190k9685l422j6153K3449l262j4145L6745j7220L263J0449p107o871O262
$$ 495190 465505 462083 445930 469379 466117 451972 488717 471497 474760 485209 478102 471231 477493
4079D77493m2221q395O40k6388M57j0136k0141q430P182J566P780N171j1858P695
$$ 477493 435272 426877 427517 401129 401586 391450 371309 362879 370061 371627 379407 384578 372720 380415
4065C80415N937J0797j1359q710P787K2033K4615P357Q445J4353k9571J4336l3674
$$ 380415 386352 397149 385790 377080 384867 406900 431515 438872 447317 461670 432099 446435 412761
4052D12761K332K083j5102j181n196j1791l925q797M608j3696Q277j589J5983
$$ 412761 415093 417176 402074 400893 395697 383906 379981 371184 375792 362096 370373 368784 384767
4039C84767j6854J1960L179l433J892o416P229K4436o583Q444k406j2414J5539
$$ 384767 367913 379873 383052 379619 381511 375095 382324 406760 400177 408621 406215 393801 409340
4026D09340k0988O978N87N256P069j1351k842k0161J2661j9134j2997O852j0119
$$ 409340 388352 395330 395917 401173 408242 396891 394049 373888 386549 367415 354418 361270 351151
4013C51151R51l476J7932J6054n614J0504K414J297K447J3338j2982n728k3411
$$ 351151 352102 348626 366558 382612 376998 387502 389916 391213 393660 406998 394016 388288 364877
4000C64877J3635L989j233j7698P248R717j2789K850K988J6127k4732m108J80
$$ 364877 378512 382501 381268 363570 370818 380535 367746 370596 373584 389711 364979 360871 361051
3987C61051k9169J8931p950p142K9914j9263J1454O712L7047j7572n92K1136M772
$$ 361051 331882 350813 342863 335721 365635 346372 357826 364538 401585 384013 383421 404557 409329
3974D09329J7856j1304j6978L774k691k263j3376k9859n555o904j3828j3676j3309
$$ 409329 427185 415881 398903 402677 399986 397723 384347 354488 348933 342029 328201 314525 301216
3961C01216J0986j639o686r939R986J720L353J5616q043k039M860K761n648J2860
$$ 301216 312202 310563 303877 293938 303924 305644 308997 324613 316570 314531 319391 322152 316504 329364
3947C29364K926j187k857p213q520k483p572j4329k5454K587P258N608k3934J39
$$ 329364 332290 331103 328246 321033 312513 310030 302458 288129 262675 265262 272520 278128 254194 254333
3933B54333j53k642M0M83P524P059j0293q730n100j328j3610j6345K320j6324
$$ 254333 254180 251538 251578 252061 259585 266644 256351 247621 242521 241193 227583 211238 213558 197234
3919A97234r25K8471k9341l829j1138Q234j0768N174j2762N285P131j3459j1409
$$ 197234 196309 224780 195439 191610 180472 188706 177938 183112 170350 175635 182766 169307 157898
3906A57898J1863K124o523r799N484J639j1065J1551j1381K56J1623r820m221
$$ 157898 169761 171885 165362 155563 161047 162686 151621 163172 151791 152047 163670 153850 149629
3893A49629K91J1021j0089q965r946M319J8045j1673j542k6487M2490j0672j2645
$$ 149629 149920 160941 150852 141887 131941 136260 154305 142632 141090 114603 157093 146421 133776
3880A33776N859o062J482O89j850l699J60L0j2030Q989j0208Q561M269j4790P710
$$ 133776 139635 133573 135055 135744 133894 130195 130355 130385 118355 127344 117136 125697 129966 115176 122886
3865A22886r876q614J318m291J092J8692m45m966o230j6328J9971k4622N980j64
$$ 122886 113010 104396 105714 101423 102515 121207 120762 115796 109566 93238 113209 88587 94567 94403
3851I4403J8233j0898k3269K5737j5897P141j3944K0070l1505m503J8627N712
$$ 94403 112636 101738 78469 104206 88309 95450 81506 101576 70071 65568 84195 89907
3839H9907K297j9579M494P957q949J622l098N612J0272p452m457M229k172n400
$$ 89907 92204 72625 77119 85076 76127 77749 74651 80263 90535 83083 78626 82855 80683 75283
3825G5283J9842O564k1282L558p296J4289k112j979q854r183J9741j1326k811
$$ 75283 95125 101689 80407 83965 76669 90958 88846 86867 78013 68830 88571 77245 74434
3812G4434n733p164K1280L812j1248J2059p127j5594m094K0198Q105o936j1987
$$ 74434 68701 61537 82817 86629 75381 87440 80313 64719 60625 80823 88928 81992 70005
3799G0005P357j0505r373J2984L256p368L623j2897J6759j2017J2673J0081q030
$$ 70005 77362 66857 57484 70468 73724 66356 69979 57082 73841 61824 74497 84578 76548
3786G6548j6087K4516l608q447j5040J7126j5501l054M935M951N432j0470o132
$$ 76548 60461 84977 81369 72922 57882 75008 59507 56453 61388 66339 71771 61301 55169
3773E5169J3845j27k0894J4295J7243j5190J2739l200q004N426r039J0913O674
$$ 55169 69014 68887 47993 62288 79531 64341 77080 73880 65876 71302 62263 73176 79850
3760G9850j9091L4448j6033l03j1410J960j1409J5153k5298K080J5196j257o524
$$ 79850 60759 95207 79174 78871 67461 69421 58012 73165 47867 49947 65143 63886 57362
3747E7362L942p142N068Q483p492o385K553J984J3457j2625N049N361j3769J2403
$$ 57362 61304 54162 59230 67713 60221 53836 56389 58373 71830 59205 64254 69615 55846 68249
3733F8249J3709k5505M615K331R658j5501p940N627l865K4944j9861M943N23j5632
$$ 68249 81958 56453 61068 63399 73057 57556 49616 55243 51378 76322 56461 61404 61927 46295
3719D6295O304N862j7049N938o203n550Q785j0057J6368J7110l1650M401J1354
$$ 46295 52599 58461 41412 47350 41147 35597 44382 34325 50693 67803 36153 40554 51908
3706E1908n181R0O558k6234K1149n442L112q006M649j830j6019L300M0393k9892
$$ 51908 46727 46817 53375 27141 48290 42848 45960 37954 42603 40773 24754 28054 68447 38555
3692C8555J1454j4778M345R053q995j1906K5860q877J6466k5121J3106o810O84
$$ 38555 50009 35231 39576 48629 39634 27728 53588 44711 61177 36056 49162 42352 43036
3679D3036r97o95q01K0700k0195N487q178k734P078J443r19R93j4743J3085o654
$$ 43036 42039 41344 40543 61243 41048 46535 38357 35623 42701 44144 43225 44218 29475 42560 35906
3664C5906Q54o023q47J8482j6528N636P917j7117O7J8781j1383K24P776p501J391
$$ 35906 36760 30737 29890 48372 31844 37480 45397 28280 28347 47128 35745 35969 43745 36244 37635
3649C7635n23l876j7686K3792m351n974J2525O177j5200m443K1095l0957Q016
$$ 37635 37112 33236 15550 39342 34991 29017 41542 47719 32519 28076 49171 18214 26230
3636B6230J0390j0747Q303N696j4489L671l350J1891p804J2551k1347J0556R50
$$ 26230 36620 25873 34176 39872 25383 29054 25704 37595 29791 42342 20995 31551 32501
3623C2501j0413L061j056r992J0680J188l364O100n870J0930r072R396n296Q00
$$ 32501 22088 25149 24093 14101 24781 25969 22605 28705 22835 33765 24693 34089 28793 29593
3609B9593M95O660k902r148l63L079k837O440J2093l0810J2440j4933J5677j419
$$ 29593 30088 36748 33846 24698 24335 27414 24577 31017 43110 12300 24740 9807 25484 24065
3595B4065M035o928R98l21q729J5011j2304L2J6116j4255r725J0598j7324K2454
$$ 24065 28100 21172 22170 21849 13120 28131 15827 15859 31975 17720 7995 18593 1269 23723
3581B3723k628j2030L970L993L634l678J495j2856R489k228J8675k6786K3886
$$ 23723 21095 9065 13035 17028 20662 16984 18479 5623 15112 12884 31559 4773 28659
3568B8659j3738j3451R581J8406o332j0865J3862o665j84M173j519j6848K5286
$$ 28659 14921 1470 11051 29457 23125 12260 26122 19457 19273 23446 21927 5079 30365
3555C0365k1670k250P480O715j036O174n508J2015j6882P495r702Q734j784j2306
$$ 30365 8695 6445 13925 20640 19604 25778 20270 32285 15403 22898 13196 21930 20146 7840
3541G840K6597k1610l728J1312o302N402O237q657P303J037j574j3527Q674J2708
$$ 7840 34437 12827 9099 20411 14109 19511 25748 17091 24394 25431 23857 10330 19004 31712
3527C1712M117j6108R005k2987J4173M047N29j9334J4573j58j422r221J2160N569
$$ 31712 35829 19721 28726 5739 19912 23959 24488 5154 19727 19569 18147 8926 21086 26655
3513B6655j6071K7132j1506l0206K3234j5000R486q040M559j2298K4301r04o853
$$ 26655 10584 37716 26210 -3996 19238 4238 13724 5684 10243 -2055 22246 21342 14489
3500A4489O57j5365j4938K7714k2323J5688J1996k237q499j1373K6099K332j3220
$$ 14489 15146 -219 -15157 12557 -9766 5922 17918 15681 7182 -4191 21908 24240 11020
3487A1020j2990O299j700J9983q929J801m963N343j3226J7965k5237J5255L572
$$ 11020 -1970 4329 2629 22612 13683 15484 10521 15864 2638 20603 -4634 10621 14193
3474A4193j3940K4906p762j8661J6175l137p473N707J7110J993j8926j4623M334
$$ 14193 253 25159 17397 -1264 14911 11774 4301 10008 27118 29111 10185 -4438 -104
3461a04K6170j1781o568L539P615n542k624L382O940L02k8299J447J7810L812
$$ -104 26066 14285 7717 11256 18871 13329 10705 14087 21027 21329 -6970 -5523 12287 16099
3447A6099j191p455l500K477j471l566O055m7J5255j8292O12J2767J4480l0458
$$ 16099 14908 7453 3953 6430 4959 1393 7448 7401 22656 4364 4976 17743 32223 1765
3433A765Q901j1819K783j816Q331j4074N589K812o172K940l709O179J5373j171
$$ 1765 10666 -1153 1630 -186 8145 -5929 -340 2472 -3700 -760 -4469 1710 17083 15912
3419A5912j3104J0159j0641L828P666R488r674J58j2451K0160j0798N54j5569
$$ 15912 2808 12967 2326 6154 13820 23308 13634 13792 1341 21501 10703 11257 -4312
3406d312J2589k732l385R319R471j921p384p490J3052j4365Q268l064K5361k3876
$$ -4312 8277 5545 2160 11479 20950 19029 11645 4155 17207 2842 11110 8046 33407 9531
3392I531l01l755J7809q875L989J4148J5306q191R880j4676j0515J6478k6772
$$ 9531 9230 5475 23284 14409 18398 32546 47852 39661 49541 34865 24350 40828 14056
3379A4056J0326q06r99J326P16k1479J3518r14j5415K4106L675P326j3184O429
$$ 14056 24382 23576 22577 23903 24619 3140 16658 15744 329 24435 28110 35436 22252 28681
3365B8681k649j3962Q897j5956N910J1238r558K2930j1967l800r003R900J0173
$$ 28681 26032 12070 20967 5011 10921 22159 12601 35531 23564 19764 10761 20661 30834
3352C0834j3030n900J5656j933N841j5249m658Q844Q027J4763J848L8140k765
$$ 30834 17804 11904 27560 25627 31468 16219 11561 20405 28432 43195 45043 83183 80418
3339H0418N3192O893L1129m959R480R712n0109j1970k5379k2663j9630m022j6097
$$ 80418 133610 140503 171632 166673 176153 185865 135756 123786 98407 75744 56114 52092 35995
3326C5995o576J5413k7118J6944k7685K4352m998q366n554J3660j3575k181n110
$$ 35995 29419 44832 17714 34658 6973 31325 26327 17961 12407 26067 12492 10311 5201
3313E201K177M039l6k688j7744J8028m048m038n361J5183q865M405k2442M259
$$ 5201 7378 11417 11381 8693 -9051 8977 4929 891 -4470 10713 1848 6253 -16189 -11930
3299a1930J0651L573N960m628R188j962l4038K8719j2917K0201L864k0804K384
$$ -11930 -1279 2294 8254 3626 12814 10852 -23186 5533 -7384 12817 16681 -4123 -1739
3286a739r15K2574k3013k885J7007J4202L106J8901L3115Q059N639j7793J0567
$$ -1739 -2654 19920 -3093 -5978 11029 25231 28337 47238 80353 88412 94051 76258 86825
3273H6825o347l2552m444j9138o843N294n549K008j048j1853J2316R179k6192
$$ 86825 80478 47926 43482 24344 17501 22795 17246 19254 18206 6353 18669 27848 1656
3260A656O644m090r676J8622o761j5110K695L574n220K2135P392k0452N424r637
$$ 1656 8300 4210 -5466 13156 6395 -8715 -6020 -2446 -7666 14469 21861 1409 6833 -2804
3246b804j5430K8452j2075j1975J3266J2097j2705R719m544m664p736R073l638
$$ -2804 -18234 10218 -1857 -13832 -566 11531 -1174 8545 4001 -663 -8399 674 -2964
3233b964M810j8714J5726j0970j5252J9200L706j17j1022M021J3264n426j0351
$$ -2964 1846 -16868 -1142 -12112 -27364 -8164 -4458 -4575 -15597 -11576 1688 -3738 -14089
3220a4089Q532M659P311q048j2046J903O513J442J7669l9822K2254m632j508J0730
$$ -14089 -5557 -898 6413 -1635 -13681 -11778 -5265 -3823 13846 -25976 -3722 -8354 -9862 868
3206H68K700k5097M901Q354R020j5543k805m766K546J4691j7021p462J9670O43
$$ 868 3568 -21529 -16628 -8274 746 -14797 -17602 -22368 -19822 -5131 -22152 -29614 -9944 -9301
3192i301O150j0721K1418j7136N175N340Q35k0837Q380M626J0038k3039R619J4405
$$ -9301 -3151 -13872 7546 -9590 -4415 925 1760 -19077 -10697 -6071 3967 -19072 -9453 4952
3178D952n797r338J1140j3434j0279J2346j0830j3796K3281J8099j4137k381J2527
$$ 4952 -845 -10183 957 -12477 -22756 -10410 -21240 -35036 -11755 6344 -7793 -10174 2353
3165B353k2420P586k592Q824j7241Q694O816k9637K1563J8216j4117j0654J1767
$$ 2353 -20067 -12481 -15073 -6249 -23490 -14796 -7980 -37617 -16054 2162 -11955 -22609 -10842
3152a0842j81O217o004k521J7814l0269J8343j987m169J1155j6145J284j9044
$$ -10842 -11023 -4806 -10810 -13331 4483 -25786 -7443 -9430 -13599 -2444 -18589 -17305 -36349
3139c6349J3553J2862m252m204p630Q248Q790M905m809j1795K2459j1129k1531
$$ -36349 -22796 -9934 -14186 -18390 -26020 -17772 -8982 -4077 -8886 -20681 1778 -9351 -30882
3126c0882M0772l0112r285J3656J9979k8616Q3q640J918J3095k311J161L068l681
$$ -30882 9890 -20222 -29507 -15851 4128 -24488 -24405 -33045 -31127 -18032 -20343 -19182 -16114 -19795
3112a9795J1088M777K053p028k345n516o014K870K243k1412J6343k695j1357K0499
$$ -19795 -8707 -3930 -1877 -8905 -11250 -16766 -22780 -19910 -17667 -39079 -22736 -25431 -36788 -16289
3098a6289M423j8184K2300q290l887p727K2171j8226J0050l753L008m890l932
$$ -16289 -11866 -30050 -7750 -16040 -19927 -27654 -5483 -23709 -13659 -17412 -14404 -19294 -23226
3085b3226R253m701n49J719P072n490q14j8188N404P824r275J7380M651j8782
$$ -23226 -13973 -18674 -19223 -17504 -10432 -15922 -16736 -34924 -29520 -21696 -30971 -13591 -8940 -27722
3071b7722P663J323M284J795N010k0099M510j1763J3546P878n772k866L736J8760
$$ -27722 -20059 -18736 -14452 -12657 -7647 -27746 -23236 -34999 -21453 -13575 -19347 -22213 -18477 283
3057B83l0637K0830J491j9770j702J1085q770Q607M347Q13k2411J9203J4p717
$$ 283 -30354 -9524 -8033 -27803 -29505 -18420 -27190 -18583 -14236 -13423 -35834 -16631 -16617 -24334
3043b4334L512l257L310J6411k9469K2806k158n060R756j3391J3602k0017N155
$$ -24334 -20822 -24079 -20769 -4358 -33827 -11021 -13179 -18239 -8483 -21874 -8272 -28289 -23134
3030b3134m432K251J3095O64j0195r882J3419N753j1123R298L657m937q905O167
$$ -23134 -27566 -25315 -12220 -11556 -21751 -31633 -18214 -12461 -23584 -14286 -10629 -15566 -24471 -18304
3016a8304l317j3437R070N305R486L760j7777l543J0536k0508J9952j6184j4134
$$ -18304 -21621 -35058 -25988 -20683 -11197 -7437 -25214 -28757 -18221 -38729 -18777 -34961 -49095
3003d9095K1071K0818j1718j3718L0648k2533R667J353o834k31J453m072k0567
$$ -49095 -28024 -7206 -18924 -32642 -1994 -24527 -14860 -13507 -20341 -20572 -19119 -23191 -43758
2990d3758K8031j0757L311M286l220K995j7313J5398L031j4033L847P073o388
$$ -43758 -15727 -26484 -23173 -18887 -22107 -19112 -36425 -21027 -17996 -32029 -28182 -21109 -27497
2977b7497K4690j9007N089j1936O606J1920l4370O566J1496L217J348J3546l1446
$$ -27497 -2807 -21814 -16725 -28661 -22055 -10135 -44505 -37939 -26443 -23226 -21878 -8332 -39778
2964c9778L1168q714J162j386r914J5464j4980k672N338l207J4702k0376J4124
$$ -39778 -8610 -17324 -16162 -17548 -27462 -11998 -26978 -29650 -24312 -27519 -12817 -33193 -19069
2951a9069P12J2557k0101l782o30p849L745K033N414o209l75R506J1346j397l321
$$ -19069 -18357 -5800 -25901 -29683 -30313 -38162 -34417 -32384 -26970 -33179 -33554 -24048 -12702 -14099 -17420
2936a7420j1976Q379K183p347k69n643J4655o591k488M897p543J6783j5797J1559
$$ -17420 -29396 -21017 -18834 -26181 -26450 -32093 -17438 -24029 -26517 -21620 -29163 -12380 -28177 -16618
2922a6618L943Q07k1469K0563j3981K256l199P464K214l675k6649K2462p21j0922
$$ -16618 -12675 -11868 -33337 -12774 -26755 -24499 -27698 -20234 -18020 -21695 -48344 -25882 -26603 -37525
2908c7525J59J1184m753m668M463J4997m158r305k900J1949j879q573P02p93q491
$$ -37525 -37366 -26182 -30935 -35603 -31140 -16143 -20301 -29606 -32506 -20557 -22436 -31009 -30307 -31100 -39591
2893c9591M582J8621K30j8284p77J6487N454m035k0240J029R536L290P035j2561
$$ -39591 -35009 -16388 -16158 -34442 -35219 -18732 -13278 -17313 -37553 -36524 -26988 -23698 -16663 -29224
2879b9224n225R667j1168J298J0069n744L935K586j912l544M188j1593K147J1832
$$ -29224 -34449 -24782 -35950 -34652 -24583 -30327 -26392 -23806 -25718 -29262 -25074 -36667 -34520 -22688
2865b2688N362j6872P932j5367J0731K2919k3218J3628j2336L902J884K827j4198
$$ -22688 -17326 -34198 -26266 -41633 -30902 -7983 -31201 -17573 -29909 -26007 -24123 -21296 -35494
2852c5494K2020k4326J1451R92L43P21O163o463J349o383n066n994m300J7992
$$ -35494 -13474 -37800 -26349 -25357 -25014 -24293 -18130 -24593 -23244 -29627 -34693 -40687 -44987 -26995
2838b6995q62J0633m041M288j1327q107N129M768o236P022N603K830k7896R103
$$ -26995 -27857 -17224 -21265 -16977 -28304 -36411 -31282 -26514 -32750 -25728 -20125 -17295 -45191 -36088
2824c6088N484K3144j7703J6868k3154J3814j2502j20m607M73J9847j972j6575
$$ -36088 -30604 -7460 -25163 -8295 -31449 -17635 -30137 -30257 -34864 -34391 -14544 -16516 -33091
2811c3091J460O803j3069J5798k861k507J753K804j3108J0439n796q327J1927
$$ -33091 -31631 -24828 -37897 -22099 -24960 -27467 -25714 -22910 -36018 -25579 -31375 -39702 -27775
2798b7775o880K1080k0638O580m055l572J0939q391P927n517o672J0138j2445
$$ -27775 -34655 -13575 -34213 -27633 -31688 -35260 -24321 -32712 -24785 -30302 -36974 -26836 -39281
2785c9281K4721j6611r589J8517o630j2491P376l544j270J943o938K2835n107
$$ -39281 -14560 -31171 -40760 -22243 -28873 -41364 -33988 -37532 -38802 -36859 -43797 -20962 -26069
2772b6069q874L319J0766j3963O18K667j753N721q037K0127q526q444k580J2288
$$ -26069 -34943 -31624 -20858 -34821 -34203 -31536 -33289 -27568 -35605 -15478 -24004 -32448 -35028 -22740
2758b2740k085j5702J1874O136j9966J4038m643L374l629J159r768J4463p709
$$ -22740 -24825 -40527 -28653 -22517 -42483 -28445 -33088 -29714 -33343 -32184 -41952 -27489 -35198
2745c5198J9986l9255K4603j6417J5533q094L523o255R010K446n653p481J6669
$$ -35198 -15212 -54467 -29864 -46281 -30748 -38842 -35319 -41574 -32564 -30118 -35771 -43252 -26583
2732b6583n967J344J1205j9561m88M283J0455n695Q662m057o601j6364J6708n472
$$ -26583 -32550 -31206 -20001 -39562 -40050 -35767 -25312 -31007 -22345 -26402 -33003 -49367 -32659 -38131
2718c8131j4057J8286j0421j650K0006q015l501R151R769k3245L555L827J476
$$ -38131 -52188 -33902 -44323 -45973 -25967 -33982 -37483 -28332 -18563 -41808 -38253 -34426 -32950
2705c2950j2716J7109l638N800q501n874J2684j3211J4414j3292Q276R361k1430
$$ -32950 -45666 -28557 -32195 -26395 -34896 -40770 -28086 -41297 -26883 -40175 -31899 -22538 -43968
2692d3968J902j301m112J8769j8285J5751r311J1035j6451J7729j847r441j072
$$ -43968 -42066 -43367 -47479 -28710 -46995 -31244 -40555 -29520 -45971 -28242 -30089 -39530 -40602
2679d0602k066L042M416j3652P776l938j757P118O901O281p053m513j015O26O252
$$ -40602 -42668 -39626 -35210 -48862 -41086 -45024 -46781 -39663 -32762 -26481 -33534 -38047 -39062 -38436 -32184
2664c2184k912L165k591O108j3407j317J4702J6P639j7460M111J2642j2704m049
$$ -32184 -35096 -31931 -34522 -28414 -41821 -43138 -28436 -28420 -20781 -38241 -34130 -21488 -34192 -38241
2650c8241m4k925Q182n391N028p528Q064m00j371m7K580J1651j2672r633O611
$$ -38241 -38285 -41210 -33028 -38419 -33391 -40919 -32855 -33255 -34626 -34673 -32093 -20442 -33114 -42747 -36136
2635c6136p405J1413j3120J5477j3271Q117N785q201M612L809j5166Q439j6649
$$ -36136 -43541 -32128 -45248 -29771 -43042 -34925 -29140 -37341 -32729 -28920 -44086 -35647 -52296
2622e2296K2586j1817J8601j7330O093M493q526l929L286P785J181m725K398r687
$$ -52296 -29710 -41527 -22926 -40256 -34163 -29670 -38196 -42125 -38839 -31054 -29873 -34598 -32200 -41887
2608d1887J0511m455o817M624m427J9269K948j4527j0307J5901r58j777q055n133
$$ -41887 -31376 -35831 -42648 -38024 -42451 -23182 -20234 -34761 -45068 -29167 -30125 -31902 -39957 -45090
2594d5090N909N617j232j760J0007n408Q391J29j0836J363k1281J5003R866p629
$$ -45090 -39181 -33564 -34796 -36556 -26549 -31957 -23566 -23437 -34273 -32910 -54191 -39188 -29322 -36951
2580c6951L210J873j0912n961J6706p565J887O050k5599L1951j8172n569J4612
$$ -36951 -33741 -31868 -42780 -48741 -32035 -39600 -37713 -31663 -57262 -25311 -43483 -49052 -34440
2567c4440j961j259L649k1739K0714j7873J6907K405j8701J6688j408k904k157
$$ -34440 -36401 -37660 -34011 -55750 -35036 -52909 -36002 -33597 -52298 -35610 -37018 -39922 -42079
2554d2079j8242K9507l028n697J0413j024O902j4261O805m066j4195j557J4405
$$ -42079 -60321 -30814 -33842 -39539 -29126 -30150 -23248 -37509 -30704 -34770 -48965 -50522 -36117
2541c6117J3280j583k6136J3070j0891K0098n822M561O450k4218m655J2606M820
$$ -36117 -22837 -24420 -50556 -37486 -48377 -28279 -34101 -29540 -23090 -47308 -51963 -39357 -34537
2528c4537R448N675k2744J245K240J5058j9912Q907l630J4042k3431J5095j1799
$$ -34537 -25089 -19414 -42158 -40913 -38673 -23615 -43527 -34620 -38250 -24208 -47639 -32544 -44343
2515d4343J2290l448K0887l3372P49L57P9P54K1984j2694r617K9468j9799k844
$$ -44343 -32053 -35501 -14614 -47986 -47237 -46880 -46801 -46047 -24063 -36757 -46374 -16906 -36705 -39549
2501c9549J0494j6557Q806p879K7184k4400j1976J5195M082j6743P633J928m477
$$ -39549 -29055 -45612 -36806 -44685 -17501 -41901 -53877 -38682 -34600 -51343 -43710 -41782 -46259
2488d6259L774l052J3250k0617J777L1375j5174o146L93J6004n332k1491J1473
$$ -46259 -42485 -45537 -32287 -52904 -51127 -19752 -34926 -41072 -40679 -24675 -30007 -51498 -40025
2475d0025Q47o641J3474O997l0940L1034j3821n30j7207J9487n907K0896j8709
$$ -40025 -39178 -45819 -32345 -25348 -56288 -25254 -39075 -39605 -56812 -37325 -43232 -22336 -41045
2462d1045k932J5914j0393j2703M866j54l610q507K585J8242o109J8993j6138
$$ -41045 -43977 -28063 -38456 -51159 -46293 -46447 -50057 -58564 -55979 -37737 -43846 -24853 -40991
2449d0991O799k920O466j3992j994M733m956K3028j7426o286L193n044K859N891
$$ -40991 -34192 -37112 -30646 -44638 -46632 -41899 -46855 -23827 -41253 -47539 -44346 -49390 -46531 -40640
2435d0640J8489j5147m664L056q084N767O798j3796K899o192J7027r359q752P170
$$ -40640 -22151 -37298 -41962 -38906 -46990 -41223 -34425 -48221 -45322 -51514 -34487 -43846 -52598 -45428
2421d5428k735K1621k1257R282J828J7166m0615K8663j9396O304J4853M016j8685
$$ -45428 -48163 -26542 -47799 -38517 -36689 -19523 -60138 -31475 -50871 -44567 -29714 -25698 -44383
2408d4383l40k004J5153p555m926J3088n222r532k42J6228o971j0007Q187J7992
$$ -44383 -44723 -46727 -31574 -39129 -44055 -30967 -36189 -45721 -45963 -29735 -36706 -46713 -38526 -20534
2394b0534l5430n601N2634l1914j488n995J0802r423j4817K2756j1578J63J4527
$$ -20534 -55964 -61565 -8931 -40845 -42333 -48328 -37526 -46949 -61766 -39010 -50588 -50425 -35898
2381c5898J124j6056R542J3214q069m639J0493p248r299Q760J0451j9508n175
$$ -35898 -34774 -50830 -41288 -28074 -36143 -40782 -30289 -37537 -46836 -38076 -27625 -47133 -52308
2368e2308j527N554K161M148Q075j4309J779J532Q332j1203J998p733J9975P134
$$ -52308 -53835 -48281 -46120 -41972 -33897 -48206 -46427 -44895 -36563 -47766 -45768 -53501 -33526 -26392
2354b6392N95j2418j224R63J3489k0930k045M34N335n34j0786L385J1526j442
$$ -26392 -25797 -38215 -39439 -38476 -24987 -45917 -47962 -47528 -42193 -42727 -53513 -50128 -38602 -40044
2340d0044n01J1671j3176J3348j1012l672J1849j372j3719o480l063K7643j3520
$$ -40044 -40545 -28874 -42050 -28702 -39714 -43386 -31537 -32909 -46628 -53108 -56171 -28528 -42048
2327d2048r610n95K0584l3346J7749l011n39J0074J54n615O330j4206L10K8632
$$ -42048 -51658 -52253 -31669 -65015 -47266 -50277 -50816 -40742 -40588 -46203 -39873 -54079 -53769 -25137
2313b5137l2874J9549P02j2517p037Q425J2895j0616k107J0208n295o067J7542
$$ -25137 -58011 -38462 -37760 -50277 -57314 -48889 -35994 -46610 -48717 -38509 -43804 -49871 -32329
2300c2329o911J962J308j1616J749n496L130j814P563J1156j7036P177Q227j0827
$$ -32329 -39240 -37278 -35970 -47586 -45837 -51333 -48203 -50017 -42454 -31298 -48334 -41157 -32930 -43757
2286d3757r024J1546n800J0889l217k812J4913j8835J8214j3681j481p77J2019
$$ -43757 -52781 -41235 -47035 -36146 -39363 -42175 -27262 -46097 -27883 -41564 -43045 -43822 -31803
2273c1803j1691m018J1880p072L225p282J6051j9830q285J8497N139P739j0861
$$ -31803 -43494 -47512 -35632 -42704 -39479 -46761 -30710 -50540 -58825 -40328 -35189 -27450 -38311
2260c8311L550n201m145l815r931J5391j3271l307J8934j2636J1525j750Q538
$$ -38311 -34761 -39962 -44107 -47922 -57853 -42462 -55733 -59040 -40106 -52742 -41217 -42967 -34429
2247c4429l067l304P932k1542Q041K754j4835J4436l352M075k1343J1313J4628
$$ -34429 -37496 -40800 -32868 -54410 -46369 -43615 -58450 -44014 -47366 -43291 -64634 -53321 -38693
2234c8693R321j1491l523O459k1128J3386m561j2024R623M084p456M26K4041q708
$$ -38693 -29372 -40863 -44386 -37927 -59055 -45669 -50230 -62254 -52631 -48547 -56003 -55577 -31536 -40244
2220d0244q439J1996j1971J6086j3493J0935j3728M574K094K945k0944J9742r095
$$ -40244 -48683 -36687 -48658 -32572 -46065 -35130 -48858 -44284 -42190 -39245 -60189 -40447 -49542
2207d9542q29M622j433M282M591Q69J7533l4124J2157l420M25p859k207R306J2760
$$ -49542 -50371 -45749 -47182 -42900 -38309 -37440 -19907 -54031 -41874 -45294 -44869 -52728 -54935 -45629 -32869
2192c2869k6163P098M872p288Q481o594p388J558L951m86J9550k0842J0367M20
$$ -32869 -59032 -51934 -47062 -54350 -45869 -52463 -59851 -58293 -54342 -54828 -35278 -56120 -45753 -45333
2178d5333j1071K2306l719j3728J1357j1454J3792q331l8M575j9654Q862M589
$$ -45333 -56404 -34098 -37817 -51545 -40188 -51642 -37850 -46181 -46219 -41644 -61298 -52436 -47847
2165d7847k82L140j624R991q097j0043J7066k1410O147J8886j8619J1510j2752
$$ -47847 -48129 -44989 -46613 -36622 -44719 -54762 -37696 -59106 -52959 -34073 -52692 -41182 -53934
2152e3934J1520J292Q300j7732M214l559l204J2179n941o076M146m616J640k899
$$ -53934 -42414 -41122 -32822 -50554 -46340 -49899 -53103 -40924 -46865 -52941 -48795 -53411 -51771 -54670
2138e4670K5431j8498k344J1834o411q353K4541o838j4443j687P966q162K0223
$$ -54670 -29239 -47737 -50081 -38247 -44658 -53011 -28470 -35308 -49751 -51438 -43472 -51634 -31411
2125c1411k7347K5195k2316q4J2771j4549R085r802N425K341R760j7266P942L80
$$ -31411 -58758 -33563 -55879 -55963 -43192 -57741 -48656 -58458 -53033 -50692 -40932 -58198 -50256 -49876
2111d9876Q053q120J1749j1008K0518m344J455k3091M784K2322k1042k883R66
$$ -49876 -41823 -49943 -38194 -49202 -28684 -33028 -31573 -54664 -49880 -27558 -48600 -51483 -50517
2098e0517r293J5056l383j836n358L874j0875J3175N5o175O663p068j318R99P707
$$ -50517 -59810 -44754 -48137 -49973 -55331 -51457 -62332 -49157 -49102 -55277 -48614 -55682 -57000 -56001 -48294
2083d8294r118O870k678q169Q638L673J640N54j5636K5808n089J59N858k579K010
$$ -48294 -57412 -50542 -53220 -61389 -52751 -49078 -47438 -46884 -62520 -36712 -41801 -41642 -35784 -38363 -36353
2068c6353j6266j4597J8729n60J4562p122j1270L432J0915j1856k627j1807J7106
$$ -36353 -52619 -67216 -48487 -49047 -34485 -41607 -52877 -49445 -38530 -50386 -53013 -64820 -47714
2055d7714J3196l0258R618r957K4013l3698L3697q563o290J1612j036p564P349
$$ -47714 -34518 -64776 -55158 -65115 -41102 -74800 -41103 -49666 -55956 -44344 -45380 -52944 -45595
2042d5595n022K243j2447L683O255l405k755k848J233J2093j0117M32J7251o072
$$ -45595 -50617 -48374 -60821 -57138 -50883 -54288 -57043 -59891 -58658 -46565 -56682 -56250 -38999 -45071
2028d5071J0083k3139N003M510J671q06R036j210j4978l637J7876j4581J970q53
$$ -45071 -34988 -58127 -53124 -48614 -46943 -47749 -38713 -39923 -54901 -58538 -40662 -55243 -53273 -54126
2014e4126L583R96K66K6693j6625j5297J3592l064O078q188o757m296P026l863
$$ -54126 -50543 -49547 -49281 -22588 -39213 -54510 -40918 -43982 -37904 -46092 -52849 -57145 -50119 -53982
2000e3982O923m325j722J2427Q85m618M540j4774J6830p262k402K561J134n271
$$ -53982 -47059 -51384 -53106 -40679 -39794 -44412 -39872 -54646 -37816 -45078 -47480 -44919 -43785 -49056
1986d9056p348K41K0618j8014l669k079J8749j8571K880Q389O624r097N802J1920
$$ -49056 -56404 -56163 -35545 -53559 -57228 -59307 -40558 -59129 -56249 -47860 -41236 -50333 -44531 -32611
1972c2611j3673p563J0138j057j1518Q967p876O311r934J6649j3088l960O064
$$ -32611 -46284 -53847 -43709 -44766 -56284 -47317 -55193 -48882 -58816 -42167 -55255 -59215 -53151
1959e3151j1605K6003k0711K6647j7585J2917p898L978j4681J0786j1271R755
$$ -53151 -64756 -38753 -59464 -32817 -50402 -37485 -45383 -41405 -56086 -45300 -56571 -46816
1947d6816q013P182P819k0454K2735j7535P951J2072k5239J7572p609r160J8682
$$ -46816 -54829 -47647 -39828 -60282 -37547 -55082 -47131 -35059 -60298 -42726 -50335 -59495 -40813
1934d0813j1571M302j9978J6843r896J3781P28o042M319n345J6242o458m476j5846
$$ -40813 -52384 -48082 -68060 -51217 -61113 -47332 -46604 -52646 -48327 -53672 -37430 -43888 -48364 -64210
1920f4210K0636p641m280J3005j6504J2690q097j0894P974P516n496J7588L82
$$ -64210 -43574 -51215 -55495 -42490 -58994 -46304 -54401 -65295 -57321 -49805 -55301 -37713 -37331
1907c7331l699p212j176j5124K4807k2487P196O221j2132N561L274K029Q221q660
$$ -37331 -41030 -48242 -49418 -64542 -39735 -62222 -55026 -48805 -60937 -55376 -52102 -50073 -41852 -50512
1893e0512M838J5154k1774j1131j7169L3756o47q573J0909J276q55j8060J7957
$$ -50512 -45674 -30520 -52294 -63425 -80594 -46838 -47485 -56058 -45149 -43873 -44728 -62788 -44831
1880d4831n554J5829j9133J5434j4751J348R022j5307K6627k2817O471o795o169
$$ -44831 -50385 -34556 -53689 -38255 -53006 -51658 -42636 -57943 -31316 -54133 -47662 -54457 -60626
1867f0626J6853k130l564j1841L407j3942K4367Q729j9512p827J1174N564j3198
$$ -60626 -43773 -45903 -49467 -61308 -57901 -71843 -47476 -38747 -58259 -66086 -54912 -49348 -62546
1854f2546M748O688K857o012O472j333j4134O06L528J9247j1165q1o051O873M100
$$ -62546 -57798 -51110 -48253 -54265 -47793 -49126 -63260 -62654 -59126 -39879 -51044 -51125 -57176 -50303 -46203
1839d6203l5j8912J5041j9744K2537p857J4109k0711Q693J9371j1660j6473j0325
$$ -46203 -46238 -65150 -50109 -69853 -47316 -55173 -41064 -61775 -53082 -33711 -45371 -61844 -72169
1826g2169K2710j9116j0457P668L7412r284j1244J340j0602J1965L6j1900J0035
$$ -72169 -49459 -68575 -79032 -71364 -33952 -43236 -54480 -53140 -63742 -51777 -51741 -63641 -53606
1813e3606k5507K6133q58j2080J1378j4309J2302N343J721R387k0897L638Q386
$$ -53606 -79113 -52980 -53838 -65918 -54540 -68849 -56547 -51204 -49483 -40096 -60993 -57355 -48969
1800d8969O52j1698n05J0399p157J1119r988J0363l329j1333J0213j3262K1788
$$ -48969 -48317 -60015 -60520 -50121 -57278 -46159 -56147 -45784 -49113 -60446 -50233 -63495 -41707
1787d1707j3569J3168j226j1093O863J646n279J1510j539n568l958M824l765j2479
$$ -41707 -55276 -42108 -43334 -54427 -47564 -45918 -51197 -39687 -41226 -46794 -50752 -45928 -49693 -62172
1773f2172K7880j6740R157j2885J4003j9250k036J1676P84P58L155j2738j341
$$ -62172 -34292 -51032 -41875 -54760 -40757 -60007 -62043 -50367 -49583 -48825 -45670 -58408 -59749
1760e9749J1082j3418J2036j7041K5960l988K592m734j8684L812J3599m724r131
$$ -59749 -48667 -62085 -50049 -67090 -41130 -45118 -42526 -47260 -65944 -62132 -48533 -53257 -62388
1747f2388M11M538P697j5552J8367J6784k2356o634R374q816Q925Q37k9441J3615
$$ -62388 -61977 -57439 -49742 -65294 -46927 -30143 -52499 -59133 -49759 -58575 -49650 -48813 -78254 -64639
1733f4639J2702k3568K1237M798n692M832K129k291r999O999o397p86J371l415
$$ -64639 -51937 -75505 -54268 -49470 -55162 -50330 -48201 -50492 -60491 -53492 -59889 -60675 -59304 -62719
1719f2719J1301P675j1713l880j1345J6381l68J3609L366k3020n175K576j0511
$$ -62719 -51418 -43743 -55456 -59336 -70681 -54300 -54668 -41059 -37693 -60713 -65888 -63312 -73823
1706g3823J6325R957J25j5960O190q613J0849Q798j5097Q680k0249K2853M89l944
$$ -73823 -57498 -47541 -47416 -63376 -57186 -65799 -54950 -46152 -61249 -52569 -72818 -49965 -49476 -53420
1692e3420K340N138L29k895k1838J6850n75m261J3408N183p656k941j356R430
$$ -53420 -51080 -45942 -45613 -48508 -70346 -53496 -54071 -58332 -44924 -39741 -47397 -50338 -51694 -42264
1678d2264k1179K915K2892l690k4978q3Q949R464j2771j1404J8538M097k0091
$$ -42264 -63443 -60528 -37636 -41326 -66304 -66387 -57438 -47974 -60745 -72149 -53611 -49514 -69605
1665f9605J8647o568J1618n65k2919J9447Q144l2130J0474K2587k4626K6556j1026
$$ -69605 -50958 -57526 -45908 -46473 -69392 -49945 -41801 -73931 -63457 -40870 -65496 -38940 -49966
1652d9966j4071J7596j4310o838J7340l776K858j2263R21p383K9501k6677N094
$$ -49966 -64037 -46441 -60751 -67589 -50249 -54025 -51167 -63430 -62509 -69892 -40391 -67068 -61974
1639f1974P590j2994K0183o040R075M074j1583o374J1796j7933k668J5418p29
$$ -61974 -54384 -67378 -47195 -53235 -44160 -40086 -51669 -58043 -46247 -64180 -66848 -51430 -52159
1626e2159p977Q786j0448J9328j59j4194K135p788J5969j4457q560K8445k893
$$ -52159 -60136 -51350 -61798 -42470 -42629 -56823 -54688 -62476 -46507 -60964 -69524 -41079 -43972
1613d3972J44O460l0445J3035j978j6587K3531p761J2993j7601J4076r288Q41
$$ -43972 -43828 -37368 -67813 -54778 -56756 -73343 -49812 -57573 -44580 -62181 -48105 -57393 -56552
1600e6552j3660J2834J0674p896o943k780J5884o384J0729j3267n065R513l482
$$ -56552 -70212 -57378 -46704 -54600 -61543 -64323 -48439 -54823 -44094 -57361 -62426 -52913 -56395
1587e6395r7j0168J979Q296l77p650o790L862J0693q038K4147j5671p342L938
$$ -56395 -56492 -66660 -64681 -56385 -56762 -64412 -71202 -67340 -56647 -64685 -40538 -56209 -63551 -59613
1573e9613o383J7717r239J3141j8806o768K9613j2671K73m882Q70l92j0598P34
$$ -59613 -65996 -48279 -57518 -44377 -63183 -69951 -40338 -53009 -52736 -57618 -56748 -57140 -67738 -67004
1559f7004k751J0318J5533l549l634l211j6193J1467J2898j0107k185L41L878
$$ -67004 -69755 -59437 -43904 -47453 -51087 -54298 -70491 -59024 -46126 -56233 -58418 -58077 -54199
1546e4199N560k4875K8949j251r879l992J1340N462j4895K0106k6779K3756k2671
$$ -54199 -48639 -73514 -44565 -45816 -55695 -59687 -48347 -42885 -57780 -37674 -64453 -40697 -63368
1533f3368J4346m589N611q741l630j4521J3602K0366j4803k642j0877J4927R433
$$ -63368 -49022 -53611 -48000 -56741 -60371 -74892 -61290 -40924 -55727 -58369 -69246 -54319 -44886
1520d4886j7998n596J580J0633p141j256K415N480J476j7119J7789N01J00R466
$$ -44886 -62884 -68480 -66900 -56267 -63408 -64664 -62249 -56769 -55293 -72412 -54623 -54122 -54022 -44556
1506d4556K600j8594L517j0565J6960j5628M060m774Q704J628j2439K7798j8528
$$ -44556 -41956 -60550 -57033 -67598 -50638 -66266 -62206 -66980 -58276 -56648 -69087 -41289 -59817
1493e9817q967J5623r286L887P626j5152P807N73R30n209J1254O493k2749J516
$$ -59817 -68784 -53161 -62447 -58560 -50934 -66086 -58279 -57706 -56776 -61985 -50731 -44238 -66987 -65471
1479f5471K2688r875j5436P614Q725l337r610l534J953K2926o296j0507J855P855
$$ -65471 -42783 -52658 -68094 -60480 -51755 -55092 -64702 -68236 -66283 -43357 -49653 -60160 -58305 -50450
1465e0450j9712K4471j4660m736J721J2893q512j139L484L244L362j0298J6140
$$ -50450 -70162 -45691 -60351 -65087 -63366 -50473 -58985 -60124 -56640 -53396 -50034 -60332 -44192
1452d4192j3323k394J2664l032j7771O304r208K0531o231O85j0014J1160k8421
$$ -44192 -57515 -59909 -47245 -50277 -68048 -61744 -70952 -50421 -56652 -55967 -65981 -54821 -83242
1439h3242J3298O747j58J4347j1299K248o485J4829K862j7364j364M196P250j0299
$$ -83242 -69944 -63197 -63355 -49008 -60307 -58059 -64544 -49715 -46853 -64217 -65581 -61385 -54135 -64434
1425f4434P658M57M390J245K3k34k4530J5388j4472O014L994N485J3017j6012
$$ -64434 -56776 -56319 -51929 -50684 -50661 -50895 -75425 -60037 -74509 -68495 -64501 -59016 -45999 -62011
1411f2011R992p460j437L186j5271K1753m268n122l009n722M696R958m369J0834
$$ -62011 -52019 -59479 -60916 -57730 -73001 -51248 -55516 -60638 -63647 -69369 -64673 -54715 -59084 -48250
1397d8250j3430R98L197m027R841j0327N311P277K393k6056K5014m694P596o350
$$ -48250 -61680 -60682 -57485 -61512 -51671 -61998 -56687 -49410 -47017 -73073 -48059 -52753 -45157 -51507
1383e1507k382L68j1630L734j4759J6740Q101q421r643K279j392K3787j551j5327
$$ -51507 -53889 -53521 -65151 -61417 -76176 -59436 -51335 -59756 -69399 -67120 -68512 -44725 -46276 -61603
1369f1603L056j722n064o859Q540J8965j8523k354N686p08M815l495J5600j3941
$$ -61603 -58547 -60269 -65333 -72192 -63652 -44687 -63210 -65564 -59878 -60586 -55771 -59266 -43666 -57607
1355e7607j6417K9208k8802Q603K2425j7599L328k153j464Q022q348O668l621
$$ -57607 -74024 -44816 -73618 -65015 -42590 -60189 -56861 -59014 -60478 -52456 -60804 -54136 -57757
1342e7757R885m524n401j247j103n864P733J1810n601j413m449O714j7744n156
$$ -57757 -47872 -52396 -57797 -59044 -60147 -66011 -58278 -46468 -52069 -53482 -57931 -51217 -68961 -74117
1328g4117K8465j6188k598m586J3381J3053L971j8802j0096O515j1343N852M998
$$ -74117 -45652 -61840 -64438 -69024 -55643 -42590 -38619 -57421 -67517 -61002 -72345 -66493 -61495
1315f1495j5042J0107K10K199R58p209j792K154P780j2353K1186L370o613j1980
$$ -61495 -76537 -66430 -66220 -64021 -63063 -70272 -72064 -69910 -62130 -74483 -53297 -49927 -56540 -68520
1301f8520J4316K309j0120O650K523J0197l3418K6579j6709J2243j6432K2758
$$ -68520 -54204 -51895 -62015 -55365 -52842 -42645 -76063 -49484 -66193 -53950 -70382 -47624
1289d7624J946p592j0700o706l78O300J1084o619p396J1414K934n928m398N334
$$ -47624 -45678 -53270 -63970 -70676 -71054 -64754 -53670 -60289 -67685 -56271 -53337 -59265 -63663 -58329
1275e8329l421N050j811m655R510Q308j0171p710r094M546J513K2923r149n605
$$ -58329 -61750 -56700 -58511 -63166 -53656 -45348 -55519 -63229 -72323 -67777 -66264 -43341 -52490 -58095
1261e8095M278j5452l675K6015j3276l135K6558j5059N342j7911J4935o647o672
$$ -58095 -53817 -69269 -72944 -46929 -60205 -63340 -36782 -51841 -46499 -64410 -49475 -56122 -62794
1248f2794p866K5139o028j3787p166Q70J6109Q653j2889k306J256R259J962l43
$$ -62794 -70660 -45521 -51549 -65336 -72502 -71632 -55523 -46870 -59759 -62065 -60809 -51550 -49588 -49931
1234d9931j1622P692m652q543N040J4502o340p534J659o12o689L383J742n599
$$ -49931 -61553 -53861 -58513 -67056 -62016 -47514 -53854 -61388 -59729 -60341 -67030 -63647 -61905 -67504
1220f7504o179O764k708j533K241K0242j5152P656m22j0049l641P269J1695o940
$$ -67504 -73683 -66919 -69627 -71160 -68919 -48677 -63829 -56173 -56595 -66644 -70285 -63016 -51321 -58261
1206e8261k90Q809j1288k1l971M028Q793n748O599O09j0044l235K014j873O771
$$ -58261 -58551 -49742 -61030 -61051 -65022 -60994 -52201 -57949 -51350 -50741 -60785 -64020 -62006 -63879 -57108
1191e7108l477O622j1889M10J4861j8105J189J1224k915K31M073k442j5735R926
$$ -57108 -60585 -53963 -65852 -65442 -50581 -68686 -67497 -56273 -59188 -58957 -54884 -57326 -73061 -63135
1177f3135p843J2517l848r429J2999j0134K0015k5729L8P41K0113k0353K2201
$$ -63135 -70978 -58461 -62309 -71738 -58739 -68873 -48858 -74587 -74549 -73808 -53695 -74048 -51847
1164e1847k4041p022K3659J1298r630L93L702q126j3364L891J2257j133l093J0047
$$ -51847 -75888 -82910 -59251 -47953 -57583 -57190 -53488 -61614 -74978 -71087 -58830 -59963 -63056 -53009
1150e3009j6648l974K7037o954j1965R55o403J1673p11p165O024r184J0260o418
$$ -53009 -69657 -73631 -46594 -53548 -65513 -64558 -70961 -59288 -59999 -67164 -61140 -70324 -60064 -66482
1136f6482K6793k5724j1100J2026K398N803L81j4722J798Q853j499j5620m513
$$ -66482 -39689 -65413 -76513 -64487 -62089 -56286 -55905 -70627 -68829 -59976 -61475 -77095 -81608
1123h1608J6493J368N55j3517J6940n180Q604l529j1749J1190j1792K567M471
$$ -81608 -65115 -63747 -63192 -76709 -59769 -64949 -56345 -59874 -71623 -60433 -72225 -69658 -65187
1110f5187%O721L269Q559j5359J1234j5727q450R626J4984j5673N575J678q387
$$ -65187 -65187 -58466 -55197 -46638 -61997 -50763 -66490 -74940 -65314 -50330 -66003 -60428 -58750 -67137
1096f7137P564j1785L720L804R379j7905J6273m524j633p988J0607J4957j9669
$$ -67137 -59573 -71358 -67638 -63834 -54455 -72360 -56087 -60611 -62244 -70232 -59625 -44668 -64337
1083f4337m110O564M773j6803P607K569K075l636l268M684r073j2070K7079K124
$$ -64337 -68447 -61883 -57110 -73913 -66306 -63737 -61662 -65298 -68566 -63882 -72955 -85025 -57946 -55822
1069e5822K263n689L728o658r62J7557k0383R611j1180O223j037j942R568m822
$$ -55822 -53559 -59248 -55520 -62178 -63140 -45583 -65966 -56355 -67535 -61312 -62349 -64291 -54723 -59545
1055e9545m714J3441m133q602K423n399Q476j1079P542o804M60R041l161J0076
$$ -59545 -64259 -50818 -54951 -63553 -61130 -66529 -58053 -69132 -61590 -68394 -67934 -58893 -62054 -51978
1041e1978m516M98m262j6429J0789j1847J2132J4349j465j4075J3981o334K511
$$ -51978 -56494 -55996 -60258 -76687 -65898 -77745 -65613 -51264 -52729 -66804 -52823 -59157 -56646
1028e6646j7296k099J2304m528p44N851j8102J2588M466O810o450q507K3621k0228
$$ -56646 -73942 -76041 -63737 -68265 -69009 -63158 -81260 -68672 -64206 -57396 -63846 -72353 -48732 -68960
1014f8960K2879k3784L920K899r486n330J8749p118k622J3455m378j332j8589
$$ -68960 -46081 -69865 -65945 -63046 -72532 -77862 -59113 -66231 -68853 -55398 -59776 -61108 -79697
1001g9697J5011k0740Q738J7671j245Q43m226n355M286L595o296J2062o667P611
$$ -79697 -64686 -85426 -76688 -59017 -60262 -59419 -63645 -69000 -64714 -61119 -67415 -55353 -62020 -54409
987e4409l492J46k181J4709n451p660r20L755p913O107p353J5927l026l0533Q438
$$ -54409 -57901 -57755 -59936 -45227 -50678 -58338 -59258 -55503 -63416 -57309 -64662 -48735 -51761 -82294 -73856
972g3856J5886o878R699L169k1716J078R897l022J3523j2962k780n243J6299j9097
$$ -73856 -57970 -64848 -55149 -51980 -73696 -72618 -62721 -65743 -52220 -65182 -67962 -73205 -56906 -76003
958g6003K0302l226n492k6j2845J2634o998L766P269o552J1392k2814K0037j5828
$$ -76003 -55701 -58927 -64419 -64445 -77290 -64656 -71654 -67888 -60619 -67171 -55779 -78593 -58556 -74384
944g4384K346J6691j1420L596J947l96K912k141j2414J0444P960n311J670j2025
$$ -74384 -72038 -55347 -66767 -63171 -61224 -61620 -58708 -60849 -73263 -62819 -54859 -60170 -58500 -70525
930g0525L0152j8368J1090j0993J0115j0389j4106J1659p899P558j9108L9534
$$ -70525 -40373 -58741 -47651 -58644 -48529 -58918 -73024 -61365 -69264 -61706 -80814 -41280
918d1280j9351K483k6771J1416O273j849q72P478J2321k9150J1662K905k881K416
$$ -41280 -60631 -58148 -84919 -73503 -67230 -69079 -69951 -62473 -50152 -79302 -67640 -64735 -67616 -65200
904f5200r693q482J4478p711O811J0252r922q347L1443j4133J0084j1577k470
$$ -65200 -74893 -83375 -68897 -76608 -69797 -59545 -69467 -77814 -46371 -60504 -50420 -61997 -64467
891f4467J4301j9153J0400j1521R308j1557R071n792O579o284P012K885J0473
$$ -64467 -50166 -69319 -58919 -70440 -61132 -72689 -63618 -69410 -62831 -69115 -62103 -59218 -48745
878d8745n593k4546K1179Q858K316j7883o854L255R190n052P126k163R022j4374
$$ -48745 -54338 -78884 -57705 -48847 -46531 -64414 -71268 -68013 -58823 -63875 -56749 -58912 -49890 -64264
864f4264m456J1284k4216P284m928J5196l534P926j4608Q56K3797j3744J7209
$$ -64264 -68720 -57436 -81652 -74368 -79296 -64100 -67634 -59708 -74316 -73460 -49663 -63407 -46198
851d6198q013l915M267j8433J4961J0216l1812J2631O281m941o805R201l835L151
$$ -46198 -54211 -58126 -53859 -72292 -57331 -47115 -78927 -66296 -60015 -64956 -71761 -62560 -66395 -63244
837f3244p42N850n843j0046j285Q550J3967j6178l0R505O853k0636J2618n299
$$ -63244 -63986 -58136 -63979 -74025 -75310 -66760 -52793 -68971 -69001 -59496 -52643 -73279 -60661 -65960
823f5960P198o069Q603q689m76k0549L2382j7351J1944J4931k8577M695J7587
$$ -65960 -58762 -64831 -56228 -64917 -65393 -85942 -53560 -70911 -58967 -44036 -72613 -67918 -50331
810e0331j3828J0507J49j1998J0513j6284K834J5751j9794j123l507K3375j4662
$$ -50331 -64159 -53652 -53503 -65501 -54988 -71272 -68438 -52687 -72481 -73604 -77111 -53736 -68398
797f8398m486K2900j4965J1271j0126J0527j6035O327l020o023N069r502P358
$$ -68398 -72884 -49984 -64949 -53678 -63804 -53277 -69312 -62985 -66005 -72028 -66959 -76461 -69103
$$ [...]
##END NTUPLES=NMR SPECTRUM
##END=
