##TITLE=abcd
##JCAMPDX= 6.0         $$ Bruker NMR JCAMP-DX V2.0
##DATA TYPE= NMR SPECTRUM
##DATA CLASS= NTUPLES
##ORIGIN= UXNMR, Bruker Analytische Messtechnik GmbH
##OWNER= root
$$ XWIN-NMR		Version 3.5
$$ Thu Aug  6 17:38:17 2026 Russian Standard Time (UT+4h)  servis@DPX200
##.OBSERVE FREQUENCY= 200.131235884673
##.OBSERVE NUCLEUS= ^1H
##.ACQUISITION MODE= SIMULTANEOUS
##.ACQUISITION SCHEME= undefined
##.AVERAGES= 32
##.DIGITISER RES= 18
##SPECTROMETER/DATA SYSTEM= spect
##.PULSE SEQUENCE= zg
##.SOLVENT NAME= DMSO
##.SHIFT REFERENCE= (INTERNAL, DMSO, 0, 16.4885)
##AUDIT TRAIL= $$ (NUMBER, WHEN, WHO, WHERE, WHAT)
$$ ##TITLE= Audit trail, XWIN-NMR		Version 3.5
$$ ##JCAMPDX= 5.01
$$ ##ORIGIN= Bruker BioSpin GmbH
$$ ##OWNER= servis
$$ F:\spectra/data/av/nmr/H1/1/pdata/1/auditp.txt
$$ ##AUDIT TRAIL=  $$ (NUMBER, WHEN, WHO, WHERE, WHAT)
(   1,<2026-08-06 17:36:22.50 +0400>,<servis>,<DPX200>,
      <created by zg, POWCHK disabled, PULCHK disabled
       configuration hash MD5:
       00 E9 B6 7A A2 85 ED C7 34 08 36 98 17 FE 4E 26
       data hash MD5: 32K
       DA 6D 60 67 CB 91 19 2D 30 8E E4 74 74 B0 21 30>)
(   2,<2026-08-06 17:37:55.56 +0400>,<servis>,<DPX200>,
      <Start of raw data processing
       efp BC_mod = 2 LB = 0.05 FT_mod = 6 PKNL = 1 PHC0 = -411.9518 PHC1 = 3.101563 SI = 16K 
       data hash MD5: 16K
       FB EF 80 B0 7A 46 DF C1 00 89 C1 F1 B0 DE 63 1D>)
$$ ##END=
$$ 
$$ hash MD5
$$ 92 12 D5 87 CA CD 72 CC 13 BF CB 29 3D 28 46 DA
##$RELAX= 
##$RELAX= 
##$RELAX= 
##$RELAX= 
##$RELAX= 
##$RELAX= 
##$RELAX= 
##$RELAX= 
$$ Bruker specific parameters
$$ --------------------------
##$DU= <F:\spectra>
##$EXPNO= 1
##$NAME= <H1>
##$PROCNO= 1
##$TYPE= <nmr>
##$USER= <av>
##$AMP= (0..31)
100 100 100 100 100 100 100 100 100 100 100 100 100 100 100 100 100 100 
100 100 100 100 100 100 100 100 100 100 100 100 100 100 
##$AQSEQ= 0
##$AQ_mod= 1
##$AUNM= <au_zg>
##$AUTOPOS= <>
##$BF1= 200.13
##$BF2= 200.13
##$BF3= 200.13
##$BF4= 200.13
##$BF5= 500.13
##$BF6= 500.13
##$BF7= 500.13
##$BF8= 500.13
##$BYTORDA= 1
##$CFDGTYP= 0
##$CFRGTYP= 5
##$CHEMSTR= <none>
##$CNST= (0..31)
1 1 145 1 1 1 1 1 1 1 1 1 1 1 1 1 1 1 1 1 1 1 1 1 1 1 1 1 1 1 1 1 
##$CPDPRG= <>
##$CPDPRG1= <>
##$CPDPRG2= <>
##$CPDPRG3= <>
##$CPDPRG4= <mlev>
##$CPDPRG5= <mlev>
##$CPDPRG6= <mlev>
##$CPDPRG7= <mlev>
##$CPDPRG8= <mlev>
##$CPDPRGB= <>
##$CPDPRGT= <>
##$D= (0..31)
0 2 0 0 0 0 0 0 0 0.06 0 0 0 0 0 0 0.0002 0 0 0 0 0 0 0 0 0 0 0 0 0 0 
0 
##$DATE= 1786023382
##$DBL= (0..7)
120 120 120 120 120 120 120 120 
##$DBP= (0..7)
150 150 150 150 150 150 150 150 
##$DBP07= 0
##$DBPNAM0= <>
##$DBPNAM1= <>
##$DBPNAM2= <>
##$DBPNAM3= <>
##$DBPNAM4= <>
##$DBPNAM5= <>
##$DBPNAM6= <>
##$DBPNAM7= <>
##$DBPOAL= (0..7)
0.5 0.5 0.5 0.5 0.5 0.5 0.5 0.5 
##$DBPOFFS= (0..7)
0 0 0 0 0 0 0 0 
##$DE= 6
##$DECBNUC= <off>
##$DECIM= 32
##$DECNUC= <off>
##$DECSTAT= 4
##$DIGMOD= 1
##$DIGTYP= 9
##$DL= (0..7)
0 120 120 120 120 120 120 120 
##$DP= (0..7)
150 150 150 150 150 150 150 150 
##$DP07= 0
##$DPNAME0= <>
$$ [...]
##$SUBNAM4= <"">
##$SUBNAM5= <"">
##$SUBNAM6= <"">
##$SUBNAM7= <"">
##$SUBNAM8= <"">
##$SUBNAM9= <"">
##$SW= 20.6817932712277
##$SWIBOX= (0..15)
0 0 3 0 0 0 0 0 0 0 0 0 0 0 0 0 
##$SW_h= 4139.07284768212
##$TD= 32768
##$TD0= 1
##$TE= 0
##$TE2= 300
##$TE3= 300
##$TEG= 300
##$TL= (0..7)
0 120 120 120 120 120 120 120 
##$TP= (0..7)
150 150 150 150 150 150 150 150 
##$TP07= 0
##$TPNAME0= <>
##$TPNAME1= <>
##$TPNAME2= <>
##$TPNAME3= <>
##$TPNAME4= <>
##$TPNAME5= <>
##$TPNAME6= <>
##$TPNAME7= <>
##$TPOAL= (0..7)
0.5 0.5 0.5 0.5 0.5 0.5 0.5 0.5 
##$TPOFFS= (0..7)
0 0 0 0 0 0 0 0 
##$TUNHIN= 0
##$TUNHOUT= 0
##$TUNXOUT= 0
##$USERA1= <user>
##$USERA2= <user>
##$USERA3= <user>
##$USERA4= <user>
##$USERA5= <user>
##$V9= 5
##$VALIST= <valist>
##$VCLIST= <CCCCCCCCCCCCCCC>
##$VD= 0
##$VDLIST= <DDDDDDDDDDDDDDD>
##$VPLIST= <PPPPPPPPPPPPPPP>
##$VTLIST= <TTTTTTTTTTTTTTT>
##$WBST= 1024
##$WBSW= 30
##$XGAIN= (0..3)
0 0 0 0 
##$XL= 0
##$YL= 0
##$YMAX_a= 97092
##$YMIN_a= -168396
##$ZGOPTNS= <>
##$ZL1= 120
##$ZL2= 120
##$ZL3= 120
##$ZL4= 120
##$ABSF1= 0
##$ABSF2= 0
##$ABSG= 0
##$ABSL= 0
##$ALPHA= 0
##$AQORDER= 0
##$ASSFAC= 0
##$ASSFACI= 0
##$ASSFACX= 0
##$ASSWID= 0
##$AUNMP= <proc_1d>
##$AZFE= 0.1
##$AZFW= 0.1
##$BCFW= 0
##$BC_mod= 2
##$BYTORDP= 0
##$COROFFS= 0
##$CY= 18.4799938201904
##$DATMOD= 1
##$DC= 0
##$DFILT= <>
##$DTYPP= 0
##$F1P= 9.9274215381318
##$F2P= -0.165520771350173
##$FCOR= 1
##$FTSIZE= 16384
##$FT_mod= 6
##$GAMMA= 0
##$GB= 0
##$INTBC= 1
##$INTSCL= 4.127829e-11
##$ISEN= 128
##$LB= 0.05
##$LEV0= 0
##$LPBIN= 0
##$MAXI= 10000
##$MC2= 0
##$MEAN= 0
##$ME_mod= 0
##$MI= 50
##$NCOEF= 0
##$NC_proc= -8
##$NLEV= 6
##$NOISF1= 3.799351
##$NOISF2= 2.8
##$NSP= 0
##$NTH_PI= 0
##$NZP= 0
##$OFFSET= 16.48848
##$PC= 4
##$PHC0= -411.9518
##$PHC1= 3.101563
##$PH_mod= 1
##$PKNL= yes
##$PPARMOD= 0
##$PSCAL= 4
##$PSIGN= 0
##$REVERSE= no
##$SF= 200.130005582386
##$SI= 16384
##$SIGF1= 3
##$SIGF2= 2
##$SINO= 400
##$SIOLD= 16384
##$SREGLST= <1H.CDCl3>
##$SSB= 0
##$STSI= 16384
##$STSR= 0
##$SW_p= 4139.07284768211
##$SYMM= 0
##$S_DEV= 0
##$TDeff= 32768
##$TDoff= 0
##$TI= <>
##$TILT= no
##$TM1= 0
##$TM2= 0
##$TOPLEV= 0
##$USERP1= <user>
##$USERP2= <user>
##$USERP3= <user>
##$USERP4= <user>
##$USERP5= <user>
##$WDW= 1
##$XDIM= 16384
##$YMAX_p= 495928949
##$YMIN_p= -2368522
$$ End of Bruker specific parameters
$$ ---------------------------------
##NTUPLES= NMR SPECTRUM
##VAR_NAME=  FREQUENCY,     SPECTRUM/REAL,   SPECTRUM/IMAG
##SYMBOL=    X,             R,               I
##VAR_TYPE=  INDEPENDENT,   DEPENDENT,       DEPENDENT
##VAR_FORM=  AFFN,          ASDF,            ASDF
##VAR_DIM=   16384,         16384,           16384
##UNITS=     HZ,            ARBITRARY UNITS, ARBITRARY UNITS
##FACTOR=    0.252644378177508, 1,           1
##FIRST=     3299.83951724647, 0,            0
##LAST=      -839.233330435636, 0,           0
##MIN=       -839.233330435636, -2368522,    0
##MAX=       3299.83951724647, 495928949,    0
$$ Real data points
##PAGE= N=1
##DATA TABLE= (X++(R..R)), XYDATA
$$ [...]
$$ plain form
6035 22560312 22990873 23327803 22738826 23294436 23490704 23461348 22846182 23686856 23646003 23728179
6025 23728179 24508157 23872831 23712402 23560119 24397072 24379422 24779256 23976904 24832594 24883767
6015 24883767 24171199 25300913 25576962 24538717 25187910 26028426 25382209 25805486 25502391
6006 25502391 26015881 26460973 25793478 27125382 27096351 25736123 26042680 27627874 26338989
5997 26338989 27583523 27436077 27270645 28008064 27734384 29141037 28814856 28255128 28625141
5988 28625141 28636036 29489122 28854883 28178712 28523610 29053447 29915040 29452540 29486100 29244681
5978 29244681 30081416 29798324 31193872 31068687 29670291 30383880 30534199 31099423 30851562
5969 30851562 30703363 30545648 31402288 30862823 31236471 31974318 31821126 31746843 32577476 32780714
$$ packed form
6035B2560312M30561L36930n88977N55610J96268k9356o15166Q40674m0853Q2176
6025B3728179P79978o35326j60429j52283Q36953j7650L99834q02352Q55690N1173
6015B4883767p12568J129714K76049j038245O49193Q40516o46217M23277l03095
6006B5502391N13490M45092o67495J331904k9031j360228L06557J585194j288885
5997B6338989J244534j47446j65432P37419k73680J406653l26181n59728L70013
5988B8625141J0895Q53086o34239o76171L44898N29837Q61593m62500L3560k41419
5978B9244681Q36735k83092J395548j25185j398396P13589J50319N65224k47861
5969C0851562j48199j57715Q56640n39465L73648P37847j53192p4283Q30633K03238
$$ plain form
5959 32780714 32626180 32978849 32736460 33293986 33235048 32835374 33411071 33822663 33814549 34161388
5949 34161388 33323001 33953963 33980719 33949715 34304044 34227337 34430475 33753746 34931346 35433346
5939 35433346 34764749 34494812 34833646 35379282 35555263 35379546 35761315 36219725 36319604 36178111
5929 36178111 36283680 37215887 37117243 36740708 37207890 36916975 37151215 37267665 38035124 38176127
5919 38176127 37904746 37887847 38267682 38340201 38664985 39010876 40066063 39592752 40122879 40413969
5909 40413969 40064233 40704953 40603455 40955618 40930026 41035469 41073620 41258991 40934945 41046966
5899 41046966 41129538 42028120 41364995 41255841 41187275 42985156 42426852 43763859 44146191
5890 44146191 45292491 45538744 45662086 45874346 46341690 46505627 46130313 46106013 46082953 47129149
$$ packed form
5959C2780714j54534L52669k42389N57526n8938l99674N75697M11592q114L46839
5949C4161388q38387O30962K6756l1004L54329p6707K03138o76729J177600N02000
5939C5433346o68597k69937L38834N45636J75981j75717L81769M58410R9879j41493
5929C6178111J05569R32207r8644l76535M67182k90915K34240J16450P67459J41003
5919C8176127k71381j6899L79835P2519L24784L45891J055187m73311N30127K91090
5909D0413969l49736O40720j01498L52163k5592J05443L8151J85371l24046J12021
5899D1046966Q2572Q98582o63125j09154o8566J797881n58304J337007L82332
5890D4146191J146300K46253J23342K12260M67344J63937l75314k4300k3060J046196
$$ plain form
5880 47129149 44660403 45443870 46074492 44918747 44642525 44959355 45159394 45187364 45637670
5871 45637670 44736975 45690256 45019450 46178909 47837718 47008472 47824355 47923088 49458164
5862 49458164 48845429 48652764 47779603 49806271 48317694 47125749 47916697 47274839 46994357
5853 46994357 46181900 46373458 46198649 45334646 45173554 45653933 45827410 45285346 45615875
5844 45615875 45720967 45538991 46181938 46250938 46053544 46289079 46674815 46671614 45327727 45950910
5834 45950910 45367981 45309306 44965341 44982473 45007577 44784197 44734996 44048056 44219459 44342541
5824 44342541 44702843 43556613 45452686 44381039 43964236 44121056 44024111 44163858 43973673
5815 43973673 43441683 43801236 43064216 43491787 43420112 43244527 44087345 43477508 43522151 43075967
$$ packed form
5880D7129149k468746P83467O30622j155745k76222L16830K00039K7970M50306
5871D5637670r00695R53281o70806J159459J658809q29246Q15883R8733J535076
5862D9458164o12735j92665q73161K026668j488577j191945P90948o41858k80482
5853D6994357q12457J91558j74809q64003j61092M80379J73477n42064L30529
5844D5615875J05092j81976O42947O9000j97394K35535L85736l201j343887O23183
5834D5950910n82929n8675l43965J7132K5104k23380m9201o86940J71403J23082
5824D4342541L60302j146230J896073j071647m16803J56820r6945J39747j90185
5815D3973673n31990L59553p37020M27571p1675j75585Q42818o09837M4643m46184
$$ plain form
5805 43075967 44197248 43622158 43078413 42963714 43769859 43131236 43312851 42802078 43480242
5796 43480242 42925359 43554286 43678746 42370803 43233506 42637412 43039470 42096749 41724334
5787 41724334 42917996 42585511 42820467 43136640 43180988 42745051 42440720 42291971 42081830
5778 42081830 41583764 42247391 41957966 41674970 41202752 42096363 41394614 41786514 41095561
5769 41095561 41015520 42064039 42546484 42649850 41488963 41384652 41741239 41508857 41171223
5760 41171223 41691202 42043746 42028030 41737202 41518849 41809592 42166542 42152535 42506808 42573895
5750 42573895 42851526 42662532 42884929 42784294 44298685 44536869 44630955 45258253 46757830
5741 46757830 46942524 47684031 49238844 51913712 53505356 54773574 58064825 61485401
$$ packed form
5805D3075967J121281n75090n43745j14699Q06145o38623J81615n10773O78164
5796D3480242n54883O28927J24460j307943Q62703n96094M02058r42721l72415
5787D1724334J193662l32485K34956L16173M4348m35937l04331j48749k10141
5778D2081830m98066O63627k89425k82996m72218Q93611p01749L91900o90953
5769D1095561q0041J048519M82445J03366j160887j04311L56587k32382l37634
5760D1171223N19979L52544j5716k90828k18353K90743L56950j4007L54273O7087
5750D2573895K77631j88994K22397j00635J514391K38184R4086O27298J499577
5741D6757830J84694P41507J554813K674868J591644J268218L291251L420576
$$ plain form
5733 61485401 64848674 67954053 71052372 74160394 76390197 77547589 77757286 78454349
5725 78454349 76491209 75552829 73183439 71322019 69318251 67428701 65924082 64113369
5717 64113369 62904552 61786079 61491791 60807397 61130580 61541154 62288296 64420105 65493093
5708 65493093 68864530 71007188 76892394 81451837 87387454 92833582 99529874 105694477
5700 105694477 110394524 115629339 117125504 118332706 118644680 116187511 112264238 108805210
5692 108805210 103258443 97691674 92664915 87174525 81790648 77464946 72989680 69594279
5684 69594279 67498293 64923663 64556232 63777574 62899089 62956683 63197468 64728917 64741441
5675 64741441 67250352 69995734 71136830 74614113 77498991 80801905 83235633 84054777
$$ packed form
5733F1485401L363273L105379L098319L108022K229803J157392K09697O97063
5725G8454349j963140r38380k369390j861420k003768j889550j504619j810713
5717F4113369j208817j118473k94288o84394L23183M10574P47142K131809J072988
5708F5493093L371437K142658N885206M559443N935617N446128O696292O164603
5700A05694477M700047N234815J496165J207202L11974k457169l923273l459028
5692A08805210n546767n566769n026759n490390n383877m325702m475266l395401
5684F9594279k095986k574630l67431p78658q78485N7594K40785J531449J2524
5675F4741441K508911K745382J141096L477283K884878L302914K433728Q19144
$$ plain form
5667 84054777 84608349 83620497 82379971 80208679 77712232 72204770 69476096 65798320
5659 65798320 62439193 59294747 56223321 53509026 51315801 49573649 46928584 45269638
5651 45269638 44594389 42635220 41646648 40972955 40066765 38547541 37990857 37304793 37297103
5642 37297103 36893728 36972951 35868345 35459257 35490494 35560037 34535662 34823435 34673821 33656728
5632 33656728 34666003 33687365 33529068 33511407 33889219 33566082 32469181 32688272 32936622
5623 32936622 33255093 32906347 31549650 32591776 32553335 32876988 31974389 32399013 32600602
5614 32600602 32752538 33086178 33088321 33248058 33262800 34268289 34215587 34557682 34899007 35413348
5604 35413348 35983181 36247848 37281008 37295363 39003171 40538673 42337216 42563384 44862177
$$ packed form
5667H4054777N53572r87852j240526k171292k496447n507462k728674l677776
5659F5798320l359127l144446l071426k714295k193225j742152k645065j658946
5651D5269638o75249j959169r88572o73693r06190j519224n56684o86064p690
5642C7297103m03375P9223j104606m09088L1237O9543j024375K87773j49614j017093
5632C3656728J009275r78638j58297j7661L77812l23137j096901K19091K48350
5623C2936622L18471l48746j356697J042126l8441L23653r02599M24624K01589
5614C2600602J51936L33640K143J59737J4742J005489n2702L42095L41325N14341
5604C5413348N69833K64667J033160J4355J707808J535502J798543K26168K298793
$$ plain form
5595 44862177 46969252 49563308 50545343 51574041 54269904 55208479 57079754 57262315 58403333
5586 58403333 59052857 60100077 62079917 62535904 62497768 64919184 65763335 67649839 68146194
5577 68146194 70487727 72663283 73829155 76708785 78333223 80752685 83359402 85758712
5569 85758712 89091092 92533063 96380441 99919072 104297965 108586605 112993592 118180413
5561 118180413 122536808 126000527 130215204 132512084 134781751 135490744 136513854 136368260
5553 136368260 135433136 135862738 134850152 134736630 135260671 134329181 133762926 133812714 132588960
5544 132588960 131670272 130536608 129179126 129630621 128821348 129909039 129307233 130477932 132808053
5535 132808053 134520131 137745970 140840073 144304716 146471613 148822911 150592593 150766143
$$ packed form
5595D4862177K107075K594056R82035J028698K695863R38575J871275J82561J141018
5586E8403333O49524J047220J979840M55987l8136K421416Q44151J886504M96355
5577F8146194K341533K175556J165872K879630J624438K419462K606717K399310
5569H5758712L332380L441971L847378L538631M378893M288640M406987N186821
5561A18180413M356395L463719M214677K296880K269667P08993J023110j45594
5553A36368260r35124M29602j012586j13522N24041r31490n66255M9788j223754
5544A32588960r18688j133664j357482M51495q09273J087691o01806J170699K330121
5535A32808053J712078L225839L094103L464643K166897K351298J769682J73550
$$ plain form
5527 150766143 150551433 149133486 146545772 142924599 138880668 133488106 127837616 122232027
5519 122232027 118755781 114166220 109820214 106383896 103318418 101805536 100205823 98411542
5511 98411542 98503759 98324828 98851258 101153138 104698184 106827404 110851911 114645436 120402690
5502 120402690 125308548 130253274 135447828 137711683 140260850 139939493 139296073 135617694
5494 135617694 133028859 128879131 122992497 116395894 110660468 104649430 100412266 97322211
5486 97322211 92191914 88135527 86492536 83462328 81952249 80552917 80022573 79593292
5478 79593292 80395988 81099947 81663254 83506473 85844536 88045418 89517484 92857303 94537862
5469 94537862 96216342 95841712 95368962 93900872 90673720 87481020 84140815 80599962
$$ packed form
5527A50766143k14710j417947k587714l621173m043931n392562n650490n605589
5519A22232027l476246m589561m346006l436318l065478j512882j599713j794281
5511I8411542R2217j78931N26430K301880L545046K129220M024507L793525N757254
5502A20402690M905858M944726N194554K263855K549167l21357o43420l678379
5494A35617694k588835m149728n886634o596603n735426o011038m237164l090055
5486I7322211n130297m056387j642991l030208j510079j399332n30344m29281
5478G9593292Q02696P03959N63307J843219K338063K200882J472066L339819J680559
5469I4537862J678480l74630m72750j468090l227152l192700l340205l540853
$$ plain form
5461 80599962 76425733 72607957 68830574 66203073 63010822 61351264 58006981 57189350
5453 57189350 55891185 53359362 52794037 52398812 51621529 51111861 50621216 50960500 50781181
5444 50781181 50167820 49396774 48794489 47789095 48407490 47297040 46902681 46574020 45353599
5435 45353599 44112730 43321203 42182848 41965614 40552508 40051783 39428305 39234980 38016675
5426 38016675 37088438 36420531 35846136 35214101 34407961 34360663 33857651 32968509 32139702 31932504
5416 31932504 30530750 30552025 29286449 28382336 28170750 27645540 26171257 26623125 25650539
5407 25650539 25527021 23424770 24815314 24023016 23695729 23424976 23405423 22055016 22475609
5398 22475609 22318959 21543811 21237110 21174320 21167573 20845318 21154571 20351022 20473120 19958476
$$ packed form
5461H0599962m174229l817776l777383k627501l192251j659558l344283q17631
5453E7189350j298165k531823n65325l95225p77283n09668m90645L39284j79319
5444E0781181o13361p71046o02285j005394O18395j110450l94359l28661j220421
5435D5353599j240869p91527j138355k17234j413106n00725o23478j93325j218305
5426C8016675r28237o67907n74395o32035q06140m7298n03012q89142q28807k07198
5416C1932504j401754K1275j265576r04113k11586n25210j474283M51868r72586
5407B5650539j23518k102251J390544p92298l27287k70753j9553j350407M20593
5398B2475609j56650p75148l06701o2790o747l22255L09253q03549J22098n14644
$$ plain form
5388 19958476 19888827 19581701 19148326 19253467 19541422 19504664 19566173 18704698 18269817 18422680
5378 18422680 18454362 18396485 18071253 18347562 18243315 19444764 18229156 17868457 18554530
5369 18554530 18028696 18514945 18593070 18227287 19043013 18918251 17748309 18101950 18778746
5360 18778746 18093398 18143202 17144010 17256843 17930254 17006760 17840208 17646742 17198202 17821089
5350 17821089 17010330 17715266 17107179 17891259 17743701 17240521 16853909 18905990 17799506
5341 17799506 18452291 18254898 18272621 18729784 18720103 19223577 18874500 18741286 19876152 19948064
5331 19948064 20301236 20932782 21597955 21476921 22414026 23307684 25027767 26771531 28373414
5322 28373414 30775317 34379626 40420056 47438145 56697911 63136807 68174094 73315078
$$ packed form
5388A9958476o9649l07126m33375J05141K87955l6758O1509q61475m34881J52863
5378A8422680L1682n7877l25232K76309j04247J201449j215608l60699O86073
5369A8554530n25834M86249P8125l65783Q15726j24762j169942L53641O76796
5360A8778746o85348M9804r99192J12833O73411r23494Q33448j93466m48540O22887
5350A7821089q10759P04936o08087P84080j47558n03180l86612K052081j106484
5341A7799506O52785j97393J7723M57163r681N03474l49077j33214J134866P1912
5331A9948064L53172O31546O65173j21034R37105Q93658J720083J743764J601883
5322B8373414K401903L604309O040430P018089R259766O438896N037287N140984
$$ plain form
5314 73315078 78493553 86136129 96505823 109716083 121197981 128209544 131821857 134345206
5306 134345206 138357399 147844547 160444746 171129866 176717726 177573629 172124524 166172788
5298 166172788 162219904 161959951 161863587 159062154 151040394 143358179 133301606 124336561
5290 124336561 117493860 111131897 105436344 99176535 91454963 83104640 75181378 67579683
5282 67579683 61264900 54827836 51110727 45608984 41386862 39961295 37555466 35996018
5274 35996018 35418739 34797575 33944087 32182067 32744715 32181756 32899701 31450524 32236560
5265 32236560 31667522 32230554 31980130 32712399 33031806 32941697 33080553 33934704 35895938
5256 35895938 36200912 37323350 38711082 39837987 41867442 42921429 44219868 46074685
$$ packed form
5314G3315078N178475P642576J0369694J3210260J1481898P011563L612313K523349
5306A34345206M012193R487148J2600199J0685120N587860Q55903n449105n951736
5298A66172788l952884k59953r6364k801433q021760p682215j0056573q965045
5290A24336561o842701o361963n695553o259809p721572q350323p923262p601695
5282F7579683o314783o437064l717109n501743m222122j425567k405829j559448
5274C5996018n77279o21164q53488j762020N62648n62959P17945j449177P86036
5265C2236560n69038N63032k50424P32269L19407r0109J38856Q54151J961234
5256C5895938L04974J122438J387732J126905K029455J053987J298439J854817
$$ plain form
5248 46074685 48719289 49615575 52567803 53575113 54926956 56732210 58400918 59467321
5240 59467321 60613689 63563985 64906970 65966939 67656302 69044293 70722383 72394757
5232 72394757 74850074 76268994 78541921 81361419 84012515 87144194 88576035 90943345
5224 90943345 92372237 93028651 92912147 93312308 91458354 90216009 88582247 86316444 83619838
5215 83619838 81146759 79257103 75961738 73942024 72236105 70072549 67939262 66485275
5207 66485275 64488841 63170422 61771131 60761060 60037389 58586443 56952689 56407038
5199 56407038 55925194 53527230 52039035 51250078 49312370 47590507 44825588 43335700
5191 43335700 41409315 38748635 37145588 35522857 33337641 31878279 30539420 29488497
$$ packed form
5248D6074685K644604Q96286K952228J007310J351843J805254J668708J066403
5240E9467321J146368K950296J342985J059969J689363J387991J678090J672374
5232G2394757K455317J418920K272927K819498K651096L131679J431841K367310
5224I0943345J428892O56414j16504M00161j853954j242345j633762k265803k696606
5215H3619838k473079j889656l295365k019714j705919k163556k133287j453987
5207F6485275j996434j318419j399291j010071p23671j450946j633754n45651
5199E6407038m81844k397964j488195p88957j937708j721863k764919j489888
5191D3335700j926385k660680j603047j622731k185216j459362j338859j050923
$$ plain form
5183 29488497 28358056 27188119 26306525 23937633 24326068 23317875 22250344 21795039 21926880
5174 21926880 21011265 19964950 20035080 20072064 19822697 18887731 17859289 18461994 17288938
5165 17288938 17906306 17355022 16851423 15746076 15949793 15187711 16199818 15305937 15103058
5156 15103058 14418654 14146519 13500922 14522999 13867880 13364254 14187483 13601542 13274184
5147 13274184 12931936 13608393 13214415 13583322 12206787 12135790 12228504 11381557 12516520
5138 12516520 11924705 11704384 11248938 12149684 11785703 11557069 12152385 10785911 12121206
5129 12121206 10896696 11313002 11466953 11772749 11297665 11062432 10885414 11155675 10449473
5120 10449473 10805498 11704519 11586836 11293276 10613464 10976563 11120069 11097131 10728195 11120226
$$ packed form
5183B9488497j130441j169937q81594k368892L88435j008193j067531m55305J31841
5174B1926880r15615j046315P0130L6984k49367r34966j028442O02705j173056
5165A7288938O17368n51284n03599j105347K03717p62082J012107q93881k02879
5156A5103058o84404k72135o45597J022077o55119n03626Q23229n85941l27358
5147A3274184l42248O76457l93978L68907j376535p0997R2714q46947J134963
5138A2516520n91815k20321m55446R00746l63981k28634N95316j366474J335295
5129A2121206j224510M16306J53951L05796m75084k35233j77018K70261p06202
5120A0449473L56025Q99021j17683k93560o79812L63099J43506k2938l68936L92031
$$ plain form
5110 11120226 11009702 11762195 10935171 11589539 11585514 12287019 12253438 13072129 13573077 12932872
5100 12932872 14522948 14685531 16082972 16357757 16578160 17933399 19586296 20385863 21441835
5091 21441835 22379602 22810510 23446519 23708652 23851316 23345697 22854550 24021154 22903525
5082 22903525 22016648 21586249 21366659 21931911 21696119 21971604 22306525 22607422 22814829
5073 22814829 23827326 25150282 26386700 28533493 30038622 32969444 35543134 37692356
5065 37692356 40690398 44640413 46627294 49273626 51800115 54725092 54224637 54319837 54678980
5056 54678980 52759906 51541704 49231196 47233334 45652029 43174658 42052756 40867159
5048 40867159 39500638 38504873 38308481 39133692 38393008 39070588 40282476 41668557 44074484
$$ packed form
5110A1120226j10524P52493q27024O54368m025P01505l3581Q18691N00948o40205
5100A2932872J590076J62583J397441K74785K20403J355239J652897P99567J055972
5091B1441835R37767M30908O36009K62133J42664n05619m91147J166604j117629
5082B2903525q86877m30399k19590N65252k35792K75485L34921L00897K07407
5073B2814829J012497J322956J236418K146793J505129K930822K573690K149222
5065C7692356K998042L950015J986881K646332K526489K924977n00455R5200L59143
5056E4678980j919074j218202k310508j997862j581305k477371j121902j185597
5048D0867159j366521r95765j96392Q25211p40684O77580J211888J386081K405927
$$ plain form
5039 44074484 45594174 48997703 51524668 55443348 58195155 61641893 64559369 67879006
5031 67879006 69515249 70325208 70784493 70900985 68853270 66568793 64030352 60003201 55586857
5022 55586857 53371231 49342914 46453416 43929018 42309565 41079145 40643605 38926414
5014 38926414 38467555 38885495 38582702 37692633 37564238 39443957 40930051 42021275 43686429
5005 43686429 46652233 48174352 49842293 50109670 50645090 49715182 49571628 48618598 45570451
4996 45570451 43746526 41579928 39134503 36981177 34151364 32523899 30145853 29068336
4988 29068336 28308812 26906131 26197384 25677881 25188784 24620566 24657910 22895067 23166414
4979 23166414 23115342 23458804 23380691 23491492 23714561 23672717 24777471 24769163 25429770 24718704
$$ packed form
5039D4074484J519690L403529K526965L918680K751807L446738K917476L319637
5031F7879006J636243Q09959M59285J16492k047715k284477k538441m027151m416344
5022E5586857k215626m028317k889498k524398j619453j230420m35540j717191
5014C8926414m58859M17940l02793q90069j28395J879719J486094J091224J665154
5005D3686429K965804J522119J667941K67377N35420r29908j43554r53030l048147
4996D5570451j823925k166598k445425k153326k829813j627465k378046j077517
4988B9068336p59524j402681p08747n19503m89097n68218L7344j762843K71347
4979B3166414n1072L43462p8113J10801K23069m1844J104754q308O60607p11066
$$ plain form
4969 24718704 25163857 24882640 24128513 23493405 22790604 21862970 19986045 19849621 19158665
4960 19158665 18160215 18403362 17620596 16476783 16648445 17212125 17036863 16578152 17046107
4951 17046107 16858350 16608294 16748621 17853723 18542896 19687179 19728136 20813561 20240465
4942 20240465 21149711 21751796 22645801 22674015 21888399 21710881 22656785 21562351 20413257
4933 20413257 20590201 19992162 19753570 18528415 18463561 18617465 18725249 18566146 17961197
4924 17961197 18278707 18037370 17563441 18101220 18445869 19331469 19544754 20699921 21221327
4915 21221327 22541983 22449864 23841495 25026342 25121739 25335208 25846585 25057616 25205254
4906 25205254 24727430 23883934 23036616 21107309 21045257 19624783 20004825 19692181 18372968
$$ packed form
4969B4718704M45153k81217p54127o35108p02801r27634j876925j36424o90956
4960A9158665r98450K43147p82766j143813J71662N63680j75262m58711M67955
4951A7046107j87757k50056J40327J105102O89173J144283M0957J085425n73096
4942B0240465R09246O02085Q94005K8214p85616j77518R45904j094434j149094
4933B0413257J76944n98039k38592j225155o4854J53904J07784j59103o04949
4924A7961197L17510k41337m73929N37779L44649Q85600K13285J155167N21406
4915B1221327J320656r2119J391631J184847R5397K13469N11377p88969J47638
4906B5205254m77824q43496q47318j929307o2052j420474L80042l12644j319213
$$ plain form
4897 18372968 18396355 17403512 16990701 17723423 17530014 16938914 17792773 17741726 18541194 18241508
4887 18241508 17391137 18188534 18840609 19216273 18923960 19770742 20608050 19185625 19690024
4878 19690024 19666279 18923737 17863598 16840259 16289518 17140410 16535994 15522866 14819184
4869 14819184 14026520 14264518 13599501 13553287 12964312 13283775 13656299 13189368 13345124 12368927
4859 12368927 12792719 12827692 12207484 12574216 12093978 13033009 13383968 13147468 13121432 13182173
4849 13182173 12557776 13180677 12544823 12066218 12651697 12530266 12083683 12697797 12750249 12308081
4839 12308081 12813725 12530873 12125792 12813391 12839325 12800235 13212650 13422730 13737784 13543270
4829 13543270 14701077 15232738 15531241 15609385 16194622 17348404 16677607 17636484 18269518
$$ packed form
4897A8372968K3387r92843m12811P32722j93409n91100Q53859n1047P99468k99686
4887A8241508q50371P97397O52075L75664k92313Q46782Q37308j422425N04399
4878A9690024k3745p42542j060139j023339n50741Q50892o04416j013128p03682
4869A4819184p92664K37998o65017m6214n88975L19463L72524m66931J55756r76197
4859A2368927M23792L4973o20208L66732m80238R39031L50959k36500k6036O0741
4849A3182173o24397O22901o35854m78605N85479j21431m46583O14114N2452m42168
4839A2308081N05644k82852m05081O87599K5934l9090M12415K10080L15054j94514
4829A3543270J157807N31661K98503P8144N85237J153782o70797R58877O33034
$$ plain form
4820 18269518 18807405 19146460 20672266 20358568 21175226 22136486 23448376 22805746 23839783
4811 23839783 24153278 25441564 26225538 27475490 27934545 28208662 28998823 30014445 31573919
4802 31573919 31321332 33245077 33980358 35671501 37659669 40089696 42515062 44372638
4794 44372638 48020680 50451003 54311274 57485683 61851767 66550356 70339568 74877065
4786 74877065 78801410 82628487 87163934 90433841 94214464 98311002 103101306 107910172
4778 107910172 113841466 118459263 124263339 129641238 135250723 139411813 143329340 147329377
4770 147329377 151980245 155852547 160682559 165986564 171697211 178357345 184060511 189578492
4762 189578492 195070486 198618014 199093338 198620912 197012478 194863424 192299374 189778453
$$ packed form
4820A8269518N37887L39055J525806l13698Q16658R61260J311890o42630J034037
4811B3839783L13495J288286P83974J249952M59055K74117P90161J015622J559474
4802C1573919k52587J923745P35281J691143J988168K430027K425366J857576
4794D4372638L648042K430323L860271L174409M366084M698589L789212M537497
4786G4877065L924345L827077M535447L269907L780623M096538M790304M808866
4778A07910172N931294M617797N804076N377899N609485M161090L917527M000037
4770A47329377M650868L872302M830012N304005N710647O660134N703166N517981
4762A89578492N491994L547528M75324m72426j608434k149054k564050k520921
$$ plain form
4754 189778453 187142701 184632018 182064474 180472587 178333627 174700065 170370183 165764228
4746 165764228 161922229 156583663 151036545 145667064 141001099 137385281 133325154 129003595
4738 129003595 125489199 121947586 118608388 113626564 108970274 104552574 100737154 96889715
4730 96889715 91654083 86779800 82859051 78608386 75172115 72441738 69048948 64864913
4722 64864913 62131758 59337589 56652422 55078227 52066021 50337418 48799808 47316878
4714 47316878 46527574 44492737 42812025 42075893 40651774 40295563 39469697 38062269 37228864
4705 37228864 35892605 35469870 34193670 32671807 31270428 31170308 30120770 29472113 28301013
4696 28301013 27534942 26369092 25968075 25436048 24319412 24017607 23957888 23229352 22811020
$$ packed form
4754A89778453k635752k510683k567544j591887k138960l633562m329882m605955
4746A65764228l841999n338566n547118n369481m665965l615818m060127m321559
4738A29003595l514396l541613l339198m981824m656290m417700l815420l847439
4730I6889715n235632m874283l920749m250665l436271k730377l392790m184035
4722F4864913k733155k794169k685167j574195l012206j728603j537610j482930
4714D7316878p89304k034837j680712p36132j424119l56211q25866j407428q33405
4705C7228864j336259m22735j276200j521863j401379j00120j049538o48657j171100
4696B8301013p66071j165850m01017n32027j116636l01805n9719p28536m18332
$$ plain form
4687 22811020 21933422 21866938 20673072 20172292 19757765 18691896 19341676 18173327 18633355
4678 18633355 17459497 17617300 16980098 16827883 16257981 16320003 16493147 16141774 14907606
4669 14907606 14149839 13985781 13992427 14263255 14577159 14043964 13484807 13471260 12910382 13026822
4659 13026822 11789735 12849449 12636325 12734686 12064909 11768900 11874568 11488702 12159131
4650 12159131 11181671 11135000 11083402 10639471 10342218 11242922 10146311 10193724 10193999 9912309
4640 9912309 9550557 10194648 10543193 10367554 9961127 10093986 9688878 9697397 9649012 10245068
4630 10245068 8927789 9010252 9018096 8986049 9311752 8414373 8391048 9102089 8536566 8598231
4620 8598231 7999192 8081651 7997526 8043247 8045125 8865342 8846906 8207798 8297651 7775861 8083093
$$ packed form
4687B2811020q77598o6484j193866n00780m14527j065869O49780j168349M60028
4678A8633355j173858J57803o37202j52215n69902O2022J73144l51373j234168
4669A4907606p57767j64058O646K70828L13904n33195n59157j3547n60878J16440
4659A3026822j237087J059714k13124R8361o69777k96009J05668l85866O70429
4650A2159131r77460m6671n1598m43931k97253R00704j096611M7413K75k81690
4640I912309l61752O44091L48545j75639m06427J32859m05108Q519m8385N96056
4630A0245068j317279Q2463P844l2047L25703q97379k3325P11041n65523O1665
4620H598231n99039Q2459q4125M5721J878Q20217j8436o39108Q9853n21790L07232
$$ plain form
4609 8083093 7602702 8036130 7709160 7031492 7218973 7796365 7549466 7904211 7301873 7114279
4599 7114279 7397135 7138551 7581051 7586429 7634947 7175361 7773873 6363168 6118348 7366264
4589 7366264 7373042 7785627 7309953 6254671 6510598 6529251 6937351 7016544 6845613 6293886
4579 6293886 6411765 6857493 6860129 6812898 6336300 5875239 6831381 6081121 6447348 6756726
4569 6756726 6601284 6968988 6842217 6199976 6811882 7016852 5657511 6070532 7142219
4560 7142219 5997706 6075195 6239055 6551326 5938177 7033522 5934014 6087313 7182526
4551 7182526 6975670 6776113 6325983 5825706 6218164 5813703 5888923 6010516 6407832 6719145
4541 6719145 6866857 6553114 6350595 6313690 6523938 6419326 6874427 7096879 5763206 6826534
$$ packed form
4609H083093m80391M33428l26970o77668J87481N77392k46899L54745o02338j87594
4599G114279K82856k58584M42500N378M8518m59586N98512j410705k44820J247916
4589G366264O778M12585m75674j055282K55927J8653M08100P9193j70931n51727
4579F293886J17879M45728K636m7231m76598m61061R56142p50260L66227L09378
4569F756726j55442L67704j26771o42241O11906K04970j359341M13021J071687
4560G142219j144513P7489J63860L12271o13149J095345j099508J53299J095213
4551G182526k06856j99557m50130n00277L92458m04461P5220J21593L97316L11313
4541F719145J47712l13743k02519l6905K10248j04612M55101K22452j333673J063328
$$ plain form
4531 6826534 6603102 6399806 6059217 7113918 7054623 6979414 6513854 6475369 6853930 6568465
4521 6568465 6555254 6139670 6959361 7448667 6388818 6721923 7873813 6752485 6518520
4512 6518520 6741788 6928152 6682505 7199954 6747622 7066682 6608825 7170104 6904045 7298277
4502 7298277 7870166 7339385 7367511 8371881 7766282 6637476 7142877 7320417 7163409
4493 7163409 7805614 7575987 7225585 7349562 7556626 7027782 7407759 7271349 7815309 7114790
4483 7114790 6891925 6961247 7187567 8113108 7524982 7831101 8052973 8066929 8641113 7944884
4473 7944884 8444324 8464002 8543565 8362710 7860739 9397405 9328785 8834914 8921754 10124014
4463 10124014 9771595 10696077 10760670 11367391 11316222 11933658 12926809 13307709 15291250 15488478
$$ packed form
4531F826534k23432k03296l40589J054701n9295p5209m65560l8485L78561k85465
4521F568465j3211m15584Q19691M89306j059849L33105J151890j121328k33965
4512F518520K23268J86364k45647N17449m52332L19060m57857N61279k66059L94232
4502G298277N71889n30781K8126J004370o05599j128806N05401J77540j57008
4493G163409O42205k29627l50402J23977K07064n28844L79977j36410N43960p00519
4483G114790k22865O9322K26320R25541n88126L06119K21872J3956N74184o96229
4473G944884M99440J9678P9563j80855n01971J536666o8620m93871Q6840J202260
4463A0124014l52419R24482O4593O06721n1169O17436R93151L80900J983541J97228
$$ plain form
4453 15488478 17245722 17332665 19709048 21675032 24419439 26997385 30474535 34854042
4445 34854042 41229345 51112825 64157464 79114435 95500940 106671033 111993767 111932252
4437 111932252 107577637 98785558 90289424 80954068 71304581 62616767 55515555 50920431
4429 50920431 46120678 41673071 39164528 36428797 34155855 32113436 29311866 27440180
4421 27440180 25274777 23844640 22378801 20393653 19441167 19151764 17624555 17524889 17341626
4412 17341626 15304348 16018059 15116309 15059652 14277755 13717264 14820451 13738685 13265056
4403 13265056 12910408 13175056 11510859 11967355 11473590 11273160 11244770 10966396 11462485
4394 11462485 10323735 11172140 10790041 9838181 9831459 10438738 10176339 10220461 10585795 9497117
$$ packed form
4453A5488478J757244Q6943K376383J965984K744407K577946L477150M379507
4445C4854042O375303R883480J3044639J4956971J6386505J1170093N322734o1515
4437A11932252m354615q792079q496134r335356r649487q687814p101212m595124
4429E0920431m799753m447607k508543k735731k272942k042419k801570j871686
4421B7440180k165403j430137j465839j985148r52486k89403j527209r9666j83263
4412A7341626k037278P13711r01750n6657p81897n60491J103187j081766m73629
4403A3265056l54648K64648j664197M56496m93765k00430k8390k78374M96089
4394A1462485j138750Q48405l82099r51860o722O07279k62399M4122L65334j088678
$$ plain form
4384 9497117 9778820 9025509 10167910 9773438 9117023 10045517 8748969 10106493 8948273
4375 8948273 9719589 9059994 9717381 9354081 9726122 10174655 10967839 10720837 10653993 11368672
4365 11368672 11442760 11109333 10356009 11200394 10743838 10233844 9684557 9939378 9699101 9113082
4355 9113082 9474355 9515485 8866865 9403315 9583770 9601595 9448383 9776053 9002929 9440529
4345 9440529 9758334 9922080 10915497 10536996 11783586 13817974 13472460 13949699 13701647
4336 13701647 13628722 13366221 11800693 12478264 11484537 11252699 11478608 10651887 10850884
4327 10850884 11305200 11515537 11387863 10392001 10405919 11564507 10583646 12769642 11719545
4318 11719545 12952745 12743216 12621601 12372692 13658995 14367335 14972293 15599367 16710388
$$ packed form
4384I497117K81703p53311J142401l94472o56415R28494j296548J357524j158220
4375H948273P71316o59595O57387l63300L72041M48533P93184k47002o6844P14679
4365A1368672P4088l33427p53324Q44385m56556n09994n49287K54821k40277n86019
4355I113082L61273M1130o48620N36450J80455J7825j53212L27670p73124M37600
4345I440529L17805J63746R93417l78501J246590K034388l45514M77239k48052
4336A3701647p2925k62501j565528O77571r93727k31838K25909q26721J98997
4327A0850884M54316K10337j27674r95862J3918J158588r80861K185996j050097
4318A1719545J233200k09529j21615k48909J286303P08340O04958O27074J111021
$$ plain form
4309 16710388 16572132 17429168 17127950 17423176 18586322 19882450 20499235 21857567 21817678
4300 21817678 23604701 23684876 25056046 25075658 24411561 23244785 23043033 22134126 20175443
4291 20175443 19059776 17016243 15919698 14499731 14872614 13210966 13253521 12492172 10820308
4282 10820308 10749491 10846886 11698844 10210480 10321975 9977072 10070266 10322343 9457027 9416088
4272 9416088 9534058 9737659 8669991 8734786 9150424 9210304 8461638 8858406 8543379 8997969
4262 8997969 9265361 8132284 8300908 7782393 7751761 8217149 8081546 7921501 8362260 7928555
4252 7928555 7461088 7212432 7498349 7482118 7385478 6614202 7502272 8155038 6820503 6788546
4242 6788546 6793033 6235723 6660884 7048263 6532886 5822857 6640958 6421077 6760892 5819885
$$ packed form
4309A6710388j38256Q57036l01218K95226J163146J296128O16785J358332l9889
4300B1817678J787023Q0175J371170J9612o64097j166776k01752r08907j958683
4291B0175443j115667k043533j096545j419967L72883j661648M2555p61349j671864
4282A0820308p0817R7395Q51958j488364J11495l44903R3194K52077q65316m0939
4272I416088J17970K03601j067668O4795M15638N9880p48666L96768l15027M54590
4262H997969K67392j133077J68624n18515l0632M65388j35603j60045M40759m33705
4252G928555m67467k48656K85917j6231r6640p71276Q88070O52766j334535l1957
4242F788546M487n57310M25161L87379n15377p10029Q18101k19881L39815r41007
$$ plain form
4232 5819885 6139202 5446379 5558778 6308256 5214735 5131778 5887476 5814835 5795402 6174272
4222 6174272 6174050 4963874 4813865 4429295 5396640 5932733 5141327 4393890 5791696 5669708
4212 5669708 5531574 4632428 4909177 5576109 4495457 4988447 4599803 5071701 5317874
4203 5317874 4596102 4640116 3907440 5459685 4270743 5314025 4808187 4480494 5210136
4194 5210136 5664076 5195281 5290193 4103666 5087224 4448138 5149803 5482779 4781362 4401924
4184 4401924 5322235 4942853 4774298 5498262 4229116 4534122 5089749 4731595 5211230
4175 5211230 5194415 4492781 4511256 3868182 4833203 4036295 5715845 4736620 4435895 4338917
4165 4338917 4829480 4573164 4568663 5004317 3777374 3922797 4914369 4833024 4688377 4190111
$$ packed form
4232E819885L19317o92823J12399P49478j093521q2957P55698p2641j9433L78870
4222F174272k22j210176j50009l84570R67345N36093p91406p47437J397806j21988
4212E669708j38134q99146K76749O66932j080652M92990l88644M71898K46173
4203E317874p21772M4014p32676J552245j188942J043282n05838l27693P29642
4194E210136M53940m68795R4912j186527R83558o39086P01665L32976p01417l79438
4184D401924R20311l79382j68555P23964j269146L05006N55627l58154M79635
4175E211230j6815p01634J8475o43074R65021p96908J679550r79225l00725r6978
4165D338917M90563k56316m501M35654j226943J45423R91572q1345j44647m98266
$$ plain form
4155 4190111 4880141 3907178 5182455 4318304 3738322 4245335 4931161 3827971 4833871
4146 4833871 4547826 3791770 4262877 4716823 3229355 3964575 3326170 4169003 3891744
4137 3891744 4775685 4011105 4015488 3892289 3692405 4063758 3845179 3615009 3623674 3052696
4127 3052696 2751856 3167130 3345228 3972494 2999375 3532306 3965808 3834591 3069529 3553445
4117 3553445 4109436 3419891 3789399 3721169 3543167 3843135 2670379 3965301 3520853
4108 3520853 3286791 3886170 3704916 3719074 3372053 2695578 3242225 3753134 2928216 3451282
4098 3451282 2808834 2658183 3859381 3569775 3521839 3444691 3067173 3275721 3314317 3311414
4088 3311414 3638391 4343394 3522187 3360849 3550469 3325172 4195575 2942548 3369112
$$ packed form
4155D190111O90030r72963J275277q64151n79982N07013O85826j103190J005900
4146D833871k86045p56056M71107M53946j487468P35220o38405Q42833k77259
4137C891744Q83941p64580M383j23199j99884L71353k18579k30170Q665n70978
4127C052696l00840M15274J78098O27266r73119N32931M33502j31217p65062M83916
4117C553445N55991o89545L69508o8230j78002K99968j172756J294922m44448
4108C520853k34062N99379j81254J4158l47021o76475N46647N10909q24918N23066
4098C451282o42448j50651J201198k89606m7936p7148l77518K08548L8596k903
4088C311414L26977P05003q21207j61338J89620k25297Q70403j253027M26564
$$ plain form
4079 3369112 3666585 3768217 3717129 3952174 3213265 4007544 3359054 2784126 3621861 3742437
4069 3742437 3748999 3907008 3531694 4040121 2835626 3713518 3892568 3306505 3858716 3644890
4059 3644890 4110241 4529336 3987122 3973272 3467409 3560353 3766065 4046617 4259113 4110301
4049 4110301 4258029 4353896 3648139 4380821 3830672 4547412 3656247 3922030 4576656 4010218
4039 4010218 4055376 4195548 4713189 4332723 4314736 4894732 5130916 4806560 4880506 4919261
4029 4919261 4620189 4335053 5374441 4323699 4243175 4880194 4320650 4863536 5003018
4020 5003018 4739489 5543733 5124288 5018573 6836960 5771340 5700020 5757737 6999234
4011 6999234 5613710 6539791 5540563 5777552 5307366 4805347 5414172 5173676 4887213
$$ packed form
4079C369112K97473J01632n1088K35045p38909P94279o48490n74928Q37735J20576
4069C742437O562J58009l75314N08427j204495Q77892J79050n86063N52211k13826
4059C644890M65351M19095n42214j3850n05863R2944K05712K80552K12496j48812
4049D110301J47728R5867p05757P32682n50149P16740q91165K65783O54626n66438
4039D010218M5158J40172N17641l80466j7987N79996K36184l24356P3946L8755
4029D919261k99072k85136J039388j050742q0524O37019n59544N42886J39482
4020E003018k63529Q04244m19445j05715J818387j065620p1320N7717J241497
4011F999234j385524R26081r99228K36989m70186n02019O08825k40496k86463
$$ plain form
4002 4887213 5122197 5065229 4531631 5093875 4105709 4793288 4358677 4339836 5479819 5423424
3992 5423424 4856672 5533121 5358429 5050155 5383213 5878038 6653048 6150523 5727717 5541843
3982 5541843 5708311 4736278 4363782 4800916 5068316 4958654 4333908 4472929 4447843 4563294
3972 4563294 4518060 4431570 4508988 4424299 4095643 4411892 4373681 4807302 4995368 5096892
3962 5096892 4744580 4479701 4286099 4942598 4610603 4134722 3899132 4640548 3508166
3953 3508166 3654370 3919913 2988085 2689941 3058578 3010616 3416420 3632017 3115778 2981824
3943 2981824 3868122 3153845 2960095 3031711 3707859 2959596 3271056 3240248 3413514 3261885
3933 3261885 2332956 3294131 3121500 2671489 2594477 3114323 2215538 3466129 3087547 3028331
$$ packed form
4002D887213K34984n6968n33598N62244r88166O87579m34611j8841J139983n6395
3992E423424n66752O76449j74692l08274L33058M94825P75010n02525m22806j85874
3982E541843J66468r72033l72496M37134K67400j09662o24746J39021k5086J15451
3972D563294m5234q6490P7418q4689l28656L16249l8211M33621J88066J01524
3962E096892l52312k64879j93602O56499l31995m75881k35590P41416j132382
3953C508166J46204K65543r31828k98144L68637m7962M05804K15597n16239j33954
3943B981824Q86298p14277j93750P1616O76148p48263L11460l0808J73266j51629
3933C261885r28929R61175j72631m50011p7012N19846q98785J250591l78582n9216
$$ plain form
3923 3028331 3099907 2650798 2933246 2898480 2592790 3293069 2507059 3185863 2931532 3216560
3913 3216560 2679117 2428875 2840902 2797029 2794824 2511523 2415908 2877389 3311340 2526743
3903 2526743 2512725 2797896 2316547 2402358 2772354 1972015 2323241 2611158 1803314 2832826
3893 2832826 2708906 2698346 2195376 2826902 2443770 2522692 2322806 2508748 2379924 1515082
3883 1515082 2868196 2767628 2224837 2986743 2277353 2895701 2318539 2707298 1304958
3874 1304958 2479831 2541513 3009100 1834903 1401201 2148881 1640312 2306847 2970558
3865 2970558 1916276 2718028 1894004 1810231 2619877 1371748 2157285 2685349 898457
3856 898457 1487002 1875620 1693511 1690210 1745191 1670626 1642440 1860716 1572311 1504889 1886904
$$ packed form
3923C028331P1576m49109K82448l4766l05690P00279p86010O78804k54331K85028
3913C216560n37443k50242M12027m3873k205k83301r5615M61481M33951p84597
3903B526743j4018K85171m81349Q5811L69996q00339L51226K87917q07844J029512
3893B832826j23920j0560n02970O31526l83132P8922j99886J85942j28824q64842
3883A515082J353114j00568n42791P61906p09390O18348n77162L88759j402340
3874A304958J174873O1682M67587j174197m33702P47680n08569O66535O63711
3865B970558j054282Q01752q24024q3773Q09646j248129P85537N28064j786892
3856H98457N88545L88618j82109l301N4981p4565k8186K18276k88405o7422L82015
$$ plain form
3845 1886904 2265904 1650465 2317856 1692669 1583011 1671587 1050298 2069675 1503030 1643149
3835 1643149 2274291 2305652 1327511 1729023 2163332 2425037 1528871 2273569 1936262 2464823
3825 2464823 2274422 2242183 1591383 2383406 2269087 2510992 2471720 2433653 1739493 1544499
3815 1544499 2255961 1389013 1796075 1638985 1866034 1309955 2180934 1952565 1642574 2562105
3805 2562105 1928961 1247992 1756772 1725897 2454693 1691319 1324669 2195859 1222326 1670335
3795 1670335 1272458 2145826 1987955 2095215 1544559 1266552 1358114 1289407 2047762 2045591
3785 2045591 1615938 1470312 935305 2089679 1444446 1858608 1796933 1969159 1324746 2054368
3775 2054368 1849942 1965414 1210456 1553626 1885544 1688689 2001878 1597413 1844002 1274573
$$ packed form
3845A886904L79000o15439O67391o25187j09658Q8576o21289J019377n66645J40119
3835A643149O31142L1361r78141M01512M34309K61705q96166P44698l37307N28561
3825B464823j90401l2239o50800P92023j14319K41905l9272l8067o94160j94994
3815A544499P11462q66948M07062j57090K27049n56079Q70979k28369l09991R19531
3805B562105o33144o80969N08780l0875P28796p63374l66650Q71190r73533M48009
3795A670335l97877Q73368j57871J07260n50656k78007R1562o8707P58355k171
3785B045591m29653j45626n35007J154374o45233M14162o1675J72226o44413P29622
3775B054368k04426J15472p54958L43170L31918j96855L13189m04465K46589n69429
$$ plain form
3765 1274573 902949 1345720 1164638 1736686 559167 1076951 908257 1931102 1613879
3756 1613879 1622585 1884311 849935 1336998 1861005 1418374 2144914 762741 1949502
3747 1949502 1600535 1065520 799947 1956290 2196970 2080362 929840 1851351 2280173
3738 2280173 1381865 2025018 2639024 1271454 1779643 1847782 1858671 2282284 1551614 1468984
3728 1468984 2359646 1479784 1995711 1726954 1863499 819361 2237223 1664700 2026623
3719 2026623 2142378 1548425 1244954 1970865 2074779 1194572 1768130 673647 1153883
3710 1153883 866314 862943 1593734 1965339 1259834 1641267 1222628 1676280 932558 1251951
3700 1251951 1838663 791636 1342690 992404 1904785 1265968 1543058 1144550 1544661
$$ packed form
3765A274573l71624M42771j81082N72048j177519N17784j68694J022845l17223
3756A613879Q706K61726j034376M87063N24007m42631P26540j382173J186761
3747A949502l48967n35015k65573J156343K40680j16608j150522R21511M28822
3738B280173q98308O43153O14006j367570N08189O8139J0889M23613p30670q2630
3728A468984Q90662q79862N15927k68757J36545j044138J417862n72523L61923
3719B026623J15755n93953l03471P25911J03914q80207N73558j094483M80236
3710A153883k87569l371P30791L71605p05505L81433m18639M53652p43722L19393
3700A251951N86712j047027N51054l50286R12381o38817K77090l98508M00111
$$ plain form
3691 1544661 1503119 2638004 1793728 1851600 1320529 1115914 1774738 1974055 2307735 1774493
3681 1774493 1035401 1189931 1503687 1965896 1044609 1469785 822207 1288598 1793306 1089881
3671 1089881 1849606 1213250 1125030 563982 1097873 809766 1714659 679432 945762 1818950
3661 1818950 1646613 477321 625459 683467 873212 1155654 700066 667410 600247 1662417
3651 1662417 440738 624022 1774778 1331522 1463143 1358827 1281907 942800 1222951
3642 1222951 1212902 940897 1666179 2100903 1308769 1537257 1633122 1215016 1086683 1509588
3632 1509588 2063791 1137287 2527999 1163199 1167557 1541224 1114161 894930 1380734 2088526
3622 2088526 1196299 1067035 1550380 1601757 1295794 1309751 1150972 1427953 836854 575961
$$ packed form
3691A544661m1542J134885q44276N7872n31071k04615O58824J99317L33680n33242
3681A774493p39092J54530L13756M62209r21287M25176o47578M66391N04708p03425
3671A089881P59725o36356q8220n61048N33891k88107R04893j035227K66330Q73188
3661A818950j72337j169292J48138N8008J89745K82442m55588l2656o7163J062170
3651A662417j221679J83284J150756m43256J31621j04316p6920l39107K80151
3642A222951j0049k72005P25282M34724p92134K28488R5865m18106j28333M22905
3632A509588N54203r26504J390712j364800M358L73667m27063k19231M85804P07792
3622B088526q92227j29264M83345N1377l05963J3957j58779K76981n91099k60893
$$ plain form
3612 575961 1246736 1060964 1124407 722282 1287766 2739834 2090631 1353216 1596503 1711903
3602 1711903 727112 1231113 706081 1185572 1418008 1534733 1137245 1031023 1379028 1159272
3592 1159272 1695038 1664525 1730675 2099807 1353729 1409420 1347438 2051263 1324522 1200454
3582 1200454 517754 1451999 1291019 925171 1585253 1371445 971653 982193 1015008 1660134
3572 1660134 922869 985606 1224251 638201 1129547 1260195 1412338 907598 1888231 1739477
3562 1739477 1569108 2359610 1879054 809107 1261976 2179102 2253867 2581782 2911012 3687199
3552 3687199 3560471 3544336 3589536 3815733 2779129 3161247 2882142 2216515 1614727 2127123
3542 2127123 2260677 1514503 1982129 1042732 3090110 1322012 1628434 1151637 1602609
$$ packed form
3612E75961O70775j85772O3443m02125N65484J452068o49203p37415K43287J15400
3602A711903r84791N04001n25032M79491K32436J16725l97488j06222L48005k19756
3592A159272N35766l0513O6150L69132p46078N5691o1982P03825p26741j24068
3582A200454o82700R34245j60980l65848O60082k13808l99792J0540L2815O45126
3572A660134p37265O2737K38645n86050M91346J30648J52143n04740R80633j48754
3562A739477j70369P90502m80556j069947M52869R17126P4765L27915L29230P76187
3552C687199j26728j6135M5200K26197j036604L82118k79105o65627o01788N12396
3542B127123J33554p46174M67626r39397K047378j768098L06422m76797M50972
$$ plain form
3533 1602609 1643125 1140949 842654 1551320 1850980 1020749 1271008 1281892 1554010 1478055
3523 1478055 1454456 1383679 1012184 1458663 720567 1020811 1513160 693699 536085 1684112
3513 1684112 2003235 970149 1536676 1606946 1240724 706829 1826757 1018052 638540
3504 638540 1696258 1271283 1116103 842619 1217841 1598502 1431089 1333789 754775 1209326
3494 1209326 1488066 1161869 1611105 1767865 1627999 1145943 1083049 1194259 1434892 1533082
3484 1533082 1596962 1495967 1173364 1579028 1224438 897822 1009825 936309 1509679 642161
3474 642161 726889 1878186 1165835 1685366 1964547 1299854 1541774 1968766 1348031 1797150
3464 1797150 1052108 1816639 1089482 1895268 1484127 1762403 1361873 1915486 1773989 2359690
$$ packed form
3533A602609M0516n02176k98295P08666K99660q30231K50259J0884K72118p5955
3523A478055k3599p0777l71495M46479p38096L00244M92349q19461j57614J148027
3513A684112L19123j033086N66527P0270l66222n33895J119928q08705l79512
3504F38540J057718m24975j55180k73484L75222L80661j67413r7300n79014M54551
3494A209326K78740l26197M49236J56760j39866m82056o2894J11210K40633R8190
3484A533082O3880j00995l22603M05664l54590l26616J12003p3516N73370q67518
3474F42161Q4728J151297p12351N19531K79181o64693K41920M26992o20735M49119
3464A797150p45042P64531p27157Q05786m11141K78276m00530N53613j41497N85701
$$ plain form
3454 2359690 1705249 1740043 1639133 1866785 2023267 1987340 1295468 1271099 2031402 2109037
3444 2109037 1921144 1167350 2280829 1398620 2460714 1212067 1489201 1631849 1802273
3435 1802273 3273431 1978075 2368867 1760395 1387279 1816967 2072643 2099604 2357382
3426 2357382 1612475 2030356 2014858 1575564 1704533 1982167 2439505 2089003 2547166 2081818
3416 2081818 2132423 2719428 1815561 2907580 2081961 3464980 2090124 2053676 3379832
3407 3379832 2421684 2838954 2691286 2484853 1899985 2508525 2505241 2557841 2672192 2514688
3397 2514688 3500851 3402784 2449725 2743904 2399688 3518690 3112083 3739507 3639943 3614205
3387 3614205 2997485 3721611 2915409 3845135 3146498 4115833 2793883 4250641 3928674
$$ packed form
3454B359690o54441L4794j00910K27652J56482l5927o91872k4369P60303P7635
3444B109037j87893p53794J113479q82209J062094j248647K77134J42648J70424
3435A802273J471158j295356L90792o08472l73116M29688K55676K6961K57778
3426B357382p44907M17881j5498m39294J28969K77634M57338l50502M58163m65348
3416B081818N0605N87005r03867J092019q25619J383019j374856l6448J326156
3407C379832r58148M17270j47668k06433n84868O08540l284N2600J14351j57504
3397B514688R86163r8067r53059K94179l44216J119002m06607O27424r9564k5738
3387C614205o16720P24126q06202R29726o98637R69335j321950J456758l21967
$$ plain form
3378 3928674 3748151 4277655 3491125 4079386 3243946 3950752 3159882 3599821 5538127
3369 5538127 5081355 4819472 4645233 5177707 5529085 5753486 5522817 5956537 6647679 5542630
3359 5542630 5601610 6487624 6741127 7045664 6996345 7107235 6770796 7176037 7028931 7888897
3349 7888897 8178488 8561347 8349286 8588990 9557345 9330862 8973152 9897334 9454723 10632088
3339 10632088 11526442 12360948 14024117 17185760 21355664 26217726 30581488 34285062
3331 34285062 37894567 40616772 41822154 45341301 50252222 58065645 68538958 86857211
3323 86857211 129796254 225133058 351253325 455842605 495928949 489532827 457753156
3316 457753156 385827527 341474745 290376104 234498515 175992218 131234214 104002384
$$ packed form
3378C928674j80523N29504p86530N88261q35440P06806p90870M39939J938306
3369E538127m56772k61883j74239N32474L51378K24401k30669M33720O91142j105049
3359E542630N8980Q86014K53503L04537m9319J10890l36439M05241j47106Q59966
3349G888897K89591L82859k12061K39704R68355k26483l57710R24182m42611J177365
3339A0632088Q94354Q34506J663169L161643M169904M862062M363762L703574
3331C4285062L609505K722205J205382L519147M910921P813423J0473313J8318253
3323H6857211M2939043R5336804J26120267J04589280M0086344o396122l1779671
3316D57753156p1925629m4352782n1098641n5877589n8506297m4758004k7231830
$$ plain form
3309 104002384 89278454 81331634 73929572 68362196 59955784 55526047 49723015 44296135
3301 44296135 39006453 37014682 33920084 31563497 28960651 28036388 27784195 25621608
3293 25621608 24502197 23628095 23097851 22375695 21417080 20430358 19869166 19524947 19982090
3284 19982090 19428204 18149756 17396394 16845323 16378985 16739514 15416283 15876287 14553345
3275 14553345 15236378 14478153 13841923 13698508 12614627 12453456 13012815 11687276 11415222
3266 11415222 11499217 11460991 11971085 11210294 11131324 11072125 11176486 10369320 9085987 9262972
3256 9262972 9826493 9779799 9620960 9975562 8953373 8944145 9101423 8417334 8812057 8105924
3246 8105924 7501089 7616678 7906270 7663453 7049453 6996410 7796658 6229628 6728836 6191912
$$ packed form
3309A04002384j4723930p946820p402062n567376q406412m429737n803032n426880
3301D4296135n289682j991771l094598k356587k602846r24263k52193k162587
3293B5621608j119411q74102n30244p22156r58615r86722n61192l44219M57143
3284A9982090n53886j278448p53362n51071m66338L60529j323231M60004j322942
3275A4553345O83033p58225o36230j43415j083881j61171N59359j325539k72054
3266A1415222Q3995l8226N10094p60791p8970n9199J04361q07166j283333J76985
3256I262972N63521m6694j58839L54602j022189r228J57278o84089L94723p06133
3246H105924o04835J15589K89592k42817o14000n3043Q00248j567030M99208n36924
$$ plain form
3236 6191912 6656075 6265768 6411882 7023874 5675390 6969033 5849512 5682482 5677335
3227 5677335 5260989 6046265 5912612 5404561 5699195 4534390 5235903 4453992 5104789
3218 5104789 5925647 4487446 5284229 5789025 5282684 4902521 5226220 4918348 4292692
3209 4292692 4560162 4351210 5058592 5372097 4748117 4553039 4673571 4745659 4569324 4179457
3199 4179457 3746865 4450733 4108898 3723193 4722350 3915278 3297951 3743468 3626017 3690871
3189 3690871 4214094 3251575 3616151 3736814 3724050 3631055 4329184 3438103 3283358 4090038
3179 4090038 3573682 3637725 2411818 3918109 3890754 3017112 3770344 3512384 2977912 3078342
3169 3078342 2594634 2662011 3111800 2593490 2787267 2575704 3009446 3009579 1887067 2517308
$$ packed form
3236F191912M64163l90307J46114O11992j348484J293643j119521j67030n147
3227E677335m16346P85276j33653n08051K94634j164805P01513p81911O50797
3218E104789Q20858j438201P96783N04796n06341l80163L23699l07872o25656
3209D292692K67470k08952P07382L13505o23980j95078J20532P2088j76335l89867
3199D179457m32592P03868l41835l85705R99157q07072o17327M45517j17451O4854
3189C690871N23223r62519L64576J20663j2764r2995O98129q91081j54745Q06680
3179D090038n16356O4043j225907J506291k7355q73642P53232k57960n34472J00430
3169C078342m83708O7377M49789n18310J93777k11563M33742J33j122512O30241
$$ plain form
3159 2517308 2048253 2695972 3338571 2305886 2761502 2767219 3162378 3118365 2804158 2173928
3149 2173928 2795960 2038028 3107813 2651835 1929480 2609540 3500432 2304280 1575273
3140 1575273 2257381 2980178 2702789 2817309 3067869 2335919 2733941 1522650 2828058
3131 2828058 1845158 2452938 2756356 2790151 1891975 1888110 2255522 2492317 2992935 2031736
3121 2031736 1770399 2686399 2520715 2647368 2605327 2258969 3388145 2547282 2653848 2821039
3111 2821039 1891404 2034512 2073096 2126502 2571893 1969461 2562544 2239150 2575059 1617256
3101 1617256 2115575 2275265 2031466 3029047 2624729 3153793 2221982 2543925 1927910 2451178
3091 2451178 2472154 2772069 3034185 3306722 3518090 3015947 3614160 4455502 4410198 4219921
$$ packed form
3159B517308m69055O47719O42599j032685M55616N717L95159m4013l14207o30230
3149B173928O22032p57932J069785m55978p22355O80060Q90892j196152p29007
3140A575273O82108P22797k77389J14520K50560p31950L98022j211291J305408
3131B828058r82900O07780L03418L3795q98176l865L67412K36795N00618r61199
3121B031736k61337R16000j65684J26653m2041l46358J129176q40863J06566J67191
3111B821039r29635J43108L8584N3406M45391o02432N93083l23394L35909r57803
3101A617256M98319J59690k43799R97581m04318N29064r31811L21943o16015N23268
3091B451178K0976K99915K62116K72537K11368n02143N98213Q41342m5304j90277
$$ plain form
3081 4219921 4079009 3207165 4106860 2909008 2902065 2084983 2474472 2178578 1948295 1857406
3071 1857406 2295399 2547275 2540601 1407306 2501860 2632734 2416301 1822820 1579590 2104404
3061 2104404 1460776 2318329 1895310 1503224 2466898 1377204 1354245 2246007 1796201 1696736
3051 1696736 2054563 1051956 1622149 2424456 1071612 1692227 1553444 2681608 1010273
3042 1010273 1726779 1803130 2843623 2055628 2224747 2454729 2082984 1323996 1965556 2099527
3032 2099527 1846427 1209968 1665856 2429905 1676195 1997116 2061922 2053441 1947194 2283450
3022 2283450 1828660 2093322 3121384 1613437 1152357 2097488 1914438 1450415 720838
3013 720838 1270413 1965160 1341693 1587089 1508296 1310016 2463298 1940294 1073527 2224169
$$ packed form
3081D219921j40912q71844Q99695j197852o943q17082L89489k95894k30283r0889
3071A857406M37993K51876o674j133295J094554J30874k16433n93481k43230N24814
3061B104404o43628Q57553m23019l92086R63674j089694k2959Q91762m49806r9465
3051A696736L57827j002607N70193Q02307j352844O20615j38783J128164j671335
3042A010273P16506P6351J040493p87995J69119K29982l71745p58988O41560J33971
3032B099527k53100o36459M55888P64049p53710L20921O4806q481j06247L36256
3022B283450m54790K64662J028062j507947m61080R45131j83050m64023p29577
3013G20838N49575O94747o23467K45396p8793j98280J153282n23004q66767J150642
$$ plain form
3003 2224169 1132048 1420264 1700011 1251031 1612431 1732180 1295908 2021051 881383
2994 881383 1958867 1500245 1712324 1572481 2187164 1721612 1810843 1430941 1504302 1812402
2984 1812402 1394390 1509025 1766538 1708932 1392700 1549933 1403701 1395323 1672536 2727846
2974 2727846 1412839 1126645 2404011 1467726 1093794 1567538 1008737 842410 806726
2965 806726 1260981 926178 1255826 937499 1805352 1731845 867125 1181369 712811 1786463
2955 1786463 1587216 279452 1292445 1278650 2125457 1416569 786010 1519078 1133198
2946 1133198 2115209 1560464 1115952 1127534 1333698 1495137 1632858 1211313 1587152 1000295
2936 1000295 1802055 1684868 1261472 1676101 1343058 1850410 1280554 1757451 703817
$$ packed form
3003B224169j092121K88216K79747m48980L61400J19749m36272P25143j139668
2994H81383J077484m58622K12079j39843O14683m65552Q9231l79902P3361L08100
2984A812402m18012J14635K57513n7606l16232J57233j46232q378K77213J055310
2974B727846j315007k86194J277366r36285l73932M73744n58801j66327l5684
2965H06726M54255l34803L29648l18327Q67853p3507q64720L14244m68558J073652
2955A786463j99247j307764J012993j3795Q46807p08888o30559P33068l85880
2946A133198R82011n54745m44512J1582K06164J61439J37721m21545L75839n86857
2936A000295Q01760j17187m23396M14629l33043N07352n69856M76897j053634
$$ plain form
2927 703817 1283934 1173940 1929830 1886734 1457205 1684846 1536625 921222 2047873 1605759
2917 1605759 1403820 1962131 2483191 799891 399476 1603307 1339993 1243044 2095621
2908 2095621 1293908 667352 505396 1830535 1505039 2040143 1602607 1894588 923461
2899 923461 1797039 1444107 1777545 984804 1764074 1865427 1250164 966095 1419428 567500
2889 567500 1667784 1321510 1975579 1874612 1178862 1576635 1861464 993264 1972341 1933921
2879 1933921 1238165 574855 2336354 1059633 2086772 614356 1554178 1103518 1294000
2870 1294000 1446339 804111 1682011 1042891 1802916 1253527 908651 713499 613533 1272118
2860 1272118 1948863 1190460 871893 1836129 1352078 742300 1247372 1076777 920160 1049524
$$ packed form
2927G03817N80117j09994P55890m3096m29529K27641j48221o15403J126651m42114
2917A605759k01939N58311N21060j683300m00415J203831k63314r6949Q52577
2908B095621q01713o26556j61956J325139l25496N35104m37536K91981r71127
2899I23461Q73578l52932L33438p92741P79270J01353o15263k84069M53333q51928
2889E67500J100284l46274O54069j00967o95750L97773K84829q68200R79077l8420
2879A933921o95756o63310J761499j276721J027139j472416R39822m50660J90482
2870A294000J52339o42228Q77900o39120P60025n49389l44876j95152r9966O58585
2860A272118O76745p58403l18567R64236m84051o09778N05072j70595j56617J29364
$$ plain form
2850 1049524 1284747 1308035 387882 1196949 1419233 1055268 1019652 934695 985385 1620689
2840 1620689 798116 1348101 1524009 1229191 1119546 1694727 1669345 1629480 1720056 1797112
2830 1797112 1772549 1107409 1202285 1555427 1398579 1086380 1928708 1530930 1649507 1118525
2820 1118525 2546937 1573953 1343001 1428399 1993603 2288758 1286797 702589 1802787
2811 1802787 1441673 1601787 1493913 1383404 814292 2069260 1401211 1682672 1632665 1359824
2801 1359824 600764 805433 1120163 1306663 159148 1966974 1445164 1212083 1706112
2792 1706112 1620673 991928 1270530 1044976 1568662 1365684 1828620 1598057 1179903 1067309
2782 1067309 1650043 1036735 1180981 1132704 813136 1219370 1160505 1554613 1491571 613872
$$ packed form
2850A049524K35223K3288r20153Q09067K22284l63965l5616q4957N0690O35304
2840A620689q22573N49985J75908k94818j09645N75181k5382l9865R0576P7056
2830A797112k4563o65140R4876L53142j56848l12199Q42328l97778J18577n30982
2820A118525J428412r72984k30952Q5398N65204K95155j001961n84208J100198
2811A802787l61114J60114j07874j10509n69112J254968o68049K81461n0007k72841
2801A359824p59060K04669L14730J86500j147515J807826n21810k33081M94029
2792A706112q5439o28745K78602k25554N23686k02978M62936k30563m18154j12594
2782A067309N82734o13308J44246m8277l19568M06234n8865L94108o3042q77699
$$ plain form
2772 613872 1182984 869295 1577102 842403 1712981 910603 1691107 666216 547130 1426939
2762 1426939 1254512 1287081 686970 1162015 362144 937158 2226319 1054913 951297
2753 951297 1384718 908936 1265751 1255179 1689273 2208686 1793168 2396760 2215767 1292654
2743 1292654 1576263 1201366 1638461 1433505 759323 1724487 1620318 1254372 1953087 1415537
2733 1415537 1328260 1032063 2109883 1900531 967563 1932696 676729 1186710 1991908
2724 1991908 1610214 1723350 1295978 1066699 1583433 938020 915197 1560049 1798609 1365105
2714 1365105 901232 1204928 1435076 1036503 800791 1489977 316358 1120507 1048252 717715
2704 717715 1864044 593569 712162 1527719 1080124 469842 1213790 1446804 1059275
$$ packed form
2772F13872N69112l13689P07807p34699Q70578q02378P80504j024891j19086Q79809
2762A426939j72427L2569o00111M75045p99871N75014J289161j171406j03616
2753I51297M33421m75782L56815j0572M34094N19413m15518O03592j80993r23113
2743A292654K83609l74897M37095k04956o74182R65164j04169l65946O98715n37550
2733A415537q7277k96197J077820k09352r32968R65133j255967N09981Q05198
2724A991908l81694J13136m27372k29279N16734o45413k2823O44852K38560m33504
2714A365105m63873L03696K30148l98573k35712O89186j173619Q04149p2255l30537
2704G17715J146329j270475J18593Q15557m47595o10282P43948K33014l87529
$$ plain form
2695 1059275 1189527 1550967 2399229 1714093 2019468 600396 1170330 1784438 1811355 968998
2685 968998 1638673 696082 928351 1076343 1428703 1327533 1299193 1284925 1206631 874862
2675 874862 323672 1591771 984061 1608749 1133034 1534905 1640439 1644274 1326522 262599
2665 262599 899619 2410 817398 2011910 852999 1210156 1170533 1137436 1271051 1450134
2655 1450134 1871437 1560539 1048858 1248730 1251706 1468542 1130920 956451 1316980 1260010
2645 1260010 1238075 1709834 1054974 1449144 351939 1751968 1815660 1411606 644103 704404
2635 704404 1632959 744755 714687 827553 877647 1231732 1686556 1057788 1417834 1356431
2625 1356431 1021023 1243730 1575657 891775 1419995 163257 1122241 947698 848905 1776094
$$ packed form
2695A059275J30252L61440Q48262o85136L05375j419072N69934O14108K6917q42357
2685I68998O69675r42591K32269J47992L52360j01170k8340j4268p8294l31769
2675H74862n51190J268099o07710O24688m75715M01871J05534L835l17752j063923
2665B62599O37020q97209Q14988J194512j158911L57157l9623l3097J33615J79083
2655A450134M21303l10898n11681J99872K976K16836l37622j74469L60529n6970
2645A260010k1935M71759o54860L94170j097205J400029O3692m04054p67503O0301
2635G04404R28555q88204l0068J12866N0094L54085M54824o28768L60046o1403
2625A356431l35408K22707L31927o83882N28220j256738R58984j74543r8793R27189
$$ plain form
2615 1776094 783409 1240228 849087 1393223 1023715 552166 1812340 1131968 916911
2606 916911 205293 1135513 1865169 1596152 1039456 1902710 973158 1207511 749472 1052054
2596 1052054 1397119 848284 657860 1020061 750565 1149607 1051406 1168807 1540961 1790431
2586 1790431 750405 1008869 1432386 1093583 882927 812117 900646 896358 1279748 1056191
2576 1056191 1092153 1059935 1282414 1505664 919964 1487290 1149667 1001712 1108939 710679
2566 710679 508690 1371036 917755 1142897 1087059 1417721 831921 1497430 961351 668406
2556 668406 809672 646216 1358239 1450181 1709734 618960 872879 1282734 1519452 1227279
2546 1227279 482144 204065 908698 1151126 442512 616480 1007293 1655444 973713 485628
$$ packed form
2615A776094r92685M56819l91141N44136l69508m71549J260174o80372k15057
2606I16911p11618R30220P29656k69017n56696Q63254r29552K34353m58039L02582
2596A052054L45065n48835j90424L62201k69496L99042r8201J17401L72154K49470
2586A790431j040026K58464M23517l38803k10656p0810Q8529m288L83390k23557
2576A056191L5962l2218K22479K23250n85700N67326l37623j47955J07227l98260
2566G10679k01989Q62346m53281K25142n5838L30662n85800O65509n36079k92945
2556F68406J41266j63456P12023R1942K59553j090774K53919M09855K36718k92173
2546A227279p45135k78079P04633K42428p08614J73968L90813O48151o81731m88085
$$ plain form
2536 485628 946641 1414423 1283110 981751 1083418 995549 1133743 571334 1107462 231117
2526 231117 719845 562519 431396 1521892 1666979 1417080 662398 837288 859736 1677921
2516 1677921 1066628 971303 1298715 924188 668293 104631 532977 577324 1382899 1444828
2506 1444828 1254730 1256081 610452 854435 785883 952550 1374044 903218 1860027 578071
2496 578071 905126 357423 308905 1237680 1415553 1009098 1126070 1082122 631399 152979
2486 152979 1431883 1293186 939571 1567624 860490 1298595 1782759 423407 309500
2477 309500 1566126 690832 831421 1287582 1348437 1024187 833558 886805 923693 256696
2467 256696 879776 750698 339503 715926 431672 1116390 1182873 1040317 880383 847146
$$ packed form
2536D85628M61013M67782j31313l01359J01667q7869J38194n62409N36128q76345
2526B31117M88728j57326j31123J090496J45087k49899p54682J74890K2448Q18185
2516A677921o11293r5325L27412l74527k55895n63662M28346M4347Q05575O1929
2506A444828j90098J351o45629K43983o8552J66667M21494m70826R56809j281956
2496E78071L27055n47703m8518R28775J77873m06455J16972m3948m50723m78420
2486A52979J278904j38697l53615O28053p07134M38105M84164j359352j13907
2477C09500J256626q75294J40589M56161O0855l24250j90629N3247L6888o66997
2467B56696O23080j29078m11195L76423k84254O84718O6483j42556j59934l3237
$$ plain form
2457 847146 1586128 1353654 828456 891000 656178 925177 575637 1902972 844794 795426
2447 795426 577471 1085570 1818193 733114 1374602 458627 1391626 1504464 865989 1299712
2437 1299712 704633 1095293 771383 1556803 998933 761048 1374182 1087080 441845 1056152
2427 1056152 1085303 795027 542832 849800 1591737 1448464 647905 898250 1425064 761533
2417 761533 423388 970890 791635 584959 549474 599307 563310 1120964 699696 954634
2407 954634 678325 753821 441216 1116427 1070202 1611067 782832 862250 1384945 919360
2397 919360 374475 1772602 536484 512577 1115166 1170214 1117900 402907 594582 1129234
2387 1129234 969678 1175990 436531 819776 588251 588123 642900 650266 869371 1212942 1452767
$$ packed form
2457H47146P38982k32474n25198O2544k34822K68999l49540J327335j058178m9368
2447G95426k17955N08099P32623j085079O41488r15975R32999J12838o38475M33723
2437A299712n95079L90660l23910P85420n57870k37885O13134k87102o45235O14307
2427A056152K9151k90276k52195L06968P41937j43273q00559K50345N26814o63531
2417G61533l38145N47502j79255k06676l5485M9833l5997N57654m21268K54938
2407I54634k76309P5496l12605O75211m6225N40865q28235P9418N22695m65585
2397I19360n44885J398127j236118k3907O02589N5048n2314p14993J91675N34652
2387A129234j59556K06312p39459L83245k31525j28N4777P366K19105L43571K39825
$$ plain form
2376 1452767 563138 764659 918868 1845224 852107 716221 1056634 456026 1230613 1495882
2366 1495882 630621 1791577 1123749 800435 753292 850410 780751 623452 807250 1008637
2356 1008637 434034 145376 984632 1292774 1297898 836798 758590 1133115 879265 310606
2346 310606 1285377 1417924 956230 822174 1032121 522587 733707 293248 234075 932430
2336 932430 1324286 775313 1032738 833061 1220558 1148177 683372 895422 1200397 1102885
2326 1102885 777888 1287880 1060940 1143217 1023538 1355019 762445 1192599 947932 1299010
2316 1299010 825676 1124885 1388408 1089593 1062717 1336398 695811 487620 988911 1037568
2306 1037568 1082706 1027340 1348811 1742969 1170295 1355377 145169 381304 1617073 1074823
$$ packed form
2376A452767q89629K01521J54209R26356r93117j35886L40413o00608P74587K65269
2366A495882q65261J160956o67828l23314m7143R7118o9659j57299J83798K01387
2356A008637n74603k88658Q39256L08142N124m61100p8208L74525k53850n68659
2346C10606R74771J32547m61694j34056K09947n09534K11120m40459n9173O98355
2336I32430L91856n48973K57425j99677L87497p2381m64805K12050L04975r7512
2326A102885l24997N09992k26940Q2277j19679L31481n92574M30154k44667L51078
2316A299010m73334K99209K63523k98815k6876K73681o40587k08191N01291M8657
2306A037568M5138n5366L21471L94158n72674J85082j210208K36135J235769n42250
$$ plain form
2296 1074823 1482446 164846 1044942 809477 1300422 578006 1349795 910427 1361451
2287 1361451 407776 1291886 574180 631967 1237941 1368247 750647 872887 950163 1422408
2277 1422408 422078 1564663 930189 830586 1186248 1456728 1637788 1502711 911080
2268 911080 992032 990350 624284 813404 1083069 1425398 787578 1204360 1277914 1224532 1027312
2257 1027312 934489 1313703 986823 470661 758471 773040 580416 1064465 552961 1077092
2247 1077092 1533892 1230930 1024444 275211 563320 588502 1155724 884631 480038 1292309
2237 1292309 790494 837517 961985 1202268 657131 767743 1078584 1304079 801305 776612
2227 776612 1396696 1569352 1156830 1425886 1987647 775710 740067 1482394 1586430 1099516
$$ packed form
2296A074823M07623j317600Q80096k35465M90945p22416P71789m39368M51024
2287A361451r53675Q84110p17706N7787O05974J30306o17600J22240P7276M72245
2277A422408j000330J142585o34474r9603L55662K70480J81060j35077n91631
2268I11080Q0952j682l66066J89120K69665L42329o37820M16782P3554n3382j97220
2257A027312r2823L79214l26880n16162K87810J4569j92624M84049n11504N24131
2247A077092M56800l02962k06486p49233K88109K5182N67222k71093m04593Q12271
2237A292309n01815M7023J24468K40283n45137J10612L10841K25495n02774k4693
2227G76612O20084J72656m12522K69056N61761j211937l5643P42327J04036m86914
$$ plain form
2217 1099516 1285760 537532 356380 1690325 589234 1096704 1100497 1570084 971505 455168
2207 455168 781997 1744405 1793285 1028765 914068 -228331 1342848 641257 691365 830490
2197 830490 617045 379946 24167 420882 985911 333534 990485 1022883 423052 646742
2187 646742 404707 672222 915259 1453388 1566038 734586 1436794 1088843 1043099 985716
2177 985716 621375 816185 1012535 1352055 814036 1114885 1902306 844467 1653658 1462509
2167 1462509 934350 867156 1163110 961077 581797 -44347 877922 953411 849286 4963
2157 4963 698232 1116306 268172 661740 1445337 606287 422753 1167482 1346838 466653
2147 466653 530761 1154003 881427 978721 257353 22963 626337 1600815 569347 658618
$$ packed form
2217A099516J86244p48228j81152J333945j101091N07470L793M69587n98579n16337
2207D55168L26829R62408M8880p64520j14697j142399J571179p01591N0108J39125
2197H30490k13445k37099l55779L96715N65029o52377O56951L2398n99831K23690
2187F46742k42035K67515K43037N38129J12650q31452P02208l47951m5744n7383
2177I85716l64341J94810J96350L39520n38019L00849P87421j057839Q09191j91149
2167A462509n28159o7194K95954k02033l79280o26144R22269P5489j04125q44323
2157D963O93269M18074q48134L93568P83597q39050j83534P44729J79356q80185
2147D66653O4108O23242k72576R7294p21368k34390O03374R74478j031468Q9271
$$ plain form
2137 658618 1158934 360905 858678 984501 1187656 1415128 1658502 746000 749281 1699297
2127 1699297 66008 1278463 1692669 1156972 1451645 402515 2261254 1045823 280935
2118 280935 936112 899744 1103520 863912 876114 757939 741250 1082506 1654729 964021
2108 964021 873583 559315 1141495 842246 675659 1016092 719446 640233 612558 312042
2098 312042 1790991 392613 547019 729547 642669 1033907 1259164 560394 672181 1125105
2088 1125105 407392 1605481 523273 720579 17782 688477 1042321 760413 715764
2079 715764 1069874 795938 953139 432523 764056 425262 988769 930559 707469 329346
2069 329346 300569 753146 1245301 1491493 1008623 956778 627587 811001 1253563 1125127
$$ packed form
2137F58618N00316p98029M97773J25823K03155K27472K43374r12502L281R50016
2127A699297j633289J212455M14206n35697K94673j049130J858739j215431p64888
2118B80935O55177l6368K03776k39608J2202j18175j6689L41256N72223o90708
2108I64021r0438l14268N82180k99249j66587L40433k96646p9213k7675l00516
2098C12042J478949j398378J54406J82528q6878L91238K25257o98770J11787M52924
2088A125105p17713J198089j082208J97306p02797O70695L53844k81908m4649
2079G15764L54110k73936J57201n20616L31533l38794N63507n8210k23090l78123
2069C29346k8777M52577M92155K46192m82870n1845l29191J83414M42562j28436
$$ plain form
2059 1125127 978668 1564132 677882 315761 513926 300894 887750 1258308 600473 971201
2049 971201 799250 1261838 1420625 722180 1226055 1484110 526082 1095821 1495490 940958
2039 940958 1036942 1075759 764972 1602883 1195214 800775 723234 1375332 1249519 1277292
2029 1277292 1302304 756611 1360095 920826 513288 565087 1624950 1109832 1284839 1278591
2019 1278591 911894 728153 1257834 1495104 844822 1460133 596363 602897 901459 530177
2009 530177 607659 312321 1319186 416955 936342 358368 1002017 279405 261391 1307747
1999 1307747 825434 765869 931991 642004 714175 -62019 661176 484159 734691 571404
1989 571404 800483 211569 557815 1354142 1717785 615158 127061 1427398 1361589 432378
$$ packed form
2059A125127j46459N85464q86250l62121J98165k13032N86856L70558o57835L70728
2049I71201j71951M62588J58787o98445N03875K58055r58028N69739L99669n54532
2039I40958R5984L8817l10787Q37911m07669l94439p7541O52098j25813K7773
2029A277292K5012n45693O03484m39269m07538N1799J059863n15118J75007o248
2019A278591l66697j83741N29681K37270o50282O15311q63770O534K98562l71282
2009E30177P7482k95338J006865r02231N19387n77974O43649p22612j8014J046356
1999A307747m82313n9565J66122k89987P2171p76194P23195j77017K50532j63287
1989E71404K29079n88914L46246P96327L63643j102627m88097J300337o5809r29211
$$ plain form
1979 432378 1121522 725663 1040748 218871 982279 934307 469764 949240 1113865 1366094
1969 1366094 638366 494950 314622 1548329 783867 -59396 995795 854019 1640751
1960 1640751 518071 249086 973230 514646 1146126 993933 1268463 597117 341101
1951 341101 724118 745982 855313 791182 751521 679532 529403 761411 877882 445317
1941 445317 890681 609942 756585 1323437 557267 488846 1228384 728438 1058127 751416
1931 751416 909246 1188678 881086 1165603 877113 570711 1046886 815157 1073443 1008936
1921 1008936 525026 720475 1090704 1082244 270637 -169677 615884 1908094 1218276 309314
1911 309314 991518 1586854 705702 1156426 1059797 906921 830200 203731 819112 517444
$$ packed form
1979D32378O89144l95859L15085q21877P63408m7972m64543M79476J64625K52229
1969A366094p27728j43416j80328J233707p64462q43263J055191j41776P86732
1960A640751j122680k68985P24144m58584O31480j52193K74530o71346k56016
1951C41101L83017K1864J09331o4131l9661p1989j50129K32008J16471m32565
1941D45317M45364k80739J46643N66852p66170o8421P39538m99946L29689l06711
1931G51416J57830K79432l07592K84517k88490l06402M76175k31729K58286o4507
1921A008936m83910J95449L70229q460q11607m40314P85561J292210o89818r08962
1911C09314O82204N95336q81152M50724r6629j52876p6721o26469O15381l01668
$$ plain form
1901 517444 602790 848500 405105 1111734 790916 792377 855809 740785 1058038 1277888
1891 1277888 1145300 772845 777038 458163 220123 430628 495278 192505 739508 634404
1881 634404 1088738 513217 393224 372116 242807 548823 344948 366959 127854 799068
1871 799068 984395 886030 1235190 837341 925552 58860 723951 382496 920175 206133
1861 206133 694516 1344347 83809 854216 901313 201747 546115 397429 915553 670575
1851 670575 351461 73310 -121621 403793 937391 932239 944188 951757 841517 729744 1454186
1840 1454186 1111723 1382397 424336 356877 384601 1127870 687589 979286 66550 89080
1830 89080 457969 1325657 795055 898895 870088 738717 928281 1225841 1011496 1738243
$$ packed form
1901E17444Q5346K45710m43395P06629l20818J461O3432j15024L17253K19850
1891A277888j32588l72455M193l18875k38040K10505O4650l02773N47003j05104
1881F34404M54334n75521j19993k1108j29309L06016k03875K2011k39105O71214
1871G99068J85327r8365L49160l97849Q8211q66692O65091l41455N37679p14042
1861B06133M88383O49831j260538P70407M7097o99566L44368j48686N18124k44978
1851F70575l19114k78151j94931N25414N33598n152J1949P569j10240j11773P24442
1840A454186l42463K70674r58061o7459K7724P43269m40281K91697r12736K2530
1830H9080L68889Q67688n30602J03840k8807j31371J89564K97560k14345P26747
$$ plain form
1820 1738243 301261 113457 562239 1354657 795494 760331 352699 965920 1053522 1058328
1810 1058328 594192 449182 1078929 223766 948184 877707 664099 538019 764134 891660
1800 891660 900988 861975 1067739 979123 836802 733778 1003505 1665980 698824 960801
1790 960801 1308395 880901 1455531 854035 953281 398612 956448 664219 288531 1202549
1780 1202549 540383 524843 645525 450013 221418 1198122 853604 1033361 615834 1070190
1770 1070190 1011124 630181 325542 119762 506462 -341295 697171 1276542 1372651 1202184
1760 1202184 264174 430860 741489 -157821 265228 1360819 1304190 1636787 815787 390292
1750 390292 1028222 162372 769506 805411 929318 1247921 691393 1097172 1393249 573251
$$ packed form
1820A738243j436982j87804M48782P92418n59163l5163m07632O13221Q7602M806
1810A058328m64136j45010O29747q55163P24418p0477k13608j26080K26115J27526
1800H91660R328l9013K05764q8616j42321j03024K69727O62475r67156K61977
1790I60801L47594m27494N74630o01496R9246n54669N57836k92229l75688R14018
1780A202549o62166j5540J20682j95512k28595R76704l44518J79757m17527M54356
1770A070190n9066l80943l04639k05780L86700q47757J038466N79371R6109j70467
1760A202184r38010J66686L10629q99310M23049J095591n6629L32597q21000m25495
1750C90292O37930q65850O07134L5905J23907L18603n56528M05779K96077q19998
$$ plain form
1740 573251 577268 518499 596061 452499 951327 636786 231364 968961 1293922 818288
1730 818288 54524 1110073 906354 350451 335744 1548362 966779 6410 553855 950196
1720 950196 240128 748316 738947 577705 338469 1162450 672319 892537 707581 629284
1710 629284 488178 20924 236146 371120 440889 381466 652669 126122 -227137 995975
1700 995975 450414 1055168 580729 85080 1304341 1100893 1069076 641072 859244 118203
1690 118203 600766 1400656 1286475 485894 982943 1654859 811606 -19139 1166398 932877
1680 932877 396482 936992 1258071 986795 649609 674505 120792 1112784 530428 668735
1670 668735 584038 1292264 392707 606513 1503543 395258 1073123 353458 -5848 522930
$$ packed form
1740E73251M017n8769P7562j43562M98828l14541m05422P37597L24961m75634
1730H18288p63764J055549k03719n55903j4707J212618n81583r60369N47445L96341
1720I50196p10068N08188r369j61242k39236Q23981m90131K20218j84956p8297
1710F29284j41106m67254K15222J34974O9769n9423K71203n26547l53259J223112
1700I95975n45561O04754m74439m95649J219261k03448l1817m28004K18172p41041
1690A18203M82563P99890j14181q00581M97049O71916q43253q30745J185537k33521
1680I32877n36395N40510L21079k71276l37186K4896n53713R91992n82356J38307
1670F68735q4697P08226q99557K13806Q97030j108285O77865p19665l59306N28778
$$ plain form
1660 522930 414086 660797 740394 679937 856605 856997 1026640 1111919 513098 784163 1650460
1649 1650460 126098 585359 558703 517422 647451 1196813 749509 302260 1566998 769179
1639 769179 1030203 401987 626270 626793 1278975 -97896 527524 748794 489328 225747
1629 225747 690093 527928 1552926 648421 144417 600366 1197102 508705 1542533
1620 1542533 1475868 1576347 223499 646766 208259 449543 281640 1459259 641964
1611 641964 657903 182653 652290 224891 804882 708521 590762 547192 269225 701844
1601 701844 410024 1069058 357339 167134 66579 703194 600046 1922194 794948
1592 794948 175591 510370 1090821 869755 313234 939863 696178 857756 779384 286822
$$ packed form
1660E22930j08844K46711P9597o0457J76668L92J69643Q5279n98821K71065Q66297
1649A650460j524362M59261k6656m1281J30029N49362m47304m47249J264738p97819
1639G69179K61024o28216K24283N23O52182j376871O25420K21270k59466k63581
1629B25747M64346j62165J024998r04505n04004M55949N96736o88397J033828
1620A542533o6665J00479j352848M23267m38507K41284j67903J177619q17295
1611F41964J5939m75250M69637m27399N79991r6361j17759m3570k77967M32619
1601G01844k91820O59034p11719j90205j00555O36615j03148J322148j127246
1592G94948o19357L34779N80451k21066n56521O26629k43685J61578p8372m92562
$$ plain form
1582 286822 353848 1298069 -133519 677833 274991 278045 174475 1161105 668205 898418
1572 898418 1125252 271610 575679 967524 936543 202745 381878 1665856 265941 359260
1562 359260 1114733 333200 1272424 796277 654536 481897 841824 1070971 1064240 752868
1552 752868 1327302 858050 606930 608490 654700 570596 624842 28884 536387 407957 1354695
1541 1354695 306514 1237097 613596 15802 623916 898668 1010613 660008 1445207
1532 1445207 765715 964434 1196378 996131 230656 221124 504027 1471381 657169 924857
1522 924857 490052 293891 847245 1112207 281659 314186 704213 1314165 653620 425267
1512 425267 1316966 603717 191101 697630 286794 790443 1492352 923047 668382 -291857
$$ packed form
1582B86822O7026R44221j431588Q11352m02842L054j03570R86630m92900K30213
1572H98418K26834q53642L04069L91845l0981p33798J79133J283978j399915R3319
1562C59260P55473p81533R39224m76147j41741j72639L59927K29147o731l11372
1552G52868N74434m69252k51120J560M6210q4104N4246n95958N07503j28430R46738
1541A354695j048181R30583o23501n97794O08114K74752J11945l50605P85199
1532A445207o79492J98719K31944k00247p65475r532K82903R67354q14212K67688
1522I24857m34805j96161N53354K64962q30548L2527L90027O09952o60545k28353
1512D25267Q91699p13249m12616N06529m10836N03649P01909n69305k54665r60239
$$ plain form
1502 -291857 1079407 806483 1464490 1035610 685445 778712 1231630 1039956 226308 278058
1492 278058 501604 711621 1181855 250494 961666 903297 52119 1282828 1433867 1201677
1482 1201677 1255011 480472 1435701 31092 322594 653222 687447 513796 256393 883783
1472 883783 792257 531421 1041168 722921 205488 1054643 93044 250484 341042 1426475
1462 1426475 407051 699618 1299524 765782 649778 779331 547195 482318 365801 732479
1452 732479 1156837 1219154 343235 857407 469415 -250589 1337024 472881 763057 562243
1442 562243 1136058 177036 319915 972068 1184526 858715 914958 438070 463512 943964
1432 943964 692392 1137543 208917 702419 1202087 1382591 1478211 1407522 659492 202852
$$ packed form
1502b91857J371264k72924O58007m28880l50165R3267M52918j91674q13648N1750
1492B78058K23546K10017M70234r31361P11172n8369q51178J230709J51039k32190
1482A201677N3334p74539R55229j404609K91502L30628L4225j73651k57403O27390
1472H83783r1526k60836N09747l18247n17433Q49155r61599J57440R0558J085433
1462A426475j019424K92567N99906n33742j16004J29553k32136o4877j16517L66678
1452G32479M24358O2317q75919N14172l87992p20004J587613q64143K90176k00814
1442E62243N73815r59022J42879O52153K12458l25811N6243m76888K5442M80452
1432I43964k51572M45151r28626M93502M99668J80504R5620p0689p48030m56640
$$ plain form
1422 202852 1320226 1476830 455223 -51283 1359892 646746 616305 367960 22461
1413 22461 -276391 -5124 477060 1160576 767192 1443202 2046907 642499 583247 516356
1403 516356 621037 778471 1188662 532878 819008 -95442 894605 225676 399245 785767
1393 785767 1488023 260248 1359571 -444858 188690 249257 526572 7028 608803
1384 608803 18969 667614 655350 520641 1463120 855391 737752 915793 357715 665353
1374 665353 167003 529287 2038473 570750 1437615 486086 1477281 633753 974513
1365 974513 801114 522255 437686 673062 779854 956461 532398 747128 633966 392127
1355 392127 -194924 725771 -62619 254127 -51143 93385 178429 445214 982884 399327
$$ packed form
1422B02852J117374J56604j021607n06506J411175p13146l0441k48345l45499
1413B2461k98852K71267M82184O83516l93384O76010O03705j404408n9252o6891
1403E16356J04681J57434M10191o55784K86130r14450R90047o68929J73569L86522
1393G85767P02256j227775J099323j804429O33548O0567K77315n19544O01775
1384F08803n89834O48645j2264j34709R42479o07729j17639J78041n58078L07638
1374F65353m98350L62284J509186j467723Q66865r51529R91195q43528L40760
1365I74513j73399k78859q4569K35376J06792J76607m24063K14730j13162k41839
1355C92127n87051R20695p88390L16746l05270J44528Q5044K66785N37670n83557
$$ plain form
1345 399327 873258 489702 -111818 740629 687272 1000456 590211 -563677 26694 87543
1335 87543 144648 506703 1080228 396261 1032070 551501 1073019 589419 1130952 572941
1325 572941 -37638 1129491 1259308 429009 253393 546937 176574 1122448 1103133 1461834
1315 1461834 1383237 724246 1219081 770689 908588 1571407 690895 895458 687092 1566196
1305 1566196 1316996 809724 599703 1080145 1127231 1071504 -300140 610795 512893 -112807
1295 -112807 590484 1121109 488096 669711 875492 1077106 735407 412195 806635 946361
1285 946361 126773 109122 965249 -900839 742353 842879 273858 44176 546816 283094
1275 283094 -616 159513 229933 568460 553103 775351 257449 439339 686641 329957
$$ packed form
1345C99327M73931l83556o01520Q52447n3357L13184m10245j153888N90371O0849
1335H7543N7105L62055N73525o83967O35809m80569N21518m83600N41533n58011
1325E72941o10579J167129J29817q30299j75616K93544l70363R45874j9315L58701
1315A461834p8597o58991M94835m48392J37899O62819q80512K04563k08366Q79104
1305A566196k49200n07272k10021M80442M7086n5727j371644R10935r7902o25700
1295a12807P03291N30625o33013J81615K05781K01614l41699l23212L94440J39726
1285I46361q19588j7651Q56127j866088J643192J00526n69021k29682N02640k63722
1275B83094k83710J60129P0420L38527j5357K22248n17902J81890K47302l56684
$$ plain form
1265 329957 692537 619136 397702 1575732 328843 977211 -17375 1288232 821876
1256 821876 992729 1234840 1344028 -34439 737970 694317 1294656 961037 410558 676611
1246 676611 34415 1000743 1091211 1283105 -233238 753510 449542 1247763 468427 374147
1236 374147 140447 696693 243257 1175976 1045865 631446 749153 387430 516628 916506
1226 916506 267077 4590 133090 785002 545903 1205420 699838 898545 621252 859494
1216 859494 363953 804300 434280 553001 236063 -29529 653175 1102664 514820 611497
1206 611497 969487 13218 239879 956231 434418 586166 496376 136988 709969 348708
1196 348708 826905 873814 -288267 409428 400158 975303 860549 530859 61554 899546
$$ packed form
1265C29957L62580p3401k21434J178030j246889O48368r94586J305607m66356
1256H21876J70853K42111J09188j378467P72409m3653O00339l33619n50479K66053
1246F76611o42196R66328R0468J91894j516343R86748l03968P98221p79336r4280
1236C74147k33700N56246m53436R32719j30111m14419J17707l61723J29198L99878
1226I16506o49429k62487J28500O51912k39099O59517n05582J98707k77293K38242
1216H59494m95541M40347l70020J18721l16938k65592O82704M49489n87844R6677
1206F11497L57990r56269K26661P16352n21813J51748q9790l59388N72981l61261
1196C48708M78197M6909j162081O97695r270N75145j14754l29690m69305Q37992
$$ plain form
1186 899546 231336 738855 892055 356907 445384 883298 1063755 903388 759999 1072983
1176 1072983 691876 1215820 856096 832420 758179 762743 423342 529735 597218 1073862
1166 1073862 393769 248257 340604 1120865 234620 390173 100356 1182683 711447 1518014
1156 1518014 180917 856849 697781 662170 1509518 238834 809517 1937304 1102092
1147 1102092 -110323 683431 670594 -122613 835397 1081489 390775 452550 761128 1208136
1137 1208136 865529 384917 526357 773160 841562 822983 1176937 709245 475064 1111970
1127 1111970 1300791 852084 123450 -20372 1071030 740813 1181550 351994 -107082
1118 -107082 1050986 986996 953800 813375 88232 -105869 1019519 234798 334290 466661
$$ packed form
1186H99546o68210N07519J53200n35148Q8477M37914J80457j60367j43389L12984
1176A072983l81107N23944l59724k3676p4241M564l39401J06393O7483M76644
1166A073862o80093j45512R2347P80261q86245J55553k89817J082327m71236Q06567
1156A518014j337097O75932j59068l5611Q47348j270684N70683J127787q35212
1147A102092j212415P93754j2837p93207R58010K46092o90714O1775L08578M47008
1137A208136l42607m80612J41440K46803O8402j8579L53954m67692k34181O36906
1127A111970J88821m48707p28634j43822J091402l30217M40737q29556m59076
1118a07082J158068o3990l3196j40425p25143j94101J125388p84721R9492J32371
$$ plain form
1108 466661 1190929 288439 764405 721993 654900 818287 -97973 356901 762405 990109
1098 990109 853750 304297 190124 501557 414503 887782 416311 918813 664698 9446
1088 9446 784671 448973 596997 386430 -377080 501449 996932 -110215 310731 211209
1078 211209 863798 72632 424384 395133 345073 563510 368644 1238356 475890 -217999
1068 -217999 328258 1317146 936063 848182 678822 735915 1125628 436104 486645 919835
1058 919835 1396339 754307 962403 484428 430198 1377796 960364 152980 660849 813141
1048 813141 1635487 514482 -1266 178181 272939 1116481 260956 845988 814357 37126
1038 37126 1025306 558424 714281 823235 269436 291509 1002845 207582 231698 1169109
$$ packed form
1108D66661P24268r02490M75966m2412o7093J63387r16260M54874M05504K27704
1098I90109j36359n49453j14173L11433q7054M73279m71471N02502k54115o55252
1088I446P75225l35698J48024k10567p63510Q78529M95483j107147M20946r9522
1078B11209O52589p91166L51752k9251n0060K18437j94866Q69712p62466o93889
1068b17999N46257R88888l81083q7881j69360N7093L89713o89524N0541M33190
1058I19835M76504o42032K08096m77975n4230R47598m17432q07384N07869J52292
1048H13141Q22346j121005n15748J79447R4758Q43542q55525N85032l1631p77231
1038C7126R88180m66882J55857J08954n53799K2073P11336p95263K4116R37411
$$ plain form
1028 1169109 534277 744120 704774 1701111 404390 501107 1126878 543652 1221719 597218
1018 597218 727360 -375315 239287 264399 598073 537074 515097 1164343 15838 679325
1008 679325 640523 602237 806308 657028 -192710 520037 214045 631319 1146995 1133660
998 1133660 -87193 583365 872019 829280 756658 1106981 222707 1076117 998570 408655
988 408655 369534 279189 764335 839947 340321 1177880 266369 1793721 994111 44535
978 44535 147234 1211950 809778 872236 1031769 1059921 360649 -121409 708045 483207
968 483207 471122 356052 403450 881033 1335546 351546 1006384 981286 1069293 803154 877932
957 877932 915296 324464 849761 1240872 -490501 334655 799566 664201 464627 292120
$$ packed form
1028A169109o34832K09843l9346R96337j296721R6717O25771n83226O78067o24501
1018E97218J30142j102675O14602K5112L33674o0999k1977O49246j148505O63487
1008F79325l8802l8286K04071j49280q49738P12747l05992M17274N15676j3335
998A133660j220853O70558K88654m2739p2622L50323q84274Q53410p7547n89915
988D08655l9121r0345M85146P5612m99626Q37559r11511J527352p99610r49576
978D4535J02699J064716m02172O2458J59533K8152o99272m82058Q29454k24838
968D83207j2085j15070M7398M77583M54513r84000O54838k5098Q8007k66139P4778
957H77932L7364n90832N25297L91111j731373Q25156M64911j35365j99574j72507
$$ plain form
947 292120 605984 701905 240740 176406 1115514 -245302 52619 874584 564599 1310975
937 1310975 -674686 977977 722286 34433 620519 -282969 728695 522169 -220987
928 -220987 612781 944237 520872 272924 953238 539753 1076195 1462596 314240 870531
918 870531 410273 1162836 1147167 253471 766753 1066024 925208 393539 1493575 450939
908 450939 899372 362298 910921 799780 543637 173388 712887 -63386 807980 634687
898 634687 570218 759650 809011 -11476 618784 750873 548416 672612 1263236 700646
888 700646 -19111 882749 153279 549307 626647 53885 270329 543595 557797 3604
878 3604 379144 578936 341224 828450 435826 497089 -177802 734311 538668 326128
$$ packed form
947B92120L13864R5921m61165o4334R39108j360816K97921Q21965l09985P46376
937A310975j985661J652663k55691o87853N86086r03488J011664k06526p43156
928b20987Q33768L31456m23365k47948O80314m13485N36442L86401j148356N56291
918H70531m60258P52563j5669q93696N13282K99271j40816n31669J100036j042636
908D50939M48433n37074N48623j11141k56143l70249N39499p76273Q71366j73293
898F34687o4469J89432M9361q20487O30260J32089k02457J24196N90624n62590
888G00646p19757R01860p29470L96028P7340n72762K16444K73266J4202n54193
878C604L75540J99792k37712M87226l92624O1263o74891R12113j95643k12540
$$ plain form
868 326128 1071257 54648 -89956 315878 713158 402143 533842 869751 381122 918057
858 918057 670429 1611078 249402 668851 20062 -235602 765495 467462 103904 924746
848 924746 510584 812660 907949 214997 347950 9740 136754 1008065 1579092 656038
838 656038 -385475 99226 208137 -42469 -213219 306052 375742 374148 889159 1118814
828 1118814 161167 447297 759748 601997 706662 98572 428277 611467 804045 457021
818 457021 857164 64233 381254 304187 397070 1095460 -64681 1281728 1127344 424379
808 424379 286069 700603 331838 235577 661165 736114 160080 349081 1006036 1165205
798 1165205 635477 579240 715956 892733 -164837 -288107 380817 285892 720556 603747
$$ packed form
868C26128P45129j016609j44604M05834L97280l11015J31699L35909m88629N36935
858I18057k47628R40649j361676M19449o48789k55664J001097k98033l63558Q20842
848I24746m14162L02076R5289o92952J32953l38210J27014Q71311N71027r23054
838F56038j041513M84701J08911k50606j70750N19271O9690j594N15011K29655
828A118814r57647K86130L12451j57751J04665o08090L29705J83190J92578l47024
818D57021M00143p92931L17021p7067R2883O98390j160141J346409j54384p02965
808D24379j38310M14534l68765r6261M25588P4949n76034J89001O56955J59169
798A165205n29728n6237J36716J76777j057570j23270O68924r4925M34664j16809
$$ plain form
788 603747 800632 1005020 4468 607041 306162 1331177 567871 375672 255683 1006330
778 1006330 420823 380438 300526 1232594 688810 813155 860770 199902 1987316 697811
768 697811 589337 948515 887721 1179112 886286 997193 815366 139285 364000 -66734
758 -66734 294938 375885 388260 129703 353044 709883 1070774 1232173 702179 896625
748 896625 -82114 242691 646263 -49386 -141060 420053 408640 937782 657493 593747
738 593747 280942 841895 502254 1370284 125788 930097 604980 1235775 -771943 400493
728 400493 465233 -559610 581176 1258161 268359 74806 822046 685972 859416 713246
718 713246 1317937 1369048 784192 351245 805797 414801 709569 200921 243639 1553072
$$ packed form
788F03747J96885K04388j000552O02573l00879J025015p63306j92199j19989P50647
778A006330n85507m0385p9912R32068n43784J24345M7615o60868J787414j289505
768F97811j08474L59178o0794K91391k92826J10907j81827o76081K24715m30734
758f6734L61672Q0947J2375k58557K23341L56839L60891J61399n29994J94446
748H96625r78739L24805M03572o95649r1674N61113j1413N29142k80289o3746
738E93747l12805N60953l39641Q68030j244496Q04309l25117O30795k007718J172436
728D00493O4740j024843J140786O76985r89802j93553P47240j36074J73444j46170
718G13246O04691N1111n84856m32947M54552l90996K94768n08648M2718J309433
$$ plain form
708 1553072 455918 -127711 -304972 281562 701530 212653 548959 806563 626072 670559
698 670559 553149 -404723 650906 143731 74857 606586 242040 624002 343039 589728
688 589728 735537 627884 494862 1376834 437157 971603 1412891 319424 502801 -265680
678 -265680 783424 340202 428972 784332 637795 973611 483179 986763 508314 111923
668 111923 532479 821046 394909 -34753 657753 566260 6301 301553 937698 690477
658 690477 711110 995659 1390212 576990 641288 -24740 507306 694718 490725 -29924
648 -29924 408418 1071791 402522 287948 -269278 1280734 -63650 113046 463146 531092
638 531092 439735 -158568 701498 -284935 206900 -126709 -300287 1355853 534113 804290
$$ packed form
708A553072j097154n83629j77261N86534M19968m88877L36306K57604j80491M4487
698F70559j17410r57872J055629n07175o8874N31729l64546L81962k80963K46689
688E89728J45809j07653j33022Q81972r39677N34446M41288j093467J83377p68481
678b65680J049104m43222Q8770L55360j46537L35816m90432N03584m78449l96391
668A11923M20556K88567m26137m29662O92506r1493n59959K95252O36145k47221
658F90477K0633K84549L94553q13222O4298o66028N32046J87412k03993n20649
648b9924M38342O63373o69269j14574n57226J550012j344384J76696L50100O7946
638E31092r1357n98303Q60066r86433M91835l33609j73578J656140q21740K70177
$$ plain form
628 804290 956493 349900 544467 354543 603488 -168859 681269 817039 598304 563797
618 563797 432968 940372 986861 316388 1434400 282677 567656 1302725 884590 753436
608 753436 438337 379112 53534 1320198 302928 130376 -288989 1587829 1014402 489575
598 489575 538413 38439 748752 873357 269440 706396 338247 659952 755498 656780
588 656780 121186 -462216 421201 -486262 842999 441184 591376 911017 287412 982395
578 982395 175280 139416 202030 402251 877923 306204 -70386 -328887 284218 423069
568 423069 859012 577523 640010 312868 1142942 702767 549216 183569 1306839 616716
558 616716 475538 790174 405172 236596 234811 136546 461868 870495 364474 -363808
$$ packed form
628H04290J52203o06593J94567j89924K48945p72347Q50128J35770k18735l4507
618E63797j30829N07404M6489o70473J118012j151723K84979P35069m18135j31154
608G53436l15099n9225l25578J266664j017270j72552m19365J876818n73427n24827
598D89575M8838m99974P10313J24605o03917M36956l68149L21705R5546r8718
588F56780n35594n83402Q83417r07463J329261m01815J50192L19641o23605O94983
578I82395q07115l5864O2614K00221M75672n71719l76590k58501O13105J38851
568D23069M35943k81489O2487l27142Q30074m40175j53551l65647J123270o90123
558F16716j41178L14636l85002j68576j785r8265L25322M08627n06021p28282
$$ plain form
548 -363808 1199242 1285247 89458 -78117 661901 570731 335178 1801141 33989 330968
538 330968 634893 835166 199187 369835 397173 929151 1778250 469229 15925 388736
528 388736 408335 421968 465898 564450 543627 363086 785749 155761 882626 692321 785303
517 785303 21785 713390 316817 839805 483631 330064 -149272 921521 660688 273034
507 273034 237595 -284172 329635 1333799 539520 -170718 421366 854468 -81721 1358660
497 1358660 133502 814298 345222 1179235 118735 -357087 328634 927181 472480
488 472480 216943 79699 -76001 652761 276490 -47989 -34689 243744 78761 494555
478 494555 510554 362155 -160544 650386 474886 752734 755198 384398 68955 91772 -609528
$$ packed form
548c63808J563050Q6005j195789j67575P40018r1170k35553J465963j767152K96979
538C30968L03925K00273o35979J70648K7338N31978Q49099j309021m53304L72811
528C88736J9599J3633M3930R8552k0823j80541M22663o29988P26865j90305R2982
517G85303p63518O91605l96573N22988l56174j53567m79336J070793k60833l87654
507B73034l5439n21767O13807J004164p94279p10238N92084M33102r36189J440381
497A358660j225158O80796m69076Q34013j060500m75822O85721N98547m54701
488D72480k55537j37244j55700P28762l76271l24479J3300K78433j64983M15794
478D94555J5999j48399n22699Q10930j75500K77848K464l70800l15443K2817p01300
$$ plain form
467 -609528 221718 1339824 -547820 844839 309945 821751 135524 760419 239122
458 239122 677850 166076 1007847 -109288 975708 308942 490811 637097 687083 -355862
448 -355862 134293 171441 1452692 233774 684781 815684 850292 384797 1089028 449394
438 449394 624527 -293497 737395 643274 257108 451813 1450522 828276 -323382 679518
428 679518 863363 -14130 348851 264746 232225 40606 -142675 1265746 362784 682263
418 682263 1012920 874703 881369 -286847 -366860 240187 1459834 162680 200031 139845
408 139845 548357 340305 892388 506868 407965 816749 199667 918960 411934 739346
398 739346 647451 535327 152365 128599 862487 325987 327532 924077 560038 425976 471803
$$ packed form
467f09528Q31246J118106j887644J392659n34894N11806o86227O24895n21297
458B39122M38728n11774Q41771j117135J084996o66766J81869J46286M9986j042945
448c55862M90155L7148J281251j218918M51007J30903L4608m65495P04231o39634
438D49394J75133r18024J030892r4121l86166J94705R98709o22246j151658J002900
428F79518J83845q77493L62981q4105l2521j91619j83281J408421r02962L19479
418F82263L30657j38217O666j168216q0013O07047J219647j297154L7351o0186
408A39845M08512k08052N52083l85520r8903M08784o17082P19293n07026L27412
398G39346r1895j12124l82962k3766P33888n36500J545N96545l64039j34062M5827
$$ [...]
##END NTUPLES=NMR SPECTRUM
##END=
