##TITLE=abcd
##JCAMPDX= 6.0         $$ Bruker NMR JCAMP-DX V2.0
##DATA TYPE= NMR SPECTRUM
##DATA CLASS= NTUPLES
##ORIGIN= UXNMR, Bruker Analytische Messtechnik GmbH
##OWNER= root
$$ XWIN-NMR		Version 3.5
$$ Wed Jul 15 16:31:01 2026 Russian Standard Time (UT+4h)  servis@DPX200
##.OBSERVE FREQUENCY= 200.131235884673
##.OBSERVE NUCLEUS= ^1H
##.ACQUISITION MODE= SIMULTANEOUS
##.ACQUISITION SCHEME= undefined
##.AVERAGES= 32
##.DIGITISER RES= 18
##SPECTROMETER/DATA SYSTEM= spect
##.PULSE SEQUENCE= zg
##.SOLVENT NAME= CDCl3
##.SHIFT REFERENCE= (INTERNAL, CDCl3, 0, 16.4885)
##AUDIT TRAIL= $$ (NUMBER, WHEN, WHO, WHERE, WHAT)
$$ ##TITLE= Audit trail, XWIN-NMR		Version 3.5
$$ ##JCAMPDX= 5.01
$$ ##ORIGIN= Bruker BioSpin GmbH
$$ ##OWNER= servis
$$ F:\spectra/data/av/nmr/H1/1/pdata/1/auditp.txt
$$ ##AUDIT TRAIL=  $$ (NUMBER, WHEN, WHO, WHERE, WHAT)
(   1,<2026-07-15 16:30:31.37 +0400>,<servis>,<DPX200>,
      <created by zg, POWCHK disabled, PULCHK disabled
       configuration hash MD5:
       00 E9 B6 7A A2 85 ED C7 34 08 36 98 17 FE 4E 26
       data hash MD5: 32K
       45 59 D7 25 E1 A0 A8 52 E2 EA 42 C2 D5 62 D0 2C>)
(   2,<2026-07-15 16:30:37.89 +0400>,<servis>,<DPX200>,
      <Start of raw data processing
       efp BC_mod = 2 LB = 0.05 FT_mod = 6 PKNL = 1 PHC0 = -415.39 PHC1 = 3.101563 SI = 16K 
       data hash MD5: 16K
       B2 F8 11 46 A3 68 50 8E 3D 14 ED ED CB A7 0B EE>)
$$ ##END=
$$ 
$$ hash MD5
$$ 4B 81 C6 17 87 D9 42 C1 86 F6 3C 94 49 21 C9 FB
##$RELAX= 
##$RELAX= 
##$RELAX= 
##$RELAX= 
##$RELAX= 
##$RELAX= 
##$RELAX= 
##$RELAX= 
$$ Bruker specific parameters
$$ --------------------------
##$DU= <F:\spectra>
##$EXPNO= 1
##$NAME= <H1>
##$PROCNO= 1
##$TYPE= <nmr>
##$USER= <av>
##$AMP= (0..31)
100 100 100 100 100 100 100 100 100 100 100 100 100 100 100 100 100 100 
100 100 100 100 100 100 100 100 100 100 100 100 100 100 
##$AQSEQ= 0
##$AQ_mod= 1
##$AUNM= <au_zg>
##$AUTOPOS= <>
##$BF1= 200.13
##$BF2= 200.13
##$BF3= 200.13
##$BF4= 200.13
##$BF5= 500.13
##$BF6= 500.13
##$BF7= 500.13
##$BF8= 500.13
##$BYTORDA= 1
##$CFDGTYP= 0
##$CFRGTYP= 5
##$CHEMSTR= <none>
##$CNST= (0..31)
1 1 145 1 1 1 1 1 1 1 1 1 1 1 1 1 1 1 1 1 1 1 1 1 1 1 1 1 1 1 1 1 
##$CPDPRG= <>
##$CPDPRG1= <>
##$CPDPRG2= <>
##$CPDPRG3= <>
##$CPDPRG4= <mlev>
##$CPDPRG5= <mlev>
##$CPDPRG6= <mlev>
##$CPDPRG7= <mlev>
##$CPDPRG8= <mlev>
##$CPDPRGB= <>
##$CPDPRGT= <>
##$D= (0..31)
0 2 0 0 0 0 0 0 0 0.06 0 0 0 0 0 0 0.0002 0 0 0 0 0 0 0 0 0 0 0 0 0 0 
0 
##$DATE= 1784118630
##$DBL= (0..7)
120 120 120 120 120 120 120 120 
##$DBP= (0..7)
150 150 150 150 150 150 150 150 
##$DBP07= 0
##$DBPNAM0= <>
##$DBPNAM1= <>
##$DBPNAM2= <>
##$DBPNAM3= <>
##$DBPNAM4= <>
##$DBPNAM5= <>
##$DBPNAM6= <>
##$DBPNAM7= <>
##$DBPOAL= (0..7)
0.5 0.5 0.5 0.5 0.5 0.5 0.5 0.5 
##$DBPOFFS= (0..7)
0 0 0 0 0 0 0 0 
##$DE= 6
##$DECBNUC= <off>
##$DECIM= 32
##$DECNUC= <off>
##$DECSTAT= 4
##$DIGMOD= 1
##$DIGTYP= 9
##$DL= (0..7)
0 120 120 120 120 120 120 120 
##$DP= (0..7)
150 150 150 150 150 150 150 150 
##$DP07= 0
##$DPNAME0= <>
$$ [...]
##$SUBNAM4= <"">
##$SUBNAM5= <"">
##$SUBNAM6= <"">
##$SUBNAM7= <"">
##$SUBNAM8= <"">
##$SUBNAM9= <"">
##$SW= 20.6817932712277
##$SWIBOX= (0..15)
0 0 3 0 0 0 0 0 0 0 0 0 0 0 0 0 
##$SW_h= 4139.07284768212
##$TD= 32768
##$TD0= 1
##$TE= 0
##$TE2= 300
##$TE3= 300
##$TEG= 300
##$TL= (0..7)
0 120 120 120 120 120 120 120 
##$TP= (0..7)
150 150 150 150 150 150 150 150 
##$TP07= 0
##$TPNAME0= <>
##$TPNAME1= <>
##$TPNAME2= <>
##$TPNAME3= <>
##$TPNAME4= <>
##$TPNAME5= <>
##$TPNAME6= <>
##$TPNAME7= <>
##$TPOAL= (0..7)
0.5 0.5 0.5 0.5 0.5 0.5 0.5 0.5 
##$TPOFFS= (0..7)
0 0 0 0 0 0 0 0 
##$TUNHIN= 0
##$TUNHOUT= 0
##$TUNXOUT= 0
##$USERA1= <user>
##$USERA2= <user>
##$USERA3= <user>
##$USERA4= <user>
##$USERA5= <user>
##$V9= 5
##$VALIST= <valist>
##$VCLIST= <CCCCCCCCCCCCCCC>
##$VD= 0
##$VDLIST= <DDDDDDDDDDDDDDD>
##$VPLIST= <PPPPPPPPPPPPPPP>
##$VTLIST= <TTTTTTTTTTTTTTT>
##$WBST= 1024
##$WBSW= 30
##$XGAIN= (0..3)
0 0 0 0 
##$XL= 0
##$YL= 0
##$YMAX_a= 281460
##$YMIN_a= -581040
##$ZGOPTNS= <>
##$ZL1= 120
##$ZL2= 120
##$ZL3= 120
##$ZL4= 120
##$ABSF1= 0
##$ABSF2= 0
##$ABSG= 0
##$ABSL= 0
##$ALPHA= 0
##$AQORDER= 0
##$ASSFAC= 0
##$ASSFACI= 0
##$ASSFACX= 0
##$ASSWID= 0
##$AUNMP= <proc_1d>
##$AZFE= 0.1
##$AZFW= 0.1
##$BCFW= 0
##$BC_mod= 2
##$BYTORDP= 0
##$COROFFS= 0
##$CY= 18.4799938201904
##$DATMOD= 1
##$DC= 0
##$DFILT= <>
##$DTYPP= 0
##$F1P= 9.9274215381318
##$F2P= -0.165520771350173
##$FCOR= 1
##$FTSIZE= 16384
##$FT_mod= 6
##$GAMMA= 0
##$GB= 0
##$INTBC= 1
##$INTSCL= 4.127829e-11
##$ISEN= 128
##$LB= 0.05
##$LEV0= 0
##$LPBIN= 0
##$MAXI= 10000
##$MC2= 0
##$MEAN= 0
##$ME_mod= 0
##$MI= 50
##$NCOEF= 0
##$NC_proc= -7
##$NLEV= 6
##$NOISF1= 3.799351
##$NOISF2= 2.8
##$NSP= 0
##$NTH_PI= 0
##$NZP= 0
##$OFFSET= 16.48848
##$PC= 4
##$PHC0= -415.39
##$PHC1= 3.101563
##$PH_mod= 1
##$PKNL= yes
##$PPARMOD= 0
##$PSCAL= 4
##$PSIGN= 0
##$REVERSE= no
##$SF= 200.130005582386
##$SI= 16384
##$SIGF1= 3
##$SIGF2= 2
##$SINO= 400
##$SIOLD= 16384
##$SREGLST= <1H.CDCl3>
##$SSB= 0
##$STSI= 16384
##$STSR= 0
##$SW_p= 4139.07284768211
##$SYMM= 0
##$S_DEV= 0
##$TDeff= 32768
##$TDoff= 0
##$TI= <>
##$TILT= no
##$TM1= 0
##$TM2= 0
##$TOPLEV= 0
##$USERP1= <user>
##$USERP2= <user>
##$USERP3= <user>
##$USERP4= <user>
##$USERP5= <user>
##$WDW= 1
##$XDIM= 16384
##$YMAX_p= 380217738
##$YMIN_p= -1651548
$$ End of Bruker specific parameters
$$ ---------------------------------
##NTUPLES= NMR SPECTRUM
##VAR_NAME=  FREQUENCY,     SPECTRUM/REAL,   SPECTRUM/IMAG
##SYMBOL=    X,             R,               I
##VAR_TYPE=  INDEPENDENT,   DEPENDENT,       DEPENDENT
##VAR_FORM=  AFFN,          ASDF,            ASDF
##VAR_DIM=   16384,         16384,           16384
##UNITS=     HZ,            ARBITRARY UNITS, ARBITRARY UNITS
##FACTOR=    0.252644378177508, 1,           1
##FIRST=     3299.83951724647, 0,            0
##LAST=      -839.233330435636, 0,           0
##MIN=       -839.233330435636, -1651548,    0
##MAX=       3299.83951724647, 380217738,    0
$$ Real data points
##PAGE= N=1
##DATA TABLE= (X++(R..R)), XYDATA
$$ [...]
7582B205758K25450n70872J94677j08170L80775j76082j11418p2184M98829m56056
7572B010707J07152j38952J68428k25126J5509M00418m9082M52559o66300L30361
7562B405674j64924j00535M59659Q9087P9217M65866l32658J026397O99744j45394
7552D482133L14230k93953n76158p4522K7338o26014j77996K59799p73846K32522
7542B793533p1634l52702M8669n35492L9703j5428k02444M44669O16873k23511
7532B542236L7501p9616J13047R551L20979j01678N45254M10221Q03492J97648
7522D798635n4371j00326m37553l10980j92905l73367o3038p22102j53580k55780
7512B134633J80746L1694l26028K47624k27856k76484K62873L15778j00869k51322
$$ y = [2205758, 2431208, 1860336, 2055013, 1946843, 2327618, 2151536, 2040118, 1967934, 2466763, 2010707, 2117859, 1978907, 2147335, 1922209, 1937718, 2338136, 2289054, 2741613, 2075313, 2405674, 2240750, 2140215, 2599874, 2688961, 2768178, 3234044, 2901386, 3927783, 4627527, 4482133, 4796363, 4502410, 3926252, 3851730, 3879068, 3253054, 3075058, 3334857, 2561011, 2793533, 2721899, 2369197, 2417866, 1882374, 1922077, 1906649, 1704205, 2148874, 2765747, 2542236, 2579737, 2500121, 2613168, 2622719, 2943698, 2842020, 3387274, 3797495, 4600987, 4798635, 4744264, 4643938, 4206385, 3895405, 3702500, 3329133, 3266095, 2543993, 2390413, 2134633, 2315379, 2347073, 2021045, 2268669, 2040813, 1764329, 2027202, 2342980, 2242111, 1990789]
7502A990789j34680K73130m34153L32008R4195J49914l47820M71911l87805J19526
7492B127015j78171L97454r7185k80427k81936O7094K09391O5680J1160J21269
7482B161344j20044j18543M10582j78188N2194m55904L39340n90713R41552m97514
7472A944106L60868Q466m54583j53184j66028L47371O02322J14640J01788n75769
7462B129997L8394P88911p32439J34416j05128L1811k26803q3094k41495m02644
7452A331926Q48678j74056l35443o8791L48990k92756L09696m09892N10729l54659
7442A714422J37358K67881j59310j34007j94495k55417M06370m4754L70135K57104
7432B365287o16734J63773l59440M83474O7245l30647J48922j40459J01741j41902
$$ y = [1990789, 1856109, 2129239, 1695086, 2027094, 2121289, 2271203, 1923383, 2395294, 2007489, 2127015, 1948844, 2346298, 2249113, 1968686, 1686750, 1753844, 1963235, 2028915, 2040075, 2161344, 2041300, 1922757, 2333339, 2155151, 2207345, 1751441, 2090781, 1500068, 2441620, 1944106, 2304974, 2313440, 1858857, 1705673, 1539645, 1887016, 2489338, 2603978, 2705766, 2129997, 2168391, 2957302, 2224863, 2359279, 2254151, 2285962, 2059159, 1976065, 1734570, 1331926, 2180604, 2006548, 1671105, 1602314, 1951304, 1658548, 1968244, 1558352, 2069081, 1714422, 1851780, 2119661, 1960351, 1826344, 1631849, 1376432, 1782802, 1738048, 2108183, 2365287, 1748553, 1912326, 1552886, 2036360, 2103605, 1772958, 1921880, 1781421, 1883162, 1741260]
7422A741260O5632P75198p65897J66447j66691J43542O17695j70397j45056k30433
7412B031300K28637K81073L8681k61214k06065k54922K13186l91198K12470j19893
7402A772055l6720L20111K33303j23585j94664K35280N8243m54511P11398j10396
7392B410514k61062J3861J4488j22039o4530K13092J58652J61766j24673k8025
7382B372044K02349j86413m13879N22270O5239j15494J93991j9543j64190j82190
7372B274184k71615Q49603o44770L18316J46613k28544K81435k23372N9092o3528
7362B497414p1250N0425L70926q7456M28176n33551L23348n5398o94060P67020
7352B995594j68313J47179n95812p5521L23015M8193M6367k01014J82796J52182
$$ y = [1741260, 1806892, 2582090, 1816193, 1982640, 1815949, 1959491, 2577186, 2406789, 2261733, 2031300, 2259937, 2541010, 2579691, 2318477, 2112412, 1857490, 2070676, 1679478, 1891948, 1772055, 1735335, 2055446, 2288749, 2165164, 1970500, 2205780, 2264023, 1809512, 2520910, 2410514, 2149452, 2163313, 2177801, 2055762, 1991232, 2204324, 2362976, 2524742, 2400069, 2372044, 2574393, 2387980, 1974101, 2496371, 2561610, 2446116, 2640107, 2620564, 2456374, 2274184, 2002569, 2852172, 2207402, 2525718, 2672331, 2443787, 2725222, 2501850, 2560942, 2497414, 2426164, 2476589, 2847515, 2760059, 3188235, 2654684, 2978032, 2922634, 2228574, 2995594, 2827281, 2974460, 2378648, 2303127, 2626142, 2674335, 2720702, 2519688, 2702484, 2854666]
7342B854666J35141O61980j69207k1592N97803M1180L05335m0436K03877N6714
7332D625461k8808l75525k01112q4753Q211p7556j4099o9485l01194J27083K0847
7321C629070L36138L0533p6245l21859L29384p7486m42844Q59591j96588q7482
7311C982212k05773N23964N74910l24559K0368R8286L3154J24158Q5496J76787
7301E089003J65418L90518m17679J58885J55315K56782K82787L19394J53531l84574
7291F169380O68017K65370l25898J77355M38144m6189K34305O86604k01617L91152
7281H456623K12271L55245K95029L78538j10490O45186J05833Q96396J7882O95686
7271A1948199M15381k82946O11427M57928Q23364k48375Q86994l95668R85690
$$ y = [2854666, 2989807, 3651787, 3482580, 3460988, 4058791, 4099971, 4405306, 4364870, 4568747, 4625461, 4596653, 4221128, 4020016, 3935263, 3943474, 3865918, 3851819, 3782334, 3481140, 3608223, 3629070, 3965208, 3995741, 3919496, 3597637, 3927021, 3849535, 3406691, 4266282, 4069694, 3982212, 3776439, 4300403, 4875313, 4550754, 4571122, 4669408, 4702562, 4826720, 4912216, 5089003, 5254421, 5644939, 5227260, 5386145, 5541460, 5798242, 6081029, 6400423, 6553954, 6169380, 6837397, 7102767, 6776869, 6954224, 7392368, 7346179, 7580484, 8267088, 8065471, 8456623, 8668894, 9024139, 9319168, 9697706, 9587216, 10232402, 10338235, 11234631, 11252513, 11948199, 12363580, 12080634, 12692061, 13149989, 13973353, 13724978, 14611972, 14216304, 15201994]
7262A5201994r473Q40857L97624K93368l0230O65987m74546L26160j17063R56513
7252A8051191j29734K31978r1772L63907L23249l61818L93323K34044j95703K17449
7242A9036114P849J75279M7840k54893Q2443k38563j16276K51042J28721L41893
7232A9461449r5496k72875J56956R8490J74400q1620P76777L99410J68632N71892
7222B1358015K49667J83945J213400K73887R59310O97350N83401J522534Q03446
7213B7844955J511645J185954J340715J609792J921667J749970K344102J875892
7205D1384692K216942K862861K654060K130836K411278K575609J841149J716566
7197E9793993J598375P29175J076J63441k72079j451268j106579j777286j678551
$$ y = [15201994, 15192521, 16033378, 16431002, 16724370, 16694140, 17360127, 16885581, 17211741, 17094678, 18051191, 17921457, 18153435, 18061663, 18425570, 18748819, 18387001, 18780324, 19014368, 18818665, 19036114, 19043963, 19219242, 19267082, 19012189, 19094632, 18856069, 18739793, 18990835, 19119556, 19461449, 19365953, 19093078, 19250034, 19348524, 19522924, 19441304, 20218081, 20617491, 20786123, 21358015, 21607682, 21791627, 23005027, 23278914, 24238224, 24935574, 25518975, 27041509, 27844955, 29356600, 30542554, 31883269, 33493061, 35414728, 37164698, 39508800, 41384692, 43601634, 46464495, 49118555, 51249391, 53660669, 56236278, 58077427, 59793993, 61392368, 62121543, 62122619, 62286060, 62013981, 60562713, 59456134, 57678848, 56000297]
7188E6000297k293133k499787j861369j997476k174322k044400j778994j939169
7180C9411647j735089j433307j192369j619763j125767j319365j082649n71787
7172B9331551j125356q80373l91939n47567l48302o14377p46205m88902l40696
7163B3847834m61180l76080k80521k38886J13901j58189j53584K2105N3169n32814
7153B1835755N2592L71301j92903R4137K35836k92735O08532k95152K76157R8494
7143B2792014O60428O03275n8275O19070L08785m9216P48025L5468J068218R62219
7133B7690011M26634O89404P45109J221846Q83207J004171J245137K080669J341992
7124C7328180J060020J888607K116365J760657K280796K176934K957541J919163
$$ y = [56000297, 53707164, 51207377, 49346008, 47348532, 45174210, 43129810, 41350816, 39411647, 37676558, 36243251, 35050882, 33431119, 32305352, 30985987, 29903338, 29331551, 28206195, 27325822, 26933883, 26386316, 26038014, 25423637, 24677432, 24188530, 23847834, 23386654, 23010574, 22730053, 22491167, 22605068, 22446879, 22293295, 22315400, 22368569, 21835755, 21888347, 22259648, 22066745, 22160882, 22396718, 22103983, 22712515, 22417363, 22693520, 22792014, 23452442, 24055717, 23997442, 24616512, 24925297, 24876081, 25624106, 25659574, 26727792, 27690011, 28116645, 28806049, 29551158, 30773004, 31656211, 32660382, 33905519, 35986188, 37328180, 38388200, 40276807, 42393172, 44153829, 46434625, 48611559, 51569100, 53488263]
7116E3488263J971924K039485J389172J434681J544117K10712L49420p46348k36164
7107F1445262j759313j401061k282031k009089k415906k271506k456893k386046
7099D4463417k555056k462011k278986j780853j577011k086081j143607j727676
7091B8852136r12785j322345j180383n64380r73396p11616o04005k69769p60952
7082B1552505n06491o62182R0982j33295o23529m99478L35815m7110n21134j39335
7072A8846748L77979r75169M14653k24047j94697j41270P16741l24332J49638
7063A8646244r8375L83303j00669M18434k46549L10995l63530m8782l33956J4831
7053A8581946j65523J41317j37154k11909o16599m254j15586K059n67539l09164
$$ y = [53488263, 55460187, 57499672, 58888844, 60323525, 61867642, 62078354, 62427774, 61681426, 61445262, 59685949, 58284888, 56002857, 53993768, 51577862, 49306356, 46849463, 44463417, 41908361, 39446350, 37167364, 35386511, 33809500, 31723419, 30579812, 28852136, 27939351, 26617006, 25436623, 24872243, 23898847, 23187231, 22583226, 22313457, 21552505, 21046014, 20383832, 20474814, 20341519, 19717990, 19218512, 19554327, 19507217, 18986083, 18846748, 19224727, 18249558, 18664211, 18440164, 18245467, 18104197, 18820938, 18496606, 18646244, 18547869, 18931172, 18830503, 19248937, 19002388, 19313383, 18949853, 18901071, 18567115, 18581946, 18416423, 18557740, 18420586, 18208677, 17592078, 17587824, 17472238, 17474297, 16906758, 16597594]
7043A6597594o5135k79044p97449p80055J48839p58951J23834o26221k55634j095615
7033A2212163J93225J25566n66355m24894k60840K42796k41064j137383j22880
7024A0020334O1986n60871q1475m81958K24935n76793K8251l14330P6222j0425
7014H385876k2379k18729n79238R6707k62012m77421K66702m205j92174J24786
7004G117913k95667j09384M34057l88430j73010n285L93844J05969n76083K96610
6994F800534l86229j10285n1298K03767R39297j147464K17957M36564n6022O01131
6984G447952n86428L4402K09252O86700p04319L36793O72663Q1076K75716J133287
6974I587094J418027K254211K076711J866994J562014n89819o42683j450731j260276
$$ y = [16597594, 16532459, 16253415, 15455966, 14675911, 14824750, 14065799, 14189633, 13563412, 13307778, 12212163, 12405388, 12530954, 11964599, 11539705, 11278865, 11521661, 11280597, 10143214, 10020334, 10082320, 9521449, 9439974, 8958016, 9182951, 8606158, 8634409, 8320079, 8396301, 8385876, 8363497, 8144768, 7565530, 7662237, 7400225, 6922804, 7189506, 7185301, 6993127, 7117913, 6822246, 6712862, 7146919, 6758489, 6585479, 6580194, 6974038, 7080007, 6503924, 6800534, 6414305, 6304020, 6252722, 6456489, 7395786, 6248322, 6466279, 6902843, 6846821, 7447952, 6861524, 6895926, 7105178, 7791878, 7087559, 7424352, 8097015, 8178091, 8453807, 9587094, 11005121, 13259332, 15336043, 17203037, 18765051, 18175232, 17532549, 16081818, 14821542]
6965A4821542j412681n12719r07673o66821l21975j49654j27290M72814N12792
6956A1708335P99147J31441Q40072J100540J312806J176830K312074K937418L412105
6947B5730768M658656P464897J0285942J2414050J1364574O487256j59211m823957
6939G3422975p684982q927894q228487o845658n205067m445046k267959k344653
6931B7473229r06464r13453j54472O40654J309359J405723K114311L548073M876919
6922C9393879O648065R568451J2026584J3071361J1145693Q447912N367022J038089
6914A06707056l755773r000636j1293806j1406793j2128435r447625p726662n831278
6906C6116048l963035l035692j854827j466154l52989J60792m15202J410802J718784
$$ y = [14821542, 13408861, 12896142, 11988469, 11321648, 10999673, 10850019, 10722729, 11195543, 11708335, 12507482, 12638923, 13478995, 14579535, 15892341, 17069171, 19381245, 22318663, 25730768, 30389424, 37854321, 48140263, 60554313, 71918887, 78406143, 78246932, 73422975, 65737993, 56810099, 48581612, 41735954, 36530887, 32085841, 29817882, 27473229, 26566765, 25653312, 25498840, 26139494, 27448853, 28854576, 30968887, 34516960, 39393879, 46041944, 55610395, 67636979, 80708340, 91854033, 100301945, 105668967, 106707056, 102951283, 93950647, 82656841, 71250048, 59121613, 49673988, 41947326, 36116048, 32153013, 29117321, 27262494, 25796340, 25443351, 25604143, 25188941, 26599743, 28318527]
6897B8318527L042135L762561N099554M957345L380481R40726r19015l072181
6889D5510133k945420k586763k080789k442493l017246l206562l963158k788921
6881B2478781k827795k323794j919301j095264j613899r43169o60776n80115m56724
6872A0057944k89946m88425o31453O3326m78883j47246n62490n13228J57072k65708
6862F900963p3078j61977J97888O6113m77824N13746m01382j01251P8547n27993
6852F013752Q3498k60867J66511j91311J22001j95613j25643Q4382k35471m18653
6842E042586L09756J10207l54291n28185L38079R40K74794p22489K54722n2450
6832D673669r5115k35178N01086k27288l73857L24519Q7522q0729M00538K60172
$$ y = [28318527, 31360662, 35123223, 40222777, 45180122, 48560603, 49501329, 48582314, 45510133, 42564713, 39977950, 37897161, 35454668, 32437422, 29230860, 25267702, 22478781, 19650986, 17327192, 15407891, 14312627, 12698728, 11755559, 11094783, 10514668, 10057944, 9767998, 9279573, 8648120, 8711446, 8232563, 8085317, 7522827, 7009599, 7166671, 6900963, 6827885, 6665908, 6863796, 6929909, 6452085, 6965831, 6564449, 6463198, 6541745, 6013752, 6097250, 5836383, 6002894, 5811583, 5933584, 5737971, 5612328, 5696710, 5461239, 5042586, 5352342, 5462549, 5108258, 4580073, 4918152, 4919092, 5193886, 4471397, 4726119, 4673669, 4578554, 4343376, 4844462, 4617174, 4243317, 4567836, 4655358, 4574629, 4975167, 5235339]
6822E235339m01096j3793q8599N5519k18327j19184k80762k9020o5930k94532
6812C779615L61070l94052L15309l62831l3137j03966O49430j77306p58858P1154
6802C346428j96887L764P9120O01423j46529R3086p69060K87986j71455J70303
6792C298179q8492J6153k83738j7355j02853p6078J28357O7302N5445K71603K43163
6781C511686L71714j012803K33258o19585O70712l26174k99533j15044N3958n27595
6771A940594O82777n39245L06120J428m5222k13635K29381k22271K06882j68759
6761B178050J68980r8832j01088m38690O39980m16455L65463J4344k28092L58950
6751B442610m89496L22117K36135j50862K0495j93031l4344J51187m56151M90548
$$ y = [5235339, 4834243, 4820450, 4731851, 4787370, 4569043, 4449859, 4169097, 4140077, 4074147, 3779615, 4140685, 3746633, 4061942, 3699111, 3665974, 3562008, 4211438, 4034132, 3275274, 3346428, 3149541, 3153305, 3232425, 3833848, 3687319, 3780405, 3011345, 3299331, 3127876, 3298179, 3209687, 3225840, 2942102, 2924747, 2821894, 2745816, 2874173, 2941475, 2996920, 3268523, 3511686, 3883400, 2870597, 3103855, 2484270, 3154982, 2828808, 2529275, 2414231, 2468189, 1940594, 2623371, 2084126, 2390246, 2391674, 2346452, 2132817, 2362198, 2139927, 2346809, 2178050, 2347030, 2248198, 2147110, 1708420, 2348400, 1931945, 2297408, 2311752, 2083660, 2442610, 1953114, 2275231, 2511366, 2360504, 2380999, 2187968, 2153624, 2304811, 1848660, 2339208]
6741B339208l58892N49817k62399q1343J56535N95202m16067Q4069l0702m1070
6731B534358L8681n2929M3478J33511l3732L47604J06594j9736k96240N4171j3454
6720B842306J7908k71239n8217J66222l14201j93101M53791k85906J42565Q7000
6710B587128J44699k52974P36015K26965k29953O12542Q56094L56116O8742Q352
6700E113726L16502n76408p25937j10759j77921K8091k68153K24449j30237K0820
6690C714173p3668M1193o6543M66749k04982K87553j28723L25465l73459J58284
6680D146042J37128N03451L56814J374910J040846K449301P23996N88726r96532
6671A0324682l78230j379540r47451q39738j59085o65038m81229l45163j12809
$$ y = [2339208, 1980316, 2530133, 2267734, 2186391, 2342926, 2938128, 2522061, 2606130, 2575428, 2534358, 2573039, 2520110, 2563588, 2697099, 2663367, 3010971, 3117565, 3097829, 2801589, 2855760, 2842306, 2860214, 2588975, 2530758, 2696980, 2382779, 2189678, 2643469, 2357563, 2500128, 2587128, 2731827, 2478853, 3214868, 3441833, 3211880, 3824422, 4680516, 5036632, 5105374, 5113726, 5430228, 4853820, 4127883, 4017124, 3839203, 3867294, 3599141, 3823590, 3693353, 3714173, 3640505, 3681698, 3615155, 4081904, 3876922, 4164475, 4035752, 4361217, 3987758, 4146042, 4283170, 4786621, 5143435, 6518345, 7559191, 10008492, 10732488, 11321214, 10324682, 9946452, 8566912, 7619461, 6779723, 6620638, 5955600, 5474371, 5129208, 5016399]
6662E016399j32674r2728P127K45557K04363K12143J0920M66735l38810J99061
6652E798093P27474j70621P01154Q61282J619326J680270J444401P13988n98852
6643A2776515k04958j122337o53355r43319j63614n541P9153Q2844R13043M46867
6633A1205298R89281J059223K045041L388444M579845O287029M376732K335385
6625C6266278j141585k546831l677898m016956l195911k316333j543671j771972
6617A6055121p40074k08424q86510j056680o84029J41621m26115r1855Q72635
6608A2975690N21998P73593J423111J333661K009464L199063O696289J1644897
6600D0577766J6557193J4356458Q611759p88739o222898j0796276j1212856j0096958
$$ y = [5016399, 4883725, 4790997, 4798124, 5043681, 5248044, 5460187, 5471107, 5937842, 5599032, 5798093, 6525567, 6354946, 7056100, 7917382, 9536708, 11216978, 12661379, 13375367, 12776515, 12571557, 11449220, 10795865, 9852546, 9688932, 9683391, 9762544, 9845388, 10758431, 11205298, 12194579, 13253802, 15298843, 18687287, 23267132, 29554161, 33930893, 36266278, 35124693, 32577862, 28899964, 24883008, 21687097, 19370764, 17827093, 16055121, 15315047, 15106623, 14220113, 13163433, 12479404, 12621025, 12194910, 12103055, 12975690, 13497688, 14271281, 15694392, 17028053, 19037517, 22236580, 28932869, 40577766, 57134959, 71491417, 80103176, 79314437, 73091539, 62295263, 51082407, 40985449]
6592D0985449p216791n884355n669053l436773k140457r52808j056105q42929
6584A3786178M44347k43186K17452L95299M70819O76196Q23345J814262J481847
6575A9866559K611311N348851J0625663J5797766J5665721J1411989J869568n162806
6567G8034622r957782j2172664j0686265r213715o903027n662157l611048k210163
6559A7617801j417286j550563q25085j028898M85887k62613k2766l58215k44767
6550A2393495O72476O4606L21174J560376J321344L103975M753247O151629M494528
6541C4836850J669611j342025k918035l793985l732946l250100k626065j114004
6533A7729301j179217n86808l45550m61176L32055M48010P61850P32971Q10199
$$ y = [40985449, 33768658, 27884303, 22215250, 18778477, 16638020, 15685212, 14629107, 13786178, 14230525, 13987339, 14204791, 14600090, 15070909, 15747105, 16570450, 18384712, 19866559, 22477870, 27826721, 38452384, 54250150, 69915871, 81327860, 83197428, 78034622, 68076840, 55904176, 45217911, 36004196, 29101169, 23439012, 19827964, 17617801, 16200515, 14649952, 13824867, 12795969, 13281856, 13019243, 12996477, 12638262, 12393495, 13065971, 13130577, 13451751, 15012127, 16333471, 19437446, 24190693, 30342322, 34836850, 36506461, 35164436, 32246401, 28452416, 24719470, 21469370, 18843305, 17729301, 16550084, 15963276, 15617726, 15156550, 15488605, 15936615, 16698465, 17431436, 18241635]
6524A8241635J622122J465363J855979K137971L222803L544261M346052N720717
6516D2156903P745811J1488093J4035445J7723320J8973637J6356596J2056234
6509A40536039K918919m457599j0870479j5219002j6078207j5627475j3531287
6502F7670909j1179639r855972o895126n781320m024879l441855k673552k656926
6494B1161640j271900j748572j308015j459668r93232q43819o23547p23352n57021
6485A1632514q14471R7136q54248l71235o300p25125k67288J13318l91815m57832
6475G954654k04443j26116p21993P39240m94893m9367p27244K20167M657J80126
6465F774788P6434J86692l73379K88166m38504k2677q85469M38955n1944m85091
$$ y = [18241635, 19863757, 21329120, 23185099, 25323070, 28545873, 32090134, 36436186, 42156903, 49902714, 61390807, 75426252, 93149572, 112123209, 128479805, 140536039, 143454958, 138997359, 128126880, 112907878, 96829671, 81202196, 67670909, 56491270, 46635298, 39740172, 33958852, 29933973, 26492118, 23818566, 21161640, 19889740, 18141168, 16833153, 15373485, 14380253, 13536434, 12912887, 12189535, 11632514, 10818043, 10915179, 10060931, 9689696, 9683396, 8958271, 8690983, 8804301, 8412486, 7954654, 7750211, 7624095, 6902102, 7641342, 7146449, 7097082, 6369838, 6590005, 6594662, 6774788, 6851222, 7037914, 6664535, 6952701, 6514197, 6491520, 5606051, 6045006, 5993062, 5507971]
6455E507971R1546o00376N60436n41572j43310o3668K96098j14670m96975K15490
6445D710970k19638J9608l24286j99704j37645p1277K88658k33384o9960K54295
6435D017637j20885k69365N67351o13222K92117k59325J92935j97581j69977k14224
6425C225461N5028q1456l74825p498N53438l36751p8038k35743K67483j99653
6415B787446Q2627n02145L15231K30175J18175l4300J44717n29524m16164J16943
6405B313181K90682j93800K13751j59411o8340M67406k5757j90277K41042o86835
6395B201642L76706l1543j52989P7426K47232j94344J55840p0719j83286R8143
6385B524108q8541M26742k13661K88543j08236j11626p46516N31211J60587K08424
$$ y = [5507971, 5599517, 4999141, 5559577, 5018005, 4874695, 4811027, 5107125, 4992455, 4495480, 4710970, 4491332, 4510940, 4186654, 3986950, 3849305, 3778028, 4066686, 3833302, 3763342, 4017637, 3896752, 3627387, 4194738, 3581516, 3873633, 3614308, 3807243, 3609662, 3439685, 3225461, 3280489, 3199033, 2824208, 2816710, 3370148, 3033397, 2955359, 2719616, 2987099, 2787446, 2870073, 2367928, 2683159, 2913334, 3031509, 2997209, 3141926, 2612402, 2196238, 2313181, 2603863, 2410063, 2623814, 2464403, 2396063, 2863469, 2837712, 2647435, 2888477, 2201642, 2578348, 2546805, 2393816, 2471242, 2718474, 2524130, 2679970, 2609251, 2425965, 2524108, 2435567, 2862309, 2648648, 2937191, 2828955, 2717329, 1970813, 2502024, 2662611, 2871035]
6375B871035l60370K52L47000l61116L29723J93592R4628N3460L05431J80304
6365C653939p64762O31878k04887k605L4971P458M41776k6190M68446Q7083p7734
6354D249373N77200r42014P70621K07395k26248n33708L57046K3300o15095J37841
6344D005711O40031J27528M92512J68478M35515M86849l3984n24511r4121O77504
6334F381512o71635r0717q6445K15927m03766l03218k93181L17341k25195m79341
6324D361282j63466J9407R3609q1149J59791Q6551l55864m1207j04517L93587
6314D368024M3668L40979k67265n51691K58890M04003o29016l0886m150j87645
6304C744911k740L15966J13165q55996n1680l28157J28929N55367j33559J23091
$$ y = [2871035, 2510665, 2510917, 2857917, 2496801, 2826524, 3020116, 3114744, 3168204, 3473635, 3653939, 2889177, 3521055, 3316168, 3313563, 3348534, 3355992, 3797768, 3771578, 4240024, 4327107, 4249373, 4826573, 3884559, 4655180, 4862575, 4636327, 4102619, 4459665, 4482965, 3867870, 4005711, 4645742, 4773270, 5265782, 5434260, 5869775, 6356624, 6322640, 5798129, 5704008, 6381512, 5709877, 5619160, 5532715, 5748642, 5344876, 5041658, 4748477, 5065818, 4840623, 4361282, 4197816, 4217223, 4310832, 4229683, 4389474, 4476025, 4120161, 4078954, 3974437, 4368024, 4411692, 4752671, 4485406, 3933715, 4192605, 4596608, 3967592, 3936706, 3932556, 3744911, 3742171, 4058137, 4171302, 3315306, 3263626, 2935469, 3064398, 3619765, 3486206, 3609297]
6294C609297J5407m85860k23011j842k24332L27852J20082k13648L08809Q7272
6284C320026L40575M03251j41149K69666j06152O4756n24161L69572n73001k50010
6274C173373r7082L8640L24555J92565l36121m89867k4594J54164M28623l44753
6264C019503J75125o96681M18365m38668N42778P8669m88831J62747J59260K16600
6254C148867J7674J22750M31605n27613r5029M5026N41456m35467J07437L10322
6244C667028n95721k47519L99831K63030j02350j61643M88353Q6288j10264M26734
6234D113767l2283M6375j99076N48529K50691J14954m0113l74559L58330m74911
6224D311704n92348J85681N18596k15373m08089M8634J17706q1792J68491k49270
$$ y = [3609297, 3624704, 3138844, 2915833, 2913991, 2689659, 3017511, 3137593, 2923945, 3232754, 3320026, 3660601, 4063852, 3922703, 4192369, 4086217, 4150973, 3626812, 3996384, 3423383, 3173373, 3076291, 3114931, 3439486, 3632051, 3295930, 2806063, 2781469, 2935633, 3364256, 3019503, 3194628, 2497947, 2916312, 2477644, 3020422, 3099091, 2610260, 2773007, 2932267, 3148867, 3166541, 3289291, 3720896, 3193283, 3098254, 3143280, 3684736, 3249269, 3356706, 3667028, 3071307, 2823788, 3223619, 3486649, 3384299, 3222656, 3711009, 3797297, 3687033, 4113767, 4081484, 4127859, 3928783, 4477312, 4728003, 4842957, 4802844, 4428285, 4786615, 4311704, 3719356, 3905037, 4423633, 4208260, 3800171, 3848805, 3966511, 3884719, 4053210, 3803940]
6214C803940K97220l43271O2628j19762O78253o97346K56684k36698P40384k38993
6204D203039J71442J34031n01404j2279O96696n00664K10669k25714j5684k94499
6194C865633J35246q573L11360K62700L12592l73120M00682l19351K30500O2797
6184D880466M22398M1281n02724L07752l42753M34116Q4716j78610n1550K79461
6174E374553l97549j9300J511M1601R4915k32186N7789J65177K8921L83013M4523
6163E542968K40280k24840M37815k32501J12082O66331l0626p6734l7006K38186
6153F635955j8237m33274K92329R62796k32558M28907N6824l28284M60699J82260
6143H007417J12889K39007O9987M31713M6234L72705r3526M65760M1287K74737
$$ y = [3803940, 4101160, 3757889, 3820517, 3700755, 4379008, 3681662, 3938346, 3701648, 4442032, 4203039, 4374481, 4508512, 4007108, 3994829, 4691525, 4190861, 4401530, 4175816, 4160132, 3865633, 4000879, 3992306, 4303666, 4566366, 4878958, 4505838, 4906520, 4587169, 4817669, 4880466, 5302864, 5344145, 4841421, 5149173, 4806420, 5240536, 5325252, 5146642, 5095092, 5374553, 4977004, 4957704, 4959215, 5000816, 5095731, 4863545, 4921334, 5086511, 5115432, 5498445, 5542968, 5783248, 5558408, 5996223, 5763722, 5875804, 6542135, 6511509, 6434775, 6397769, 6635955, 6617718, 6184444, 6476773, 7439569, 7207011, 7635918, 7692742, 7364458, 7825157, 8007417, 8120306, 8359313, 8429300, 8861013, 8907247, 9279952, 9186426, 9652186, 9693473, 9968210]
6133I968210L61404j2113L0014k31469J34075K68110m92805N02232K00008J69964
6123A0897630K16102j78832P97349L09063J31522K97931L98204O43832K81946
6114A3794747N57624J15997O35293K89608Q21064P27464J049008Q28376Q81901
6105A9701082K016131O97336K112241J603198J965774L068554L307545M743671
6097C9215532O347889R068209J1369334J3494506J4503061J1415182Q113892J993574
6089A15521179l785556n590465r577158q388901o809893n297841l321883j032329
6081G1717153P32432J989792L610148L759343N149924N864016P102421Q230223
6073A08155452R880597R882554R476473Q253830M660683J548618j426400m915353
$$ y = [9968210, 10329614, 10317501, 10347515, 10116046, 10250121, 10518231, 10025426, 10527658, 10727666, 10897630, 11113732, 10934900, 11732249, 12041312, 12172834, 12470765, 12868969, 13512801, 13794747, 14352371, 14468368, 15103661, 15393269, 16214333, 16941797, 17990805, 18819181, 19701082, 21717213, 22414549, 24526790, 26129988, 28095762, 31164316, 34471861, 39215532, 45563421, 54631630, 66000964, 79495470, 93998531, 105413713, 113527605, 115521179, 111735623, 106145158, 96568000, 88179099, 81369206, 76071365, 72749482, 71717153, 72449585, 74439377, 78049525, 81808868, 86958792, 92822808, 99925229, 108155452, 118036049, 127918603, 137395076, 145648906, 150309589, 151858207, 150431807, 145516454]
6065A45516454o828634p131851q036296q073328p653173p016344o863199n417410
6057H8496219m240539l733331k421586k145872N05664J232504M402323P238361
6049H9333743J1742141J2234089J0278869O184694k82613o466092j0937555j3758120
6041I8329156j3110967j1419443j1319005q725565o580072o090561m578546k985521
6033C3519476k525106j962441k089386j467276j257613j009837n13779j299795
6025B1394243j038005o86462j91598l52302p30303L11080q19252n00159K34650
6016A7621892K71431o2735j259760r8566m44889r03969l95832q43736l39032k51691
6006A3293113n60923j51989j17127k81738n44182l195j74879L22091r8859q29159
$$ y = [145516454, 138687820, 131555969, 123519673, 115446345, 107793172, 100776828, 93913629, 88496219, 84255680, 80522349, 78100763, 75954891, 76460555, 77693059, 82095382, 89333743, 101075884, 113309973, 123588842, 129773536, 129490923, 123024831, 112087276, 98329156, 85218189, 73798746, 62479741, 53754176, 47174104, 41083543, 36504997, 33519476, 30994370, 29031929, 26942543, 25475267, 24217654, 23207817, 22694038, 21394243, 20356238, 19669776, 19478178, 19125876, 18395573, 18706653, 17887401, 17387242, 17621892, 17893323, 17830588, 16570828, 16472262, 16027373, 15123404, 14727572, 13883836, 13544804, 13293113, 12732190, 12580201, 12463074, 12181336, 11637154, 11633959, 11459080, 11781171, 11682312, 10853153]
5996A0853153Q95057k87690k8769o2545L07838m14920l3412M34037j102414J29118
5986A0689453n54550n80772l24538Q1834r4576k22265n72525j49999N63935m72316
5976H363681Q6504J45452j66899L28075k65336j82431K18280k60182J61745k01220
5966H227669K41593R3148J79051k40510j57577N0830M52485j2761J42293R2131
5956I068352k81065R7191K13865j35048m7980p3446m65821M54548K6747J73461
5946I030804l66420J43080K26604J70419K98644L06416k5779M93436m42372K38537
5936A0073369m69892O62751k42448j30557J5872O0825j85102l51995M08728K15368
5926A0056919K94481n57473L44047j51790N01140j79638l522p8053O87225n95
$$ y = [10853153, 11748210, 11460520, 11431751, 11369206, 11677044, 11262124, 11228712, 11662749, 10560335, 10689453, 10134903, 9554131, 9229593, 9311427, 9216851, 8994586, 8422061, 8272062, 8835997, 8363681, 8450185, 8595637, 8428738, 8756813, 8491477, 8309046, 8527326, 8267144, 8428889, 8227669, 8469262, 8562410, 8741461, 8500951, 8343374, 8394204, 8846689, 8833928, 8976221, 9068352, 8787287, 8884478, 9098343, 8963295, 8915315, 8841869, 8376048, 8830596, 8857343, 9030804, 8664384, 8807464, 9034068, 9204487, 9503131, 9809547, 9783768, 10277204, 9834832, 10073369, 9603477, 10266228, 10023780, 9893223, 9909095, 9969920, 9784818, 9432823, 9841551, 10056919, 10351400, 9793927, 10137974, 9986184, 10487324, 10307686, 10304164, 10226111, 10913336, 10912741]
5916A0912741J38640L86205J30626K16911M90494N1578M56961L51581r0713L95902
5906A3440926O04378J09888K58384N59852N99266K98371P99729N10550L12218
5897A7493562J801492O65907P80883J584602J094609K048635K053996K117609
5889B9641295L040880K903228L262917M116653M337277N096002M801702M462621
5881F1662575M153593L726828K781320J694452J234081l24619p74249j356587
5873G2797394j877013k658782k816921l234479l082232k153527j491148j568375
5865E3914917j380024k23640P15419J006261J972381K443735M346278M541456
5857F7336783O237809P105151Q366725R238340Q708279R252724Q697796Q134881
$$ y = [10912741, 11051381, 11437586, 11568212, 11785123, 12275617, 12327195, 12784156, 13135737, 13045024, 13440926, 14045304, 14155192, 14413576, 14973428, 15572694, 15871065, 16670794, 17181344, 17493562, 19295054, 19960961, 20741844, 22326446, 23421055, 25469690, 27523686, 29641295, 32682175, 35585403, 38848320, 42964973, 47302250, 52398252, 57199954, 61662575, 65816168, 69542996, 72324316, 74018768, 75252849, 74928230, 74153981, 72797394, 70920381, 68261599, 65444678, 62210199, 59127967, 56974440, 55483292, 53914917, 52534893, 52311253, 53026672, 54032933, 56005314, 58449049, 62795327, 67336783, 73574592, 80679743, 89046468, 98284808, 106993087, 116245811, 124943607, 133078488]
5849A33078488N740965M079384J775462j197146j871669m870896o566236p291958
5841A22876394q428432r023238p657934q270502p132468o724932n086528m428051
5833F6124309l613806k670019j818127j399207m40672M87155J412696J413813
5825E9496142K851127L831558M545811N571818N147855O288253N278078L900077
5817I6910719L000721O27961j544518l784369m671915n257902p149731o461968
5809G1668998o572720n689427n399082l821662l538306l371646k819703k042219
5801C8414233j803160j037455j339886q15859p06088o60419j004965K22181m91065
5792C0777517n7491l73618K95258j01974k18853J99646J25584L35081N58018n55873
$$ y = [133078488, 138819453, 142898837, 144674299, 143477153, 141605484, 136734588, 130168352, 122876394, 114447962, 105424724, 97766790, 89496288, 82363820, 75638888, 70552360, 66124309, 62510503, 59840484, 58022357, 56623150, 56182478, 56669633, 58082329, 59496142, 62347269, 66178827, 70724638, 76296456, 81444311, 87732564, 93010642, 96910719, 99911440, 100539401, 98994883, 95210514, 90538599, 85280697, 78130966, 71668998, 65096278, 59406851, 54007769, 50186107, 46647801, 43276155, 40456452, 38414233, 36611073, 35573618, 34233732, 33417873, 32711785, 32051366, 31046401, 31268582, 30777517, 30720026, 30346408, 30641666, 30539692, 30320839, 30520485, 30646069, 30981150, 31539168, 30983295]
5782C0983295J081491j42735J46997L50496J249740L08620O46043P8422J433487
5773C6135856N69208J074272J337784J962968J270483J852413L048315K774108
5765E0025407M109542M301928O036725Q886966R327661J0492620J0836754R784561
5757A13802164O517394L582983m44598l536287n602957o003780n484768m994060
5749I7836091k882853j350256j84665J020180J427598K731812L640090N331509
5741A07569506O520191R194702J2021294J2585302J5117111J5756266J3878400
5734A92642772J1649700P907516M254306J298046l099704m374527n935730n820659
5726A98521720n345526m135733j957874n703K427029L832633M013810M360200
$$ y = [30983295, 32064786, 31922051, 32069048, 32419544, 33669284, 33977904, 34623947, 34702369, 36135856, 36705064, 37779336, 39117120, 41080088, 42350571, 44202984, 47251299, 50025407, 54134949, 58436877, 64473602, 73360568, 82688229, 93180849, 104017603, 113802164, 120319558, 123902541, 123457943, 119921656, 114318699, 108314919, 102830151, 97836091, 94953238, 93602982, 93418317, 94438497, 95866095, 98597907, 102237997, 107569506, 114089697, 123284399, 135305693, 147890995, 163008106, 178764372, 192642772, 204292472, 212199988, 216454294, 217752340, 214652636, 210278109, 204342379, 198521720, 193176194, 189040461, 187082587, 187076884, 189503913, 193336546, 197350356, 201710556]
5718B01710556L568466K431422K257763K545640M713528O466894R514714J0242938
5710B43451921R237039O007654M36843m145308p443380r957431r965188r537043
5702B18085107q166089p370528n307070l610500k571978m05810P13980K940437
5694A94307549M848158N585877O050832N045225K584831j177277n051598p326865
5686B04866732r788267j0038616r962594r343363q505439p589284o602364m614284
5678A38422521n108229m319859m320350m294376l848455l261393l190469k721410
5670A07357980k612106j466144j91691L29971J206738L231945L600523K858675
5662A14315891L147330J456390r46900k740178m223653n316481n093130n212413
$$ y = [201710556, 205279022, 207710444, 209968207, 212513847, 217227375, 223694269, 233208983, 243451921, 252688960, 258696614, 259133457, 254988149, 247544769, 237587338, 227622150, 218085107, 209919018, 202548490, 197241420, 193630920, 191058942, 190653132, 191367112, 194307549, 199155707, 204741584, 210792416, 215837641, 218422472, 217245195, 212193597, 204866732, 195078465, 185039849, 175077255, 165733892, 157228453, 149639169, 143036805, 138422521, 133314292, 128994433, 124674083, 120379707, 116531252, 113269859, 110079390, 107357980, 104745874, 103279730, 103088039, 103418010, 104624748, 107856693, 111457216, 114315891, 117463221, 118919611, 117972711, 115232533, 111008880, 105692399, 100599269, 95386856]
5654I5386856m969040l527004m197138k505690l000930k264746k241369j492491
5646G1188448j653703j518298o89607j519124j109825j53240K58876l88531O8400
5637F4483396O34768P12861J143601Q04037J442922R07441M50670J355010M90848
5628G2425554M01830o25913J32216p47055o39203p73844l95142q38092j084445
5619F7855906j049813p18101q83702p62492j150798p89009K49028o80686L14910
5610F2385243N05362l10717K19234P54911O78597N31413J144602J441624Q24976
5601F8175245J147154M92904J63662m8983n79701k7784m20362p99020l53772j475867
5591F6273476j007525j338089j29012j548826j510794j107571r13951l50824j558005
$$ y = [95386856, 90417816, 86890812, 82693674, 80187984, 77187054, 74922308, 72680939, 71188448, 69534745, 68016447, 67326840, 65807716, 64697891, 64544651, 64803527, 64414996, 64483396, 65118164, 65831025, 66974626, 67778663, 69221585, 70129026, 70579696, 71934706, 72425554, 72827384, 72201471, 72333687, 71586632, 70947429, 70173585, 69778443, 68940351, 67855906, 66806093, 66087992, 65204290, 64441798, 63291000, 62501991, 62751019, 62070333, 62385243, 62890605, 62579888, 62799122, 63554033, 64232630, 64764043, 65908645, 67350269, 68175245, 69322399, 69815303, 69978965, 69929982, 69350281, 69322497, 68902135, 68103115, 67749343, 66273476, 65265951, 63927862, 63798850, 62250024, 60739230, 59631659, 58717708, 58366884, 56808879]
5582E6808879l26037o44404l36489J42292J98386L53083J266266J098650J403534
5573E9964160J229509J617617J725868R55471N48922M59914o91310j128284q94679
5564F3787188j933075k031456k391682k321881j679766k565479j950225j853629
5556D7059995r07405j203668q35900j444275m48393q73434o06405k15440N35317
5547D1060392l96506L81324j53323M74255k6801Q46124O16221n79442k03174n09804
5537D1509266j134112j450956j573478j361593j653850j639367j699625j845317
5529B9150968j277185j053960j191496q40419r56185p60934n17724j65215n12868
5520B1874982l66878o5056n13389k27381n16885j11881l56492n7603K70916m51082
$$ y = [56808879, 56482842, 55838438, 55501949, 55644241, 55842627, 56195710, 57461976, 58560626, 59964160, 61193669, 62811286, 64537154, 65492625, 66041547, 66501461, 65810151, 64681867, 63787188, 61854113, 59822657, 57430975, 55109094, 53429328, 50863849, 48913624, 47059995, 46152590, 44948922, 44113022, 42668747, 42220354, 41346920, 40740515, 40525075, 41060392, 40663886, 41045210, 40891887, 41366142, 41339341, 42185465, 42801686, 42222244, 42019070, 41509266, 40375154, 38924198, 37350720, 35989127, 34335277, 32695910, 30996285, 29150968, 27873783, 26819823, 25628327, 24787908, 23831723, 23070789, 22553065, 22387850, 21874982, 21508104, 21443048, 20929659, 20702278, 20185393, 20073512, 19717020, 19659417, 19930333, 19479251]
5510A9479251p9325k21029l91208l60191N70276m90533J75926O20635j37725m50918
5500A8715159K80130K75974m42073k24897K87864O39050j45620m24650P19857
5491A9680794M956Q10138j3377K2034P74669R4400J02900P78279M27587L87143
5481B3069523J79562J66904N04578P49651L68381O37583J243782J23833L24160
5472B7367957N22251L33367O41436L1295Q27664m02958K84302l1151M27202K15794
5462C0217159P78625O97152R4664R1503R90364L11980l06449N71166J013463M5864
5452C4505491J329725O32257M05869L88618Q20686O14196O84080P92873R19038
5443D1092833J36568k39379Q07759O57919R11167M47097R44201N42900M09087
$$ y = [19479251, 19399926, 19178897, 18787689, 18427498, 18997774, 18507241, 18683167, 19303802, 19166077, 18715159, 18995289, 19271263, 18829190, 18604293, 18892157, 19531207, 19385587, 18960937, 19680794, 19685750, 20495888, 20482511, 20504545, 21279214, 21373614, 21476514, 22254793, 22682380, 23069523, 23249085, 23415989, 23920567, 24670218, 25038599, 25676182, 26919964, 27043797, 27367957, 27890208, 28223575, 28865011, 28896306, 29723970, 29321012, 29605314, 29574163, 30001365, 30217159, 30995784, 31692936, 31787600, 31879103, 32869467, 33181447, 32874998, 33446164, 34459627, 34505491, 35835216, 36467473, 36873342, 37261960, 38082646, 38696842, 39380922, 40173795, 41092833, 41229401, 40990022, 41797781, 42455700, 43366867, 43813964, 44758165, 45301065, 45710152]
5434D5710152O53988P76235M03627L45711j52401L96011o84575R14531n91077
5425D7772202r58452l1140r8076M17424l98299M5693J136143L05261Q31927J852448
5415E0875131R89456J807877J065287O61786R30348P78872M43290Q69757l13268
5406E8108536K83522j285854j04979j141874o67968j584709j426460j723399j498963
5397D8957852j029617j388423m14813n24480r38132j080098j06428k85521R5250
5388D3285590O8020p73454L2663J44703n84357m22331p18198r37599r87084r92401
5378C8115552j110135r25911p97618j795139k44124p66523q75833j099095l96904
5369C0104270o88120o43220m04008l37416n33980o62763j57650p03874k95605
$$ y = [45710152, 46364140, 47140375, 47544002, 47889713, 47737312, 48133323, 47448748, 48363279, 47772202, 46813750, 46782610, 46684534, 47101958, 46703659, 46749352, 47885495, 48190756, 49022683, 50875131, 51864587, 53672464, 54737751, 55399537, 56329885, 57108757, 57552047, 58421804, 58108536, 58392058, 57106204, 57001225, 55859351, 55191383, 53606674, 52180214, 50456815, 48957852, 47928235, 46539812, 46124999, 45600519, 44662387, 43582289, 43475861, 43190340, 43285590, 43353610, 42580156, 42612819, 42757522, 42173165, 41750834, 41032636, 40095037, 39107953, 38115552, 37005417, 36079506, 35281888, 33486749, 33242625, 32476102, 31600269, 30501174, 30104270, 29416150, 28772930, 28368922, 28031506, 27497526, 26834763, 26677113, 25973239, 25677634]
5360B5677634l88405l66490K98281o8152m82040r9464k35966J42512j54061n33747
5350B3790102K8068m27675m73611n7111L68942l66868Q2983K39134L88626k91050
5340B3281540j53930M47982m37119K25345n39157k23469N53187L0636k17937l22208
5330B2644870M35797J36600J29365Q42339K10870N05767Q2899M56687J3060J314824
5320B6773078N65753k2321J254406J207768O52553J087394K128558J909620J493746
5311C7050555K318125K441259K160949J859851K450160K089374K412822K757530
5303E5540625J319073K803551J786745K222892J530031K702351J772041K093761
5295G1771070J499209K310784J382726K543463J555194J666546K529855J399561
$$ y = [25677634, 25289229, 24922739, 25221020, 25152868, 24670828, 24571364, 24335398, 24477910, 24323849, 23790102, 23818170, 23390495, 22916884, 22859773, 23228715, 22861847, 22944830, 23183964, 23572590, 23281540, 23127610, 23575592, 23138473, 23363818, 22824661, 22601192, 23154379, 23185015, 22967078, 22644870, 23080667, 23217267, 23346632, 24188971, 24399841, 24905608, 24988507, 25445194, 25458254, 26773078, 27338831, 27316510, 28570916, 29778684, 30431237, 31518631, 33647189, 35556809, 37050555, 39368680, 41809939, 43970888, 45830739, 48280899, 50370273, 52783095, 55540625, 56859698, 59663249, 61449994, 63672886, 65202917, 67905268, 69677309, 71771070, 73270279, 75581063, 76963789, 79507252, 81062446, 82728992, 85258847, 86658408]
5287H6658408K169331J919195K480857K069896J911737K267110J658597J734055
5279A02869186K106219J307522J906610R88662L70885J279665K07357L98229n80576
5270A10853759j92676n98403j063033j270211j751453j904453k340683j747151
5262I9985696k529033k687682k798300k191683k853300l038972k437052k510685
5254G8938989k081971k297298k114057j721444k376033k251736j666491j853244
5246F2576715j806002j852362j833908k802840k381841k659406k257167j933176
5238D5050013k808565k002341j824809k458765j953339j793499j576125j458141
5230B9174429j412295p84335j687602o14711j429427m95979q31637q36027o85243
$$ y = [86658408, 88827739, 90746934, 93227791, 95297687, 97209424, 99476534, 101135131, 102869186, 104975405, 106282927, 108189537, 109178199, 109549084, 110828749, 111036106, 111434335, 110853759, 110661083, 110062680, 108999647, 107729436, 105977983, 104073530, 101732847, 99985696, 97456663, 94768981, 91970681, 89778998, 86925698, 83886726, 81449674, 78938989, 76857018, 74559720, 72445663, 70724219, 68348186, 66096450, 64429959, 62576715, 60770713, 58918351, 57084443, 54281603, 51899762, 49240356, 46983189, 45050013, 42241448, 40239107, 38414298, 35955533, 34002194, 32208695, 30632570, 29174429, 27762134, 26977799, 25290197, 24675486, 23246059, 22750080, 21918443, 21082416, 20397173]
5221B0397173m20687p16368L92115p53494j027105m369m77798q77282q596k77422
5211A6226167L8006n77913K59485n69608j92200J04153n74337K91868L6221k49476
5201A4792366J5396m06504N68901l6281k40735k1097m76290k06058m60511j52914
5191A3376273n53946k72672k01105J22556j08970K96193q86966k02478L41634
5182A1910519k09114m72153P36537k68438M3988K19024J14346m97054K83363P9786
5172A1940804l40119L02378N8292k63597Q9085R8064j62025J07795J80575j02349
5162A1908903K25327k35258K79042J94085P8389o582M23249J40169o2782j81234
5152A2763308J76734M82108K12563P0491J84489J61845J57560K67602K15612K14639
$$ y = [20397173, 19976486, 19260118, 19652233, 18898739, 17871634, 17867265, 17389467, 16512185, 16503589, 16226167, 16264173, 15686260, 15945745, 15376137, 15183937, 15288090, 14713753, 15005621, 15041842, 14792366, 14807762, 14401258, 14970159, 14933878, 14693143, 14672046, 14195756, 13989698, 13529187, 13376273, 12822327, 12549655, 12348550, 12471106, 12362136, 12658329, 11771363, 11568885, 11910519, 11701405, 11229252, 11965789, 11697351, 11741339, 11960363, 12074709, 11577655, 11861018, 11940804, 11600685, 11903063, 11961355, 11697758, 11786843, 11884907, 11722882, 11830677, 12011252, 11908903, 12134230, 11898972, 12178014, 12372099, 12450488, 12443906, 12867155, 13007324, 12944542, 12763308, 12940042, 13422150, 13634713, 13705204, 13889693, 14051538, 14209098, 14476700, 14692312, 14906951]
5142A4906951L6890K84912L27535K83532J02329L54844K53437J54702M14140P58282
5132A7877554R6290N77648P90450P02292L78648Q52823P90429J511944P86205
5123B4364283J185896J657129K876607K716669M105112M367458M562226L511992
5115D9347372K209787O41091m96465j459266j866731j037342k27536l84692R96010
5106D7722228J530377K853305L237054L602389L815445M237001M103560M857461
5098G5958820M644802L971220M946009M476409M883217M177809L254556K383140
5090A08695982M77522J408207l64900L0379q7926j430722J05109P8453L89645
5081A09301749Q5389J075857Q06565Q89933J440220K321430L108619M749774O522730
$$ y = [14906951, 14943841, 15228753, 15556288, 15839820, 15942149, 16296993, 16550430, 16705132, 17119272, 17877554, 17973844, 18551492, 19341942, 20044234, 20422882, 21275705, 22066134, 23578078, 24364283, 25550179, 27207308, 30083915, 32800584, 36905696, 41273154, 45835380, 49347372, 51557159, 52198250, 51701785, 50242519, 48375788, 47338446, 47110910, 46726218, 47722228, 49252605, 52105910, 55342964, 58945353, 62760798, 66997799, 71101359, 75958820, 80603622, 84574842, 89520851, 93997260, 98880477, 103058286, 106312842, 108695982, 109173504, 110581711, 110216811, 110247190, 110159264, 108728542, 108833651, 108912104, 109301749, 109387138, 110462995, 111269560, 112159493, 113599713, 115921143, 119029762, 123779536, 130302266]
5072A30302266R199995R434074Q518729O091657K623551j068837l353198n253890
5064A56494347o316460n925635m886811l678341l340923j292719n21452m29067
5056A30102939M56199J200383K425300K237365K776369K046161J925473K721564
5048A45891753K419168L038866L658271J729468J759753l68185o08235j725420
5040A55795439k574360l754392l843048m604594m234605n212560l860435m715362
5032A22996083m408884m090287l134568k858883j730401L6372R63368J163036
5024A08935836J855479K797659K032117J478783J032035J379860J985716J965437
5016A23462922K885200K065900J908054O45772o50515j294780k164691k794264
$$ y = [130302266, 139502261, 148936335, 157455064, 163546721, 166170272, 165101435, 161748237, 156494347, 150177887, 144252252, 139365441, 135687100, 132346177, 131053458, 130532006, 130102939, 130559138, 131759521, 134184821, 136422186, 139198555, 141244716, 143170189, 145891753, 148310921, 151349787, 155008058, 156737526, 158497279, 158129094, 157520859, 155795439, 153221079, 149466687, 145623639, 141019045, 136784440, 131571880, 127711445, 122996083, 118587199, 114496912, 111362344, 108503461, 106773060, 106809432, 107772800, 108935836, 110791315, 113588974, 115621091, 117099874, 118131909, 119511769, 121497485, 123462922, 126348122, 128414022, 130322076, 130967848, 130317333, 129022553, 126857862, 124063598]
5008A24063598k857218l495870k021726k487964k036082j920982k658616k999372
5000A03585768l870992l553806k615539k486856k224532n78511J03637J075122
4992H9434291J765644L260648L428328L435006L035853L197119J495399M81626
4984A09533914j685515k288942k812138k799745k911286j898294j682308j123240
4976I2332446o62638k02247r6584r42516j356563l020624k851564l232443k703514
4967G7263753j744392n09056j86323M33641Q30156P71479J132514N09289M54015
4958G8955076j34671o34989j309359j294336q50736K60582p4333K231854L205399
4949H0354487O582537J0121075K0960688M7507259P5312494P9921512N1720781
$$ y = [124063598, 121206380, 117710510, 115688784, 113200820, 111164738, 109243756, 106585140, 103585768, 99714776, 96160970, 93545431, 91058575, 88834043, 88255532, 88359169, 89434291, 91199935, 94460583, 97888911, 101323917, 104359770, 107556889, 109052288, 109533914, 107848399, 105559457, 102747319, 99947574, 97036288, 95137994, 93455686, 92332446, 91669808, 91467561, 91370977, 90428461, 89071898, 86051274, 83199710, 79967267, 77263753, 75519361, 75010305, 74823982, 75257623, 76087779, 76859258, 77991772, 78501061, 78955076, 78820405, 78185416, 76876057, 75581721, 74730985, 74991567, 74917234, 77149088, 80354487, 86937024, 97058099, 118018787, 165526046, 240838540, 320760052, 372480833]
4942C72480833O718456k6599663m7712902o0649769n1502126l7865794l0223733
4935A24645302k3929936j7018068r528997n929208m656634m640129m387705l591684
4927E0962941l429877l268123l240369k809840j931777j541064j068727j455099
4919C2218065q72597j428746j2481l45873j50430l22280o68050n41896n37497
4910B7338215q99398p90703o94660r22597l39619n17061m88715j242714K8974
4901B1471722o53707p72669k32569o17847k27397N0553m21753m11305n02287J09495
4891A7792236m33230k97103m741j72680q3941p17261k73912j88007K90998j41969
4881A5770390N384L941K52696k42778k27082R9574K22572k57439O4441p05718
$$ y = [372480833, 379199289, 352599626, 304886724, 244236955, 192734829, 154869035, 124645302, 100715366, 83697298, 74168301, 68239093, 63582459, 58942330, 54554625, 50962941, 47533064, 44264941, 41024572, 38214732, 36282955, 34741891, 33673164, 32218065, 31345468, 29916722, 29904241, 29558368, 29407938, 29085658, 28417608, 27875712, 27338215, 26438817, 25648114, 24953454, 24030857, 23691238, 23174177, 22685462, 21442748, 21471722, 20818015, 20045346, 19812777, 19194930, 18967533, 19018086, 18596333, 18185028, 17682741, 17792236, 17359006, 17061903, 17057162, 16884482, 16800541, 16083280, 15809368, 15621361, 15912359, 15770390, 15775774, 15779715, 16032411, 15789633, 15562551, 15662125, 15884697, 15627258, 15691699, 14985981]
4871A4985981M37974k3766r748K5559j67999p5099L66067K61496m69627M98473
4861A5829311l74921N6397p7331M26011k62927K60033j63417N14032k24571O39034
4851A6621651m5043M71952k93907M23242M12703O1984Q151M74330K42070j95143
4841A8181990N27922L60528Q25007P64808N6499P78863P4230L52083O38518Q00239
4831B3360687J56385M50575K30545M54375M88549J278825J395353r6734J748935
4822B9467495O59448J255336J599156L36557J428466L99147J512596J144803O34296
4813C8437300J147102J134312J446051J974099O16681J654001J803327R83972
4805D9196845J837785J034344K015780K022639J816850L586814K276369K948784
$$ y = [14985981, 15423955, 15400189, 15390441, 15416000, 15248001, 15172902, 15538969, 15800465, 15330838, 15829311, 15454390, 15510787, 15433456, 15859467, 15596540, 15856573, 15693156, 16207188, 15982617, 16621651, 16576608, 17048560, 16754653, 17177895, 17590598, 17652582, 17660733, 18135063, 18377133, 18181990, 18709912, 19070440, 19895447, 20660255, 20716754, 21495617, 21569847, 21921930, 22560448, 23360687, 23517072, 23967647, 24198192, 24652567, 25141116, 26419941, 27815294, 27718560, 29467495, 30126943, 31382279, 32981435, 33317992, 34746458, 35145605, 36658201, 37803004, 38437300, 39584402, 40718714, 42164765, 44138864, 44755545, 46409546, 48212873, 49196845, 51034630, 52068974, 54084754, 56107393, 57924243, 61511057, 63787426, 66736210]
4797F6736210K702424K917233L384371K698765K839040K119454K486457K261437
4789H8145391K159003K509801J357408J737657K388996J845284L131283K845267
4781A06120090M248140K935460L939022N202743M975717N581464N390258M957003
4773A43349897N272132L858591M669126K823224K944754K038961K012667J313613
4765A68282965J231639J279487J119826L68854J228543k06894N25145m26223M88748
4756A73892090Q69517J004458J439725J643267K416283K979672K749778L025491
4748A90020281J714005R93225Q35393q05144j536496l057619k505359l479652
4740A82178634l918449l619367m316264l811341l896131m129859k315037l547396
$$ y = [66736210, 69438634, 72355867, 75740238, 78439003, 81278043, 83397497, 85883954, 88145391, 90304394, 92814195, 94171603, 95909260, 98298256, 100143540, 103274823, 106120090, 110368230, 113303690, 117242712, 122445455, 127421172, 133002636, 138392894, 143349897, 148622029, 152480620, 157149746, 159972970, 162917724, 164956685, 166969352, 168282965, 169514604, 170794091, 171913917, 172282771, 173511314, 173304420, 173829565, 173403342, 173892090, 174761607, 175766065, 177205790, 178849057, 181265340, 184245012, 186994790, 190020281, 191734286, 192727511, 193562904, 192757760, 191221264, 188163645, 185658286, 182178634, 178260185, 174640818, 170324554, 166513213, 162617082, 158487223, 156172186, 152624790]
4732A52624790k059872j869073k082940k320262j870931j569570j908267j875414
4724A37068461j523098j819358j668037k735934k298409k749380l409110l635852
4716A17229283l029149k750652l301488l705059l289090l245209l788338k486938
4708I1633360k915594k205256k508021k283749k076223k076059k216458j336671
4700G4015329j592359j996648n81892j954492r18735j777930j175342j249033
4692F2768898o20737o26813j117631R509n28313l60520q84501j057096j206540
4683E6376256j328424o25687j536835j000147j351457k067604q88564j448410
4675D6129128r33524j367721o97109q66477r28398o47050o55159r55639l12867
$$ y = [152624790, 150564918, 148695845, 146612905, 144292643, 142421712, 140852142, 138943875, 137068461, 135545363, 133726005, 132057968, 129322034, 127023625, 124274245, 120865135, 117229283, 114200134, 111449482, 108147994, 104442935, 101153845, 97908636, 94120298, 91633360, 88717766, 86512510, 84004489, 81720740, 79644517, 77568458, 75352000, 74015329, 72422970, 70426322, 69844430, 67889938, 66971203, 65193273, 64017931, 62768898, 62148161, 61521348, 60403717, 60413226, 59884913, 59524393, 58639892, 57582796, 56376256, 55047832, 54422145, 52885310, 51885163, 50533706, 48466102, 47577538, 46129128, 45195604, 43827883, 43130774, 42264297, 41335899, 40688849, 40033690, 39078051, 38765184]
4666C8765184o96531k34723j517738M29827k36583q66006o36270q23431K4300
4657C4208029m36410q09099n73841o45405r77999n53313j128015p89097o02178
4648B7692672j118948p4336j308429m77002l78430l93869r25779m89052p46962
4639B1779865p4665p5146r67186n7546r67668k70982m74872n9444p6279p31489
4629A8024588o06517m39071n31976l55015r77503L5898r3987j054729M3890k05565
4619A3840013o79512o2925k90664n8372m86917n68543m8965L53204l59886p03583
4609A0933850m46348J68186l79365J30400l95849l20245k57759k42050J87010
4600I377830j27682L55647m3815l88959M23091l45206K02883n12223l94722J56149
$$ y = [38765184, 38068653, 37833930, 36316192, 36746019, 36509436, 35643430, 35007160, 34183729, 34208029, 33771619, 32962520, 32388679, 31743274, 30765275, 30211962, 29083947, 28294850, 27692672, 26573724, 26499388, 25190959, 24713957, 24335527, 23941658, 23015879, 22526827, 21779865, 21705200, 21630054, 20662868, 20605322, 19637654, 19366672, 18891800, 18832356, 18756077, 18024588, 17418071, 16979000, 16447024, 16092009, 15114506, 15150404, 15056417, 14001688, 14045578, 13840013, 13160501, 13097576, 12806912, 12748540, 12261623, 11693080, 11644115, 11997319, 11637433, 10933850, 10487502, 10655688, 10276323, 10406723, 10010874, 9690629, 9432870, 9190820, 9377830, 9250148, 9605795, 9561980, 9173021, 9596112, 9250906, 9453789, 8941566, 8546844, 8702993]
4590H702993m21859j38111K05674o1573j97922k37057m21105n4159l8930n02642
4580F835309j08372n5738J78037p70288j62226j61596j16220l23959J45476J43385
4570E603808K52647Q8005o34734J71841j35101k12191K42870k58662k28926n43226
4560D346331r9708j11919k03666P01597k16510J02670k24235j93728j8383J39559
4550D222008m1224L67326n68731P84103p12081J15826n9427k5877j93241m7712
4540C840970J73900Q31640l48905k46023n07740K69153l61197l31636O18055m80309
4530C457908K5748j56778L04157j71491K15290l22523N2447l3506K62112m58753
4520C174611K87992m31290J1924M42197n48343m4212L17008l08680L55360P66
$$ y = [8702993, 8281134, 8143023, 8348697, 8287124, 8089202, 7852145, 7431040, 7376881, 7337951, 6835309, 6726937, 6671199, 6849236, 6078948, 5916722, 5755126, 5638906, 5314947, 5460423, 5603808, 5856455, 5944460, 5309726, 5481567, 5346466, 5134275, 5377145, 5118483, 4889557, 4346331, 4246623, 4134704, 3931038, 4632635, 4416125, 4518795, 4294560, 4100832, 4082449, 4222008, 4180784, 4548110, 3979379, 4763482, 4051401, 4167227, 4107800, 4081923, 3888682, 3840970, 4014870, 4846510, 4497605, 4251582, 3743842, 4012995, 3651798, 3320162, 3938217, 3457908, 3483656, 3326878, 3631035, 3459544, 3674834, 3352311, 3404758, 3371252, 3633364, 3174611, 3462603, 3031313, 3043237, 3485434, 2937091, 2892879, 3209887, 2901207, 3256567, 3257333]
4510C257333M66570n88481j203K34578L16349K37927q4425j102639P27760j19191
4500C344578R7726k15655L11443J01710j56867k71051M46776k75942J13314J7940
4490C513972M69355r4955L75405q94825L7340k84779P70223j26589K76971j99690
4480C842428K85514k73471K79673J82084O7244J46430l78073J66563L8599j18076
4470D238915j05140L04149Q4642Q5112l1448j59093O90939m22543N8149l1117
4460D712565m6298K72911m04097N10624j40319q8081K58572j23736L99711N7498
4450E409350m51206Q31704k25796M68463n71864L46420j733p0114p1151j95762
4440E468311M81826L02999m25113L31754P415O461L89823N36717J59133J38564
$$ y = [3257333, 3723903, 3135422, 3134219, 3368797, 3685146, 3923073, 3838648, 2736009, 3463769, 3344578, 3442304, 3226649, 3538092, 3639802, 3482935, 3211884, 3658660, 3382718, 3496032, 3513972, 3983327, 3888372, 4263777, 3368952, 3406292, 3121513, 3891736, 3765147, 4042118, 3842428, 4127942, 3854471, 4134144, 4316228, 4383472, 4529902, 4151829, 4318392, 4356991, 4238915, 4133775, 4437924, 4522566, 4607678, 4576230, 4417137, 5108076, 4685533, 4743682, 4712565, 4666267, 4939178, 4535081, 5045705, 4905386, 4817305, 5075877, 4952141, 5351852, 5409350, 4958144, 5789848, 5564052, 6032515, 5460651, 5807071, 5805338, 5735224, 5664073, 5468311, 5950137, 6253136, 5828023, 6159777, 6167192, 6173653, 6563476, 7100193, 7259326, 7397890]
4430G397890l35154P60315l53503J11533K13924N17117j48432J33734Q29580Q14024
4420I941028k29761J285839J332160J516846J058389K811076M929104N599353
4412B8244034O634793N552210J757285p28103l314301m507905m824132l811668
4404B5002213k554231k581038j689811j424286m00283R8663m90972m1178O58315
4395A6577392L40551P07171P58825J700646K428478K482411L625287L807633M551431
4386C6979825P150279J0900982J3456645J0409876L407141k557162o828012r480687
4378F3438887r914088q686053o451663n371231l680220k618675j821631n97109
4370B4298217k33961k58654m3598n449P24344K48634J040693L206663L675622
$$ y = [7397890, 7062736, 7823051, 7469548, 7581081, 7795005, 8312122, 8163690, 8297424, 9127004, 9941028, 9711267, 10997106, 12329266, 13846112, 14904501, 17715577, 22644681, 28244034, 34878827, 40431037, 42188322, 41460219, 38145918, 33638013, 28813881, 25002213, 22447982, 19866944, 18177133, 16752847, 16352564, 16451227, 15960255, 15919077, 16577392, 16917943, 17625114, 18383939, 20084585, 22513063, 24995474, 28620761, 32428394, 36979825, 44130104, 55031086, 68487731, 78897607, 82304748, 79747586, 72919574, 63438887, 53524799, 44838746, 38387083, 33015852, 29335632, 26716957, 24895326, 24298217, 24064256, 23805602, 23762004, 23756555, 24480899, 24729533, 25770226, 28976889, 32652511]
4361C2652511M476607L990740K979480L351414L930228N236136M691983K412852
4353F3721951P68060j700010p66304N233671J4093765J8146530J3212234K771588
4345A15481485o507355j1756898j4871385j3994923r525405p940925n980940m686404
4337D0217250k676589p38307N07541r9055J866697J691320R39677J304493N87513
4328D3600540J144656K275668K202259L388213M561589P941748J6446888L4319947
4320A15881508M4292829M0907867J8900396J230858j1713363k1488047k4764961
4313A63247087j8436339j6382017j6500307j5296316j2539522r471642q872639
4306F5748305p273897n080490m504939l440429l082798j957297j656486j180081
$$ y = [32652511, 37129118, 41119858, 44099338, 47450752, 51380980, 56617116, 61309099, 63721951, 64490011, 62790001, 62023697, 67257368, 81351133, 99497663, 112709897, 115481485, 108974130, 97217232, 82345847, 68350924, 58825519, 50884594, 44903654, 40217250, 37540661, 36802354, 37309895, 37210840, 39077537, 40768857, 41708534, 43013027, 43600540, 44745196, 47020864, 49223123, 52611336, 57172925, 65114673, 81561561, 115881508, 160174337, 201082204, 219982600, 221213458, 209500095, 188012048, 163247087, 144810748, 128428731, 111928424, 96632108, 84092586, 74620944, 65748305, 58474408, 53393918, 48888979, 45448550, 42365752, 40408455, 38751969, 37571888]
4298C7571888j97760k95506N06174J757697M527760J2647304J8364119J8838466
4290I3720142R918360n59635q290278j2412298j5395531j2756238q266779p460845
4282C8496898n780308m604434k800662j935685k287448n44487n40470q20608r41371
4273A8241425l86092q88386j051048j020686m66467l90224n71222l61079o73069
4264A2433152n6011o00271j12139o87644l93123o26333p8242K11123j46375k09664
4254I734473l20908l10576k58741J89560J3396j20206q01268l89089Q03382r78464
4244G561559n70199K60057m49886J93881n90608J66469k35100r9871p6733j20436
4234F039133o02766L52380m66128M13424o31525L79030m22455P1436J24898k16072
$$ y = [37571888, 37374128, 37078622, 37584796, 39342493, 43870253, 56517557, 74881676, 93720142, 103638502, 103078867, 94788589, 82376291, 66980760, 54224522, 45957743, 38496898, 32716590, 28112156, 25311494, 23375809, 21088361, 20543874, 20003404, 19182796, 18241425, 17855333, 16966947, 15915899, 14895213, 14428746, 14038522, 13467300, 13106221, 12433152, 12377141, 11776870, 11664731, 10977087, 10583964, 9957631, 9879389, 10090512, 9944137, 9734473, 9413565, 9102989, 8844248, 9033808, 9047204, 8926998, 8125730, 7736641, 8540023, 7561559, 6991360, 7251417, 6801531, 6995412, 6404804, 6571273, 6336173, 6236302, 6159569, 6039133, 5436367, 5788747, 5322619, 5736043, 5104518, 5483548, 5061093, 5132529, 5257427, 5041355]
4224E041355j82435o5187O4647m69903l26887J24649J82566k51659q7615k30824
4214C798707L34525L6404j87001n95657L26885n4760l21286O21707k15902J25039
4204C868661n16248K2054l733K77586l00453p79420M07367k18899M66403p6150
4194C147168j92374M46514k55201j81597K88780m6867l77304K86958m16497M6444
4184B746024j09051m64742L96647K58140p7902m67107K65246J3796K26100o40535
4174B146616K15222q4679m09009J68153L88085o65292j36801k51788O60170n40213
4164A490464M24261R5791l39423J56569J19397k33303N91789j97460J00788j48487
4154B060386n10206l04150M70007J12076p11268J62014N4310l13039O13811K20145
$$ y = [5041355, 4858920, 4793733, 4858380, 4388477, 4061590, 4186239, 4368805, 4117146, 4029531, 3798707, 4133232, 4169636, 3982635, 3386978, 3713863, 3659103, 3337817, 3959524, 3743622, 3868661, 3352413, 3374467, 3370734, 3648320, 3347867, 2568447, 2975814, 2756915, 3223318, 3147168, 2954794, 3401308, 3146107, 2964510, 3253290, 3206423, 2829119, 3116077, 2699580, 2746024, 2636973, 2172231, 2568878, 2827018, 2749116, 2282009, 2547255, 2561051, 2787151, 2146616, 2361838, 2277159, 1868150, 2036303, 2424388, 1759096, 1622295, 1370507, 2030677, 1490464, 1914725, 2010516, 1671093, 1827662, 1947059, 1713756, 2305545, 2108085, 2208873, 2060386, 1550180, 1246030, 1716037, 1828113, 1116845, 1278859, 1333169, 1020130, 1633941, 1854086]
4144A854086n27944K33288k62746R9332m13027N37348n88302L25198J13608L0828
4134A401669p1609J59442k6862L01773l64731L61455L29940l00892k95584J50529
4124A645130n33000k89283j5455L56639r8147Q58489q85430j76839j82764L52228
4114A031568L2291M28890J07902q3211n76276J03235K29546k98626K20733M0516
4104A236568k10935K19327o00757R67843o26365n1782L59498J57298K99836M83872
4094B234403k73665o91263J03466k57833K69946l86442J82073K75147n59418K83845
4084A180259l291K35537J66496j1235o1348M8637n04211M35401P3292k12216l29228
4073A018093K20645j66774K19817J88327k19035N94220m73125P16231K90309P6452
$$ y = [1854086, 1326142, 1559430, 1296684, 1396016, 982989, 1520337, 932035, 1257233, 1370841, 1401669, 1330060, 1489502, 1462640, 1764413, 1399682, 1761137, 2091077, 1790185, 1494601, 1645130, 1112130, 822847, 807392, 1164031, 1065884, 1924373, 1038943, 862104, 679340, 1031568, 1063859, 1492749, 1600651, 1517440, 941164, 1044399, 1273945, 975319, 1196052, 1236568, 1025633, 1244960, 644203, 1612046, 985681, 933899, 1293397, 1450695, 1750531, 2234403, 1960738, 1269475, 1372941, 1115108, 1385054, 998612, 1180685, 1455832, 896414, 1180259, 1176968, 1412505, 1579001, 1567766, 1506418, 1555055, 1050844, 1486245, 1559537, 1347321, 1018093, 1238738, 1071964, 1291781, 1480108, 1261073, 1855293, 1382168, 2098399, 2388708, 2465160]
4063B465160k06945j03743m64160M54196l88207M52086m46910M25842J14911J60725
4053B462955k80867N18189k19016N06962m66207L39104j95169P01250q9392L11039
4043C588848J15428n26758K95054N01653N99452k76693o43241J41233L30506l77712
4033C747770N3918P43152n46594L8063P9393P97408m90536K33169M3463k4887
4023D674319L54658L99248L48912J08480R8851O76467M21925L58330o7290k73007
4013G100893M89933j049862n80226l74680J56680l62959j07170m17388j25715
4004D729506K67979L30886P08248j37035p4085M20807j0358L40147J55643O1888
3994F793626K45194l70229j06895l817J94871p0661O9336n07810o79392j96165
$$ y = [2465160, 2258215, 2154472, 1690312, 2144508, 1756301, 2208387, 1761477, 2187319, 2302230, 2462955, 2182088, 2700277, 2481261, 2988223, 2522016, 2861120, 2665951, 3367201, 3277809, 3588848, 3704276, 3177518, 3472572, 3974225, 4573677, 4296984, 3653743, 3794976, 4125482, 3747770, 3801688, 4544840, 3998246, 4036309, 4115702, 4913110, 4422574, 4655743, 4699206, 4674319, 5028977, 5428225, 5777137, 5885617, 5984468, 6660935, 7082860, 7441190, 7373900, 7100893, 7590826, 6540964, 5960738, 5586058, 5742738, 5379779, 5272609, 4855221, 4729506, 4997485, 5328371, 6036619, 5899584, 5825499, 6246306, 6235948, 6576095, 6731738, 6793626, 7038820, 6668591, 6561696, 6557879, 6752750, 6682089, 6751425, 6243615, 5564223, 5368058]
3984E368058J66506o13542L83270l66961k82900L25241j50540O21100p60187L13895
3974E003940k27068l37993q711k6524J91485m4565p49633M86403m66878j60963
3964C659493m75815m7276J06880o15253n22969O32769o95005O7940r8595L60031
3954B372200l67506j41133j13341p8062J40522j13002K82972j60560k54534l15617
3944A251939R4895l17735L80563o58440J10117J86445k19452N507J32218J48902
3934A114959o03262Q5715J0272l9451J98496q9950j30514O6549k46487J83004
3924E49331j21813k91030L27826K14630m73100M06737j70275n09401O08769J49177
3914F90851j84332j65916J85595j12049L2663j81110K62334j17520n1323j08358
$$ y = [5368058, 5534564, 4921022, 5304292, 4937331, 4654431, 4979672, 4829132, 5450232, 4690045, 5003940, 4776872, 4438879, 4430168, 4403644, 4595129, 4550564, 3800931, 4287334, 3820456, 3659493, 3183678, 3136402, 3243282, 2628029, 2105060, 2737829, 2042824, 2110764, 2012169, 2372200, 2004694, 1863561, 1750220, 1672158, 1812680, 1699678, 1982650, 1822090, 1567556, 1251939, 1346834, 1029099, 1409662, 751222, 861339, 1047784, 828332, 833839, 966057, 1114959, 511697, 597412, 607684, 568233, 766729, 676779, 546265, 612814, 366327, 549331, 427518, 136488, 464314, 678944, 205844, 612581, 442306, -67095, 541674, 690851, 506519, 340603, 526198, 414149, 446812, 265702, 528036, 410516, 359193, 250835]
3904B50835k29795p0779J29312k6648n3257J48938m6462J12377K21744l13712
3894A22553M6237m27230L4762J11520L86741o21564K89117k61112L8022q8284
3884c69238J91398M63055L42675j84022m71925O5173K3644p2287L16575n70672
3874b65624k9454M09338q37361l380M83793O7562J72284k48712K74704j93481
3864a70331O1201M11674l76645M87465q97976o1769P9226J28113l32677N1905
3854f19814J36881L91647l50307M74334j70671j26329m076J2144K37991n06757
3844e24957M67588n68885k56817l75856J55524L72576j72772r1792M82922L59139
3834a53330m0089k81978J38601k65036m4602J22443K21781n25949O6843J36376
$$ y = [250835, 21040, -49739, 79573, 52925, -332, 148606, 102144, 214521, 436265, 122553, 168790, -258440, -223678, -112158, 274583, -346981, -57864, -318976, -280954, -369238, -177840, 285215, 627890, 443868, -28057, 37116, 60760, -11527, 305048, -265624, -295078, 114260, -723101, -726481, -242688, -175126, -2842, -251554, 23150, -170331, -109130, 302544, -74101, 413364, -484612, -546381, -467155, -339042, -671719, -619814, -482933, -91286, -441593, 32741, -137930, -264259, -268335, -256191, -18200, -524957, -57369, -626254, -883071, -1258927, -1103403, -730827, -903599, -995391, -512469, -153330, -193419, -475397, -336796, -601832, -646434, -523991, -302210, -828159, -761316, -624940]
3824f24940L94774n69670N22124l6974p5585J0730l62882J71046K00027o76651
3814a048001M96206K98913k78862J14852k80033M47253j88101N7148k0732k92413
3804f93770L77166k88135Q0079N4844j35886j18113Q2198q1197K09114K4263j92748
3793f82185j32554L28828n48346J23482J17969K39767K1108n3194J07923K4595
3783d52607l0900l64976M32071k78551K14323P5889m06400l52896L73748p5277
3773h65576J64201K66583K67831k63881l38354j40624K82310m6683J28730j86336
3763g31799N72190l83141m81854L71216k22126k6659J20393j90830N50246n87711
3753a010075L80638J36082j90113J01167k123K11771J98098n51975J31684j92285
$$ y = [-624940, -230166, -799836, -277712, -314686, -390271, -379541, -742423, -571377, -371350, -1048001, -551795, -252882, -531744, -416892, -696925, -249672, -437773, -380625, -401357, -693770, -316604, -604739, -524660, -469816, -605702, -723815, -641617, -722814, -513700, -489437, -682185, -814739, -485911, -1034257, -910775, -792806, -553039, -531931, -585125, -477202, -452607, -483507, -848483, -416412, -694963, -480640, -404751, -811151, -1164047, -790299, -865576, -701375, -434792, -166961, -430842, -769196, -909820, -627510, -674193, -545463, -731799, -159609, -542750, -1024604, -653388, -875514, -902173, -781780, -972610, -422364, -1010075, -629437, -493355, -683468, -582301, -584424, -372653, -174555, -726530, -594846, -787131]
3743g87131L75789o44377L92748J80390J06882l69626M70104m82602r9818J0313
3733h47328L05032L92868o69628L04420j70395k5633l64624N44215P2253l22235
3723g81055R7142m48430N16064j13050l1722K97021m57131N67576j15825j69016
3713f38426k22931l5543P5052j14131Q5622L19614m90882P00429o85229K40674
3703g65751J44386J93696o73851Q94419k79247m14399P7609K08333m09905N64066
3693d60644j74026r1347J06044j34286J08994M16390o07739O2709L77058k58651
3683f55498j5440L96131k90621r9106J48116r2768M5987p5380k32290L73187K11904
3672b85778o66569N35956j03648K53386k56724j33564k55743L66009p3281m27691
$$ y = [-787131, -411342, -1055719, -662971, -482581, -375699, -745325, -275221, -757823, -857641, -847328, -542296, -149428, -819056, -514636, -685031, -710664, -1075288, -531073, -458820, -781055, -683913, -1132343, -616279, -729329, -761051, -464030, -921161, -353585, -469410, -638426, -861357, -896900, -821848, -935979, -850357, -530743, -1021625, -321196, -1006425, -765751, -621365, -427669, -1101520, -207101, -486348, -900747, -823138, -614805, -1024710, -460644, -634670, -726017, -619973, -754259, -645265, -228875, -836614, -773905, -396847, -655498, -670938, -274807, -565428, -664534, -516418, -609186, -563199, -638579, -870869, -497682, -285778, -952347, -416391, -520039, -266653, -523377, -656941, -912684, -546675, -619956, -1047647]
3662a047647J43417K53043l25344M67615k91241N09912j34537l47637L8590k10191
3652i44020M74700r3651k90800K48553l76551M36953j75718m82219N37980N76610
3642h8163q79128N3025J24991L76060k89212M61226n24725J23680k83603N8427
3632h67422l99309N50946j44940O6555J86703J83794k51132L3451M4188j01893
3622f99059L97709p6049J67827p43254K57503m80417N1952L02778L20814q6404
3612e86600J51323L53527n7193l97215r3764m1050l10993K01032K19851l08369
3602h69451M40395k70094o32333N91335j88152J89324J60080o5929j90302q7042
3592i22169K57543q8992L58357l25485J61203j09153J25185n18872M2030J30518
$$ y = [-1047647, -904230, -651187, -976531, -508916, -800157, -290245, -424782, -772419, -733829, -944020, -469320, -562971, -853771, -605218, -981769, -544816, -720534, -1202753, -664773, -88163, -967291, -914266, -789275, -413215, -702427, -241201, -765926, -642246, -925849, -867422, -1266731, -715785, -860725, -794170, -607467, -423673, -674805, -641354, -597166, -699059, -301350, -377399, -209572, -952826, -695323, -1175740, -1123788, -821010, -500196, -586600, -435277, -81750, -138943, -536158, -629922, -670972, -981965, -780933, -561082, -869451, -429056, -699150, -1331483, -740148, -928300, -738976, -578896, -644825, -835127, -922169, -664626, -753618, -395261, -720746, -559543, -668696, -543511, -1062383, -1020353, -889835]
3582h89835L02525n3512L25341k25737R911k71143K45671n20247L83597m7791
3572g41220R8779K11166k00453k02557J20772l09491N86056k74484J50251J34923
3562d26258k32470K45222l66497j20559l83785Q29598m86580m5059K16196M6320
3552g23872k50799L73874k54632K43095q2677q601O29954m71969M86393m92356
3542e51590o01155J79978L18807Q4846K88549j47786N8269m56092k02137J384349
3532C56038r28089K46836p5378k91941m04844K39397J64599L4793q0073J56640
3522e82022j21507K71790n83859N07933k93307K09702J25112R4958k11715k62738
3512h45653M47988j47935M1071k24416K52093K53352k01020n66980O5392N2288
$$ y = [-889835, -587310, -640822, -315481, -541218, -531307, -802450, -556779, -1077026, -693429, -741220, -642441, -431275, -631728, -834285, -713513, -1023004, -436948, -711432, -561181, -426258, -658728, -413506, -780003, -900562, -1284347, -454749, -941329, -986388, -770192, -723872, -974671, -600797, -855429, -612334, -695011, -703612, -73658, -545627, -59234, -551590, -1152745, -972767, -653960, -569114, -280565, -428351, -370082, -826174, -1028311, 356038, -572051, -325215, -400593, -692534, -1097378, -857981, -693382, -658589, -738662, -582022, -703529, -431739, -1015598, -507665, -800972, -591270, -466158, -371200, -582915, -845653, -397665, -545600, -504529, -728945, -476852, -223500, -424520, -991500, -926108, -873820]
3502h73820K44429J34413j04712p5212j08493R0368L35537j09044K74319k53100
3492d45315N319o46474Q44436k29672j36889J87553j14759K62168l63322P4007
3482e62948P787j09115n0711l82026O97890J95625n42162P1841L24192k81421
3472f31048L44144j22044m65110J46469L54709l06185R0628M00218l17257j76878
3462f82354J8810K35745q759J83956q82230R47716k35399m0996l62946L44766
3452d81691P1890o0317j89928o0294j27562O01946n15691N90002l65108L25069
3442b11684k88860j32218j15588N7357L35899l68412N12598l92896K85731q9422
3432d07495k02186N38171k95871j4227K56509L19199n21180K45827j82422J4097
$$ y = [-873820, -629391, -494978, -599690, -674902, -783395, -693027, -357490, -466534, -192215, -445315, -439996, -1086470, -242034, -471706, -608595, -421042, -535801, -273633, -636955, -562948, -555161, -664276, -714987, -1097013, -399123, -203498, -745660, -673819, -349627, -631048, -286904, -408948, -874058, -727589, -372880, -679065, -588437, -188219, -505476, -682354, -663544, -427799, -436558, -252602, -1134832, -187116, -422515, -463511, -826457, -481691, -409801, -470118, -660046, -720340, -847902, -245956, -761647, -171645, -536753, -211684, -500544, -632762, -748350, -690993, -355094, -723506, -210908, -603804, -318073, -407495, -609681, -71510, -367381, -381608, -125099, 194100, -327080, -81253, -263675, -249578]
3422b49578p8177K32355n16213M91921o33247N39947r6096j23669J81102J58094
3412i3561n0828P4130Q8409O6040j28585k59688M82184k01083k6366j13511p3734
3401b36593J31758J31444K10156P23840n37034M66843k30254L16214p645Q1206
3391A049935L74412J684n5735J41501O07216m93504M20015R31920O55181Q30994
3381D463619K011623L962811N134089M433528K774668n86004k715503k690345
3373A6788486m172479l056403k231510k030305j106414j456054l57729P5582n21533
3364A931641j38665m3146l9667l97765l28216L43626n49107m36416J00508L10298
3354G53091J93684m10294l78042J67897j54085K86960l74656J49715j81521l2489
$$ y = [-249578, -327755, -95400, -611613, -119692, -752939, -212992, -309088, -432757, -251655, -93561, -144389, -70259, 18150, 84190, -44395, -304083, 178101, -22982, -49348, -162859, -236593, -104835, 26609, 236765, 960605, 423571, 890414, 660160, 976374, 968729, 1049935, 1424347, 1426031, 1370296, 1511797, 2119013, 1625509, 2045524, 2977444, 3632625, 4463619, 6475242, 10438053, 15572142, 20005670, 22780338, 22194334, 19478831, 16788486, 12616007, 9559604, 7328094, 5297789, 4191375, 2735321, 2377592, 2453174, 1931641, 1792976, 1749830, 1710163, 1312398, 984182, 1327808, 778701, 342285, 442793, 753091, 946775, 536481, 158439, 326336, 172251, 459211, 84555, 234270, 52749, 20260]
3344B0260N0755k3334k87424l2050j94551L1209L26841j30400L00783k76993j0306
3333b25210l56354J80536l03477K35814J68106k22436M30311k08295l74741N04133
3323a71613k33063J15306l95043L06047J45280j87354K52337l68794L34921n92162
3313g94138J95561M06686J59001l76902m9503r1345R647m98889N26225o0407K93651
3302b80413m91282K83915M91439l82949M835j06396q3045J77424J7497p4931k98950
3291g42856J53303J06454n4867k84036J41435L44125M1823k49384J13604p0929
3281e01328l3091j37644m09664J068266O2161q97601K92804R8650l8514r9038
3271e94999j69204K55905k4164N7293J34589m0742k59038j70854K77315L0655
$$ y = [20260, 71015, 47681, -239743, -271793, -466344, -435135, -108294, -238694, 62089, -214904, -225210, -581564, -401028, -704505, -468691, -300585, -523021, -92710, -301005, -675746, -171613, -404676, -289370, -684413, -378366, -233086, -420440, -168103, -536897, -201976, -794138, -598577, -191891, -32890, -409792, -459295, -550640, -540993, -1039882, -513657, -574064, -280413, -771695, -487780, 3659, -379290, -374455, -480851, -563896, -386472, -368975, -443906, -742856, -589553, -483099, -537966, -822002, -680567, -336442, -294619, -544003, -430399, -501328, -534419, -672063, -1081727, -13461, 48700, -848901, -556097, -457447, -495961, -594999, -764203, -508298, -532462, -475169, -340580, -381322, -640360, -811214, -533899, -503244]
3261e03244K24135l5402o80489M30288N1702K72955J52927o28398J26048J3146
3251e76332o53005N81282l5742L8286J59330p80374P61265j66457N2743m8380
3241f67384j36590M8746K09103l43614O49137k91738k36947l883j5201L43633
3231d44738J23517k55143M24942o59428l7359R0933K54046k51246K46382J17096
3221c90998j68777n62375p4063J033008o42677O7855p990j5644j16951J77039
3211g01573j30240J46687P0113n52791M42518J75683M8452n59893L92859l81241
3201a049426L73063K9387M4859O0181j29402m18704m43159Q08168j01771L68908
3191d57896k20248m3137M62933l55847l19208n3923M28930r8093j07794m8838
$$ y = [-503244, -279109, -314511, -995000, -564712, -513010, -240055, -87128, -715526, -589478, -576332, -1229337, -648055, -683797, -645511, -486181, -1266555, -505290, -671747, -619004, -667384, -803974, -755228, -546125, -889739, -240602, -532340, -769287, -773170, -788371, -444738, -321221, -576364, -151422, -810850, -848209, -757276, -503230, -754476, -508094, -390998, -559775, -1122150, -1196213, -163205, -805882, -738027, -746017, -761661, -878612, -701573, -831813, -685126, -615013, -1167804, -725286, -549603, -501151, -1061044, -668185, -1049426, -676363, -646976, -602117, -541936, -671338, -1090042, -1533201, -725033, -826804, -457896, -678144, -721281, -258348, -614195, -933403, -987326, -558396, -656489, -764283, -813121]
3181h13121K55122m59478K33877j06318K35101j47707J0686K63861j17543l7470
3171f82990j09609p7573Q0125J56778K45687P6745n02775K9585k21276N82814
3161d22489n07474L66183m97032M76683j51200J35114j45288n62850N24818J91438
3151e92097j00005K62941o87729M94170J6054m60144K75561P18427k76336m94802
3141h43960J43670j31375N2589q7322J241K5937J95318J84569r6820J07802k01318
3130f49669N6886k89167L45214Q8842j92792M1189J27835r2968J26397k51821
3120f90054K01799O0594q31922N68801k9844J49627K4263J79933l33857J6714
3110f83946J02757o07569O27147l82166N895m3943K65050K10164k12189J32492
$$ y = [-813121, -557999, -1017477, -783600, -889918, -654817, -802524, -791838, -527977, -645520, -682990, -792599, -870172, -790047, -633269, -387582, -310837, -813612, -784027, -1005303, -422489, -929963, -563780, -1060812, -584129, -735329, -600215, -745503, -1308353, -783535, -592097, -692102, -429161, -1116890, -622720, -606666, -1066810, -791249, -72822, -349158, -843960, -700290, -831665, -779076, -866398, -865157, -839220, -643902, -459333, -556153, -448351, -649669, -592783, -881950, -536736, -447894, -640686, -599497, -471662, -564630, -438233, -690054, -488255, -427661, -1259583, -690782, -720626, -570999, -546736, -366803, -700660, -683946, -581189, -1188758, -561611, -943777, -937882, -981825, -716775, -506611, -718800, -586308]
3100e86308L80324q05525L96334k2014M8813j50468n6615K80721j099551J003008
3090f11281k17825L51862k13821Q0116j83306k18195K63376K32061m30315K56363
3080f90965M2769N7555J80485o96329O32119j36846p59397O52927j06167J26804
3070f97045K30599j33739L14510l85594J03887l21180Q4744q3711J53331L76525
3060c57673k09466n95633N0118O81863K62230p75439N99219n7087j26612j51688
3050f80168j04164L42265l09660q9222j2580R3590k32859N44296o2021j37647
3040f48170J96381j06173L28598n17435M45644n87850N69347K6912l64485L42909
3030c14322n12532L8197K38134J61436J60124m32908j4423Q6852j9323k22296
$$ y = [-586308, -205984, -1011509, -615175, -637189, -588376, -738844, -795459, -514738, -1614289, -611281, -829106, -477244, -691065, -610949, -794255, -1012450, -749074, -517013, -947328, -690965, -648196, -590641, -410156, -1106485, -474366, -611212, -1370609, -717682, -823849, -697045, -466446, -600185, -285675, -671269, -567382, -888562, -803818, -887529, -734198, -357673, -567139, -1162772, -1112654, -430791, -168561, -944000, -344781, -401868, -528480, -680168, -784332, -442067, -751727, -840949, -853529, -759939, -992798, -448502, -510523, -648170, -451789, -557962, -229364, -746799, -301155, -889005, -319658, -292746, -657231, -314322, -826854, -788657, -550523, -389087, -228963, -661871, -676294, -589442, -608765, -831061]
3020h31061k65381K54961Q0368J23567J97838n76792j15337O5492K46720L02104
3010e17521Q3091o40949M70938j18878J10683j83700L43137k08390J67836l51309
3000h45062J50246j88822M18994M5084j54507K68399m14594n5778l4880K41225
2990e69695n01005O0084J2485M61659l1082k93519K16503M47354k09043P373r5200
2979d94086j57879J8110J11658n01855J31527L6905Q3548n3565j75495P0421q8406
2968a019117R9744j0995L53047j45788j59306L71102k85118j1801k1749j73817
2958a003798j24957K79979j22537J00114j16844K79129j68191M8240L02189J45629
2948c81047n71481p0579K93931J17491m34410K70233j10042j84449J76791N23450
$$ y = [-831061, -1096442, -841481, -761113, -637546, -439708, -1016500, -1131837, -1066345, -819625, -517521, -434430, -1075379, -604441, -723319, -612636, -796336, -453199, -661589, -493753, -845062, -694816, -883638, -464644, -419560, -574067, -305668, -720262, -776040, -810920, -569695, -1070700, -1010616, -998131, -536472, -567554, -861073, -644570, -197216, -406259, -398886, -494086, -651965, -633855, -522197, -1024052, -892525, -855620, -772072, -825637, -1001132, -930711, -1019117, -919373, -930368, -577321, -723109, -882415, -511313, -796431, -808232, -829981, -1003798, -1128755, -848776, -971313, -871199, -988043, -708914, -877105, -828865, -526676, -381047, -952528, -1023107, -729176, -611685, -1046095, -775862, -885904, -1070353, -893562, -370112]
2938c70112K7718p48133M34876J73180k80462j26937K98203o8401j7542j93963
2928h71573J57164k36206R533j74723L11952L70000l27958n65918M48117J12810
2918g66802K07738k61348J84931Q3865p8825j05496l9373j3010N12479n71234
2908h47075K5968P1261O10172j53412n70461O17415j15592j39480l14953Q6013
2898g30144K86329l58954J64421l32044M74747j47860k93366N18495l30806P6392
2888f72790M11815l76620K4441K29760L33932r68334K074L19158J13460j23133
2878g06237j16986j17024j18773N35984P1605j48058J52877m04676M46428k71980
2868f76840j00965l0454j11389P596q0728K13729k64142L29325P561l97852L68833
$$ y = [-370112, -342394, -1090527, -655651, -482471, -762933, -889870, -591667, -660068, -677610, -871573, -714409, -950615, -941082, -1115805, -803853, -433853, -761811, -1327729, -879612, -766802, -559064, -820412, -635481, -551616, -630441, -735937, -775310, -788320, -275841, -847075, -821107, -749846, -139674, -293086, -863547, -246132, -361724, -501204, -816157, -730144, -443815, -802769, -638348, -970392, -495645, -643505, -936871, -418376, -749182, -672790, -260975, -637595, -613154, -383394, -49462, -1017796, -1015722, -696564, -583104, -706237, -823223, -940247, -1059020, -523036, -451431, -599489, -446612, -851288, -404860, -676840, -777805, -808259, -919648, -912052, -992780, -779051, -1043193, -713868, -706307, -1104159, -735326]
2857g35326L1491J70501Q7795Q854k14415l47032M91896j54066l79278L15010
2847g24570n6027K64933l12330L5341N9010J15843K09789n2128J18558k90837
2837f32418j83248j940K62032j53211J97228K64566k28402l5049j09458J17217
2827e02683k05014q9850K55135l47799k07814K56394k71761J09619m09591J48003
2817a265361M57893K42787j63799k98475J72572J68610o0123L50782j20739j16825
2807f32678R1692l64033Q13019j13599j78673l94084Q6351K11105n77377J052006
2797f271l15482m97779L80370k76056l78112N22349j09942m8200J17607J97578
2787d13938n26431O86270k89437l61561M84476m57986J26257O239J80440J07510
$$ y = [-735326, -703835, -533334, -445539, -436685, -651100, -998132, -506236, -660302, -1039580, -724570, -780597, -515664, -827994, -792653, -733643, -617800, -408011, -460139, -341581, -632418, -815666, -817606, -555574, -708785, -511557, -246991, -475393, -510442, -619900, -502683, -707697, -797547, -542412, -890211, -1098025, -841631, -1113392, -1003773, -1413364, -1265361, -807468, -564681, -728480, -1026955, -854383, -685773, -745896, -395114, -515853, -632678, -540986, -905019, -92000, -205599, -384272, -778356, -692005, -480900, -1058277, -6271, -321753, -819532, -439162, -715218, -1093330, -570981, -680923, -729123, -611516, -413938, -940369, -254099, -543536, -905097, -420621, -878607, -752350, -746111, -565671, -458161]
2777d58161j06732l47456J81883L89675j90422j65447m3451r8144J15153k74812
2767i97914J2858P21384j48302m12432K66126p7617m7098J10048k26037L55498
2757d43486m15817J91443J27025J23026M2284n82314r9016N55279p94640J61865
2747a134351M16135m35328L28211j42898L53829o0205L76353j77570J5055M8183
2737d12586j65978M42936o26729L0240j1590o327R717K84062J84464m03736l17672
2726i93199J89774K81204N2354J5331k57413k316L30204m31017j03471J06156
2716h12393m91385N85312q3592J92762k06804L89935L95980k78046q658p0659
2706c87548m34769J78691J57644K23503k60922l47940L13746m2878m10189L97057
$$ y = [-458161, -564893, -912349, -730466, -340791, -531213, -696660, -740111, -838255, -723102, -997914, -985056, -263672, -411974, -824406, -558280, -635897, -682995, -572947, -798984, -443486, -859303, -667860, -540835, -417809, -375525, -957839, -1056855, -501576, -1296216, -1134351, -718216, -1153544, -825333, -968231, -614402, -674607, -298254, -475824, -460769, -412586, -578564, -135628, -762357, -732117, -743707, -750034, -740317, -456255, -271791, -675527, -993199, -803425, -522221, -469867, -454536, -711949, -714265, -384061, -815078, -918549, -812393, -1303778, -718466, -802058, -609296, -816100, -426165, -30185, -308231, -316889, -387548, -822317, -643626, -485982, -262479, -523401, -871341, -557595, -600473, -1010662, -613605]
2696f13605k48495M39423k16762J57393j55180M21562r12489L36153K53598O838
2686e31564k30275J98177j56170n14750P0310O8477K52350N97931l58112K05093
2676c98533k06775K60771k32241q7479L704j83496K86802m36100J73760k27046
2666a046633k90766K61503P57255q6211k16912k01895L69637k93169j81629j48425
2656a077245M77138M56526n96598J49154K55668n34402k33143J85902N24974l5413
2646d27439J14371j43479n5734l26345j18332N06333o6311r7474k44641P1584
2636g87467K52471J20004m30569K69469M2651J78605l19271L22576l2734k53954
2626f38219j32159j40321k3963R1067K00221n83294M98629m19045K12743K34444
$$ y = [-613605, -862100, -422677, -639439, -482046, -637226, -215664, -1128153, -792000, -538402, -531564, -761839, -563662, -719832, -1234582, -1164272, -1095795, -843445, -245514, -603626, -398533, -605308, -344537, -576778, -664257, -660553, -844049, -557247, -993347, -819587, -1046633, -1337399, -1075896, -318641, -404852, -621764, -823659, -454022, -747191, -928820, -1077245, -600107, -143581, -740179, -591025, -335357, -869759, -1102902, -917000, -392026, -427439, -313068, -456547, -512281, -838626, -956958, -450625, -516936, -614410, -859051, -787467, -534996, -414992, -845561, -576092, -533441, -354836, -674107, -351531, -384265, -638219, -770378, -910699, -934662, -843595, -643374, -1226668, -728039, -1147084, -934341, -699897]
2616f99897L3283l10343J90864J90943o54475K37215K21998m67688N74186k89013
2606i72927M05992k74555M40221j42775K40164k62170m61959M96139K37204o92257
2596i86923K51788Q7524J24648N1716m10797R75618m50470n94738m07676Q73731
2586d85579l96015N23919K8621M0174m79494J70611j54368K55752j78767K60905
2576d14241m0251m76339K17228k0468j52667J35621K9435K66011l11393K34331
2566e32733j65058L1750J75232j99946j87847M21807k20779O35750k36122m17598
2556f95544m82017K38565O92715o54276J59708r8077k179K20604l60698L94319
2546e86880K04716l03209J17706q6600m0308K54434m25861l0649l45330P85748
$$ y = [-699897, -666614, -976957, -786093, -595150, -1249625, -1012410, -790412, -1258100, -683914, -972927, -566935, -841490, -401269, -544044, -303880, -566050, -1028009, -531870, -294666, -986923, -735135, -647611, -522963, -471247, -882044, 93574, -356896, -951634, -1359310, -485579, -881594, -357675, -329054, -288880, -768374, -597763, -752131, -496379, -675146, -414241, -454492, -930831, -713603, -734071, -886738, -751117, -721682, -455671, -767064, -532733, -697791, -666041, -490809, -690755, -878602, -456795, -677574, -41824, -277946, -695544, -1177561, -938996, -246281, -900557, -740849, -838926, -841105, -620501, -981199, -586880, -382164, -685373, -567667, -654267, -694575, -440141, -866002, -896651, -1241981, -456233]
2536d56233r1082k89348L63696j01267m66482J34692L74965m7213Q848K78157
2526b91267j76064q929m33374J65478K6064j82759j78608L78060N86453p00594
2516h15540K57264j94256M0401j42739q7837Q98474k78865p33117L86419n0009
2506g19805L08633o5048j35333p3962J34910O0471K40514n19656J61221P6338
2496e31717J13735k57872M06206j60498j06515j65904p6418J28247l48013J42127
2486h56622P34456l28137k63481m9509k04713M31430j40207K25256l09993l19973
2476a081493r2176P07399m77206l1093j18174J08512L73475k2085K02303Q1165
2466c49373m60509J55214l25845N38476k47839O8240j68818r7480k4749R8433
$$ y = [-456233, -547315, -836663, -472967, -574234, -1040716, -906024, -531059, -578272, -569424, -291267, -467331, -476260, -909634, -744156, -718092, -900851, -1079459, -701399, -114946, -815540, -558276, -752532, -712131, -854870, -942707, -44233, -323098, -1056215, -669796, -719805, -411172, -476220, -611553, -685515, -550605, -490134, -249620, -769276, -608055, -531717, -417982, -675854, -269648, -430146, -536661, -702565, -778983, -650736, -998749, -856622, -122166, -450303, -713784, -763293, -968006, -536576, -676783, -451527, -761520, -1081493, -1173669, -466270, -943476, -974569, -1092743, -984231, -610756, -632841, -430538, -349373, -809882, -654668, -980513, -442037, -689876, -621636, -790454, -887934, -912683, -814250]
2456h14250L90608l8437k4919K49764n7032p8971K23000m24054K4452j33309J65408
2445e17740j17339N45938n47700M26334n74378J79151j42419L95377k17627J63483
2435d06920L63280o20298J27142K65828k13333k04998L08383q6519j74913j53991
2425g96339K5036K52830o32133P47083J43227l66966l77726L51562L0648j94560
2415h17338n5530n40323Q14283K08680n19845J00382K31705N031l19474P60002
2405a32427n34301L05007m19999N13340n15067L7786o9029j26683J99788k10170
2395i51755P00860r1225l61045J75771K3747j43689J58392J00118l13211j92450
2385h94487J20271L30262k64215j4212M22262L51671o28256n6664R0128m9257
$$ y = [-814250, -423642, -462079, -486998, -237234, -294266, -373237, -150237, -574291, -549839, -683148, -517740, -635079, -89141, -636841, -210507, -784885, -605734, -748153, -352776, -570403, -406920, -43640, -663938, -536796, -270968, -484301, -689299, -380916, -467435, -642348, -796339, -771303, -518473, -1150606, -403523, -260296, -627262, -1004988, -653426, -622778, -817338, -872868, -1413191, -598908, -390228, -910073, -809691, -577986, -572955, -892429, -132427, -666728, -361721, -781720, -268380, -783447, -745661, -814690, -941373, -741585, -951755, -250895, -342120, -703165, -527394, -503647, -647336, -488944, -388826, -702037, -894487, -774216, -443954, -708169, -722381, -300119, 51552, -576704, -633368, -543240, -592497]
2375e92497o3006j1820K11515k04240k07304m1910J47092j59989K61625R2974
2365e67560l71136K59132k20494P62639m84711j13417J60366L86204n36986L16449
2355d09514p4407n80050N72622k30904K77081j66656l5795k58870J86187K28823
2345d91483j78426M33983j22573L20876m61697l93774j57371L86474l3705k28761
2335i26457J25722k20221N29033k14821K04028Q086j16410l91693O18297k99665
2325f84101J19327m28898M81692n58473K86682r8181L60190k01230J75838l00599
2315h47753K06213J84964n71747N10562m13507K06163l35538O13559P3788j86753
2305e60049j10670l0860J21206J66008k40944L45580k68852L30596l81061L4078
$$ y = [-592497, -655503, -667323, -455808, -660048, -867352, -909262, -762170, -922159, -660534, -567560, -938696, -679564, -900058, -137419, -622130, -735547, -575181, -188977, -725963, -409514, -483921, -1063971, -491349, -722253, -445172, -611828, -647623, -906493, -720306, -491483, -669909, -235926, -358499, -37623, -499320, -893094, -1050465, -663991, -697696, -926457, -800735, -1020956, -491923, -706744, -502716, -494630, -611040, -1002733, -384436, -684101, -564774, -993672, -511980, -1070453, -783771, -881952, -521762, -722992, -547154, -847753, -641540, -456576, -1028323, -517761, -931268, -725105, -1060643, -447084, -373296, -560049, -670719, -701579, -580373, -414365, -655309, -309729, -578581, -247985, -629046, -594968]
2295e94968k13553K05117l74399J06425L13283m6986j83242N29198m49615J79556
2285e29184k86946l27409N59916L79620n31398M01l21889J81933k87192P2030
2275a090118N95758m37526j70334L91012o4312R4928J52518J97332m16730j04146
2265h51618K30296J00558P1014n16227R3870J84810m6279J22370k4242P186M0056
2254e88206k36138K76729K97814l19198N056l92492O65298k37276j24996j99922
2244h53331N43556q5901k82363L58423q5458K06502k57671j12145n83525M71442
2234f80471q7727j22272L64309k04109k06129k5864N86400K18680n93394K35039
2224e15538j18822O137k78519O3204Q7403j17478N99784m23433m80328O91266
$$ y = [-594968, -808521, -603404, -977803, -871378, -558095, -605081, -788323, -259125, -708740, -529184, -816130, -1143539, -583623, -204003, -735401, -735000, -1056889, -874956, -1162148, -1090118, -494360, -931886, -1102220, -711208, -775520, -680592, -528074, -330742, -747472, -851618, -621322, -520764, -449750, -965977, -872107, -687297, -733576, -611206, -635448, -628262, -588206, -824344, -547615, -249801, -568999, -563943, -956435, -291137, -528413, -653409, -853331, -309775, -395676, -678039, -319616, -405074, -198572, -456243, -568388, -1151913, -680471, -768198, -890470, -526161, -730270, -936399, -962263, -375863, -157183, -750577, -515538, -634360, -628223, -906742, -843538, -756135, -873613, -273829, -697262, -1177590, -486324]
2214d86324m12560J34743N4138p6144L30669j27872j21866r9408R2080J22637
2204e89907j77847J53835k6662q6975j93522J58077l80163O54726K332m03011
2194h89117K77503K80457l43109o7343L45958J13097o0642k76229M00987l86747
2184f05185j28880j23027K38842k9151L87722l10415j53013K93015q5687j80070
2174f95849J4156L65065K11267m49981o2954P1452n54259J24363M88276J33332
2164c55132l06233j54518L06274J9005K2863J1094k06134l00976N47524o58450
2154a074683M05308M987K342q4937n3637J77688J564j23129N4032j5529N45944
2143a60050m71345Q5482j81273R5845k34144L08158l37956J53407K97902j38249
$$ y = [-486324, -898884, -764141, -710003, -786147, -455478, -583350, -705216, -804624, -712544, -589907, -767754, -613919, -640581, -727556, -921078, -763001, -1143164, -488438, -486106, -889117, -611614, -331157, -674266, -741609, -395651, -282554, -343196, -619425, -218438, -605185, -734065, -857092, -618250, -647401, -259679, -570094, -723107, -430092, -515779, -695849, -681693, -316628, -105361, -555342, -618296, -546844, -1101103, -976740, -488464, -355132, -661365, -815883, -509609, -490604, -467741, -456647, -662781, -963757, -416233, -1074683, -669375, -664388, -662046, -746983, -800620, -622932, -621368, -744497, -690465, -705994, -160050, -631395, -545913, -727186, -631341, -865485, -557327, -895283, -741876, -443974, -582223]
2133e82223J79854j75312o44969R31529k74396l60639J17363N03029J88922p62266
$$ y = [-582223, -402369, -577681, -1222650, -291121, -565517, -926156, -808793, -305764, -116842, -879108]
$$ [...]
##END NTUPLES=NMR SPECTRUM
##END=
