##TITLE=abcd
##JCAMPDX= 6.0         $$ Bruker NMR JCAMP-DX V2.0
##DATA TYPE= NMR SPECTRUM
##DATA CLASS= NTUPLES
##ORIGIN= UXNMR, Bruker Analytische Messtechnik GmbH
##OWNER= root
$$ XWIN-NMR		Version 3.5
$$ Tue Mar 17 18:48:58 2026 Russian Standard Time (UT+4h)  servis@DPX200
##.OBSERVE FREQUENCY= 200.131235884673
##.OBSERVE NUCLEUS= ^1H
##.ACQUISITION MODE= SIMULTANEOUS
##.ACQUISITION SCHEME= undefined
##.AVERAGES= 32
##.DIGITISER RES= 18
##SPECTROMETER/DATA SYSTEM= spect
##.PULSE SEQUENCE= zg
##.SOLVENT NAME= DMSO
##.SHIFT REFERENCE= (INTERNAL, DMSO, 0, 16.4885)
##AUDIT TRAIL= $$ (NUMBER, WHEN, WHO, WHERE, WHAT)
$$ ##TITLE= Audit trail, XWIN-NMR		Version 3.5
$$ ##JCAMPDX= 5.01
$$ ##ORIGIN= Bruker BioSpin GmbH
$$ ##OWNER= servis
$$ F:\spectra/data/av/nmr/H1/1/pdata/1/auditp.txt
$$ ##AUDIT TRAIL=  $$ (NUMBER, WHEN, WHO, WHERE, WHAT)
(   1,<2026-03-17 18:48:31.46 +0400>,<servis>,<DPX200>,
      <created by zg, POWCHK disabled, PULCHK disabled
       configuration hash MD5:
       00 E9 B6 7A A2 85 ED C7 34 08 36 98 17 FE 4E 26
       data hash MD5: 32K
       39 2D F9 31 24 11 C2 7D BF 51 2E B8 EB D3 20 12>)
(   2,<2026-03-17 18:48:33.23 +0400>,<servis>,<DPX200>,
      <Start of raw data processing
       efp BC_mod = 2 LB = 0.05 FT_mod = 6 PKNL = 1 PHC0 = -256.1951 PHC1 = -0.898437 SI = 16K 
       data hash MD5: 16K
       B9 02 D2 61 A9 89 6C EC 9A 35 1F D6 58 A3 E2 FF>)
$$ ##END=
$$ 
$$ hash MD5
$$ 25 6B BE F8 A5 22 F6 6B C7 6E 94 82 4E 38 E7 FA
##$RELAX= 
##$RELAX= 
##$RELAX= 
##$RELAX= 
##$RELAX= 
##$RELAX= 
##$RELAX= 
##$RELAX= 
$$ Bruker specific parameters
$$ --------------------------
##$DU= <F:\spectra>
##$EXPNO= 1
##$NAME= <H1>
##$PROCNO= 1
##$TYPE= <nmr>
##$USER= <av>
##$AMP= (0..31)
100 100 100 100 100 100 100 100 100 100 100 100 100 100 100 100 100 100 
100 100 100 100 100 100 100 100 100 100 100 100 100 100 
##$AQSEQ= 0
##$AQ_mod= 1
##$AUNM= <au_zg>
##$AUTOPOS= <>
##$BF1= 200.13
##$BF2= 200.13
##$BF3= 200.13
##$BF4= 200.13
##$BF5= 500.13
##$BF6= 500.13
##$BF7= 500.13
##$BF8= 500.13
##$BYTORDA= 1
##$CFDGTYP= 0
##$CFRGTYP= 5
##$CHEMSTR= <none>
##$CNST= (0..31)
1 1 145 1 1 1 1 1 1 1 1 1 1 1 1 1 1 1 1 1 1 1 1 1 1 1 1 1 1 1 1 1 
##$CPDPRG= <>
##$CPDPRG1= <>
##$CPDPRG2= <>
##$CPDPRG3= <>
##$CPDPRG4= <mlev>
##$CPDPRG5= <mlev>
##$CPDPRG6= <mlev>
##$CPDPRG7= <mlev>
##$CPDPRG8= <mlev>
##$CPDPRGB= <>
##$CPDPRGT= <>
##$D= (0..31)
0 2 0 0 0 0 0 0 0 0.06 0 0 0 0 0 0 0.0002 0 0 0 0 0 0 0 0 0 0 0 0 0 0 
0 
##$DATE= 1773758911
##$DBL= (0..7)
120 120 120 120 120 120 120 120 
##$DBP= (0..7)
150 150 150 150 150 150 150 150 
##$DBP07= 0
##$DBPNAM0= <>
##$DBPNAM1= <>
##$DBPNAM2= <>
##$DBPNAM3= <>
##$DBPNAM4= <>
##$DBPNAM5= <>
##$DBPNAM6= <>
##$DBPNAM7= <>
##$DBPOAL= (0..7)
0.5 0.5 0.5 0.5 0.5 0.5 0.5 0.5 
##$DBPOFFS= (0..7)
0 0 0 0 0 0 0 0 
##$DE= 6
##$DECBNUC= <off>
##$DECIM= 32
##$DECNUC= <off>
##$DECSTAT= 4
##$DIGMOD= 1
##$DIGTYP= 9
##$DL= (0..7)
0 120 120 120 120 120 120 120 
##$DP= (0..7)
150 150 150 150 150 150 150 150 
##$DP07= 0
##$DPNAME0= <>
$$ [...]
##$SUBNAM4= <"">
##$SUBNAM5= <"">
##$SUBNAM6= <"">
##$SUBNAM7= <"">
##$SUBNAM8= <"">
##$SUBNAM9= <"">
##$SW= 20.6817932712277
##$SWIBOX= (0..15)
0 0 3 0 0 0 0 0 0 0 0 0 0 0 0 0 
##$SW_h= 4139.07284768212
##$TD= 32768
##$TD0= 1
##$TE= 0
##$TE2= 300
##$TE3= 300
##$TEG= 300
##$TL= (0..7)
0 120 120 120 120 120 120 120 
##$TP= (0..7)
150 150 150 150 150 150 150 150 
##$TP07= 0
##$TPNAME0= <>
##$TPNAME1= <>
##$TPNAME2= <>
##$TPNAME3= <>
##$TPNAME4= <>
##$TPNAME5= <>
##$TPNAME6= <>
##$TPNAME7= <>
##$TPOAL= (0..7)
0.5 0.5 0.5 0.5 0.5 0.5 0.5 0.5 
##$TPOFFS= (0..7)
0 0 0 0 0 0 0 0 
##$TUNHIN= 0
##$TUNHOUT= 0
##$TUNXOUT= 0
##$USERA1= <user>
##$USERA2= <user>
##$USERA3= <user>
##$USERA4= <user>
##$USERA5= <user>
##$V9= 5
##$VALIST= <valist>
##$VCLIST= <CCCCCCCCCCCCCCC>
##$VD= 0
##$VDLIST= <DDDDDDDDDDDDDDD>
##$VPLIST= <PPPPPPPPPPPPPPP>
##$VTLIST= <TTTTTTTTTTTTTTT>
##$WBST= 1024
##$WBSW= 30
##$XGAIN= (0..3)
0 0 0 0 
##$XL= 0
##$YL= 0
##$YMAX_a= 450144
##$YMIN_a= -360925
##$ZGOPTNS= <>
##$ZL1= 120
##$ZL2= 120
##$ZL3= 120
##$ZL4= 120
##$ABSF1= 0
##$ABSF2= 0
##$ABSG= 0
##$ABSL= 0
##$ALPHA= 0
##$AQORDER= 0
##$ASSFAC= 0
##$ASSFACI= 0
##$ASSFACX= 0
##$ASSWID= 0
##$AUNMP= <proc_1d>
##$AZFE= 0.1
##$AZFW= 0.1
##$BCFW= 0
##$BC_mod= 2
##$BYTORDP= 0
##$COROFFS= 0
##$CY= 18.4799938201904
##$DATMOD= 1
##$DC= 0
##$DFILT= <>
##$DTYPP= 0
##$F1P= 9.9274215381318
##$F2P= -0.165520771350173
##$FCOR= 1
##$FTSIZE= 16384
##$FT_mod= 6
##$GAMMA= 0
##$GB= 0
##$INTBC= 1
##$INTSCL= 4.127829e-11
##$ISEN= 128
##$LB= 0.05
##$LEV0= 0
##$LPBIN= 0
##$MAXI= 10000
##$MC2= 0
##$MEAN= 0
##$ME_mod= 0
##$MI= 50
##$NCOEF= 0
##$NC_proc= -6
##$NLEV= 6
##$NOISF1= 3.799351
##$NOISF2= 2.8
##$NSP= 0
##$NTH_PI= 0
##$NZP= 0
##$OFFSET= 16.48848
##$PC= 4
##$PHC0= -256.1951
##$PHC1= -0.898437
##$PH_mod= 1
##$PKNL= yes
##$PPARMOD= 0
##$PSCAL= 4
##$PSIGN= 0
##$REVERSE= no
##$SF= 200.130005582386
##$SI= 16384
##$SIGF1= 3
##$SIGF2= 2
##$SINO= 400
##$SIOLD= 16384
##$SREGLST= <1H.CDCl3>
##$SSB= 0
##$STSI= 16384
##$STSR= 0
##$SW_p= 4139.07284768211
##$SYMM= 0
##$S_DEV= 0
##$TDeff= 32768
##$TDoff= 0
##$TI= <>
##$TILT= no
##$TM1= 0
##$TM2= 0
##$TOPLEV= 0
##$USERP1= <user>
##$USERP2= <user>
##$USERP3= <user>
##$USERP4= <user>
##$USERP5= <user>
##$WDW= 1
##$XDIM= 16384
##$YMAX_p= 389825658
##$YMIN_p= -1887270
$$ End of Bruker specific parameters
$$ ---------------------------------
##NTUPLES= NMR SPECTRUM
##VAR_NAME=  FREQUENCY,     SPECTRUM/REAL,   SPECTRUM/IMAG
##SYMBOL=    X,             R,               I
##VAR_TYPE=  INDEPENDENT,   DEPENDENT,       DEPENDENT
##VAR_FORM=  AFFN,          ASDF,            ASDF
##VAR_DIM=   16384,         16384,           16384
##UNITS=     HZ,            ARBITRARY UNITS, ARBITRARY UNITS
##FACTOR=    0.252644378177508, 1,           1
##FIRST=     3299.83951724647, 0,            0
##LAST=      -839.233330435636, 0,           0
##MIN=       -839.233330435636, -1887270,    0
##MAX=       3299.83951724647, 389825658,    0
$$ Real data points
##PAGE= N=1
##DATA TABLE= (X++(R..R)), XYDATA
$$ [...]
8812d78198J6422o8940P3823j86219M0446K02921n5778q7391J7651N4903L3124
8801d37236J2264j56914K11469m7665k24784R1631P2592o0399N9867R7154J02450
8790b79571P8475l45764J12361m5786L73296l15389q1273K4762k5040r0912R4854
8779d99987j41319J81590l9596J1145j76066K91733k12789J95111j98314J67693
8769d20799k82767K26542R7790m113o6920l8727l9719j09437R7262o4278n9407
8758f64573K56262k6493K1306o097p3655Q463n9262K2592K6231M4990j6585J21391
8746c45430q4196j2552l0872q9732m077J01814K8250K6341r8991Q888q0983J834
8734e79706L9826J2937K8974j64776J51044p9655K40088k89185J63575J17877
$$ plain form
8812 -478198 -461776 -530716 -456893 -643112 -602666 -399745 -455523 -542914 -525263 -470360 -437236
8801 -437236 -424972 -581886 -370417 -418082 -642866 -551235 -478643 -539042 -479175 -382021 -279571
8790 -279571 -201096 -546860 -434499 -480285 -106989 -422378 -503651 -478889 -503929 -594841 -499987
8779 -499987 -641306 -459716 -499312 -488167 -664233 -372500 -585289 -390178 -588492 -420799
8769 -420799 -703566 -477024 -379234 -383347 -450267 -488994 -528713 -638150 -540888 -605166 -664573
8758 -664573 -408311 -434804 -413498 -419595 -493250 -484787 -544049 -521457 -495226 -450236 -466821 -345430
8746 -345430 -429626 -442178 -473050 -562782 -566859 -465045 -436795 -410454 -509445 -500557 -581540 -579706
8734 -579706 -539880 -526943 -497969 -662745 -511701 -591356 -351268 -640453 -476878 -359001
8724c59001j69154J3607j4227L0729q3863J9204N4333j8532R6924j56702J96196
8713c90486m7395j41382J49521j7890j73668J20413K38271K1192j96738j21043
8703e59205J1926O9899J8451n6755j8456O7398m6996l573J02722n3822p82l9916
8691e09109J19541j5648j63146M7989R7686K6392n6183L2876j13441R677J2610
8680e10756j50119J67318J78210k75272J73362p0643L5663K6017j3849k48763
8670f88832J49984R7990O9822l70405K57394K3393J5233r4164J52650l2991j38566
8659e58492o7147K58813O458j6635k8970k7432j31291M5681q9503J8507J10990
8648d79021p5934K50430q3681o142m7436Q6668j20132j05378Q648k1008M6349
$$ plain form
8724 -359001 -528155 -514548 -528775 -498046 -581909 -562705 -508372 -526904 -429980 -586682 -390486
8713 -390486 -437881 -579263 -429742 -447632 -621300 -500887 -262616 -241424 -438162 -559205
8703 -559205 -547279 -477380 -458929 -515684 -534140 -466742 -513738 -517311 -414589 -468411 -469193 -509109
8691 -509109 -389568 -405216 -568362 -520373 -422687 -396295 -452478 -419602 -533043 -523366 -510756
8680 -510756 -660875 -493557 -315347 -590619 -417257 -487900 -452237 -426220 -440069 -688832
8670 -688832 -538848 -440858 -371036 -741441 -484047 -460654 -445421 -539585 -386935 -419926 -558492
8659 -558492 -625639 -366826 -360368 -377003 -405973 -433405 -564696 -519015 -608518 -590011 -479021
8648 -479021 -554955 -304525 -388206 -394348 -441784 -355116 -475248 -580626 -571978 -592986 -546637
8637e46637M4398k235j52634m6917J81377r5129J22577K510J72604j05110l8825
8626d64021k50974J33312J54325j41382J83908k92841p865M1895O1198R0394o1019
8615e53070J42545j16856Q0024j11931J87272O892j39017K23849L3106k98883
8605e46069J2976l6680L46092k48055j0715j67594J43291J59877m3941r4705j06250
8594e91773K78017j66659n2088N8523J23427k78161K07886j48080J82493p3658
8584d60073J1178k44447J18836J73254j43119K2713J72495k12849K63553o2995
8574c61454j07533N0222j32702R0810j66833J65984M3608j25342J35753j29467
8564e36954L3740J6553Q933k3453l8161R7089N7552k7185o9334j35606L6091J37658
$$ plain form
8637 -546637 -502239 -504474 -657108 -704025 -522648 -617777 -495200 -492690 -320086 -425196 -464021
8626 -464021 -714995 -581683 -427358 -568740 -384832 -677673 -685538 -643643 -582445 -492051 -553070
8615 -553070 -410525 -527381 -447357 -559288 -372016 -365124 -504141 -280292 -247186 -546069
8605 -546069 -533093 -569773 -223681 -471736 -482451 -650045 -506754 -346877 -390818 -485523 -591773
8594 -591773 -313756 -480415 -532503 -473980 -350553 -628714 -420828 -568908 -386415 -460073
8584 -460073 -448895 -693342 -574506 -401252 -544371 -521658 -349163 -562012 -298459 -361454
8574 -361454 -468987 -418765 -551467 -460657 -627490 -461506 -417898 -543240 -407487 -536954
8564 -536954 -503214 -486661 -477728 -501181 -539342 -442253 -384701 -411886 -481220 -616826 -580735 -443077
8552d43077J00278k07090M3156L8647o7616M9487N1914L6972l727j41523K441
8541e40138J52703l6221J02378p5063q7041j42553J64300j9902j46915K49900
8531c78552M53366j962084J032096K30194J07698m3479L2919j0586K52336k71097
8521e57189M26J30726O3898k5656l22092L49414j72555L74894k53934P7258k02598
8510e37408k8124j5171K69457l6898l79578J92070o5426J80778j18228j85605
8500g24133L8110P5018R9487o2392R4950M4502L6515k09627K17018N7394p46k12045
8488e45949R9107j39136K80147k3150k08844K500J21137o6410n8755j07506L65368
8477b81491k88767j4394J92451r6727J69772j47712m8802j29242K01117l4082
$$ plain form
8552 -443077 -342799 -549889 -506733 -468086 -535702 -486215 -434301 -397329 -401056 -542579 -540138
8541 -540138 -387435 -423656 -321278 -396341 -483382 -625935 -461635 -481537 -628452 -378552
8531 -378552 74814 -1887270 -855174 -624980 -517282 -560761 -527842 -538428 -286092 -557189
8521 -557189 -556763 -426037 -362139 -387795 -709887 -360473 -533028 -158134 -412068 -334810 -537408
8510 -537408 -565532 -580703 -311246 -348144 -727722 -535652 -601078 -420300 -538528 -724133
8500 -724133 -686023 -611005 -511518 -573910 -478960 -434458 -397943 -607570 -390552 -333158 -333904 -545949
8488 -545949 -446842 -585978 -305831 -328981 -537825 -535325 -414188 -480598 -539353 -646859 -281491
8477 -281491 -570258 -584652 -392201 -488928 -319156 -466868 -515670 -644912 -443795 -477877
8467d77877J6823M5772K0075j52788Q6259Q7519j68294J20446O1944o5616k50732
8456f76469K10341l986J15533k24782K0348l2966m5565J93737L799K0912O8412
8445c50686j16966P7713k0894j5650p9397l1010O0734K5525q1806J51906M3608
8434c36923J676j09871m1726j30088M22153p2333k61400j10812J60599J27517
8424c51208j63655r191N0163o4187r2767K16498R7825k79286R0450O4631J52851
8413b87876j66798j21290j7163K0981j15856L87418k37533L2938k1196J99165
8403c27210J01735m06975J55360N1639J4604r946r3233K6754k72496K50075J4325
8392d95368K5416k8871J05845k50855J69139J7680j23464J48314J07609l3909
$$ plain form
8467 -477877 -461054 -415282 -395207 -547995 -461736 -374217 -542511 -422065 -360121 -425737 -676469
8456 -676469 -466128 -470114 -354581 -579363 -559015 -591981 -637546 -443809 -440010 -419098 -350686
8445 -350686 -467652 -389939 -410833 -426483 -505880 -536890 -476156 -450631 -532437 -380531 -336923
8434 -336923 -335247 -445118 -486844 -616932 -194779 -267112 -528512 -639324 -478725 -351208
8424 -351208 -514863 -524054 -473891 -538078 -630845 -414347 -316522 -595808 -505358 -440727 -287876
8413 -287876 -454674 -575964 -593127 -572146 -688002 -300584 -538117 -505179 -526375 -327210
8403 -327210 -225475 -632450 -477090 -425451 -410847 -420793 -514026 -487272 -759768 -509693 -495368
8392 -495368 -469952 -498823 -392978 -643833 -474694 -457014 -580478 -432164 -324555 -358464
8382c58464k21520J43708J94225l02034j03822J54587j39053K49671k20752K30275
8372c73179k25450L7568J81908k16173J97669k13641K67870k22711J26361j16793
8362e56571J09633o3735N8040j03116O2921l1071o8867K3126J64031r4824j36505
8351f36938J11977L3364l0840o762r6053K20761k10158M7521k0380j0346K42819
8340c55035k22562J20875j7294Q8926j22012J46291k5235k9133k23749K06249
8330d32679m2227j38102K6767L7301K7855J75209p5237O3368j63807k5982K58
8319e47276J61080k9431J0331K6339k21124J61188j89350J93801q2502R9206k40328
8308f58066J31344N5966R5756j492k10704J03595m2562J44388K4284j87129J50693
$$ plain form
8382 -358464 -579984 -436276 -242051 -544085 -647907 -493320 -632373 -382702 -603454 -373179
8372 -373179 -598629 -561061 -379153 -595326 -397657 -611298 -343428 -566139 -439778 -556571
8362 -556571 -446938 -510673 -452633 -555749 -492828 -523899 -592766 -569640 -405609 -500433 -636938
8351 -636938 -524961 -491597 -522437 -529199 -625252 -404491 -614649 -567128 -587508 -597854 -355035
8340 -355035 -577597 -456722 -474016 -385090 -507102 -360811 -386046 -415179 -638928 -432679
8330 -432679 -474906 -613008 -586241 -548940 -521085 -345876 -421113 -357745 -521552 -547534 -547276
8319 -547276 -386196 -415627 -405296 -378957 -600081 -438893 -628243 -434442 -516944 -417738 -658066
8308 -658066 -526722 -470756 -375000 -376492 -587196 -483601 -526163 -381775 -357491 -544620 -393927
8297c93927K0497j19877L5684R7298k52159J46912K37178k68517L28050k6634
8287a95495l49642J33712n9238J8042j00901M2816J07113n1613j03264j25424
8277f83894K15115k5544P8017J7752j9758k44449p9663K47831j92518J59098J06002
8266d22011r1823r3173K19161l48j31955l8080J14053j24972p166L51493l14632
8255e39453m6780J15913k6787J83725m5296k44868k27158K81650N8288m5711J61332
8244c75145j38576J92749P5790r0579j37718K6041l6833K42324o9842j9749K2206
8233c09332O3041j03851j82439M8533J05596J5319j40067J45507j76377J89539
8223c44531o660o3170K8006r1777j01644J50605j24511k7467K01454j97713j2385
$$ plain form
8297 -393927 -373430 -493307 -457623 -360325 -612484 -465572 -228394 -496911 -168861 -195495
8287 -195495 -545137 -411425 -470663 -452621 -553522 -510706 -403593 -455206 -558470 -683894
8277 -683894 -468779 -494323 -416306 -398554 -418312 -662761 -742424 -494593 -687111 -528013 -422011
8266 -422011 -513834 -607007 -387846 -388194 -520149 -558229 -444176 -569148 -576314 -224821 -539453
8255 -539453 -586233 -470320 -497107 -313382 -358678 -603546 -830704 -549054 -490766 -536477 -375145
8244 -375145 -513721 -320972 -245182 -335761 -473479 -447438 -484271 -241947 -311789 -331538 -309332
8233 -309332 -246291 -350142 -532581 -484048 -378452 -363133 -503200 -357693 -534070 -344531
8223 -344531 -351191 -414361 -386355 -478132 -579776 -429171 -553682 -581149 -379695 -577408 -589793
8212e89793L0026J27678K20970j60868p129q6895j96327K45605P0518k32271M4620
8201e33866L3207L49651r7288p1023J6048k49364L17180k07168j07666j197609
8191a747898J192273o9037j08242M53013j88580R9683j07922K3534J41147o8539
8181c80568j25425j04187P0429L57263m84525J95988j3921k6413m1866n8421K00594
8170d11052k68186N03901k44862L07627l45237J02854j64165j1028O8055J02888
8160c59205j18268l9224n169J15543j05399m7554M0992j35382L65496j39110j34248
8149e61528J68005j52067J52749J69095k05151Q8887r4616L3199r5783n608K5085
8138d77733r5492J79953j28308J35335o416P8401k10218J60632k0464p0779j37596
$$ plain form
8212 -589793 -559767 -432089 -211119 -371987 -379116 -466011 -662338 -416733 -346215 -578486 -533866
8201 -533866 -500659 -151008 -248296 -319319 -303271 -552635 -235455 -442623 -550289 -1747898
8191 -1747898 -555625 -624662 -732904 -279891 -468471 -368788 -476710 -453176 -312029 -380568
8181 -380568 -505993 -610180 -539751 -182488 -667013 -471025 -484946 -511359 -553225 -611646 -411052
8170 -411052 -679238 -175337 -420199 -112572 -457809 -354955 -519120 -530148 -462093 -359205
8160 -359205 -477473 -516697 -521866 -406323 -511722 -559276 -518284 -653666 -288170 -427280 -561528
8149 -561528 -393523 -545590 -392841 -223746 -428897 -340010 -434626 -401427 -497210 -502818 -477733
8138 -477733 -573225 -393272 -521580 -386245 -392661 -314260 -524478 -363846 -384310 -455089 -592685
8127e92685L7415K25297o7391p0836n6636J52932j42016K55304k38953L02972
8117a94597k36273N6228j80265J53056J02397O7029l07662R5800Q0959R4310j48969
8106d17987k4892J46909j46779J25685j6657m9362K11380k39331J70070k35943
8096d76907L55320k15351p8033K1278R2628q9542K05052l23626K48343k24723
8086d85561J67227j43894q5479J22299Q2339J74215j27479k66775L77261j79161
8076c65008L4746p889k51863K66436k32822J30285J41457r979j62979J60499J56726
8065a40391j85790j55439L4320L8626O6462Q1279r3823K0200M3609j21178N1410
8054c60715n6641R6331P6033m1230K64152m62375R3747j57845L28946o3113j52112
$$ plain form
8127 -592685 -555270 -329973 -397364 -468200 -524836 -371904 -513920 -258616 -497569 -194597
8117 -194597 -430870 -374642 -554907 -401851 -299454 -232425 -540087 -444287 -363328 -269018 -417987
8106 -417987 -442879 -295970 -442749 -317064 -333721 -383083 -171703 -411034 -240964 -476907
8096 -476907 -121587 -336938 -414971 -393693 -301065 -390607 -185555 -509181 -260838 -485561
8086 -485561 -318334 -462228 -547707 -425408 -343069 -168854 -296333 -563108 -185847 -365008
8076 -365008 -330262 -338151 -590014 -323578 -556400 -426115 -284658 -294637 -457616 -297117 -140391
8065 -140391 -326181 -481620 -447300 -408674 -342212 -260933 -354756 -334556 -290947 -412125 -360715
8054 -360715 -417356 -321025 -244992 -286222 -22070 -484445 -390698 -548543 -219597 -282710 -434822
8043d34822n3619q4946M06648j62019J35650r8361n2178J35697k26244J37773
8033b96421L9732k1790j94184Q4532l6844K04027j10588j17904R7457J40642j74091
8022c85432q9330J94571M8254j16566O7038j7844J27428k05817O8068Q3538j3937
8011b40029K653q4061K8112j8923J4038j04334P1382n8042K01202j38576M0250
8000b86328J16646m4666o6214r6072J4275J01165L8641P7033j15733n0647j7967
7989c29867L1872o1682L22237m21074J96449m8132m1420K76674k99599J89805
7979a84737k40561K52149r9010J46865j87404o5256K3257l7206K60749N3571k01554
7968b79137l1561R3913j6343j1300j1933j07094n995J94906l0397L8483j58517
$$ plain form
8043 -434822 -488441 -573387 -166739 -328758 -193108 -291469 -343647 -207950 -434194 -296421
8033 -296421 -256689 -278479 -472663 -388131 -424975 -220948 -331536 -449440 -351983 -211341 -385432
8022 -385432 -474762 -280191 -231937 -348503 -281465 -299309 -171881 -377698 -309630 -226092 -240029
8011 -240029 -237376 -321437 -293325 -312248 -298210 -402544 -331162 -389204 -188002 -326578 -286328
8000 -286328 -169682 -214348 -280562 -376634 -362359 -261194 -222553 -145520 -261253 -311900 -329867
7989 -329867 -297995 -359677 -37440 -458514 -262065 -310197 -351617 -74943 -374542 -184737
7979 -184737 -425298 -173149 -272159 -125294 -312698 -377954 -354697 -391903 -131154 -77583 -279137
7968 -279137 -310698 -216785 -233128 -244428 -256361 -363455 -369450 -174544 -204941 -166458 -324975
7957c24975O3007J27122J6772j7735k09592J66435p7344j04610J01495O2130k69109
7946d66404K04370J42211L6515M6765j83495N7381M7774M1695J10032j46323n5924
7935a65403p6543O4971J43673j84812K68803j56621r2727k1994K54524k93342
7925b59471P6395k2426R2831p6326Q532p0360K51555j01242Q4108j85151K21082
7914A9527L3344j82522l8963j18328K18986j8880Q2372j53772J96103j18869R5263
7903A4261q6683j30931J3890J05147J4949k6193j3734j4643J41814j51104o0413
7892a93640l6568J36055p319J11440r7900o9309Q4829Q4015J51856k08742p3103
7881a18386J17267n4645J47070k37677M99555m03549J78986l39357L03528R7065
$$ plain form
7957 -324975 -261968 -134846 -118074 -135809 -345401 -178966 -256310 -360920 -259425 -197295 -466404
7946 -466404 -262034 -119823 -83308 -36543 -220038 -162657 -114883 -73188 36844 -109479 -165403
7935 -165403 -241946 -176975 -33302 -218114 50689 -105932 -198659 -220653 33871 -259471
7925 -259471 -183076 -205502 -112671 -188997 -180465 -250825 730 -100512 -16404 -201555 19527
7914 19527 52871 -129651 -168614 -286942 -67956 -86836 -4464 -158236 37867 -81002 14261
7903 14261 -72422 -203353 -189463 -84316 -69367 -95560 -109294 -123937 17877 -133227 -193640
7892 -193640 -230208 -94153 -101472 9968 -87932 -157241 -72412 11603 163459 -45283 -118386
7881 -118386 -1119 -55764 91306 -146371 353184 -50365 128621 -210736 92792 189857
7871A89857n3658j95758J87526p2342K10571p1870j40203M4831J37670l04922
7861f8298K53162j34201j11986J52266O3868o4892O22523j410659R67925Q4120
7851C53828j86579j16363J39302k07381j2283K11793R4872j52647l0348m6214
7841D7980J27023o0371J05999j15084J60993M856k37089K38384o1404J34563L4163
7830C80013l9696K3005q5709L7931l5468J36236j33945j02637K39282n899j39437
7819B73676J75965K4992j86982L5624Q1338m3545m5307J66559l7190N7579j85276
7808C17433L8630J6303J14922j4508m405j67330J07287J30417Q3755j62656r7430
7797C62418J57293R5850k3178M58972n05773J37181J67896k14472M6498j40473
$$ plain form
7871 189857 136199 -59559 127967 55625 266196 194326 54123 98954 236624 -68298
7861 -68298 184864 50663 -61323 90943 154811 89919 712442 -698217 269708 353828
7851 353828 167249 50886 190188 -17193 -29476 182317 277189 124542 94194 47980
7841 47980 175003 114632 220631 105547 266540 271396 34307 272691 211287 345850 380013
7830 380013 340317 363322 277613 315544 280076 416312 282367 179730 419012 413113 273676
7819 273676 449641 474633 287651 323275 404613 361068 315761 482320 445130 502709 317433
7808 317433 356063 372366 487288 472780 468375 301045 408332 538749 622504 459848 362418
7797 362418 519711 615561 592383 1051355 545582 682763 850659 636187 682685 542212
7787E42212L75376j78680j29090l2514J75836N3845l588o4531j93980L00620m7826
7776G97680Q7425k383K4648O3094j27615J03225N7974n8808R7194l2702M3512
7765A053244n7008R5163K159J49479j38285J12765P8757j39449K4855L9149P6453
7754A297282j972J02207m0540q2051K01691r9491K9823j53472J50222J02344P8080
7743A584123k16337M56057m66103J11733M9296J05122n0463m8112K09703M2405
7733A777424j54654K14043k53814K08584k9101k6049J1770K48086r5032l6695
7723A864562M2341J22111k4094P4007j48092J70135Q5686k411r3209J26301N4070
7712B271407p7441J2568J82020j38718K86745j03066K4933N4285Q2174J31597
$$ plain form
7787 542212 917588 738908 609818 577304 753140 806985 803397 738866 544886 845506 797680
7776 797680 885105 882722 907370 970464 842849 946074 1004048 945240 1042434 1009732 1053244
7765 1053244 996236 1091399 1093558 1243037 1104752 1217517 1296274 1156825 1181680 1220829 1297282
7754 1297282 1295310 1397517 1356977 1274926 1476617 1377126 1406949 1253477 1403699 1506043 1584123
7743 1584123 1367786 1823843 1357740 1469473 1518769 1623891 1573428 1525316 1735019 1777424
7733 1777424 1622770 1836813 1582999 1791583 1762482 1736433 1748203 1996289 1901257 1864562
7723 1864562 1906903 2029014 2004920 2078927 1930835 2100970 2186656 2184245 2091036 2217337 2271407
7712 2271407 2193966 2206534 2388554 2249836 2536581 2433515 2458448 2512733 2594907 2726504
7702B726504k60396J11979O7969J47136q7305K30031k28084K91536l7322L43753
7692C305801l18095P8570J31828k12577J87187L0594J23106l2319J00036J16346
7682C510477j59083K17823j78108M21618p0059P9795j28166j30052L07927o561
7672C865611K38152Q093N2591j72008K33640J80749l4074p1648K20467K24437
7662D746010o0826N394J5330j21891L84277o9403K4759J50831J77320R8981l18861
7651E031921L68722j7675r9103K93057M1409k300O1197K49409j33416J41466J3836
7640E948523M609J83101R4222j72810K71565R8687k1863J85984q2717K3472Q172
7629F540945Q0744J04507R6017P8528L9997K38141j43283j13065J9665J76589
$$ plain form
7702 2726504 2466108 2578087 2646056 2793192 2705887 2935918 2707834 2999370 2962048 3305801
7692 3305801 2987706 3066276 3198104 2985527 3172714 3203308 3326414 3294095 3394131 3510477
7682 3510477 3351394 3569217 3391109 3812727 3742668 3822463 3694297 3564245 3872172 3865611
7672 3865611 4103763 4111856 4164447 3992439 4226079 4406828 4372754 4301106 4521573 4746010
7662 4746010 4685184 4690578 4705908 4584017 4968294 4898891 4923650 5074481 5251801 5350782 5031921
7651 5031921 5400643 5382968 5283865 5576922 5618331 5616031 5677228 5926637 5793221 5934687 5948523
7640 5948523 5953132 6136233 6230455 6057645 6329210 6427897 6406034 6592018 6509301 6532773 6540945
7629 6540945 6621689 6726196 6822213 6900741 6940738 7178879 7035596 6922531 6942196 7118785
7619G118785n2583K07885R9517J07542j44205k32003L47543R062o6129j2821P1080
7608G453673N4366p9878O5387p3065J76765q4230J09829j97290L7402j22675L95996
7597G736280o1524K2543p9127j17758j52874K5J81761K6807q4485m6752J97992
7586G622888k95313q3685k3455m9066O6553p4379j68748O6581M9594j85469J7517
7575F943018M8742j08132l05882K32215j78646M2640j03472j43769n1303J47253
7565F522664m3962j27969n694p7516j88481O5351j71208O702p2020m2973p8539
7554E786355j29349r656p5652j25763r7457J39157k98603L6569K22132j96280
7544E251453j4846j08358l7071k10260l2493P5075j32105k7175O4431O40k57238
$$ plain form
7619 7118785 7066202 7274087 7373604 7481146 7336941 7104938 7452481 7461543 7395414 7382593 7453673
7608 7453673 7508039 7428161 7493548 7420483 7597248 7513018 7622847 7425557 7462959 7340284 7736280
7597 7736280 7674756 7697299 7618172 7500414 7347540 7347565 7529326 7556133 7471648 7424896 7622888
7586 7622888 7327575 7243890 7220435 7171369 7237922 7163543 6994795 7061376 7110970 6925501 6943018
7575 6943018 6991760 6883628 6577746 6809961 6631315 6673955 6570483 6426714 6375411 6522664
7565 6522664 6478702 6350733 6345039 6267523 6079042 6144393 5973185 5979887 5907867 5864894 5786355
7554 5786355 5657006 5647350 5571698 5445935 5348478 5487635 5189032 5225601 5447733 5251453
7544 5251453 5236607 5128249 5091178 4880918 4848425 4923500 4791395 4764220 4828651 4829291 4572053
7533D572053J70807k78558l9275j49200p4920p014J2873j80301j02653J25916
7523D049728r6042o8958j54753P3193M663j21956m6964L920N8247m6444j31511
7512C523123Q7491k94825O7418j80874j5495l535N0688j63425J68712o8900j34302
7501C036076N8091J06702N917k24790K6782r2361m1064o8938J09993r6710r6595
7490B723103k3897J59007j97862J61433k34369o359K4729n0828j60774Q076N6955
7479B459214k68793J21027J54875L5706n032r2055J2425P3136l36928J99429Q1910
7468B434914j81473n898J70654k4181l45889K97877j88236N8158K19185j48091
7458B287020Q5711j78098M3615J00726j3276m1450J45970l00501Q8562J99369
$$ plain form
7533 4572053 4742860 4464302 4425027 4275827 4200907 4193893 4206766 4026465 3923812 4049728
7523 4049728 3953686 3884728 3729975 3803168 3807831 3685875 3638911 3642831 3701078 3654634 3523123
7512 3523123 3610614 3315789 3383207 3202333 3186838 3183303 3233991 3070566 3239278 3170378 3036076
7501 3036076 3094167 3200869 3206786 2981996 3008778 2916417 2875353 2806415 2916408 2819698 2723103
7490 2723103 2699206 2858213 2660351 2821784 2587415 2581056 2605785 2554957 2394183 2402259 2459214
7479 2459214 2190421 2311448 2466323 2502029 2496997 2404942 2417367 2490503 2153575 2353004 2434914
7468 2434914 2253441 2247543 2418197 2394016 2048127 2346004 2157768 2215926 2435111 2287020
7458 2287020 2372731 2194633 2238248 2338974 2325698 2284248 2430218 2129717 2218279 2417648
7448B417648j06696j12065L8515N7616r3552L7553P8137k70170L85227l85290
7438B046923K10337j40635r5653K69862j81526n4417M8951K4432q5838J89652
7428B232088l08100j34546J08034M7302N459O8265l61089J07655L3705q9577O1428
7417A770624P8380k82570J02807j47047K15280k47397l4326K61519k78267J3262
7407A452265m8012j46932J09158m1470n0502M5869j09873j4570j4695J3944K2899
7396A218081m09934K40168J42738n3241K3448n9521j30617j42208K42630K4177
7386A095721j82474j45148j8050P1956k04404J47458J5979O4528j295l47601L31299
7375H27969j24400K6332j31498M2075N0886l7442r9761O1036J5620J5378j81135
$$ plain form
7448 2417648 2310952 2198887 2237402 2295018 2201466 2239019 2317156 2046986 2432213 2046923
7438 2046923 2257260 2116625 2020972 2290834 2109308 2054891 2103842 2128274 2042436 2232088
7428 2232088 1923988 1789442 1897476 1944778 1950237 2018502 1657413 1765068 1798773 1709196 1770624
7417 1770624 1849004 1566434 1669241 1522194 1737474 1490077 1455751 1717270 1439003 1452265
7407 1452265 1404253 1257321 1366479 1325009 1274507 1320376 1210503 1195933 1181238 1195182 1218081
7396 1218081 808147 1048315 1191053 1137812 1161260 1101739 971122 828914 1071544 1095721
7386 1095721 913247 768099 750049 822005 617601 765059 781038 845566 844271 496670 827969
7375 827969 703569 729901 598403 640478 691364 653922 554161 615197 630817 646195 465060
7364D65060K90562k02347Q4915J61280m21736k4913J35361O3043j32141K08579
7354F27663J99700k39834j71018J73064j97838n5034R1176k93064K44759J7501
7344C97075j39776J15599O2173j34038J05471n5958K07508k86763L12112k04129
7334C79274r1299p8159J08351l7454j3088J320r3735q8915M3197j4547L05006
7323D19951j07579j56493K8692J90537j49110j67992Q8498N611R111p2428P2025
7312A60823m1631J47205r2097l3131J90994k26427r8842M1983M0318M0815R9979
7301B29989J4711O1336j57074k18362P1755J24866o1726J27432j04535j38163
7291d9771J03230p0014J66170j39596o6205N7394r2681J11389j10785O8269j98396
$$ plain form
7364 465060 755622 553275 638190 799470 377734 352821 488182 551225 419084 627663
7354 627663 827363 587529 416511 589575 391737 336703 427879 134815 379574 397075
7344 397075 257299 372898 435071 301033 406504 350546 558054 271291 583403 379274
7334 379274 287975 209816 318167 280713 267625 268945 175210 86295 129492 114945 419951
7323 419951 312372 155879 184571 375108 225998 58006 146504 152115 161226 88798 160823
7312 160823 119192 266397 174300 141169 332163 105736 6894 48877 89195 130010 229989
7301 229989 244700 306036 148962 -69400 2355 127221 65495 192927 88392 -49771
7291 -49771 53459 -16555 149615 10019 -56186 1208 -91473 19916 -90869 -22600 -220996
7280b20996J41361P3266j5992K8457p2623K52774l98726J61652O162j25712J92381
7269B2004O6599m52132J82189J65616K37624k54513M7611k15341K43595r0439
7259d7187L9519j79387J14785k4138J0364P1121m1980p8564k7343n9670N3504
7248a68976m1074m8605K59861j10707n7596j07496K66922k59954J23545P6883
7238f7197j28805m934J55017k4259o8517m3773Q2813j26772J15267j39517J36858
7227a13819J00105k29192L07O5327M9056r2317J6176O1929j50634J26562N1711
7216a14789j41168j78507L32135n6938P427j00036k0777P737J25754j34140Q6255
7205a87047l7927K481j0414j9210J28492j54013L5713J68921j88017j22642N4895
$$ plain form
7280 -220996 -79635 -6369 -22361 6096 -66527 186247 -212479 -50827 -44665 -170377 22004
7269 22004 88603 -363529 -181340 -15724 221900 -32613 14998 -200343 43252 -47187
7259 -47187 -7668 -187055 -72270 -96408 -86044 -14923 -56903 -135467 -162810 -222480 -168976
7248 -168976 -210050 -258655 1206 -109501 -167097 -274593 -7671 -267625 -144080 -67197
7238 -67197 -196002 -200936 -45919 -70178 -138695 -182468 -99655 -226427 -111160 -250677 -113819
7227 -113819 -13714 -242906 -242599 -177272 -128216 -220533 -204357 -142428 -293062 -166500 -114789
7216 -114789 -255957 -434464 -102329 -159267 -151840 -251876 -272653 -264916 -139162 -273302 -187047
7205 -187047 -224974 -222493 -232907 -252117 -123625 -277638 -241925 -73004 -261021 -383663 -328768
7194c28768k8340K10014l2041j50817J43850q6797J39330j4803j60125M0414j20714
7183c88797J05896N7087J0595k852K5495J43052j94987J4372p6198p879j73024
7172d87240K46124J70493j88189K834K2592k9493K2025Q4362j38519p0889M5768
7161c20132J51126p5089k50J8167j42622L7010O7126q1379m7672K0486R5399L5441
7149b42389M751K5118m1340q8431K02907k12132R510l4231J863L6085N6360k4399
7137c06328j74171n3331K61487j94917O1681r2438M3341J11751N8043j36799N4005
7126c67676K51132l06015J00653Q5639j69585J09119l6560j3427n8469r9143Q0839
7115d23493K9076J24433J7724k5999j18668J61862j77988J31035r2373r7234J40920
$$ plain form
7194 -328768 -357108 -147094 -179135 -329952 -186102 -272899 -133569 -148372 -308497 -268083 -388797
7183 -388797 -282901 -225814 -215219 -218071 -192576 -49524 -244511 -230139 -306337 -314216 -487240
7172 -487240 -241116 -70623 -258812 -255978 -233386 -262879 -240854 -156492 -295011 -365900 -320132
7161 -320132 -169006 -244095 -244345 -226178 -368800 -331790 -264664 -346043 -393715 -373229 -277830 -242389
7149 -242389 -237638 -212520 -253860 -342291 -139384 -351516 -342006 -376237 -374374 -338289 -281929 -306328
7137 -306328 -480499 -533830 -272343 -467260 -405579 -498017 -454676 -342925 -284882 -421681 -367676
7126 -367676 -116544 -422559 -321906 -236267 -405852 -296733 -333293 -346720 -405189 -504332 -423493
7115 -423493 -394417 -269984 -252260 -278259 -396927 -235065 -413053 -282018 -374391 -471625 -330705
7104c30705j07838p303J08015l6168j01737K65336l73827J45758J0614P0500J64389
7093a92966J1530k34058J22372j23968L8064q5344Q2144m7778j29969J61156p116
7082d05933m2410K1173J81253l17234K57633M1446j44506j19114J69746k2074
7072c80020K8606k8839K816j9428L6457o5627J27771j52747J19397P204o6516
7061c90926q0165O2957q3634J18632k80590L05269l1868J86530k61499K03757
7051b51537j91058n5362N7432J71809l21993K19010k6268j09939Q7459Q09R7010
7040c22628j1414k33133l3247L21996m5576j01636M4309Q5013J1351r0053r6260
7029d71278p4744J17889M3818q5881q224N8273j32721M1862K41974m01899K60881
$$ plain form
7104 -330705 -438543 -445846 -337831 -373999 -475736 -210400 -584227 -438469 -427855 -357355 -192966
7093 -192966 -181436 -415494 -293122 -417090 -379026 -464370 -382226 -430004 -559973 -398817 -405933
7082 -405933 -448343 -427170 -245917 -563151 -305518 -264072 -408578 -527692 -357946 -380020
7072 -380020 -351414 -380253 -377437 -396865 -360408 -426035 -298264 -451011 -331614 -324410 -390926
7061 -390926 -471091 -408134 -491768 -373136 -653726 -348457 -380325 -193795 -455294 -251537
7051 -251537 -442595 -497957 -440525 -268716 -590709 -371699 -397967 -507906 -420447 -419638 -322628
7040 -322628 -334042 -567175 -600422 -278426 -324002 -425638 -381329 -296316 -284965 -375018 -471278
7029 -471278 -546022 -428133 -384315 -470196 -478420 -420147 -552868 -511006 -269032 -670931 -410050
7018d10050m9077p9349n8775K02913n2059R95n0893r4743K68135k59671P1690
7007e10884K1087Q2204l18266K85146j7065j09491Q7151j9003j27334J11164K1265
6996d94026J7234m0861n1477K17171r1555k62327J82820K16207p9473k41921R3595
6985e34613N4275j9233k6399N8530k37546J77886J35022k37184K58444l02486
6975f73304K68834m29385L69977J52211p9428j50064J04259l5179L2387l7826
6965d77518j73339k9135R4578M0083K12192k09305J75840j18520J05801j74308
6955e53631O0346J01699q1650O4904k44841J56834L4252L9037m5926k02634J83691
6944d87919J69694r2972k15598J42693o133N8692j21804k5528O8266j02914J67652
$$ plain form
7018 -410050 -459127 -538476 -597251 -394338 -446397 -445402 -496295 -591038 -322903 -582574 -510884
7007 -510884 -489797 -407593 -725859 -440713 -457778 -567269 -480118 -499121 -626455 -515291 -494026
6996 -494026 -476792 -517653 -569130 -351959 -443514 -705841 -523021 -306814 -386287 -628208 -534613
6985 -534613 -480338 -499571 -525970 -467440 -704986 -527100 -392078 -629262 -370818 -673304
6975 -673304 -404470 -833855 -463878 -311667 -391095 -541159 -436900 -472079 -439692 -477518
6965 -477518 -650857 -679992 -585414 -545331 -333139 -542444 -366604 -485124 -379323 -553631
6955 -553631 -493285 -391586 -473236 -408332 -653173 -496339 -462087 -423050 -468976 -671610 -487919
6944 -487919 -318225 -411197 -626795 -484102 -490235 -431543 -553347 -578875 -510609 -613523 -445871
6933d45871p444j8227J14846p621k15135K827j13953L21588q3325j01172L7227
6922e16260M8705n5859J77977j58824P1906j29941R4314k60443L00644M4437j81623
6911e64967K27141l13371L5661J10308k0262q6309P0387J92582j00602K2033J05584
6900c21815l20126K02575K9583m4237M3372r9047k23801K46700J59014j76262
6890e04044m8711J31529Q0416j05467R6912j98824J46433m4339J2648j6631p807
6879d57885j21823M0220J34861Q1417j63443J136P8503j39325K8518M6736J70287
6868c00798k34215J65490j00533j1018r4434M18695l44522J92344k43436J24164
6858d28263K69404j0857K29078l00601L9334j5362o8132j74457K54373k40916
$$ plain form
6933 -445871 -453315 -471542 -356696 -364317 -579452 -576625 -690578 -368990 -452315 -553487 -516260
6922 -516260 -467555 -523414 -345437 -504261 -432355 -562296 -467982 -728425 -427781 -383344 -564967
6911 -564967 -337826 -651197 -615536 -505228 -525490 -611799 -541412 -348830 -449432 -427399 -321815
6900 -321815 -641941 -439366 -409783 -454020 -410648 -509695 -733496 -486796 -327782 -504044
6890 -504044 -552755 -421226 -340810 -446277 -349365 -548189 -401756 -446095 -433447 -450078 -457885
6879 -457885 -579708 -539488 -404627 -323210 -486653 -485517 -407014 -546339 -517821 -471085 -300798
6868 -300798 -535013 -369523 -470056 -481074 -575508 -156813 -501335 -308991 -552427 -428263
6858 -428263 -158859 -169716 59362 -241239 -201905 -217267 -285399 -459856 -205483 -446399
6848d46399M1566j08105J2348L0482r1179n3903K45805j12394j13458J34747q7320
6837e47810j1969N3538j24782J60119K8203m6633P6376J03134Q1874P6692l0731
6826a81989j19892J3078q0794k2724J14742p3930l37638K58020l2589J95798k01052
6815d68970L9041j43127l229r4276L8827l1324K69298k34927L7753L6408m4821
6804e99347K16815l45854J28449J28353Q3473j2707j40321N9472P7469o1878q1451
6793e47527J7463M8665k05861n3628Q9948k1026J79548j23925p64q0954L2994
6782f65067J87617k73460K29783j70148J23354m5354P2512O8328j37632J21649
6772d88418k1842k65945J42772N5732k7310O1097o3364N8095q6053K5495o7045
$$ plain form
6848 -446399 -404833 -512938 -500590 -470108 -561287 -615190 -369385 -481779 -595237 -460490 -547810
6837 -547810 -559779 -506241 -631023 -470904 -442701 -489334 -412958 -309824 -227950 -151258 -181989
6826 -181989 -301881 -288803 -369597 -392321 -277579 -351509 -689147 -431127 -463716 -267918 -468970
6815 -468970 -429929 -573056 -576285 -670561 -631734 -663058 -393760 -628687 -590934 -554526 -599347
6804 -599347 -382532 -728386 -599937 -471584 -388111 -400818 -541139 -481667 -404198 -466076 -547527
6793 -547527 -530064 -481399 -687260 -740888 -650940 -671966 -492418 -616343 -617107 -698061 -665067
6782 -665067 -477450 -750910 -521127 -691275 -567921 -613275 -540763 -472435 -610067 -488418
6772 -488418 -510260 -776205 -633433 -577701 -605011 -543914 -607278 -549183 -635236 -609741 -676786
6761f76786N6190J13631l0307M1168K1761J03203j88870r0202J0434J16893j52664
6750f75549K31496j07886R1118j47836J04474N6459m1455N285k69396K16301k44036
6739g81025K67344k02723J83447L3398n0627j01295O870O2777N2730p2811J36133
6728d65782j87421J72541q7962J5424q7382J87064o5426o4836R8751j70234O9226
6717e86037j28718K2799J67936j49422o8975L00930m4215K9759m1389j62876J39357
6706e20851K126N8951j04240K494M4714k6067L2150k2348n7334Q6138j18128r2435
6694g14830L69492l41108J57267n9603J43327p9453q8228m8541K38285l13766
6684g37158J92748Q9203n3240k17390m9231K07619J41839n3056K00982j34904
$$ plain form
6761 -676786 -620596 -506965 -537272 -496104 -474343 -371140 -560010 -650212 -639778 -522885 -675549
6750 -675549 -444053 -551939 -460821 -608657 -504183 -447724 -489179 -483894 -753290 -536989 -781025
6739 -781025 -513681 -716404 -532957 -499559 -550186 -651481 -644611 -581834 -529104 -601915 -465782
6728 -465782 -653203 -480662 -568624 -553200 -640582 -453518 -518944 -583780 -485029 -655263 -586037
6717 -586037 -714755 -691956 -524020 -673442 -742417 -441487 -485702 -455943 -497332 -660208 -520851
6706 -520851 -518725 -459774 -564014 -561520 -516806 -542873 -510723 -533071 -590405 -504267 -622395 -714830
6694 -714830 -345338 -686446 -529179 -588782 -445455 -524908 -613136 -661677 -423392 -737158
6684 -737158 -544410 -455207 -508447 -725837 -775068 -567449 -425610 -478666 -277684 -412588
6674d12588k22215K79196j26193n3843j13018K04639j0868k21084j2113J72423
6664e15664j7045J09012j73000j66725Q5894J34190K4706j01446j72896Q3324
6654g09650J42381q6688J41311k5293p0335L5647r1975J04974J50057r6105n8016
6643e63692R8782j87887J10654J35653j56758j10063K34813l9490j01724j53677
6633g33389R4008K02410j59451Q9523L4516q5145J05073M7085r4861P1918k05757
6622f34070R2305J17429o3010k7747k508K07601r1321j48733J27264j5968J02709
6611c36049P8047o8243q3236N7559j0889J34304k76992R7532R8085k02738M4897
6600d67723J63223L6545j15333J13793j03457K9321q201K467P1511J37403k12447
$$ plain form
6674 -412588 -634803 -355607 -481800 -535643 -648661 -444022 -454890 -675974 -688087 -515664
6664 -515664 -532709 -423697 -596697 -763422 -677528 -543338 -518632 -620078 -792974 -709650
6654 -709650 -567269 -653957 -512646 -537939 -608274 -572627 -664602 -559628 -409571 -505676 -563692
6643 -563692 -464910 -652797 -542143 -406490 -563248 -673311 -438498 -477988 -579712 -733389
6633 -733389 -639381 -436971 -596422 -506899 -472383 -557528 -452455 -405370 -500231 -428313 -634070
6622 -634070 -541765 -424336 -487346 -515093 -517601 -310000 -401321 -550054 -422790 -438758 -336049
6611 -336049 -258002 -326245 -409481 -351922 -362811 -228507 -505499 -407967 -309882 -512620 -467723
6600 -467723 -304500 -267955 -383288 -269495 -372952 -343631 -351832 -349365 -277854 -140451 -352898
6589c52898J57980p3529Q4038o0036K01457l2364K4234L5849J84699J7966n1194
6578A36202k30816R7736M5684L2265j06755K2328j86069J76605K40204j13650
6568A13734p6574l4832M23192J89448K28019P01939N70766J76938j08321k34648
6558A949661l93463k62770k13155j78548n336m8444k0927k34519k8304J04013
6548F68208q3972p7713N6022j05016K13417k6462O056K33185O2666J43075L44341
6537A433807K79235J040156J474111J717317J242570j73232j124121p76847j024543
6528D088453r10447q61300j71955m57631l5622l44305k84666q2988J74549q2318
6518A031770k51496J64064J11288K3879k6133J05869J23319K856J65105O18500
$$ plain form
6589 -352898 -194918 -268447 -184409 -244445 -42988 -75352 -51118 -15269 169430 187396 136202
6578 136202 -94614 3122 48806 81071 -25684 -3356 -189425 -12820 227384 113734
6568 113734 37160 2328 425520 614968 842987 1544926 2115692 2292630 2184309 1949661
6558 1949661 1556198 1293428 1080273 901725 896389 847945 827018 592499 564195 668208
6548 668208 584236 506523 562545 457529 670946 644484 650540 883725 946391 1089466 1433807
6537 1433807 1713042 2753198 4227309 5944626 7187196 7013964 5889843 5112996 4088453
6528 4088453 3178006 2316706 2144751 1687120 1651498 1307193 1022527 939539 1114088 1031770
6518 1031770 780274 944338 1055626 1079505 1053372 1159241 1282560 1285416 1450521 2069021
6508B069021P36467J112543J734231J297503L01974j060815r84095j008380j206551
6499B991898l72092p34901j30563n03288j71960j56054J19791l23072M2247L6351
6489G98357n6918n9758j02073p7877P7566K44678j66836K59910L1151J11615M74338
6478A534153P37372K49180n9146j15017k74773l33816l36270j95568l25190L6251
6468I17176k52061J43890l50020L44525l10946L9184J0834J8624q5798J48324
6458F23732j2630J48156k69616K56041k82631j4990K43160n7539j05456p1419
6448D56808J16635j2649M2617N7742o3174P4937R5495L933n8379J3124J78601
6437I05690o3892N9277o9110K2956p7409J69756J04849k3718k58507K04353o5041
$$ plain form
6508 2069021 2805488 3918031 5652262 6949765 7251739 6190924 5206829 4198449 2991898
6499 2991898 2619806 1884905 1754342 1251054 1079094 923040 1042831 719759 762006 798357
6489 798357 741439 681681 579608 501731 579297 823975 657139 917049 948200 1059815 1534153
6478 1534153 2271525 2520705 2461559 2346542 2071769 1737953 1401683 1206115 880925 917176
6468 917176 665115 809005 458985 803510 492564 531748 542582 561206 475408 623732
6458 623732 611102 759258 489642 745683 463052 448062 691222 633683 528227 456808
6448 456808 573443 560794 603411 661153 597979 672916 768411 772344 713965 727089 905690
6437 905690 841798 901075 831965 854921 777512 947268 1052117 1028399 769892 974245 909204
6426I09204j8247K71319l7927N4451M6486Q5465q038K1084J35346l1648o2690
6415A364805r0488K33546J19790K8493J01125j45011J8897k1875K5858K41474
6405A876614K6232O1314J29272O6883j48405J28355M2778r5533K58508R8225m5121
6394B399122J97183Q9573Q1857p6321J96778Q1471k30597L41219J02196J22477
6384C304958J64904q2415R1359K34232J40828P1514J46641m5402J12596P4782
6374D213997L45568J6060J46647J41325J13877K67712J53653J01472K46971K06077
6364E953359J84823K08086P2164J49845J23030M25942K22906O2664L67989L19920
6354H090728m6572O82192J77535R5592L86497M07951K65291M50949K96044L94654
$$ plain form
6426 909204 890957 1162276 1124349 1178800 1225286 1310751 1302713 1323797 1459143 1427495 1364805
6415 1364805 1274317 1507863 1627653 1656146 1757271 1612260 1631157 1609282 1635140 1876614
6405 1876614 1902846 1964160 2093432 2160315 2011910 2140265 2183043 2087510 2346018 2444243 2399122
6394 2399122 2596305 2685878 2767735 2691414 2888192 2969663 2739066 3080285 3182481 3304958
6384 3304958 3469862 3387447 3478806 3713038 3853866 3925380 4072021 4026619 4139215 4213997
6374 4213997 4559565 4575625 4722272 4863597 4977474 5245186 5398839 5500311 5747282 5953359
6364 5953359 6138182 6346268 6418432 6568277 6691307 7117249 7340155 7402819 7770808 8090728
6354 8090728 8044156 8726348 8903883 8999475 9385972 9793923 10059214 10510163 10806207 11200861
6344A1200861L12824N50918L53204L38929N87493M73322L95097L77189N86039
6335A5175876O00688K37720N17639M02293O24993M77636M00718P33019N37254
6326A9707836N79965N05472M75176Q46728O12667P61551O41737P40732Q62878
6317B5734742O65626Q41688P44965Q42846P49385O86953R86344O58874R90754
6308C2902177Q51836R63980Q50092R26758O57753Q04667R41169J162061J075160
6299D1135653J085816J236444J037164J207892J179469J357227J333738J736479
6291E1309882J497733J612233J853628J508506K166489J965910J960335K181136
6283F6055852K376306K454320K407864K543797K647939K870544K670320L048844
$$ plain form
6344 11200861 11513685 12064603 12417807 12756736 13344229 13817551 14212648 14589837 15175876
6335 15175876 15776564 16014284 16531923 16934216 17559209 18036845 18437563 19170582 19707836
6326 19707836 20287801 20793273 21268449 22115177 22727844 23489395 24131132 24871864 25734742
6317 25734742 26400368 27242056 27987021 28829867 29579252 30266205 31252549 31911423 32902177
6308 32902177 33754013 34717993 35568085 36494843 37152596 37957263 38898432 40060493 41135653
6299 41135653 42221469 43457913 44495077 45702969 46882438 48239665 49573403 51309882
6291 51309882 52807615 54419848 56273476 57781982 59948471 61914381 63874716 66055852
6283 66055852 68432158 70886478 73294342 75838139 78486078 81356622 84026942 87075786
6275H7075786L025108K965866K743521K614474K467559K128006J698393J304514
6267A06023227J169337K19753n1439p6637r03784j052033j438592j339399j328765
6258A01221668j752427j776708j590363j462055k010133j732880j944908j865061
6250H7087133k375378j924530k208360j995744k685038k353820k419238k647078
6242F8477947k313013k750865k343844k577236k576996k364602k086912k296059
6234D9168420k077799k012582j851998j739068j643151j615336j470816j642064
6226C5115606j165733j354514j446748j194536j228091j069668j166546j021170
6218B5468600r41265p78785o21858o98870p44655n09441l01117l15792l83374
$$ plain form
6275 87075786 90100894 93066760 95810281 98424755 100892314 103020320 104718713 106023227
6267 106023227 107192564 107412317 107360878 107284241 106380457 105328424 103889832 102550433 101221668
6258 101221668 99469241 97692533 96102170 94640115 92629982 90897102 88952194 87087133
6250 87087133 84711755 82787225 80578865 78583121 75898083 73544263 71125025 68477947
6242 68477947 66164934 63414069 61070225 58492989 55915993 53551391 51464479 49168420
6234 49168420 47090621 45078039 43226041 41486973 39843822 38228486 36757670 35115606
6226 35115606 33949873 32595359 31148611 29954075 28725984 27656316 26489770 25468600
6218 25468600 24527335 23748550 23126692 22427822 21683167 21173726 20872609 20556817 20173443
6209B0173443p76520p21755o98986r62458q77969n11073r27046m30922o79877
6200A3586837n97887m57421l67806l06745l95073m71729j95960l37753m03509
6191A0052954k64330k49904l75412p1085j56225m24300k12782j34986k66748O2572
6181G959754k77429l20276j05661l87589k1206j89292O4856j73794k24979j31591
6171F192793j35068j2847k58879o8070R8572j58519m2123k69094L8633M3088l93329
6160E035157o842j45818j048o0413k3706k47076J62324q7689M385k98237J11172
6149D442209j42692j53754j71660o7189o3503k7257j11670l2977j0296j4248k35555
6138C411408r0378n1536N5594l637j59441l8838p1581J5169J77744j62822P0400
$$ plain form
6209 20173443 19396923 18675168 17976182 17013724 16135755 15624682 14697636 14266714 13586837
6200 13586837 12988950 12531529 12163723 11856978 11461905 10990176 10794216 10456463 10052954
6191 10052954 9788624 9538720 9163308 9092223 8935998 8511698 8298916 8163930 7897182 7959754
6181 7959754 7682325 7362049 7256388 6868799 6847593 6658301 6723157 6549363 6324384 6192793
6171 6192793 6057725 6044878 5785999 5717929 5816501 5657982 5615859 5346765 5385398 5428486 5035157
6160 5035157 5028315 4882497 4881449 4821036 4797330 4550254 4712578 4624889 4629274 4331037 4442209
6149 4442209 4299517 4145763 3974103 3906914 3843411 3816154 3704484 3671507 3661211 3646963 3411408
6138 3411408 3321030 3269494 3325088 3321451 3162010 3123172 3051591 3066760 3244504 3081682 3152082
6127C152082j17465R5739j56013j5242J44568o9378j87708j56382J8454Q7540
6117B796195J91868j70870q7888R9073j65472O3480L3847j19433P4059j44734
6107B570125K02167j92126M266m1092P7427l2155q4718K25422k142j27432j44215
6096B455527q329J4089O0096p2616R0888j45383J35556j22237j11994j081J39606
6085B434122L0120j7387R4565k71324l1896J28922P5407R2771p3179j5107N8792
6074B505806J99016q8124j48762J89588q6244J57070j1311Q1633o4111k4248J08053
6063B818366J75372p0764m4785j42490K39051N1052o5650O8890n0258m835r0334
6052B883615J32124k00161Q3270Q3066R0922n7880K61210J05315k19227k3981
$$ plain form
6127 3152082 3034617 3130356 2974343 2959101 3103669 3034291 2846583 2690201 2708655 2796195
6117 2796195 2988063 2817193 2729305 2828378 2662906 2726386 2760233 2640800 2714859 2570125
6107 2570125 2772292 2580166 2584432 2543340 2620767 2588612 2503894 2729316 2727174 2599742 2455527
6096 2455527 2447198 2461287 2521383 2448767 2539655 2394272 2529828 2407591 2295597 2294516 2434122
6085 2434122 2464242 2446855 2541420 2270096 2238200 2367122 2442529 2535300 2462121 2447014 2505806
6074 2505806 2704822 2616698 2467936 2657524 2571280 2728350 2717039 2798672 2734561 2710313 2818366
6063 2818366 2993738 2922974 2878189 2735699 2974750 3025802 2960152 3029042 2978784 2973949 2883615
6052 2883615 3015739 2815578 2898848 2981914 3072836 3014956 3276166 3381481 3162254 3138273
6042C138273L37521l4491k2901M9755K21954L67317r0518r3648J93616j44450
6032C922428J67712r8334n7172P4811P5000J27295n1477j37670J30224Q3170k30559
6021D005428J58853L33072j91799J92624K47526l8094P5250r4960J61078J03219
6011D952197J0577K0655K85827J06792Q5286M0353O8646J36428N4981J43319J54780
6000F059841K16445J51585Q9490K17617O1852K57632j6400L85152K54382R8379
5990G775975P7169K97979J38393J00186K37784K30852J08680J20001M40319J95513
5980I722851L21646M08530L59194M47984K59137J09970O69593R0399K71748P31078
5970A3392130M53498M06346M65571N59527O28417N82478Q95928M72725P29991
$$ plain form
6042 3138273 3475794 3441303 3418402 3468157 3690111 4057428 3966910 3873262 4066878 3922428
6032 3922428 4090140 3991806 3934634 4009445 4084445 4211740 4160263 4022593 4152817 4235987 4005428
6021 4005428 4164281 4497353 4305554 4498178 4745704 4707610 4782860 4687900 4848978 4952197
6011 4952197 4962774 4983429 5269256 5376048 5461334 5501687 5570333 5706761 5761742 5905061 6059841
6000 6059841 6276286 6427871 6517361 6734978 6796830 7054462 7038062 7423214 7677596 7775975
5990 7775975 7853144 8151123 8289516 8389702 8627486 8858338 8967018 9087019 9527338 9722851
5980 9722851 10044497 10453027 10812221 11260205 11519342 11629312 12298905 12389304 12661052 13392130
5970 13392130 13845628 14251974 14717545 15277072 15905489 16487967 17383895 17856620 18586611
5961A8586611Q82063J123421J228027J024555J540903J713102J842823K074004
5953C0015509K273761K545732L054169L852993M234558N583831O505852Q303368
5945F6369773J0262307J4115849J9674057K7907082L9944281N5310070O3942679
5938B97526098N3583165K3519771j5826190l5757988m3043138m4714862m0056740
5931A95230116l3252158k6522891k1217911j6034544j2681600j0061847p636799
5924F7822366o264088m919829l853713l117861k717607k081904j887440j660351
5916D1319573j357285j241309j007566j129230q16314o33390q46556p58702l98803
5907C3130418n22894l24776l57594k08433k98990j35343l56443P6553n0353j5725
$$ plain form
5961 18586611 19468674 20592095 21820122 22844677 24385580 26098682 27941505 30015509
5953 30015509 32289270 34835002 37889171 41742164 45976722 51560553 58066405 66369773
5945 66369773 76632080 90747929 110421986 138329068 178273349 233583419 297526098
5938 297526098 351109263 374629034 358802844 323044856 280001718 235286856 195230116
5931 195230116 161977958 135455067 114237156 98202612 85521012 75459165 67822366
5924 67822366 61558278 56638449 52784736 49666875 46949268 44867364 42979924 41319573
5916 41319573 39962288 38720979 37713413 36584183 35767869 35134479 34287923 33529221 33130418
5907 33130418 32607524 32282748 31925154 31716721 31417731 31282388 30925945 31002498 30952145 30936420
5897C0936420n6523J09233J93273J43101J54518K58951L62365J02086K20362M69808
5887C2893594J42115O83287K68392M42721N23991O77494O95110N60924P67351
5878C7654979Q66915O50361J294058R57578J164725J103635J126592J454176J365476
5869D7638495J297042J461382J657188J713863K157114J925616J956887K488237
5861F2295824K620300K629816L011147L234932L455562L662398M339114M559358
5853H9808451M463361N469322N659963O430495O865292P436021Q267906Q685657
5845A43086468J0029623J0507061J1719259J2833090J3775162J5247642J5892139
5838B33090444J7471968J7932137J8937099J8872011J8612935J7940726J5717229
$$ plain form
5897 30936420 30879897 30989130 31182403 31325504 31480022 31738973 32101338 32203424 32423786 32893594
5887 32893594 33035709 33718996 33987388 34430109 34954100 35631594 36326704 36887628 37654979
5878 37654979 38521894 39172255 40466313 41423891 42588616 43692251 44818843 46273019 47638495
5869 47638495 48935537 50396919 52054107 53767970 55925084 57850700 59807587 62295824
5861 62295824 64916124 67545940 70557087 73792019 77247581 80909979 85249093 89808451
5853 89808451 94271812 99741134 105401097 111831592 118696884 126132905 134400811 143086468
5845 143086468 153116091 163623152 175342411 188175501 201950663 217198305 233090444
5838 233090444 250562412 268494549 287431648 306303659 324916594 342857320 358574549
5831C58574549J3409868R882163O044464J914614k642965o410327j0157229j2886395
5823C57728742j5119219j6459701j7294281j7426824j7455777j6664418j5936436
5816B41372086j5015455j3999742j2916956j2201484j1214037j0052315r355411
5809A56616686q598488p716535p409863o939161n891901n740229n483839m862244
5801A03974426m318288m175451l854565l893315l450996l319318k966481k860620
5793G5135392k720780k268980k487984k032082k138026k144008k097813j703325
5785E7542394j465834k021668j340871j653625j620024j052094j406164j334500
5777D5647614j337003j177484q08942j403846r88866j108718p15029r19595j022872
$$ plain form
5831 358574549 371984417 381866580 387911044 389825658 387182693 380772366 370615137 357728742
5823 357728742 342609523 326149822 308855541 291428717 273972940 257308522 241372086
5816 241372086 226356631 212356889 199439933 187238449 176024412 165972097 156616686
5809 156616686 148018198 140301663 132891800 125952639 120060738 114320509 108836670 103974426
5801 103974426 99656138 95480687 91626122 87732807 84281811 80962493 77996012 75135392
5793 75135392 72414612 70145632 67657648 65625566 63487540 61343532 59245719 57542394
5785 57542394 56076560 54054892 52714021 51060396 49440372 48388278 46982114 45647614
5777 45647614 44310611 43133127 42324185 40920339 39931473 38822755 38107726 37188131 36165259
5768C6165259o33314j199705p28190o66336n53499p72300o07862p35143q20559
5759B9448351n14807p51647m79296k88057q84777m66530m25558n80005m18742
5750B4638932l88768o73220l78651n17594l49211l59086j57297m84119l40638
5741B0990348r0116m07361m46426k81472l73590k64355j91352l16841j76969n74337
5731A7867529k44729j10596q8104l89363M072k70329k80350k56349l5018k91964
5721A5904799j62848R7676l63087r3258j13385p8911k00210J6531l54866j71939
5711A4480502J37444l19508J78286j82727K5067k26672R2110K148l45407L9244
5701A3880487m6869p3917R7561J8421m3987p3116N8370k4671J11492j29145K21362
$$ plain form
5768 36165259 35531945 34332240 33604050 32937714 32384215 31611915 31004053 30268910 29448351
5759 29448351 28933544 28181897 27702601 27414544 26529767 26063237 25637679 25057674 24638932
5750 24638932 24250164 23576944 23198293 22680699 22331488 21972402 21815105 21330986 20990348
5741 20990348 20900232 20492871 20046445 19764973 19391383 19127028 18935676 18618835 18441866 17867529
5731 17867529 17622800 17512204 17424100 17034737 17038809 16768480 16488130 16231781 16196763 15904799
5721 15904799 15741951 15839627 15476540 15383282 15269897 15190986 14990776 15007307 14652441 14480502
5711 14480502 14617946 14298438 14476724 14293997 14319064 14092392 14184502 14186650 13841243 13880487
5701 13880487 13833618 13759701 13857262 13875683 13831696 13758580 13816950 13792279 13903771 13774626 13995988
5690A3995988R0836J35683M66424L27476L33707O89710O80578K55021K54928k62013
5680A6968338k10453k10302k96835k71032p7967L21879k24270J03789L62885L83255
5670A6849287L58589M83899L66050M47536L81328O71840N49284P57513O17211
5661B1482537K07501Q1103k13024r4877J2584l66848l14265j68411j08865n5218
5651B0462217M0596J48624K94564K63013M71579O42692Q41343R38621Q37251Q50791
5641B5791291N07958N78575L04051M98207M00271N20785O85886Q50507O65342
5632C0802873Q47863Q35037O58504Q75366P83016O94844Q41160N87121K73053
5623C7198837Q18471N89497Q55818N47366Q05045N28985P10730R28533N33891
$$ plain form
5690 13995988 14086824 14222507 14688931 15016407 15350114 16039824 16720402 16975423 17230351 16968338
5680 16968338 16757885 16547583 16250748 15979716 15901749 16223628 15999358 16103147 16466032 16849287
5670 16849287 17207876 17691775 18057825 18505361 18886689 19558529 20107813 20865326 21482537
5661 21482537 21690038 21771141 21558117 21463240 21475824 21108976 20794711 20626300 20517435 20462217
5651 20462217 20502813 20651437 20946001 21209014 21680593 22323285 23164628 24103249 24940500 25791291
5641 25791291 26299249 26877824 27181875 27680082 28080353 28601138 29287024 30137531 30802873
5632 30802873 31650736 32485773 33144277 34019643 34802659 35497503 36338663 36925784 37198837
5623 37198837 38017308 38606805 39462623 40009989 40815034 41344019 42054749 42983282 43517173
5614D3517173Q02547P03841O54135R18225P75173J031887P75020J144202J218232
5605E1540435J261377J439857J370565J410049J534961J376653J410125J285527
5597F2629549J003102P61291P98990O47008M86857K88218L35773J72989j11581
5588F7012196K68330k86116j87273l44525o76593l04127m93774r01117p19681
5579F3367320k47646r44667l13759p41244j23684j3715J55823K36355J51471M35752
5569F1962006P04446N37199Q93017O24718Q45671R72365Q29444R58675Q22606
5560F9150147R20355P46407P35504N52565M73260L84180K95619j10617K75489
5551G3422909k35217k51132j26694m24495r2228k94213k02308M2674O056K63140
$$ plain form
5614 43517173 44319720 45023561 45677696 46595921 47371094 48402981 49178001 50322203 51540435
5605 51540435 52801812 54241669 55612234 57022283 58557244 59933897 61344022 62629549
5597 62629549 63632651 64393942 65192932 65839940 66326797 66615015 66950788 67123777 67012196
5588 67012196 67280526 66994410 66807137 66462612 65786019 65481892 64988118 64087001 63367320
5579 63367320 63119674 62175007 61861248 61120004 60996320 60982605 61138428 61374783 61526254 61962006
5569 61962006 62666452 63203651 64096668 64721386 65567057 66539422 67368866 68327541 69150147
5560 69150147 70070502 70816909 71552413 72104978 72578238 72962418 73258037 73147420 73422909
5551 73422909 73187692 72936560 72809866 72385371 72293143 71998930 71796622 71839296 71845352 72108492
5541G2108492L74944M99517R47923P90921J205049J410735J420575J543090J488710
5532H1789956J325511J284214R83782O36205L81304q0417p06812j075321j169192
5523H3369230j560734j802434j924752k051093j893146k017342j774457j861330
5515F8483942j524494j407717r90373q87051p69928n66297m24105m91586l67133
5506F1055258m40401k85846o11196r17145q16678j184390j252254j589182j649897
5497E2308269k007024j638947j941466k040380j473332j678885j853250j318388
5489C8356597j490543j144026j250222j246743o85761q89602n22586j113627k10591
5480B9802896o52797o85228n32635j23521m79223k93186L3528o66919k37309j3457
$$ plain form
5541 72108492 72483436 72982953 73930876 74721797 75926846 77337581 78758156 80301246 81789956
5532 81789956 83115467 84399681 85383463 86019668 86400972 86320555 85613743 84538422 83369230
5523 83369230 81808496 80006062 78081310 76030217 74137071 72119729 70345272 68483942
5515 68483942 66959448 65551731 64561358 63674307 62904379 62338082 61913977 61422391 61055258
5506 61055258 60614857 60329011 59717815 58800670 57983992 56799602 55547348 53958166 52308269
5497 52308269 50301245 48662298 46720832 44680452 43207120 41528235 39674985 38356597
5489 38356597 36866054 35722028 34471806 33225063 32539302 31649700 31127114 30013487 29802896
5480 29802896 29150099 28464871 27932236 27808715 27329492 27036306 27069834 26402915 26165606 26152149
5470B6152149j65895k29422k56007q1891k18437l03493K7893k84066n2585p8098
5460B4510148P4389p2369j20556O2450j17834q8727L8733k7414n5151j14606j25053
5449B3964010K32822O737r2611J94349l9384j17878j87471J87316L43683l01847
5439B4189726R2469J20928l582r1973L7879J89880O6693R974P7785J32133o5684
5428B4756228r592J46659L258j7973J56255l4579K70277j93042J84530R4218j3861
5417B5342378J53523K78724J77864k50203J84861L04043K35922N9633J24682L92965
5407B7004392K52877K91246K14319L83099J76250L41006K93746N99778M58455
5398C0015168Q0986M05621N08294N88719K36015N83146M57960N52048L28509O53863
$$ plain form
5470 26152149 25986254 25756832 25500825 25418934 25200497 24897004 24924897 24640831 24588246 24510148
5460 24510148 24584537 24512168 24391612 24454062 24336228 24247501 24286234 24258820 24203669 24089063 23964010
5449 23964010 24196832 24203569 24110958 24305307 24265923 24148045 23960574 24147890 24491573 24189726
5439 24189726 24282195 24403123 24399541 24307568 24345447 24535327 24602020 24611994 24689779 24821912 24756228
5428 24756228 24746636 24893295 24896553 24878580 25034835 25000256 25270533 25077491 25262021 25356239 25342378
5417 25342378 25495901 25774625 25952489 25702286 25887147 26191190 26427112 26486745 26611427 27004392
5407 27004392 27257269 27548515 27762834 28145933 28322183 28663189 28956935 29556713 30015168
5398 30015168 30096154 30501775 31010069 31598788 31834803 32417949 32875909 33427957 33756466 34410329
5388C4410329L97989O59250K48754Q52455K75354O48532N08534M79666P40841
5379C9221704N87236Q04903N29021Q18150O73879P17007N51588P77848P50699
5370D5432035P75240Q51077O79328O48060O20873O79050P84752Q75023N78369
5361E1923807Q95483R84463J325647K377330L645935M819038M987505K883922
5353G3843130p15146k664132l165044l291650k917897k340164j661876j497531
5345E5589690j113591j034390q05500q29541p29898o10519p75835m92145p07997
5336D8490274p57590r26799l42493q65242j022607o30761o40879n26508p26772
5327D2050623l89687o99367l92439k59453k9933L38413Q24074J654919J720200
$$ plain form
5388 34410329 34808318 35467568 35716322 36568777 36844131 37492663 38001197 38480863 39221704
5379 39221704 39808940 40613843 41142864 41961014 42634893 43351900 43903488 44681336 45432035
5370 45432035 46207275 47058352 47737680 48385740 49006613 49685663 50470415 51345438 51923807
5361 51923807 52819290 53803753 55129400 57506730 61152665 65971703 70959208 73843130
5353 73843130 73127984 70463852 67298808 64007158 61089261 58749097 57087221 55589690
5345 55589690 54476099 53441709 52636209 51806668 51076770 50466251 49690416 49198271 48490274
5336 48490274 47732684 46805885 46463392 45598150 44575543 43944782 43303903 42777395 42050623
5327 42050623 41660936 40961569 40569130 40309677 40279744 40618157 41442231 43097150 44817350
5318D4817350R83553O37467k24753K22793J240878K331714L352585K743261N69645
5309E6674493r31143r28817l00210J337163L570884L357596J053634k223744l621250
5300E7988606l286647k113379n37423N18976m99772k160446l696592l564173l204117
5291C9445033k161851j584510q97477j540417k479813k702090k311795k306983
5283B3460097j802671j489525r24721j206775q46845n29502m39623n72921p60031
5274A4887483l15006l00531m04747l89995k09290l55344k59726m80877j13462
5265A2058505r3508l83272m29716j77731j13448j84651k39903j02904k24998l15181
5255I793193j42408k45733k53033n0864k22575p9337k76653j06032p5554l20227
$$ plain form
5318 44817350 45800903 46438370 46213617 46436410 47677288 50009002 53361587 56104848 56674493
5309 56674493 55743350 54814533 54514323 55851486 59422370 62779966 63833600 61609856 57988606
5300 57988606 54701959 52588580 52051157 52570133 52070361 49909915 46213323 42649150 39445033
5291 39445033 37283182 35698672 34801195 33260778 30780965 28078875 25767080 23460097
5283 23460097 21657426 20167901 19243180 18036405 17189560 16660058 16220435 15647514 14887483
5274 14887483 14572477 14271946 13867199 13477204 13267914 12912570 12652844 12171967 12058505
5265 12058505 11964997 11581725 11152009 10974278 10860830 10676179 10436276 10333372 10108374 9793193
5255 9793193 9650785 9405052 9152019 9101155 8878580 8799243 8522590 8416558 8341004 8020777
5245H020777n3725j06508j90453j14502j42992l9857J2680m64886M5138j01002
5235F864670k27902M6940j46182k72561j3422O8593l26747L9122r8969p8004j69721
5224E685817l6010j67246j1782k5503k12548J13137j78983k9895r4817K296L6719
5213E081185j32015p8919j03523n8115J41885k68628j0458k14816M7947J646j7807
5202D388382k59940l1080m2713j23441J97952k15996K17263k06209k52156L07362
5192C979424j96239J77014k76575o5568l1914j17151J83981k49686Q5465k8293
5182C460458j39335j40913J00198n5548j70973r1292K04465j59363L7852J27773
5172C173322j39248k3122Q1210j94122j36888J43711j0694p2201j60921J89072
$$ plain form
5245 8020777 7967052 7860544 7670091 7555589 7412597 7372740 7385420 6920534 6965672 6864670
5235 6864670 6636768 6683708 6537526 6264965 6251543 6320136 5993389 6032511 5933542 5855538 5685817
5224 5685817 5649807 5482561 5470779 5445276 5232728 5345865 5166882 5136987 5042170 5044466 5081185
5213 5081185 4949170 4870251 4766728 4708613 4850498 4581870 4571412 4356596 4404543 4406189 4388382
5202 4388382 4128442 4097362 4054649 3931208 4129160 3913164 4130427 3924218 3672062 3979424
5192 3979424 3783185 3960199 3683624 3618056 3586142 3468991 3652972 3403286 3488751 3460458
5182 3460458 3321123 3180210 3280408 3224860 3053887 2962595 3167060 3007697 3045549 3173322
5172 3173322 3034074 3010952 3092162 2898040 2761152 2904863 2894169 2821968 2661047 2850119
5162B850119j84343j0720K6172n9827O8363K77687j81804m605j55474O94L8024
5151B664286k4197J7443m2168J76420k55000P5555p6097Q0761j05236j85510J98455
5140B524712k26719P8273K19955m00699J55335J56083q6648N0614j64950N0112
5130B356068k15854J97458j676r8696j36378K83723p7962j03756r715J89204J4214
5119B396630j85189N4868l12235L00269P7541j12856J3425j42693R1310P2952
5109B254022o1976K94861k81366j95278J86150o3760K6629J11046J02349k39824
5099B132853K0599n7898K44945r2581J63387k15290R2245K3810l0482n1098L0002
5088B260492M5811J00613j10531J34727k04650P4061J40023m534j7632k87195
$$ plain form
5162 2850119 2665776 2655056 2681228 2621401 2689764 2967451 2785647 2781042 2625568 2626262 2664286
5151 2664286 2640089 2657532 2615364 2791784 2536784 2612339 2536242 2617003 2511767 2326257 2524712
5140 2524712 2297993 2376266 2596221 2195522 2350857 2506940 2420292 2470906 2305956 2356068
5130 2356068 2140214 2337672 2335996 2237300 2100922 2384645 2306683 2202927 2193212 2382416 2396630
5119 2396630 2211441 2266309 1954074 2254343 2331884 2219028 2232453 2089760 2181070 2254022
5109 2254022 2192046 2486907 2205541 2010263 2196413 2132653 2159282 2270328 2372677 2132853
5099 2132853 2153452 2095554 2340499 2247918 2411305 2196015 2288260 2312070 2281588 2230490 2260492
5088 2260492 2306303 2406916 2296385 2431112 2226462 2300523 2440546 2436012 2418380 2131185
5078B131185K16141J54026j27413K9811j4594J72563j05048N2825L6903N9727
5068B606126J8192L4381j09062R7421p4303K03182j65682J6574J73288K838o7337
5057B735618K00379J8047l6990j45027J17678j13798J55771j8852K14655k6757
5047C100724P1619K62463k15994J6372J15419K34350j21761N7427J87156J6309
5037C724084P0360J72222J4409j02642J35016K46189q792J58841P0645P993J11827
5026D600152J65560Q3106J4330k3123K09500J01208J47096J20773J64024m731
5016E577895L65834M9520m6989L08204L31810j84559L36528J21908L02518L08893
5006G471562M4001M27327J2113M43297J11418K27484N06130L79650L20747K14250
$$ plain form
5078 2131185 2347326 2501352 2373939 2403750 2389156 2561719 2456671 2509496 2546399 2606126
5068 2606126 2624318 2658699 2549637 2647058 2572755 2775937 2610255 2626829 2800117 2802955 2735618
5057 2735618 2935997 2954044 2917054 2772027 2889705 2775907 2931678 2912826 3127481 3100724
5047 3100724 3172343 3434806 3218812 3235184 3350603 3584953 3463192 3520619 3707775 3724084
5037 3724084 3794444 3966666 3981075 3878433 4013449 4259638 4250846 4409687 4480332 4488325 4600152
5026 4600152 4765712 4848818 4863148 4840025 5049525 5150733 5297829 5418602 5582626 5577895
5016 5577895 5943729 5993249 5946260 6254464 6586274 6401715 6738243 6860151 7162669 7471562
5006 7471562 7515563 7942890 7955003 8398300 8509718 8737202 9243332 9622982 9943729 10157979
4996A0157979L08395N82825Q4465N28087L45642M30865Q9484N27205M09087M23475
4986A3887509M78610L89795K59755K56010N50174K40264K42296O48506N14399
4977A7467318K72442N94746M35746M79364M95817N56416M00588L48730P57851
4968B1809018L08671O59329M41482N41197J67560N64659N28561O12394K65585
4959B5898456M36190N21443M89026K69167M68626O30158L54379M39419M97969
4950C0004833M06153K97404N32503N32462J71979M57634J94840M70320K1156L74825
4940C3464109N1609J97071J40974J98961K04750O6504r7933q3222K46520j78176
4930C4211167J50871n8931j29469o7647j26998o436M0436J3187j41514j7444K14518
$$ plain form
4996 10157979 10466374 11049199 11133664 11661751 12007393 12438258 12527742 13054947 13464034 13887509
4986 13887509 14366119 14755914 15015669 15271679 15821853 16062117 16304413 16952919 17467318
4977 17467318 17739760 18334506 18770252 19249616 19745433 20301849 20702437 21051167 21809018
4968 21809018 22117689 22777018 23218500 23759697 23927257 24491916 25020477 25632871 25898456
4959 25898456 26334646 26856089 27345115 27614282 28082908 28713066 29067445 29506864 30004833
4950 30004833 30410986 30708390 31240893 31773355 31945334 32402968 32597808 33068128 33089284 33464109
4940 33464109 33515718 33712789 33853763 34052724 34257474 34323978 34226045 34142823 34389343 34211167
4930 34211167 34362038 34303107 34173638 34105991 33978993 33972557 34012993 34026180 33884666 33867222 34081740
4919C4081740n9885K24708k3284k42899J94232O586J12279l94712N9688k01923
4909C3756530l56016J2910l67885k18175k57172m09416j70352m06307k13263q2137
4899C1288717K73696P94667K143438N436762P667726O843165J465885n298042
4891E0616014m817175m933137m570274l546686k336757k001834j208066j339242
4883B5862843n85379p43846o49752l91818m55078n76107l41851p77305j39328
4874B1202379o36261m57826m93509n03198m15599n04395m96887l25574n89950
4865A6779180k55899l22501j80577o40081k66719j37812m95426j74541m02080
4856A3903544q0351k32697j90608m10977j97012L8915k49021k23090j73873k74315
$$ plain form
4919 34081740 34021855 34246563 34223279 33980380 34174612 34181198 34293477 33898765 33958453 33756530
4909 33756530 33400514 33413424 33045539 32827364 32570192 32160776 31990424 31584117 31370854 31288717
4899 31288717 31562413 32357080 34500518 39937280 47605006 54448171 55914056 50616014
4891 50616014 45798839 40865702 36295428 32748742 30411985 28410151 27202085 25862843
4883 25862843 25277464 24533618 23883866 23492048 23036970 22460863 22119012 21341707 21202379
4874 21202379 20566118 20108292 19614783 19111585 18695986 18191591 17694704 17369130 16779180
4865 16779180 16523281 16200780 16020203 15380122 15113403 14975591 14480165 14305624 13903544
4856 13903544 13823193 13590496 13399888 12988911 12791899 12830814 12581793 12358703 12184830 11910515
4846A1910515R2678l36633j48038p8961k49700N6311k33020n1715j47520j30307
4836A0683610j65339K2763K40135N5816K1234q925j42422l31029r3945m6583n81
4825A0234734Q8571k09592K06502n2605K81726l999K56916l2867K71375K28922
4815A1269683K41943K65995L6540M37862J30413K22375N93170J65549M45032K60128
4805A4068690L69308L60561M36522K62534M92666M94970N99109P14627O17927
4796A8416914M44480L58405N74460O14067M17420K54398O18480L50286N40060
4787B2588970L53406M55673J84537P62610L38946M82274Q19683O20298P69998
4778B7376395Q60125R57195R82478J115096J195032J113538J148785J013972Q94297
$$ plain form
4846 11910515 12003193 11666560 11518522 11439561 11189861 11246172 11013152 10961437 10813917 10683610
4836 10683610 10518271 10541034 10781169 10836985 10858219 10849294 10706872 10375843 10281898 10235315 10234734
4825 10234734 10323305 10113713 10320215 10267610 10549336 10545337 10802253 10769386 11040761 11269683
4815 11269683 11511626 11777621 11814161 12252023 12382436 12604811 13197981 13363530 13808562 14068690
4805 14068690 14437998 14798559 15235081 15497615 15990281 16485251 17084360 17798987 18416914
4796 18416914 18861394 19219799 19794259 20408326 20825746 21080144 21698624 22048910 22588970
4787 22588970 22942376 23398049 23582586 24345196 24684142 25166416 25986099 26606397 27376395
4778 27376395 28236520 29193715 30176193 31291289 32486321 33599859 34748644 35762616 36656913
4769C6656913Q87919R00568O99340Q03641N56614L22619O77115K09266N64919
4760D2278914O51387L89007P37754P88844P71775R71032O71781J210002J305168
4751D9775664J356561J601117J708553J932182J888114K202452K083954K181215
4743F4729812K148270J882432J804738K027888J774257J282274J199594J383805
4735G8233070R29356P20558M42018L36261J94038O9256n6160L10279n8585K40475
4725H1360566J97397J68931M24098M35604M65094N81554M50749N93594N30633
4716H5208220O00302k184J6808n18257p10375r58527j288797j472184k050961
4707G8824045j453923k145400j921506j711767j938097j563104j945295j517185
$$ plain form
4769 36656913 37544832 38445400 39144740 39948381 40504995 40827614 41504729 41713995 42278914
4760 42278914 42930301 43319308 44057062 44845906 45617681 46588713 47260494 48470496 49775664
4751 49775664 51132225 52733342 54441895 56374077 58262191 60464643 62548597 64729812
4743 64729812 66878082 68760514 70565252 72593140 74367397 75649671 76849265 78233070
4735 78233070 79162426 79882984 80325002 80661263 80855301 80924557 80868397 81178676 81120091 81360566
4725 81360566 81557963 81726894 82150992 82586596 83051690 83633244 84083993 84677587 85208220
4716 85208220 85808522 85806338 85823146 85304889 84594514 83635987 82347190 80875006 78824045
4707 78824045 77370122 75224722 73303216 71591449 69653352 68090248 66144953 64627768
4699F4627768j747972j430584j237771j034329j345228j080155j122934q26043
4691E4802752j202521j051314j119998j222101j087784j325835r36244j109533
4683D5747422j173427p96538q62458p32370j181538q02059r70333r40712j302335
4674C6985652r17553j289161j370095j071022q54530j040954p74723p59331j121715
4665B7786568q46963p14791r18656r73031n36910p44367r00087p33822p48582
4656B0669359m94917o10257o36673m24223o00630n52326n08644p09687l12947
4647A5819055n98852m63057k46669o41688m70263m78260m83529l42753l72692
4638A1721292o31097k62050m25518l56045m87274l37876k45146n17407q7897l41466
$$ plain form
4699 64627768 62879796 61449212 60211441 59177112 57831884 56751729 55628795 54802752
4691 54802752 53600231 52548917 51428919 50206818 49119034 47793199 46856955 45747422
4683 45747422 44573995 43777457 42914999 42182629 41001091 40199032 39228699 38287987 36985652
4674 36985652 36068099 34778938 33408843 32337821 31483291 30442337 29667614 28908283 27786568
4665 27786568 26939605 26224814 25306158 24333127 23796217 23051850 22151763 21417941 20669359
4656 20669359 20174442 19564185 18927512 18503289 17902659 17350333 16841689 16132002 15819055
4647 15819055 15220203 14757146 14510477 13868789 13398526 12920266 12436737 12093984 11721292
4638 11721292 11090195 10828145 10402627 10046582 9559308 9221432 8976286 8458879 8370982 8029516
4628H029516k82722k17280j76823o3877l77461j00828j06824j00465k95766n3846
4618F253624j11555j20945j11562k66908j09483p0509J9147k94407j49556R3184
4608E131030j06996K3843k72731J74208l06313Q953j88539J01168j59368k01062
4598D204193J69820j29329J6179l90695K26353j23459j39261O9121j37480o8767
4588C696675j19792J1574P9996k06643j2680k17200j435p2403j8190k43392J10002
4577C006512l2292K02532j56318j16224j7292P6151n0672j22286r5066O2195k3898
4566B733342J2342L0066k27215P8646m5000n2331R3326q4058m27135K15875p3587
4555B254271J01629M2942j29026K26461k40138J01034j73280m185R1374j32585
$$ plain form
4628 8029516 7746794 7529514 7352691 7288814 6911353 6810525 6703701 6603236 6307470 6253624
4618 6253624 6142069 6021124 5909562 5642654 5533171 5462662 5481809 5187402 5037846 5131030
4608 5131030 5024034 5047877 4775146 4949354 4643041 4651994 4463455 4564623 4405255 4204193
4598 4204193 4374013 4244684 4260863 3870168 4096521 3973062 3833801 3902922 3765442 3696675
4588 3696675 3576883 3588457 3668453 3461810 3449130 3231930 3230495 3158092 3139902 2896510 3006512
4577 3006512 2974220 3176752 3020434 2904210 2886918 2963069 2912397 2790111 2695045 2757240 2733342
4566 2733342 2745684 2775750 2548535 2627181 2582181 2529850 2623176 2539118 2111983 2327858 2254271
4555 2254271 2355900 2398842 2269816 2496277 2256139 2357173 2183893 2179708 2271082 2138497
4545B138497j8811J33730r070J50706l01679P3930L307j23021J149q0285P8211
4534B046664j56338K43229j47088m2757J6455j25923J32854r7396o1623L5514
4524A843591m3020R8813R231j52371J88203O0250j85499l1196N5763M0797j29820
4513A754742K3908N6700k01891M8063M2930j8327P1074Q532J70126k63637j01352
4502A590868K11721j28472M457J2323j01580K31751r6279k42172J59192O5462
4492A707271m6603j68584R7626J16727p4351M2471j07115L4164p0823K0300j61546
4481A389537K07937j21251J17301K4436l0180J45003k88649o0213R0624J43238
4471A617783L1481j36707j43740J48084m4338J38525Q2332j55181j00129J80626
$$ plain form
4545 2138497 2119686 2253416 2244346 2395052 2093373 2167303 2170610 2047589 2048738 1968453 2046664
4534 2046664 1890326 2133555 1986467 1943710 1960165 1834242 1967096 1869700 1808077 1843591
4524 1843591 1800571 1899384 1908615 1756244 1944447 2004697 1819198 1788002 1843765 1884562 1754742
4513 1754742 1778650 1835350 1633459 1681522 1724452 1706125 1777199 1785731 1955857 1692220 1590868
4502 1590868 1802589 1674117 1678574 1690897 1589317 1821068 1724789 1482617 1641809 1707271
4492 1707271 1660668 1492084 1589710 1706437 1632086 1674557 1567442 1601606 1530783 1551083 1389537
4481 1389537 1597474 1476223 1593524 1617960 1587780 1732783 1444134 1383921 1474545 1617783
4471 1617783 1649264 1512557 1368817 1516901 1472563 1611088 1693420 1538239 1438110 1618736
4461A618736P9376j02343j76496p8958L41221j97949r021j34291J21913p3034
4451A389154k5318J18436J0936K7867M3567j57686o1368L9015L4715L9014m0936
4440A417396p3149L3029J15919k06767P9882m7473J7029q3157J39025O4262J58838
4429A614834k50905n3569j10698L84074j62712l9164j18902R4115N6940j23314
4419A290699K12183k62402K02730j86698J76953J5594j21539j30601J9945J3199
4409A230063J14155r6925q0144K68109j67469K5117l238j94049J89757N9509j37668
4398A207217J0562N206o0240J05506o0254N4567j7159M9608j29719m010M4242
4387A205526l4605j65561L96026r7711M3239N1074j46267J18187Q8408J00825
$$ plain form
4461 1618736 1698112 1595769 1419273 1340315 1681536 1483587 1474566 1340275 1462188 1389154
4451 1389154 1363836 1482272 1493208 1521075 1564642 1406956 1345588 1384603 1419318 1458332 1417396
4440 1417396 1344247 1377276 1493195 1286428 1366310 1318837 1335866 1252709 1391734 1455996 1614834
4429 1614834 1363929 1310360 1199662 1583736 1421024 1381860 1262958 1357073 1414013 1290699
4419 1290699 1502882 1240480 1443210 1256512 1433465 1449059 1327520 1196919 1216864 1230063
4409 1230063 1344218 1247293 1167149 1435258 1267789 1292906 1289668 1095619 1285376 1344885 1207217
4398 1207217 1217779 1222985 1162745 1268251 1207997 1262564 1245405 1295013 1165294 1161284 1205526
4387 1205526 1170921 1005360 1401386 1303675 1346914 1397988 1251721 1369908 1458316 1559141
4377A559141j50268J04348j55793P0257M5944J18880o2420j89909K36736K38581
4367A815497k69433J07963j11601R182j46738J4672l119J35175K0413r2462P1371
4356A550920J81857j45620M4932P2826p3478R1777j69896R1262J2374L0701n433
4345A682222q2168L07693O4198O4241J54898K84459k18098n8767l1718J6221j13953
4334B069228J03109J53859K01889q1173r4485J42482M45085L42775P14371J685114
4324E682254K274350J735610J92874j405655j037648j168647j001407o43462m74631
4315D153638k43841k49811J62449k93811M4937j65937K28265L3405K1737R3982
4305C785013L59234J4758L04337L74989J72858M01071L81261J300685K508201
$$ plain form
4377 1559141 1408873 1513221 1357428 1427685 1473629 1592509 1530089 1340180 1576916 1815497
4367 1815497 1546064 1654027 1542426 1551608 1404870 1419542 1416423 1551598 1572011 1479549 1550920
4356 1550920 1732777 1587157 1632089 1704915 1631437 1723214 1553318 1644580 1656954 1687655 1682222
4345 1682222 1600054 1907747 1971945 2036186 2191084 2475543 2257445 2198678 2166960 2183181 2069228
4334 2069228 2172337 2326196 2528085 2446912 2352427 2494909 2939994 3282769 3997140 5682254
4324 5682254 7956604 9692214 9885088 8479433 7441785 6273138 5271731 4628269 4153638
4315 4153638 3909797 3659986 3822435 3528624 3573561 3407624 3635889 3669294 3691031 3785013
4305 3785013 4144247 4159005 4463342 4838331 5011189 5412260 5793521 7094206 9602407
4296I602407M210908L504343J316815k960086k362774k517365k200095j634148
4288F960005j403688q02919o16721n13620k44175k82111j40811l7776k08467P8406
4278B788123k9581k53334J50349k02523J46420M5379K18432K44459N62555J124693
4268D794972J845879J856049R80419j053936j141581j000329j441818o94211n72479
4259C572965o17491l72912k2070k39694k04823j07313l28931J89603P7549m00644
4249A546239J94404k57677J50845o627j55158J25128j07278k6108l6946J64533
4239A591355j08539o8211j54707M4840j2331K232k7746p1854J4926j81401O4337
4228A092901j6844L8324j78701m2828K10602k52632J21422J39447j02201m6159
$$ plain form
4296 9602407 13813315 17317658 18634473 15674387 13311613 10794248 8594153 6960005
4288 6960005 5556317 4753398 4136677 3623057 3378882 3096771 2955960 2918184 2709717 2788123
4278 2788123 2758542 2505208 2655557 2453034 2599454 2644833 2863265 3107724 3670279 4794972
4268 4794972 6640851 8496900 9477319 8423383 7281802 6281473 4839655 4145444 3572965
4259 3572965 2955474 2582562 2560492 2320798 2115975 2008662 1679731 1869334 1946883 1546239
4249 1546239 1740643 1482966 1633811 1627184 1472026 1597154 1489876 1463768 1426822 1591355
4239 1591355 1482816 1414605 1259898 1304738 1292407 1294639 1266893 1195039 1209965 1028564 1092901
4228 1092901 1076057 1114381 935680 892852 1103454 850822 972244 1111691 1009490 963331
4218I63331p9424K6626J99867j14284R4212j20441O4653r5664J3075j7620J25560
4207A059891j32122J48687j98123J535J9469j24096K8182J48028j51808o1693
4197G37950j56776K85096R182k17978K23622j58088M742j0289K45232j22198l1068
4186H09427r1122o6816L550J05998l9958J11484m2424k1533N3125J46229j05690
4175H62270k36038M6040k0963p6168J6318K9153P6867r3929K20891j47432l1260
4164F45749K1509m5629K7182N869j59782J72010r8405O9321j09794J22721k01967
4153D48784J83129j34639K05832n0619J15306k46686m4657R6433j0259L9995K9574
4142F32193j03128q9J19618l50120K52700N646J42754j28436j99825n5438J67395
$$ plain form
4218 963331 883907 910533 1110400 996116 1090328 969887 1034540 938876 951951 934331 1059891
4207 1059891 927769 1076456 878333 879868 899337 775241 803423 951451 799643 737950
4197 737950 581174 866270 875452 657474 881096 723008 727750 717461 962693 840495 809427
4186 809427 718305 651489 655039 761037 721079 832563 790139 768606 821731 967960 862270
4175 862270 626232 672272 651309 575141 591459 620612 697479 603550 824441 677009 645749
4164 645749 667258 621629 648811 654680 494898 666908 568503 637824 528030 650751 448784
4153 448784 631913 497274 703106 652487 767793 521107 476450 572883 562624 602619 632193
4142 632193 529065 528976 648594 298474 551174 556820 699574 571138 371313 315875 483270
4131D83270J15355p3674J56214k30025R0601K6604J8321q5783N4002j20215J24505
4120E59175j11406J62675J52201l00927j01094M5373q2084P0442J38800k22232
4110C10923K50578k85209J51422m2506J87020k1427k1199k20308L09421P354n3815
4099E72254q2720q3945J92842L1789p2329j35610J14695k88124K43079J69300
4089F61231k959k17132O1672J47179j97200J66880k10705L0585q6428J26675M7094
4078E26892Q4318p3913P5935n6621n1850j8627J32692j28393M3730j07249K13042
4067F39956j58990K3241r0570q363J16489P1802k3164j31522K08666j31516l78340
4056A37689L59694J33631j2067k9809q8417j34385L33868N068j81243R2798j40786
$$ plain form
4131 483270 598625 524951 681165 451140 541741 568345 586666 500883 554885 434670 559175
4120 559175 447769 610444 762645 461718 360624 405997 323913 394355 533155 310923
4110 310923 561501 276292 427714 385208 572228 550801 529602 309294 618715 626069 572254
4099 572254 489534 405589 598431 630220 557891 422281 536976 248852 491931 661231
4089 661231 658272 441140 502812 649991 452791 619671 408966 439551 353123 479798 526892
4078 526892 611210 537297 613232 556611 504761 486134 618826 490433 534163 426914 639956
4067 639956 480966 504207 413637 405274 521763 593565 570401 438879 647545 516029 137689
4056 137689 497383 631014 618947 589138 500721 366336 700204 705272 524029 616827 476041
4045D76041J02708L381q8910K76270J24785k79115n2980p4563l2172Q1725J36199
4034F73369r1469k33735K68364O6207k58076K33149P2208j19339m6975j00616
4024D63087Q3763r679J51819o6380O0634J7600o0675L91189l97931J05580n3384
4013F85623m7785L007N7090n5850l253P1902j59988j04011q1189J66921J04089
4002F36556r0779j2800p700J20609L8445j65331L0123Q2507l2730m0649J58875
3991G17126J91049k21395j38189K22001p1050q1070q2719o6743J19640q1801P1562
3980E78411m910j50987L3813o4190L4054k687J57298j82189J02442J4346k360
3969E13041P3318k4952o9051p1431n5782N8162o5074O1126r5177P0508J36283
$$ plain form
4045 476041 578749 582130 493220 769490 894275 615160 562180 487617 455445 537170 673369
4034 673369 581900 348165 616529 682736 424660 657809 730017 610678 563703 463087
4024 463087 546850 537171 688990 622610 683244 700844 640169 1031358 633427 739007 685623
4013 685623 637838 640845 697935 642085 638832 710734 550746 446735 365546 532467 636556
4002 636556 545777 532977 525277 645886 684331 519000 549123 631630 598900 558251 717126
3991 717126 908175 686780 548591 770592 699542 618472 535753 469010 588650 506849 578411
3980 578411 573501 422514 456327 392137 426191 423504 580802 398613 501055 515401 513041
3969 513041 586359 561407 492356 420925 365143 423305 358231 419357 324180 394688 530971
3958E30971j4861k28349J62659o5980N3790q4168j6111n5376J40966j9641J1061
3947D14961j89349N2952L11863m06116J31789L4872k335m5749L0107l5107j962
3936B95926N4836K80670k70175j59241J36705o9281k2496J02437q2116J88162
3926D55427k51752j0739m4577j14000L26788N2514p3579r1977K4875j19358N7423
3915B11045J26808j36763J18681o7777Q4811M8718j71832m706J162n1481R5602
3904B54268p6542j084J22833k5448Q1878P0459r1753L5443k04943K68826k17109
3893B16828K3506o627N5525J5499r7939N7348j5298j53728J88218L7191j49572
3882A70951Q6040O9932Q739O9499k08899R8315j86312L5768K3608r4776L61657
$$ plain form
3958 530971 516110 287761 450420 384440 438230 354062 337951 282575 423541 403900 414961
3947 414961 225612 278564 590427 184311 316100 350972 348637 302888 332995 297888 295926
3936 295926 350762 631432 361257 202016 338721 269440 246944 349381 267265 455427
3926 455427 203675 192936 148359 34359 361147 413661 340082 248105 272980 153622 211045
3915 211045 337853 201090 319771 251994 336805 385523 213691 208985 210147 158666 254268
3904 254268 177726 176642 299475 274027 355905 426364 334611 370054 165111 433937 216828
3893 216828 240334 233707 289232 304731 206792 264140 248842 95114 283332 320523 170951
3882 170951 256991 326923 335662 405161 196262 294577 108265 144033 167641 72865 434522
3871D34522l00302J71438j60700J4059J27906O4347j55593N0401R0161k77699
3861E8540J84207J4801M5424r0158M09K53816k93715J36134j27090J78948j05088
3850B56228j28118J52638j61620P3442O2436L1454P3485n1422j70830L65210k47395
3839B55508j31015J87739k6457r5753N0502n8271K7009J3378r8525J66256k2747
3828B67624M1111j42265k06678K18622K5278Q682o4975j00654P8202K22155j67035
3817A80067K0097l716J08755R1091k46225J33918j82301K28105j23287J09604
3807C16108l61418J51483L392J08824k12967J97103m2955R4682o4924M8281j35881
3796A01728M3335J33438k4169k17631K56061j36103J00131j60584O22M1050L5392
$$ plain form
3871 434522 134220 305658 144958 159017 286923 351270 195677 246078 336239 58540
3861 58540 242747 257548 302972 212814 213223 467039 173324 309458 182368 361316 256228
3850 256228 128110 280748 119128 192570 255006 286460 359945 308523 137693 502903 255508
3839 255508 124493 312232 285775 190022 240524 182253 209262 222640 124115 290371 267624
3828 267624 308735 166470 -40208 178414 203692 212374 147399 46745 124947 347102 180067
3817 180067 200164 196448 305203 396294 150069 283987 101686 329791 206504 316108
3807 316108 -45310 106173 109565 218389 5422 202525 159570 254252 189328 237609 101728
3796 101728 145063 278501 254332 36701 292762 156659 256790 96206 96828 137878 173270
3785A73270j04302M6158J63482J1142n6380r7942k6584O207j79522J69170J68947
3774B73646j49278L3067j80661K88730p8625j11952J92501Q2733k8433k49151
3764G2577L7438j1870L3876K5493R3555n052q0113o1000q6367J07503N290k306
3752A29024N3237J25431j49530N8133j44132K25282r8596k3297l3790j19978J28924
3741A50708J01059j49143K1875J36358l252j05221j08402L1815J41913l4369K6294
3730B09635J24035k67188K4035L4707J17073p3660n9964Q2184j01875L381J06741
3719A99104j70825J68221l7652k2809Q219k7751l1453J91238K5435k11345K21076
3708C11458k70229K54239k10066O6013J02603j14418j51274K16537j13443l4667
$$ plain form
3785 173270 68968 115126 278608 289750 233370 135428 108844 115051 -64471 104699 273646
3774 273646 124368 157435 -23226 265504 186879 74927 267428 350161 321728 72577
3764 72577 110015 98145 132021 157514 251069 246017 165904 104904 18537 126040 131330 129024
3752 129024 182261 307692 158162 216295 72163 297445 198849 175552 141762 21784 150708
3741 150708 251767 102624 124499 260857 257605 152384 43982 75797 217710 183341 209635
3730 209635 333670 66482 90517 125224 242297 168637 108673 190857 88982 92363 199104
3719 199104 28279 196500 158848 136039 144258 116507 85054 276292 301727 90382 311458
3708 311458 41229 295468 85402 151415 254018 139600 -11674 204863 91420 56753
3698E6753K22308j7487M2968j82201J5738K6102j00119K2496M1009R9734J01426
3687C28727k27908J99401l4023J77J4770o58j47802K7402j23206P450J1159j6662
3675C8827K18987j48092P6037J4518p367l0853j9301j7589q9703J51532k1665
3664A65331o5015K669K0410P8233m6642P0135l6252j9066J9738R5423r3180J51258
3652C43042r0028j13932J21565j6903j74875J20336j11427J4087M8808j14813
3642B5860Q677K41770o0823o8821M3991n5001n4978r5722J41323j34458K5924
3631A7742Q4105K22481r5934j52382J57110p3004j33524K24886o5245m0164J04906
3620B50977k31621k7457O8704J07737k05620L45988j37315n2920O1900o5826R9410
$$ plain form
3698 56753 279061 261574 304542 122341 138079 164181 64062 86558 127567 227301 328727
3687 328727 100819 300220 266197 266374 281144 280486 132684 160086 36880 44330 55489 38827
3675 38827 257814 109722 185759 200277 192910 162057 142756 125167 35464 186996 165331
3664 165331 100316 102985 123395 201628 154986 225121 188869 169803 189541 284964 191784 343042
3652 343042 253014 139082 260647 243744 68869 189205 77778 91865 140673 25860
3642 25860 34537 276307 215484 146663 190654 135653 80675 -15047 126276 -8182 17742
3631 17742 101847 324328 228394 76012 233122 160118 26594 251480 186235 146071 250977
3620 250977 19356 -8101 60603 168340 -37280 308708 171393 118473 180373 114547 213957
3609B13957j40968L27178m0476m67333L13892q408L1050j87487J16379N7447l17271
3598a02040L42404q5131l21760J51925K01571M7637j20201J02734N7415q0144
3588A94410J04054j76564J88386p8541j50547J74461o3804L4990r8720L4021j07904
3577E4242J4885J9125p5589M0364K72511j22497R1539j85920K33272n7959P7615
3566C61588R9592l05646j40291l067J19037J53240k55227J13386m9101K44454
3556C37965o2627m9942J40575k9971O6503J40865m01994J02323J44012k03699
3546A84010p3573Q7169O8754j06581J12320l2336n0556j36759J09871J2887l9316
3535A35890p0233K66401k26933J10789j64241J9893O4862n2928L2431J74710j19250
$$ plain form
3609 213957 72989 400167 359691 -107642 206250 197842 228892 41405 157784 215231 -102040
3598 -102040 240364 155233 -166527 -14602 186969 234606 114405 217139 274554 194410
3588 194410 298464 121900 310286 231745 81198 255659 191855 226845 128125 162146 54242
3577 54242 69127 88252 12663 53027 325538 203041 294580 108660 341932 283973 361588
3566 361588 461180 155534 15243 12176 131213 284453 29226 142612 93511 337965
3556 337965 275338 225396 365971 336000 402503 543368 141374 243697 387709 184010
3546 184010 110437 197606 266360 159779 272099 239763 189207 52448 162319 175206 135890
3535 135890 65657 332058 105125 215914 51673 71566 136428 83500 115931 290641 171391
3524A71391l5044m7218l3075Q3209M3261N3261j25390q1698L18784m17277L25036
3513B55240r9862O209R0969p777j21989j29184K69911j60763j5643l0173j15667
3502e8729K63158j43161J0387J93207j74537J14818n8371k3489J058R4320N9180
3491B77841n8756n5098R1880j76403J80103j8774k8415j97086K98556k09239J4426
3480A19035q5237J66091Q3397k45108J47616K5539J2670m1891P4195J8472k11138
3469F3641J00198j78765J69773K4174j53407K77949o3121o7385j02878K09410
3459B79589j75018m0857J13734k46343L20749J5603k54948j2572J18784J53603
3449B72324r3336k44649K32035M8168m7928K08127n3553q8595R9746l2995J50337
$$ plain form
3524 171391 136347 89129 56054 139263 182524 235785 110395 28697 347481 -69796 255240
3513 255240 155378 161587 252556 244779 122790 -6394 263517 102754 87111 56938 -58729
3502 -58729 204429 61268 71655 264862 90325 205143 146772 123283 124341 218661 277841
3491 277841 219085 163987 255867 79464 259567 240793 212378 15292 313848 104609 119035
3480 119035 33798 199889 283286 38178 185794 211333 224003 182112 256307 274779 63641
3469 63641 163839 -14926 154847 179021 25614 303563 240442 173057 70179 279589
3459 279589 104571 63714 177448 -68895 251854 267457 12509 -63 118721 272324
3449 272324 178988 -65661 166374 214542 166614 374741 321188 232593 332339 299344 449681
3438D49681j48711k31732K67276j26963j51j40290R1571k8047J10832n2554J99376
3427C90288N8094j87974l150K4908j49493J54702K7188p2197K00693j1975m3492
3416C87592O2278n4269L7174k36636J37349K9306N2420j98771K2200j13765L43506
3405D68384j89506K15432j07554K2923j16475K20791k27394J30530j16609N1684
3395C52206J03585n8542j2440Q3980j04111l7817K7464J47782q991r1305N4581
3384D56392R1827j50949Q6097l4676Q5718J45570j32604j36326K12264j0308J07908
3373G20913l3959k01072L00188j03860R8275j43499J3139J39389K3379p4367J00816
3362H39342L29333l93016J70917j04965K27953L9874K8661r9221J32514r9175
$$ plain form
3438 449681 300970 69238 336514 209551 209400 69110 160681 132634 243466 190912 390288
3427 390288 448382 260408 257258 282166 132673 287375 314563 242366 443059 431084 387592
3416 387592 449870 395601 432775 196139 333488 362794 415214 216443 238643 124878 468384
3405 468384 278878 494310 386756 409679 293204 513995 286601 417131 300522 352206
3395 352206 455791 397249 384809 468789 364678 326861 354325 502107 493116 401811 456392
3384 456392 548219 397270 483367 448691 534409 679979 547375 411049 623313 613005 720913
3373 720913 686954 485882 786070 682210 780485 636986 650125 789514 812893 738526 839342
3362 839342 1168675 775659 946576 841611 1069564 1109438 1138099 1038878 1171392 1072217
3352A072217P3711n6916J6284P3757J51380k42360L77515m0840J53982N9619K30453
3341A868802j01026M12885J42356J70656O29265P06080L83127P76262j69994L61671
3331E180084K08920K45286M61133R14314J555966K572419M820860J0032293J9915399
3322D5906674J5598993J1189886j5305853r112409r669752j0088062o971279n186199
3314A6361999l441138k842657j617124q09687o91118k09004k87730p91086l91884
3305E280571n27919m15020l21614m82249l59544q5538n2075j40564j81036j62789
3295B552223M3855k65389j63875j52755R8177O5504k43720R2194j21014M6677
3285A951877j71436K2863j55021J28146j23422j2626m8847J59303j00031j22247
$$ plain form
3352 1072217 1145928 1089012 1105296 1179053 1330433 1088073 1465588 1424748 1578730 1638349 1868802
3341 1868802 1767776 2180661 2323017 2493673 3122938 3829018 4212145 4988407 4818413 5180084
3331 5180084 5389004 5634290 6095423 7009737 8565703 11138122 15958982 25991275 45906674
3322 45906674 61505667 72695553 57389700 48277291 38607539 28519477 21548198 16361999
3314 16361999 12920861 10078204 8461080 7651393 6960275 6751271 6463541 5672455 5280571
3305 5280571 4752652 4337632 4016018 3533769 3174225 3088687 3036612 2896048 2715012 2552223
3295 2552223 2596078 2330689 2166814 2014059 2112236 2177740 1934020 2026214 1905200 1951877
3285 1951877 1780441 1803304 1648283 1776429 1653007 1640381 1591534 1750837 1650806 1528559
3275A528559R0637j51146k73004J2657O2932j78413J42353q0123m2631k04216
3265I07605O5291k98921L71207n135q0841K2045k65477J99866L311M8499j73212
3254G94238P8654k35578J81880j76867J21608r6170J35453r0108j2534k7141m0404
3243F33031k575q2243K7573Q0249j59758J82110k31723Q3156J9177R91k24868
3232C25120J83041L0518J29690j27021Q6883k03837P7722m8293J15257j93148
3222C75932J40925j5598j79420n1142K09288q1417k4203J64663r4783n3349r8912
3211B91984j34597N2966M3074J72189l16617P8671P5003J38696J89879j69023
3201D22225O634j83640J15889J29113j56327M0794j54961k3856J50389j47043
$$ plain form
3275 1528559 1619196 1468050 1195046 1207703 1270635 1092222 1234575 1154452 1111821 907605
3265 907605 972896 673975 1045182 1040047 959206 981251 715774 915640 918951 967450 794238
3254 794238 872892 637314 819194 642327 763935 667765 803218 713110 700576 673435 633031
3243 633031 630456 548213 575786 656035 496277 678387 446664 529820 548997 549988 325120
3232 325120 508161 538679 668369 541348 628231 424394 502116 453823 569080 375932
3222 375932 516857 501259 321839 270697 479985 398568 374365 539028 444245 390896 291984
3211 291984 157387 210353 253427 425616 108999 187670 262673 401369 591248 422225
3201 422225 428859 245219 361108 490221 333894 374688 219727 195871 346260 199217
3191A99217k7073P6344p1013J58317n6937M6501j09038q4445J65509j78862J55287
3180B73807P6120o4185q1539n3129J61280j71569J7989J85897j30131j2279l9958
3169A62303l7375R5106q4051l182J42074K4523j26323j1985j51584J53992K6358
3158A89856K2428l1222r7496n1380J13342K015k7535J7042J50225k18251N7041
3147A26065N4043l3977J46117j88611J27349j73613K1403L0825Q5451J3215k12141
3136c874K02696q4174J971Q8578J06815j71398j15263P0714q4406K9566K9683
3125G0908J79459l17607L22937k52336m3925J53475j33793K14740p2153J32957
3115B54662j68309J24184j5072j14524m9797K29872j54943j19824J29128q7228
$$ plain form
3191 199217 172144 248488 177475 335792 278855 325356 216318 131873 297382 118520 273807
3180 273807 349927 285742 204203 151074 312354 140785 158774 344671 214540 202261 162303
3169 162303 124928 220034 135983 132801 274875 299398 173075 161090 9506 163498 189856
3158 189856 212284 181062 83566 32186 145528 147543 120008 137050 287275 69024 126065
3147 126065 180108 146131 292248 103637 230986 57373 78776 109601 195052 208267 -3874
3136 -3874 198822 114648 116619 205197 312012 140614 25351 96065 11659 41225 70908
3125 70908 250367 -67240 255697 3361 -40564 112911 -20882 193858 121705 254662
3115 254662 86353 210537 195465 80941 31144 261016 106073 -13751 115377 28149
3105B8149J04777O0598M4748M3178j92196J00056m6818L4143O2015K2936k05993
3094E5593K49250l03045J70894o5649k0805j49984J62312L34924n0049N9446l7741
3083D05146k39527R3819j29052R2154l6767N9625j58897K0519j33679J88946j6857
3072A45430J09291j56327o9720j0146Q7774P4701J75604j51409r4753p7507j8484
3061A4454J17693M3374j06941n8435J17003j44177J99965M6076k4479k55220j04134
3050a54821J39063O9013k7629J02754J03798j68325o0144J06398J9864n4965j56823
3039h1817J00571P7454O3302k18271R4928Q0688j00792j35271K21211J41089j09710
3028A33382m1548k0616J1873N9115k21772J19200J33925K7095J8479j73318n9519
$$ plain form
3105 28149 132926 193524 238272 281450 89254 189310 142492 176635 238650 261586 55593
3094 55593 304843 1798 172692 107043 86238 -63746 98566 433490 383441 442887 405146
3083 405146 165619 259438 130386 222540 185773 245398 86501 107020 -26659 162287 145430
3072 145430 254721 98394 28674 18528 106302 181003 356607 205198 110445 32938 14454
3061 14454 132147 175521 68580 10145 127148 -17029 182936 229012 204533 -50687 -154821
3050 -154821 -15758 53255 25626 128380 232178 63853 3709 110107 129971 75006 -81817
3039 -81817 18754 96208 159510 -58761 36167 116855 16063 -119208 102003 243092 133382
3028 133382 91834 71218 83091 142206 -79566 39634 173559 200654 219133 45815 -13704
3017a3704J38174j00701L8452J08310J8610j40542m7090J32556j67537P6935r3483
3006e0020R8768q9211K3119J12390n3236j25420L0472P3667M6927r2786l1778
2995e7108R6955j06320R473J37586L783r3044K7933K2305L3121K5465j27375P9949
2983E2723K32551j85247p2251J7274j33049L54570k49467k353M0587l8849o2923
2972d6434J99075J6519j53724P0830j15800r3377J72237n9835K43565k50707j28808
2961a46459J58131l2006j80365L12409J17334n2430r8278l3383j77276L79330
2951B47007k55501l3892N0826Q2514N261q1550J03215k24091M7850k5596N9792
2940b4165J38536k37279K01509p8746J50658k68012K76122O5452j46194o8997
$$ plain form
3017 -13704 124470 23769 62221 170531 189141 48599 1509 134065 -33472 43463 -50020
3006 -50020 48748 -40463 -17344 95046 41810 -83610 -53138 20529 67456 -25330 -57108
2995 -57108 39847 -66473 -57000 80586 84369 -8675 19258 41563 74684 100149 -27226 52723
2983 52723 285274 100027 27776 45050 -87999 266571 17104 14751 55338 16489 -46434
2972 -46434 152641 169160 15436 86266 -29534 -122911 49326 -10509 233056 -17651 -146459
2961 -146459 11672 -20334 -200699 111710 229044 176614 78336 44953 -132323 247007
2951 247007 -8494 -42386 8440 90954 96215 14665 117880 -106211 -58361 -83957 -24165
2940 -24165 114371 -122908 78601 -145 150513 -117499 158623 224075 77881 8884
2930H884P0465n0909q0043P7040j76259K06380k8287J40694k9788q3550j02190
$$ plain form
2930 8884 79349 28440 -51603 25437 -150822 55558 27271 167965 138177 54627 -47563
$$ [...]
##END NTUPLES=NMR SPECTRUM
##END=
