##TITLE=abcd
##JCAMPDX= 6.0         $$ Bruker NMR JCAMP-DX V2.0
##DATA TYPE= NMR SPECTRUM
##DATA CLASS= NTUPLES
##ORIGIN= UXNMR, Bruker Analytische Messtechnik GmbH
##OWNER= root
$$ XWIN-NMR		Version 3.5
$$ Tue Mar 24 13:06:10 2026 Russian Standard Time (UT+4h)  servis@DPX200
##.OBSERVE FREQUENCY= 200.131235884673
##.OBSERVE NUCLEUS= ^1H
##.ACQUISITION MODE= SIMULTANEOUS
##.ACQUISITION SCHEME= undefined
##.AVERAGES= 32
##.DIGITISER RES= 18
##SPECTROMETER/DATA SYSTEM= spect
##.PULSE SEQUENCE= zg
##.SOLVENT NAME= CDCl3
##.SHIFT REFERENCE= (INTERNAL, CDCl3, 0, 16.4885)
##AUDIT TRAIL= $$ (NUMBER, WHEN, WHO, WHERE, WHAT)
$$ ##TITLE= Audit trail, XWIN-NMR		Version 3.5
$$ ##JCAMPDX= 5.01
$$ ##ORIGIN= Bruker BioSpin GmbH
$$ ##OWNER= servis
$$ F:\spectra/data/av/nmr/H1/1/pdata/1/auditp.txt
$$ ##AUDIT TRAIL=  $$ (NUMBER, WHEN, WHO, WHERE, WHAT)
(   1,<2026-03-24 13:05:46.89 +0400>,<servis>,<DPX200>,
      <created by zg, POWCHK disabled, PULCHK disabled
       configuration hash MD5:
       00 E9 B6 7A A2 85 ED C7 34 08 36 98 17 FE 4E 26
       data hash MD5: 32K
       39 D2 C2 05 64 7C 27 45 0E 93 44 41 A5 E3 1A E1>)
(   2,<2026-03-24 13:05:48.40 +0400>,<servis>,<DPX200>,
      <Start of raw data processing
       efp BC_mod = 2 LB = 0.05 FT_mod = 6 PKNL = 1 PHC0 = -256.1951 PHC1 = -0.898437 SI = 16K 
       data hash MD5: 16K
       F1 16 EC C3 86 2F 06 E0 9E 12 97 04 70 BF 79 FF>)
$$ ##END=
$$ 
$$ hash MD5
$$ A6 0F 7D 8B 35 8B 68 88 81 58 90 CB 55 E5 5F C9
##$RELAX= 
##$RELAX= 
##$RELAX= 
##$RELAX= 
##$RELAX= 
##$RELAX= 
##$RELAX= 
##$RELAX= 
$$ Bruker specific parameters
$$ --------------------------
##$DU= <F:\spectra>
##$EXPNO= 1
##$NAME= <H1>
##$PROCNO= 1
##$TYPE= <nmr>
##$USER= <av>
##$AMP= (0..31)
100 100 100 100 100 100 100 100 100 100 100 100 100 100 100 100 100 100 
100 100 100 100 100 100 100 100 100 100 100 100 100 100 
##$AQSEQ= 0
##$AQ_mod= 1
##$AUNM= <au_zg>
##$AUTOPOS= <>
##$BF1= 200.13
##$BF2= 200.13
##$BF3= 200.13
##$BF4= 200.13
##$BF5= 500.13
##$BF6= 500.13
##$BF7= 500.13
##$BF8= 500.13
##$BYTORDA= 1
##$CFDGTYP= 0
##$CFRGTYP= 5
##$CHEMSTR= <none>
##$CNST= (0..31)
1 1 145 1 1 1 1 1 1 1 1 1 1 1 1 1 1 1 1 1 1 1 1 1 1 1 1 1 1 1 1 1 
##$CPDPRG= <>
##$CPDPRG1= <>
##$CPDPRG2= <>
##$CPDPRG3= <>
##$CPDPRG4= <mlev>
##$CPDPRG5= <mlev>
##$CPDPRG6= <mlev>
##$CPDPRG7= <mlev>
##$CPDPRG8= <mlev>
##$CPDPRGB= <>
##$CPDPRGT= <>
##$D= (0..31)
0 2 0 0 0 0 0 0 0 0.06 0 0 0 0 0 0 0.0002 0 0 0 0 0 0 0 0 0 0 0 0 0 0 
0 
##$DATE= 1774343146
##$DBL= (0..7)
120 120 120 120 120 120 120 120 
##$DBP= (0..7)
150 150 150 150 150 150 150 150 
##$DBP07= 0
##$DBPNAM0= <>
##$DBPNAM1= <>
##$DBPNAM2= <>
##$DBPNAM3= <>
##$DBPNAM4= <>
##$DBPNAM5= <>
##$DBPNAM6= <>
##$DBPNAM7= <>
##$DBPOAL= (0..7)
0.5 0.5 0.5 0.5 0.5 0.5 0.5 0.5 
##$DBPOFFS= (0..7)
0 0 0 0 0 0 0 0 
##$DE= 6
##$DECBNUC= <off>
##$DECIM= 32
##$DECNUC= <off>
##$DECSTAT= 4
##$DIGMOD= 1
##$DIGTYP= 9
##$DL= (0..7)
0 120 120 120 120 120 120 120 
##$DP= (0..7)
150 150 150 150 150 150 150 150 
##$DP07= 0
$$ [...]
##$SUBNAM4= <"">
##$SUBNAM5= <"">
##$SUBNAM6= <"">
##$SUBNAM7= <"">
##$SUBNAM8= <"">
##$SUBNAM9= <"">
##$SW= 20.6817932712277
##$SWIBOX= (0..15)
0 0 3 0 0 0 0 0 0 0 0 0 0 0 0 0 
##$SW_h= 4139.07284768212
##$TD= 32768
##$TD0= 1
##$TE= 0
##$TE2= 300
##$TE3= 300
##$TEG= 300
##$TL= (0..7)
0 120 120 120 120 120 120 120 
##$TP= (0..7)
150 150 150 150 150 150 150 150 
##$TP07= 0
##$TPNAME0= <>
##$TPNAME1= <>
##$TPNAME2= <>
##$TPNAME3= <>
##$TPNAME4= <>
##$TPNAME5= <>
##$TPNAME6= <>
##$TPNAME7= <>
##$TPOAL= (0..7)
0.5 0.5 0.5 0.5 0.5 0.5 0.5 0.5 
##$TPOFFS= (0..7)
0 0 0 0 0 0 0 0 
##$TUNHIN= 0
##$TUNHOUT= 0
##$TUNXOUT= 0
##$USERA1= <user>
##$USERA2= <user>
##$USERA3= <user>
##$USERA4= <user>
##$USERA5= <user>
##$V9= 5
##$VALIST= <valist>
##$VCLIST= <CCCCCCCCCCCCCCC>
##$VD= 0
##$VDLIST= <DDDDDDDDDDDDDDD>
##$VPLIST= <PPPPPPPPPPPPPPP>
##$VTLIST= <TTTTTTTTTTTTTTT>
##$WBST= 1024
##$WBSW= 30
##$XGAIN= (0..3)
0 0 0 0 
##$XL= 0
##$YL= 0
##$YMAX_a= 553955
##$YMIN_a= -433116
##$ZGOPTNS= <>
##$ZL1= 120
##$ZL2= 120
##$ZL3= 120
##$ZL4= 120
##$ABSF1= 0
##$ABSF2= 0
##$ABSG= 0
##$ABSL= 0
##$ALPHA= 0
##$AQORDER= 0
##$ASSFAC= 0
##$ASSFACI= 0
##$ASSFACX= 0
##$ASSWID= 0
##$AUNMP= <proc_1d>
##$AZFE= 0.1
##$AZFW= 0.1
##$BCFW= 0
##$BC_mod= 2
##$BYTORDP= 0
##$COROFFS= 0
##$CY= 18.4799938201904
##$DATMOD= 1
##$DC= 0
##$DFILT= <>
##$DTYPP= 0
##$F1P= 9.9274215381318
##$F2P= -0.165520771350173
##$FCOR= 1
##$FTSIZE= 16384
##$FT_mod= 6
##$GAMMA= 0
##$GB= 0
##$INTBC= 1
##$INTSCL= 4.127829e-11
##$ISEN= 128
##$LB= 0.05
##$LEV0= 0
##$LPBIN= 0
##$MAXI= 10000
##$MC2= 0
##$MEAN= 0
##$ME_mod= 0
##$MI= 50
##$NCOEF= 0
##$NC_proc= -7
##$NLEV= 6
##$NOISF1= 3.799351
##$NOISF2= 2.8
##$NSP= 0
##$NTH_PI= 0
##$NZP= 0
##$OFFSET= 16.48848
##$PC= 4
##$PHC0= -256.1951
##$PHC1= -0.898437
##$PH_mod= 1
##$PKNL= yes
##$PPARMOD= 0
##$PSCAL= 4
##$PSIGN= 0
##$REVERSE= no
##$SF= 200.130005582386
##$SI= 16384
##$SIGF1= 3
##$SIGF2= 2
##$SINO= 400
##$SIOLD= 16384
##$SREGLST= <1H.CDCl3>
##$SSB= 0
##$STSI= 16384
##$STSR= 0
##$SW_p= 4139.07284768211
##$SYMM= 0
##$S_DEV= 0
##$TDeff= 32768
##$TDoff= 0
##$TI= <>
##$TILT= no
##$TM1= 0
##$TM2= 0
##$TOPLEV= 0
##$USERP1= <user>
##$USERP2= <user>
##$USERP3= <user>
##$USERP4= <user>
##$USERP5= <user>
##$WDW= 1
##$XDIM= 16384
##$YMAX_p= 322073393
##$YMIN_p= -1780635
$$ End of Bruker specific parameters
$$ ---------------------------------
##NTUPLES= NMR SPECTRUM
##VAR_NAME=  FREQUENCY,     SPECTRUM/REAL,   SPECTRUM/IMAG
##SYMBOL=    X,             R,               I
##VAR_TYPE=  INDEPENDENT,   DEPENDENT,       DEPENDENT
##VAR_FORM=  AFFN,          ASDF,            ASDF
##VAR_DIM=   16384,         16384,           16384
##UNITS=     HZ,            ARBITRARY UNITS, ARBITRARY UNITS
##FACTOR=    0.252644378177508, 1,           1
##FIRST=     3299.83951724647, 0,            0
##LAST=      -839.233330435636, 0,           0
##MIN=       -839.233330435636, -1780635,    0
##MAX=       3299.83951724647, 322073393,    0
$$ Real data points
##PAGE= N=1
##DATA TABLE= (X++(R..R)), XYDATA
$$ [...]
$$ plain form
8746 173749 187703 390221 -58927 256272 434271 -166900 -154486 312905 224463 278540
8736 278540 366670 348701 258218 384148 385707 249837 -27134 281228 568435 476876 202332
8725 202332 203654 92213 80579 143438 138948 207467 397211 11816 316415 393870 542588
8714 542588 45250 276902 306992 331438 390110 441001 424732 332730 249375 183377 485138
8703 485138 73115 648472 906257 670247 489511 852562 344690 816008 958603 746207
8693 746207 886883 817780 995084 563116 537323 783465 562244 697485 534548 1026887
8683 1026887 692512 688155 1297941 949502 757016 1133052 991618 1020650 1118417 973198
8673 973198 967439 1574426 1191937 1334817 1495814 1144200 1512992 997108 1508702 1350168
$$ packed form
8746A73749J3954K02518m49148L15199J77999o01171J2414M67391q8442N4077
8736B78540Q8130j7969r0483J25930J559j35870k76971L08362K87207r1559k74544
8725B02332J322j11441j1634O2859m490O8519J89744l85395L04599P7455J48718
8714E42588m97338K31652L0090K4446N8672N0891j6269r2002q3355o5998L01761
8703D85138m12023N75357K57785k36010j80736L63051n07872M71318J42595k12396
8693G46207J40676o9103J77304m31968k5793K46142k21221J35241j62937M92339
8683A026887l34375m357O09786l48439j92486L76036j41434K9032R7767j45219
8673I73198n759O06987l82489J42880J60997l51614L68792n15884N11594j58534
$$ plain form
8663 1350168 1081267 1380639 913668 1393959 1054838 845649 1093316 992899 1126876 1151290
8653 1151290 1295244 1350243 1228578 1242437 879869 1302617 1369736 1191482 1143183 1132378
8643 1132378 1073625 1201036 1460625 1317921 2007864 1410858 1307355 1635807 1893513 1645495
8633 1645495 1624167 1641551 1960599 1989031 2251404 2443015 2467166 2699387 2453883 2749675
8623 2749675 2862002 3190218 3387194 3522216 3678040 3645425 3696192 4180708 4134850 4663476
8613 4663476 3939226 4125317 5062844 4668244 4909143 5112035 4842093 4720486 4604204 4655750
8603 4655750 4843620 4404227 4308619 4314028 3992693 3925313 4020401 3496015 3729724 3715832 3141005
8592 3141005 2972766 3007483 2677661 2578722 2578601 2330609 2659306 2560183 2419643 2070162 2147094
$$ packed form
8663A350168k68901K99372m66971M80291l39121k09189K47667j00417J33977K4414
8653A151290J43954N4999j21665J3859l62568M22748O7119j78254m8299j0805
8643A132378n8753J27411K59589j42704O89943n97006j03503L28452K57706k48018
8633A645495k1328J7384L19048K8432K62373J91611K4151K32221k45504K95792
8623B749675J12327L28216J96976J35022J55824l2615N0767M84516m5858N28626
8613D663476p24250J86091R37527l94600K40899K02892k69942j21607j16282N1546
8603D655750J87870m39393r5608N409l21335o7380R5088n24386K33709j3892n74827
8592C141005j68239L4717l29822r8939j21k47992L28697r9123j40540l49481P6932
$$ plain form
8581 2147094 1734011 1911643 1376656 1869847 1942310 1472409 1770048 1455686 1573263 1551856
8571 1551856 1544014 1644327 1620795 1546228 1545910 1649716 1303368 1384922 1502974 1326032 1454403
8560 1454403 1481405 1477190 1444343 978548 1496069 1296886 1218847 1379128 809346 1726958
8550 1726958 1475177 1061219 1170255 1428970 1291991 1160798 1309244 1098484 1257779 1224418
8540 1224418 888535 1157161 1278221 1063517 1439414 1188290 1357651 1122477 1092119 1251879
8530 1251879 974533 1096981 747959 525941 200671 1945997 1834123 1398934 1853587
8521 1853587 2002624 1365743 1472741 1236592 1185338 1160160 1213437 1249693 1677420 955452
8511 955452 1312199 1158754 843854 1157497 979329 1187221 1508228 1270220 1295868 1198156
$$ packed form
8581B147094m13083J77632n34987M93191P2463m69901K97639l14362J17577k1407
8571A551856p842J00313k3532p4567l18J03806l46348Q1554J18052j76942J28371
8560A454403K7002m215l2847m65795N17521j99183p8039J60281n69782R17612
8550A726958k51781m13958J09036K58715j36979j31193J48446k10760J59295l3361
8540A224418l35883K68626J21060k14704L75897k51124J69361k35174l0358J59760
8530A251879k77346J22448l49022k22018l25270J745326j11874m35189M54653
8521A853587J49037o36881J06998k36149n1254k5178N3277L6256M27727p21968
8511I55452L56747j53445l14900L13643j78168K07892L21007k38008K5648r7712
$$ plain form
8501 1198156 1374006 1454982 1158771 1449530 1168455 1394419 1513143 986898 1449809 1359649
8491 1359649 1243067 992797 1409719 888022 1299660 917828 1391755 1131727 982758 1308271
8481 1308271 1357757 1383385 1404911 495871 1318199 1234568 1178459 1220939 1270273 1069103 1258384
8470 1258384 857189 1105615 1120001 1149269 1122954 1085441 1375310 1162339 1197620 1453154
8460 1453154 1058261 847174 1010257 1486874 1132448 1053913 747334 1078904 1013297 814082
8450 814082 1323833 773704 1334103 1554179 925534 1127413 1350748 1025280 805274 1115859
8440 1115859 1183582 909994 1197615 1118843 1346340 724817 717747 1088707 1142951 1135344 760273
8429 760273 817507 1001602 1069032 908072 956510 1109649 667099 1069312 1001710 1215090
$$ packed form
8501A198156J75850Q0976k96211K90759k81075K25964J18724n26245M62911r0160
8491A359649j16582k50270M16922n21697M11638l81832M73927k60028j48969L25513
8481A308271M9486K5628K1526r09040Q22328q3631n6109M2480M9334k01170J89281
8470A258384m01195K48426J4386K9268k6315l7513K89869k12971L5281K55534
8460A453154l94893k11087J63083M76617l54426p8535l06579L31570o5607j99215
8450H14082N09751n50129N60399K20076o28645K01879K23335l25468k20006L10585
8440A115859O7723k73588K87621p8772K27497o21523p070L70960N4244p607l75071
8429G60273N7234J84095O7430j60960M8438J53139m42550M02213o7602K13380
$$ plain form
8419 1215090 1078384 1120334 1111843 1198475 1015876 1170660 1092718 1035506 814464 1098887 527143
8408 527143 1182836 624855 1157593 1278440 1358014 1235071 1205692 1297301 1217903 739309
8398 739309 976485 882103 1247111 1089043 1374274 922686 1195928 883200 855844 1117539
8388 1117539 1341416 1331492 1321468 1150760 1182243 1275767 1348141 1484613 1180039 1340821 1178856
8377 1178856 1289713 1412141 1107470 1411451 1097388 1311840 1391128 1600206 1605306 1163582
8367 1163582 1115916 1300587 1351697 1141607 1386580 1438878 1373187 1329618 1301642 1444698 1156129
8356 1156129 1491855 1227858 1582056 1568844 1463390 1143214 1756052 1536675 1441902 1658005
8346 1658005 1480578 1326623 1587179 1426097 1854887 1644057 1611456 1325788 1575732 1341593
$$ packed form
8419A215090j36706M1950q491Q6632j82599J54784p7942n7212k21042K84423n71744
8408E27143O55693n57981N32738J20847P9574j22943k9379R1609p9398m78594
8398G39309K37176r4382L65008j58068K85231m51588K73242l12728k7356K61695
8388A117539K23877r924j0024j70708L1483R3524P2374J36472l04574J60782j61965
8377A178856J10857J22428l04671L03981l14063K14452P9288K09078N100m41724
8367A163582m7666J84671N1110k10090K44973N2298o5691m3569k7976J43056k88569
8356A156129L35726k63997L54198j3212j05454l20176O12838k19377r4773K16103
8346A658005j77427j53955K60556j61082M28790k10830l2601k85668K49944k34139
$$ plain form
8336 1341593 1580642 1357636 1239412 1647044 1557783 1306994 1743034 2045739 1480195 1400818
8326 1400818 1530608 1747564 1579805 1517200 1830942 1952964 1601167 1870179 2079403 1905780
8316 1905780 2049072 1692016 1891396 2264717 2270794 1727198 2078166 1998599 2074244 2258560
8306 2258560 1852953 2042914 1764134 2349415 2135735 2061118 2195610 2057888 2527894 2092415
8296 2092415 2248985 2130776 2572221 1886691 2485793 2511640 2171113 2434182 2138491 2579567
8286 2579567 2414360 2303678 2580884 2434547 2610373 2431780 2402034 2681605 2276621 2770639
8276 2770639 2616631 2704687 2778371 2315021 2419303 2566482 2597781 2527135 2409004 2852829
8266 2852829 2676837 2842325 2383036 2763539 2532966 2403743 2640532 2615740 2714781 2498809
$$ packed form
8336A341593K39049k23006j18224M07632q9261k50789M36040L02705n65544p9377
8326A400818J29790K16956j67759o2605L13742J22022l51797K69012K09224j73623
8316A905780J43292l57056J99380L73321O077n43596L50968p9567P5645J84316
8306B258560m05607J89961k78780N85281k13680p4617J34492j37722M70006m35479
8296B092415J56570j18209M41445o85530N99102K5847l40527K63069k95691M41076
8286B579567j65207j10682K77206j46337J75826j78593k9746K79571m04984M94018
8276B770639j54008Q8056P3684m63350J04282J47179L1299p0646j18131M43825
8266B852829j75992J65488m59289L80503k30573j29223K36789k4792R9041k15972
$$ plain form
8256 2498809 2596551 2305243 2512344 2409305 2396412 2370294 2776002 2611379 2644379 2834937
8246 2834937 2400604 2804027 2635895 2179860 2596389 2680932 2648503 2524812 2736464 2713300
8236 2713300 2677536 2585106 2396952 2608544 2519640 2405564 2490018 2655017 2691667 2691114 2549960
8225 2549960 2924845 2719241 2533352 2625981 2678485 2404927 2479739 2613379 2254107 2459894
8215 2459894 2355433 2373683 2325547 2983334 2647961 2602555 2779262 2652378 2431262 2495087
8205 2495087 2906837 2830606 2481376 2858534 2484349 2308177 2403942 2647313 2664478 2844096
8195 2844096 2986998 2943208 2881336 5597485 2413397 2517654 2271221 2273453 2580132 2898206
8185 2898206 2668099 2553461 3053354 2480191 2554380 3127139 2616333 2963469 3159041 2687252
$$ packed form
8256B498809R7742k91308K07101j03039j2893k6118M05708j64623L3000J90558
8246B834937m34333M03423j68132m56035M16529Q4543l2429j23691K11652k3164
8236B713300l5764r2430j88154K11592q8904j14076Q4454J64999L6650n53j41154
8225B549960L74885k05604j85889R2629N2504k73558P4812J33640l59272K05787
8215B459894j04461J8250m8136O57787l35373m5406J76707j26884k21116O3825
8205B495087M11750p6231l49230L77158l74185j76172R5765K43371J7165J79618
8195B844096J42902m3790o1872K716149l184088J04257k46433K232L06679L18074
8185B898206k30107j14638M99893n73163P4189N72759n10806L47136J95572m71789
$$ plain form
8175 2687252 2767022 2935974 3033595 2493945 2853525 2916345 2732925 2962373 2919907 2855645
8165 2855645 2971303 2806231 3187207 3386700 3321211 2888952 2843641 2853707 3198015 3477368
8155 3477368 2749391 3012078 3176535 2841603 3074058 3129441 2872139 2890109 3154793 2957369
8145 2957369 3248693 3394496 3013581 3035641 3004851 3473686 2962168 3383599 3159928 3288129
8135 3288129 3613706 3497818 3429779 3457703 3405713 3312595 3382071 3632205 3316256 3178758
8125 3178758 2938986 3270731 3655571 3559936 3338149 3901162 3311877 3631847 3321568 3278707
8115 3278707 3477217 3714164 3440059 3848728 3893005 3601657 3513074 3674730 3686645 3660867
8105 3660867 3906252 3658526 3526262 3649039 3286263 3756990 3759273 4027333 4102292 3873781
$$ packed form
8175B687252P9770J68952R7621n39650L59580O2820j83420K29448m2466o4262
8165B855645J15658j65072L80976J99493o5489m32259m5311J0066L44308K79353
8155C477368p27977K62687J64457l34932K32455N5383k57302J7970K64684j97424
8145B957369K91324J45803l80915K2060l0790M68835n11518M21431k23671J28201
8135C288129L25577j15888o8039K7924n1990r3118O9476K50134l15949j37498
8125C178758k39772L31745L84840r5635k21787N63013n89285L19970l10279m2861
8115C278707J98510K36947k74105M08669M4277k91348q8583J61656J1915k5778
8105C660867K45385k47726j32264J22777l62776M70727K283K68060P4959k28511
$$ plain form
8095 3873781 3828920 4098152 3956653 4194069 3744075 4203311 4204046 4093995 4127459 4135595 4227553
8084 4227553 4167253 4405016 4405953 4481237 3811016 3863103 4338286 4095168 4099176 4225340 4276389
8073 4276389 3992843 4136198 4607218 4383266 4481245 4157153 4421733 4156000 4536444 4606193
8063 4606193 4685142 4695881 4605837 4627530 4223094 4296080 4383484 4908373 4802768 4603739 4688701
8052 4688701 4701005 4666180 4615161 4703618 4579888 4823193 4988127 4903243 4889775 4970420 4660806
8041 4660806 4725723 4867702 4886819 4691316 5162594 5001610 4894439 4850528 4904741 5126999
8031 5126999 4905409 4741997 4978794 5006638 5240840 5261441 5416085 5076570 4794049 5162457
8021 5162457 4834013 5069485 5213734 5115061 5451108 5175647 5166827 5327270 4956686 5077119
$$ packed form
8095C873781m4861K69232j41499K37416m49994M59236P35j10051L3464Q136R1958
8084D227553o0300K37763R37P5284o70221N2087M75183k43118M008J26164N1049
8073D276389k83546J43355M71020k23952R7979l24092K64580k65733L80444O9749
8063D606193P8949J0739r0044K1693m04436P2986Q7404N24889j05605j99029Q4962
8052D688701J2304l4825n1019Q8457j23730K43305J64934q4884j3468Q0645l09614
8041D660806O4917J41979J9117j95503M71278j60984j07171m3911N4213K22258
8031E126999k21590j63412K36797K7844K34202K0601J54644l39515k82521L68408
8021E162457l28444K35472J44249r8673L36047k75461q820J60443l70584J20433
$$ plain form
8011 5077119 5749759 5213969 5762419 4926135 5430780 5643604 5294165 5960542 5406409 5960474
8001 5960474 5764914 6147466 5622054 5789040 5296108 5409462 5699356 5526745 5612293 5869721
7991 5869721 5998703 5914204 5776276 5458169 5679286 6478553 5767121 5802460 6254744 5800690
7981 5800690 6093672 5960440 6003606 6245007 6094143 6204183 6235719 6127050 6222827 6256539
7971 6256539 6378225 6379205 6617900 6156588 6431274 6388430 5959211 6325262 6544444 6386181
7961 6386181 6583435 6724347 6769704 6593140 6678930 6937909 6717799 6617212 6680218 6633921
7951 6633921 6595740 6772942 6838221 6992410 6881507 6977921 6936498 7249029 7297765 6833360
7941 6833360 6941840 7002182 7315024 7017564 7414253 7197192 7114330 7300646 7322049 7349010
$$ packed form
8011E077119O72640n35790N48450q36284N04645K12824l49439O66377n54133N54065
8001E960474j95560L82552n25412J66986m92932J13354K89894j72611Q5548K57428
7991E869721J28982q4499j37928l18107K21117P99267p11432L5339M52284m54054
7981E800690K92982j33232M3166K41401j50864J10040L1536j08669R5777L3712
7971F256539J21686R80K38695m61312K74686m2844m29219L66051K19182j58263
7961F386181J97254J40912M5357j76564Q5790K58979k20110j00587O3006m6297
7951F633921l8181J77202O5279J54189j10903R6414m1423L12531M8736m64405
7941F833360J08480O0342L12842k97460L96689k17061q2862J86316K1403K6961
$$ plain form
7931 7349010 7324848 7091635 7338582 7398441 7660931 7402598 7679597 7544875 7627295 7678232
7921 7678232 7575395 7755750 7668025 7674399 7956206 7621140 8179280 7605363 7939310 8080677
7911 8080677 7991339 8017351 8038581 8247537 8019631 7924149 8076049 8116318 8212677 7916357 8426062
7900 8426062 8120647 8441909 8423322 8252849 8080924 8321772 8361674 8756975 8310625 8614815
7890 8614815 8537862 8546830 8664015 8776248 8362536 8584139 8420239 8881531 8854651 8571104
7880 8571104 8236610 8530081 8661357 8622108 8875642 8972507 9090368 8814873 8469625 9158030
7870 9158030 8879650 8863826 8929860 9105962 9163820 9144154 8780025 8809640 8740004 9133286 8868431
7859 8868431 8735977 9137393 9320432 8951564 9365940 9510440 9670259 9345235 9689431 9144652
$$ packed form
7931G349010k4162k33213K46947N9859K62490k58333K76999j34722Q2420N0937
7921G678232j02837J80355q7725O374K81807l35066N58140n73917L33947J41367
7911H080677q9338K6012K1230K08956k27906r5482J51900M0269R6359k96320N09705
7900H426062l05415L21262j8587j70473j71925K40848L9902L95301m46350L04190
7890H614815p6953Q968J17185J12233m13712K21603j63900M61292k6880k83547
7880H571104l34494K93471J31276l9249K53534R6865J17861k75495l45248O88405
7870I158030k78380j5824O6034J76102N7858j9666l64129K9615o9636L93282k64855
7859H868431j32454M01416J83039l68868M14376J44500J59819l25024L44196n44779
$$ plain form
7849 9144652 9333313 9289193 9850130 9866548 9431473 9587222 9950473 9671099 9499102 9589272
7839 9589272 10009232 10013476 9687867 9846336 9795907 9835499 9717341 9754591 9822236 9793288 10019705
7828 10019705 10048678 10116414 10438110 10327818 9815616 9862023 10042835 10263306 10398629 10018643
7818 10018643 10339385 9838378 10079746 10067593 10210522 10218846 9838801 9964820 10514277 10650764
7808 10650764 10378180 10609241 10470326 10076612 10267243 10213225 10665887 10685191 10545577 10424373
7798 10424373 10774025 10579335 10656062 10857254 10715466 10663254 10932594 10760706 10922781 11146189
7788 11146189 10910041 11172376 10908876 11237823 11067664 11100913 10729893 10814452 11078666 11023627
7778 11023627 10813029 11376031 11171207 10789790 11270826 11240058 10791341 10837778 11091287 11039933
$$ packed form
7849I144652J88661m4120N60937J6418m35075J55749L63251k79374j71997R0170
7839I589272M19960M244l25609J58469n0429L9592j18158L7250O7645k8948K26417
7828A0019705K8973O7736L21696j10292n12202M6407J80812K20471J35323l79986
7818A0018643L20742n01007K41368j2153J42929Q324l80045J26019N49457J36487
7808A0650764k72584K31061j38915l93714J90631n4018M52662J9304j39614j21204
7798A0424373L49652j94690P6727K01192j41788n2212K69340j71888J62075K23408
7788A1146189k36148K62335k63500L28947j70159L3249l71020Q4559K64214n5039
7778A1023627k10598N63002k04824l81417M81036l0768m48717M6437K53509n1354
$$ plain form
7768 11039933 11156756 11146456 11213104 11350629 11592954 11029737 11467489 11240868 11701266 11542808
7758 11542808 11199330 11357840 11087765 11286756 11232835 11439113 11245341 11335343 11198897 11063656
7748 11063656 11508281 11346494 11671812 11354157 11738757 11420301 11186649 11754205 11672590 11672474
7738 11672474 10918469 11540941 11480255 11695107 11568003 11788947 11477142 11755564 11700080 11919313
7728 11919313 11817323 11686395 11542024 12049381 11600441 11652457 11660790 11931852 11660945 12041319
7718 12041319 11872698 11623905 11826071 11715034 11996445 12116079 11921875 12161178 12013891
7709 12013891 11850745 12269276 11825745 11922840 11988778 12136473 12375217 11931537 11979449 11972043
7699 11972043 12013937 11874262 11831665 12031205 11710307 12171396 11879509 11701092 12051593 12102953
$$ packed form
7768A1039933J16823j0300O6648J37525K42325n63217M37752k26621M60398j58458
7758A1542808l43478J58510k70075J98991n3921K06278j93772R0002j36446j35241
7748A1063656M44625j61787L25318l17655L84600l18456k33652N67556q1615j16
7738A1672474p54005O22472o0686K14852j27104K20944l11805K78422n5484K19233
7728A1919313j01990j30928j44371N07357m48940N2016Q333K71062k70907L80374
7718A2041319j68621k48793K02166j11037K81411J19634j94204K39303j47287
7709A2013891j63146M18531m43531R7095O5938J47695K38744m43680M7912p406
7699A1972043M1894j39675m2597J99540l20898M61089k91887j78417L50501N1360
$$ plain form
7689 12102953 12307716 12063822 11610652 11975077 12276891 11787731 11844044 12383953 11957401 11976865
7679 11976865 12003821 12121427 11567206 11791460 12030854 12414908 12188438 11886082 11420065 11677357
7669 11677357 11975371 11932881 11618151 12019357 11526718 11477499 12262530 12032180 12131923 11789273
7659 11789273 11983966 11513778 11862158 11759806 11684731 12106035 11604082 11733986 11675987 11831857
7649 11831857 12027242 11580224 11946620 11676096 11805074 11600437 12057737 11607529 11552777 11806768
7639 11806768 12025887 11907835 11994567 11552282 11891684 11688832 11761201 11695496 11848565 11605743
7629 11605743 11741490 11724495 11855334 11661066 11560446 11651086 11472721 11638945 11868619 11431304
7619 11431304 11513152 11436952 11339304 11407940 11462854 11248834 11362910 11513912 11347997 11195043
$$ packed form
7689A2102953K04763k43894m53170L64425L01814m89160N6313N39909m26552J9464
7679A1976865K6956J17606n54221K24254K39394L84054k26470l02356m66017K57292
7669A1677357K98014m2490l14730M01206m92639m9219P85031k30350R9743l42650
7659A1789273J94693m70188L48380j02352p5075M21304n01953J29904n7999J55870
7649A1831857J95385m47018L66396k70524J28978k04637M57300m50208n4752K53991
7639A1806768K19119j18052Q6732m42285L39402k02852P2369o5705J53069k42822
7629A1605743J35747j6995J30839j94268j00620R0640j78365J66224K29674m37315
7619A1431304Q1848p6200r7648O8636N4914k14020J14076J51002j65915j52954
$$ plain form
7609 11195043 11140950 11193083 11345979 11349650 11338328 11163099 11565055 11265615 11249863 11302880 11319133
7598 11319133 11072031 11112230 10973988 11121507 11160138 11330008 10719579 11044445 11369012 11228317
7588 11228317 11255633 10903388 11051969 11133247 11167295 10783683 11574589 11297901 10809874 10873374
7578 10873374 10809392 11098154 10741863 11003517 10955357 11064249 10763036 10587737 10256911 10571794
7568 10571794 10868823 10781734 10988045 10508925 10934432 10945078 10374373 10680129 10843515 10636241
7558 10636241 10821571 10469389 10863047 10922107 10682313 10679912 10500971 10590580 10356143 10476969
7548 10476969 10409045 10528201 10420833 10732616 10643393 10663306 10147424 10356703 10012195 10306205
7538 10306205 10186001 10002928 10020222 10026299 10059299 10211833 9759120 10074373 9897695 9742537
$$ packed form
7609A1195043n4093N2133J52896L671j1322j75229M01956k99440j5752N3017J6253
7598A1319133k47102M0199j38242J47519L8631J69870o10429L24866L24567j40695
7588A1228317K7316l52245J48581Q1278L4048l83612P90906k76688m88027O3500
7578A0873374o3982K88762l56291K61654m8160J08892l01213j75299l30826L14883
7568A0571794K97029q7089K06311m79120M25507J0646n70705L05756J63386k07274
7558A0636241J85330l52182L93658N9060k39794k401j78941Q9609k34437J20826
7548A0476969o7924J19156j07368L11783q9223J9913n15882K09279l44508K94010
7538A0306205j20204j83073J7294O077L3000J52534m52713L15253j76678j55158
$$ plain form
7528 9742537 9662174 9473308 9778866 10034518 9904732 10118508 10160305 9878927 9921776 9430695
7518 9430695 9502827 9889302 9389236 9479331 9702056 9666563 9892686 9762823 9794049 9691712
7508 9691712 9872277 9707395 9795441 9168144 9659776 9625686 9222347 9421360 9510593 9476995
7498 9476995 9348250 8913014 9153782 9066485 9301577 8634661 9479424 9057249 9318514 8994455
7488 8994455 8847154 9015845 8858959 9231970 9095240 9155970 9089288 8822888 8706087 8435805
7478 8435805 8740265 8462772 8688474 8474719 8450901 8747849 8684796 8293838 8670757 8249511
7468 8249511 8202657 8190734 8344298 8212565 8102049 8125750 8334452 8478451 8186185 8294627
7458 8294627 8312836 8031633 7632126 7943866 7936013 8435823 8135680 8058867 8075835 8064458 8194995
$$ packed form
7528I742537q0363j88866L05558K55652j29786K13776M1797k81378M2849m91081
7518I430695P2132L86475n00066R0095K22725l5493K26123j29863L1226j02337
7508I691712J80565j64882Q8046o27297M91632l4090m03339J99013Q9233l3598
7498I476995j28745m35236K40768q7297K35092o66916Q44763m22175K61265l24059
7488H994455j47301J68691j56886L73011j36730O0730o6682k66400j16801k70282
7478H435805L04460k77493K25702k13755k3818K96948o3053l90958L76919m21246
7468H249511m6854j1923J53564j31733j10516K3701K08702J43999k92266J08442
7458H294627J8209k81203l99507L11740p853M99810l00143p6813J6968j1377J30537
$$ plain form
7447 8194995 7704208 7936111 7836542 7463837 7791071 7886868 7791021 7463552 7971105 7741066
7437 7741066 7719492 7576537 7656869 7263920 7439824 7273572 7509888 7599379 7441221 7114968
7427 7114968 6931479 7365817 7393582 7514969 7381373 7410326 6842949 7126037 7087579 7453704
7417 7453704 7171147 7324969 7293005 7209729 7313998 7218762 6765321 6988058 6729568 6707141
7407 6707141 6903124 6985099 6772450 6970253 6782468 7051016 6761207 6996133 6471074 6728765
7397 6728765 6665068 6841494 6347341 6826452 6489656 6927316 6892532 6600637 6647030 6512726
7387 6512726 6635092 6519643 6408703 6575731 6496576 6190891 6197649 6513884 6283185 6005863
7377 6005863 6362711 6063323 6368773 6531936 5903345 6138046 6103385 5660558 5637048 5794983
$$ packed form
7447H194995m90787K31903r9569l72705L27234R5797r5847l27469N07553k30039
7437G741066k1574j42955Q0332l92949J75904j66252K36316Q9491j58158l26253
7427G114968j83489M34338K7765J21387j33596K8953n67377K83088l8458L66125
7417G453704k82557J53822l1964q3276J04269r5236m53441K22737k58490k2427
7407F707141J95983Q1975k12649J97803j87785K68548k89809K34926n25059K57691
7397F728765o3697J76426m94153M79111l36796M37660l4784k91895M6393j34304
7387F512726J22366j15449j10940J67028p9155l05685O758L16235k30699k77322
7377F005863L56848k99388L05450J63163o28591K34701l4661m42827k3510J57935
$$ plain form
7367 5794983 6156039 6218306 6008268 6317520 5867706 5931525 5858980 5505827 5815592 5694122
7357 5694122 5552322 5930913 5799364 6155302 5935492 5860429 5746952 5270291 5702355 5625833
7347 5625833 5451399 5634171 5267757 5298486 5407454 5428535 5091078 5138875 5182108 5404642
7337 5404642 5213531 5689009 5394958 5463212 5187104 5090313 5176862 5437527 5372572 5221153
7327 5221153 5046058 5571769 5200654 5168517 4865389 4973868 5330685 4851818 5029710 5094470
7317 5094470 5279947 5000829 5184958 5212605 5017942 5215805 4818963 5141911 5250817 5085210
7307 5085210 5361215 5066959 4809486 4645427 4554542 4722755 4470757 4906897 4863853 4727157
7297 4727157 5131086 4633919 5142131 4828513 4467111 4853508 4590184 4813421 5170494 4853800
$$ packed form
7367E794983L61056O2267k10038L09252m49814O3819p2545l53153L09765j21470
7357E694122j41800L78591j31549L55938k19810p5063j13477m76661M32064p6522
7347E625833j74434J82772l66414L0729J08968K1081l37457M7797M3233K22534
7337E404642j91111M75478k94051O8254k76108r6791Q6549K60665o4955j51419
7327E221153j75095N25711l71115l2137l03128J08479L56817m78867J77892O4760
7317E094470J85477k79118J84129K7647j94663J97863l96842L22948J08906j65607
7307E085210K76005k94256k57473j64059r0885J68213k51998M36140m3044j36696
7297D727157M03929m97167N08212l13618l61402L86397k63324K23237L57073l16694
$$ plain form
7287 4853800 4652004 4597880 4399204 4808729 4497804 4500299 4359562 4721967 4122717 4205021
7277 4205021 4486394 4396812 3911945 4479478 4531734 4387196 4559486 4533693 4364821 4342893
7267 4342893 4338056 3992879 4200670 4401698 4274629 4283902 4417490 4154244 4577580 4167624
7257 4167624 4442334 4256286 4264137 3842898 4130651 4346539 4042713 4313769 4409785 4211074
7247 4211074 3916516 4215406 4198699 4229881 4031722 4238826 3959797 4089848 4173506 3538312
7237 3538312 4249365 4217048 4485533 4373966 4514371 4181960 4512804 4085412 3919607 4005469
7227 4005469 3905454 3829187 4311030 4003076 4157796 3979456 3948727 3752199 3987432 4108865
7217 4108865 3867111 3981370 3846332 4072387 3728128 3925833 4216357 4222973 4031117 3834474
$$ packed form
7287D853800k01796n4124j98676M09525l10925K495j40737L62405n99250Q2304
7277D205021K81373q9582m84867N67533N2256j44538J72290k5793j68872k1928
7267D342893m837l45177K07791K01028j27069R273J33588k63246M23336m09956
7257D167624K74710j86048P851m21239K87753K15888l03826K71056R6016j98711
7247D211074k94558K98890j6707L1182j98159K07104k79029J30051Q3658o35194
7237C538312P11053l2317K68485j11567J40405l32411L30844m27392j65805Q5862
7227D005469j00015p6267M81843l07954J54720j78340l0729j96528K35233J21433
7217D108865k41754J14259j35038K26055l44259J97705K90524O616j91856j96643
$$ plain form
7207 3834474 3806634 4088222 4299328 3680288 3631632 4286182 4122832 3874270 3736384 3922675
7197 3922675 3752089 3961648 3503880 3643435 4114635 3532829 3938926 3960204 3804954 4000779
7187 4000779 3952744 3664037 3801081 3796648 3678678 4026466 3547453 3849284 4111963 3753090
7177 3753090 3651195 3649983 3606026 3534224 3703157 3920672 3777871 3679653 3376536 3897813
7167 3897813 3550021 3329763 3878970 3593597 3535182 3546655 3327932 3500050 3283675 3269055
7157 3269055 3163926 3121091 3538221 3429499 3195224 3317546 2965640 3227421 2833413 3224936
7147 3224936 3046379 3361456 3147792 3364378 3329247 3120926 3005476 3041595 3030694 2715630
7137 2715630 3300485 3513406 3484997 3331672 3062251 3173272 3462414 3241376 3040263 3027387
$$ packed form
7207C834474k7840K81588K11106o19040m8656O54550j63350k48562j37886J86291
7197C922675j70586K09559m57768J39555M71200n81806M06097K1278j55250J95825
7187D000779m8035k88707J37044m433j17970L47788m79013L01831K62679l58873
7177C753090j01895j212m3957p1802J68933K17515j42801r8218l03117N21277
7167C897813l47792k20258N49207k85373n8415J1473k18723J72118k16375j4620
7157C269055j05129m2835M17130j08722k34275J22322l51906K61781l94008L91523
7147C224936j78557L15077k13664K16586l5131k08321j15450L6119j0901l15064
7137B715630N84855K12921k8409j53325k69421J11021K89142k21038k01113j2876
$$ plain form
7127 3027387 3036456 2908723 3312444 3314943 3086521 3233844 3092231 2888620 2988044 3292990
7117 3292990 2766407 2804961 3271770 2690754 3118246 2803153 2954716 3056997 2683901 2932661
7107 2932661 3461229 2977288 3399208 3078519 3224540 3301235 3111112 2885986 2469510 2871553
7097 2871553 3177474 3126374 3105520 3265677 3054615 3502432 3172602 3229556 3186553 3229530
7087 3229530 3105058 2997721 3254747 3107969 3043555 3266327 2603178 2891697 2706797 3156314
7077 3156314 3359242 3415280 2721161 2984619 2786175 3030213 2667153 3238141 3140005 2723637
7067 2723637 3145609 3435030 3302770 3023929 3646708 3171987 3161767 3506245 3127954 3093245
7057 3093245 3117568 3313164 3104729 2954687 2648278 3126059 3137399 2983032 2990859 2750392
$$ packed form
7127C027387R069j27733M03721K499k28422J47323j41613k03611R9424L04946
7117C292990n26583L8554M66809n81016M27492l15093J51563J02281l73096K48760
7107B932661N28568m83941M21920l20689J46021P6695j90123k25126m16476M02043
7097B871553L05921n1100k0854J60157k11062M47817l29830N6954m3003M2977
7087C229530j24472j07337K57026j46778o4414K22772o63149K88519j84900M49517
7077C156314K02928N6038o94119K63458j98444K44038l63060N70988r8136m16368
7067B723637M21972K89421j32260k78841O22779m74721j0220L44478l78291l4709
7057C093245K4323J95596k08435j50042l06409M77781J1340j54367P827k40467
$$ plain form
7047 2750392 3106913 3079239 3176494 3469344 3294367 3648580 3458515 3139604 3107782 3307536
7037 3307536 3425277 3075532 3088103 3145972 3249655 3287618 3281923 3435130 3519812 3591317 3051790
7026 3051790 3497664 3196131 3059552 3253190 3205785 2809590 2909484 3036074 2608824 2995093
7016 2995093 3101333 3015112 3295481 2839708 3001430 2831245 3239785 3050523 3415091 2790812
7006 2790812 3236021 3093824 3249938 3045919 3054005 3197245 3113379 3453704 3602968 3035093
6996 3035093 3112434 3644475 3275827 3259891 3434152 3654009 3533511 3434454 3399895 3596626
6986 3596626 3597119 3764127 3922619 3745184 3984650 4000462 4224973 4456913 4751714 5284704
6976 5284704 5345929 6033226 6384494 6339549 6986852 7450223 7556285 7720963 7984143 8294696
$$ packed form
7047B750392L56521k7674R7255K92850j74977L54213j90065l18911l1822J99754
7037C307536J17741l49745J2571N7869J03683L7963n695J53207Q4682P1505n39527
7026C051790M45874l01533j36579J93638m7405l96195R9894J26590m27250L86269
7016B995093J06240q6221K80369m55773J61722j70185M08540j89262L64568o24279
7006B790812M45209j42197J56114k04019Q086J43240q3866L40325J49264n67875
6996C035093P7341N32041l68648j5936J74261K19857j20498r9057l4559J96731
6986C596626M93J67008J58492j77435K39466J5812K24511K31940K94801N32990
6976E284704O1225O87297L51268m4945O47303M63371J06062J64678K63180L10553
$$ plain form
6966 8294696 8312253 8468903 8401472 8355232 7823611 8021518 7275191 7304126 7083100 7142673
6956 7142673 6691601 7293382 7185372 7597523 7831021 8201864 8411908 9454016 10429799
6947 10429799 10968182 11510092 12180394 13601351 14454409 15608400 16320336 16952489 17794162
6938 17794162 17436186 17532488 17195192 16601186 15907417 14993577 13495708 12224451 11511574
6929 11511574 10468662 10260746 9762474 9256913 9296549 9113332 9497159 9753428 10313777
6920 10313777 10984749 11647060 12409306 13224314 14277577 15396763 15710189 16307553 17038880
6911 17038880 17465742 16741101 17112554 16654304 16121682 15354595 14136367 13443413 11914468
6902 11914468 10909878 10076842 9249914 8693718 8342026 7285822 7254626 7098440 6883467
$$ packed form
6966H294696J7557J56650o7431m6240n31621J97907p46327K8935k21026N9573
6956G142673m51072O01781j08010M12151K33498L70843K10044J042108R75783
6947A0429799N38383N41910O70302J420957Q53058J153991P11936O32153Q41673
6938A7794162l57976R6302l37296n94006o93769r13840j497869j271257p12877
6929A1511574j042912k07916m98272n05561L9636j83217L83827K56269N60349
6920A0313777O70972O62311P62246Q15008J053263J119186L13426N97364P31327
6911A7038880M26862p24641L71453m58250n32622p67087j218228o92954j528945
6902A1914468j004590q33036q26928n56196l51692j056204l1196j56186k14973
$$ plain form
6893 6883467 6901310 6774795 6806243 6735994 7095059 7010349 7422552 7710683 7345357 7906310
6883 7906310 8084073 7620754 8111502 7678136 7579511 7182998 7071885 6565682 6259671 5943105
6873 5943105 4929453 4699060 4327769 4334755 4191587 3812871 3368674 3281267 3285469 3065518
6863 3065518 2795244 2651701 3117830 2838831 2860676 2691509 2658246 2413022 2675639 2833576
6853 2833576 2553852 2347480 2789578 2569298 2817692 2645158 2429500 2364447 2509746 2577960
6843 2577960 2789794 2418388 2611597 2610666 2650559 2533559 2505183 2254441 2292513 2536613 2633616
6832 2633616 2620382 2304606 2649925 2561330 2345895 2064228 2094201 2195810 2254326 1666942
6822 1666942 1963653 1660622 2393719 2452465 2547744 2060026 2570909 2340277 2388698 2087992
$$ packed form
6893F883467J7843j26515L1448p0249L59065q4710M12203K88131l65326N60953
6883G906310J77763m63319M90748m33366r8625l96513j11113n06203l06011l16566
6873E943105j013652k30393l71291O986j43168l78716m44197q7407M202k19951
6863C065518k70274j43543M66129k78999K1845j69167l3263k45224K62617J57937
6853B833576k79724k06372M42098k20280K48394j72534k15658o5053J45299O8214
6843B577960K11834l71406J93209r31L9893j17000k8376k50742L8072K44100R7003
6832B633616j3234l15776L45319q8595k15435k81667K9973J01609N8516n87384
6822A666942K96711l03031P33097N8746R5279m87718N10883k30632M8421l00706
$$ plain form
6812 2087992 2111401 2558889 1953351 2090904 2261060 2130626 2088187 2213870 2300774 2180298
6802 2180298 1921554 1656057 1990444 2112990 2004119 2074453 1898772 2372490 2347611 2217436
6792 2217436 1833521 1945829 2112963 1925464 1970110 2324930 2037089 2018222 1925668 2583114
6782 2583114 2097748 2013561 2155895 1824170 2174273 1541308 1835349 2134323 1695125 1809261
6772 1809261 2207648 2163798 2262020 1997710 2101329 1900224 2292622 2004726 2050936 2078751
6762 2078751 2315982 2278726 2264949 2347971 2700144 2671238 2358589 2624006 2375225 2475563
6752 2475563 2454990 2261659 2469921 2393717 2451435 2234339 2457528 2397025 2482883 2405925 2575360
6741 2575360 2114285 2446255 1976711 2404612 2360390 2715247 3022300 2357691 2202220 3147744
$$ packed form
6812B087992K3409M47488o05538J37553J70156j30434m2439J25683Q6904j20476
6802B180298k58744k65497L34387J22546j08871P0334j75681M73718k4879j30175
6792B217436l83915J12308J67134j87499M4646L54820k87841j8867r2554O57446
6782B583114m85366q4187J42334l31725L50103o32965K94041K98974m39198J14136
6772A809261L98387m3850R8222k64310J03619k01105L92398k87896M6210K7815
6762B078751K37231l7256j3777Q3022L52173k8906l12649K65417k48781J00338
6752B475563k0573j93331K08262p6204N7718k17096K23189o0503Q5858p6958J69435
6741B575360m61075L31970m69544M27901m4222L54857L07053o64609j55471R45524
$$ plain form
6731 3147744 3048317 2497177 2953468 2804343 3238808 2664000 2831483 3237423 3373502 2908650
6721 2908650 3212692 3487901 2959955 3747824 3446812 3688862 3862681 3892278 3923293 3944903
6711 3944903 4307742 4705393 4896320 4620728 5236969 5472283 5762091 6179581 6147384 6318285
6701 6318285 6958345 6874013 6551989 7018871 6781171 7061290 6705599 6675847 6826882 6948584
6691 6948584 6586361 6529650 6771625 7028699 6725117 6926516 6838490 7047166 7163503 7561932
6681 7561932 7524291 8064540 8958097 9373758 10228061 10741233 11318179 11760007 12092862 12463400
6671 12463400 12805253 12436744 12081333 11819518 11462074 10831618 10112497 9185941 8126651
6662 8126651 8227318 7606962 6893117 7209613 6977829 6692302 7000838 7096419 7247026 7572359
$$ packed form
6731C147744r9427n51140M56291j49125M34465n74808J67483M05940J36079m64852
6721B908650L04042K75209n27946P87869l01012K42050J73819K9597L1015K1610
6711C944903L62839L97651J90927k75592O16241K35314K89808M17490l2197J70901
6701F318285O40060q4332l22024M66882k37700K80119l55691k9752J51035J21702
6691F948584l62223n6711K41975K57074l03582K01399q8026K08676J16337L98429
6681G561932l7641N40249Q93557M15661Q54303N13172N76946M41828L32855L70538
6671A2463400L41853l68509l55411k61815l57444o30456p19121r26556j059290
6662H126651J00667o20356p13845L16496k31784k85527L08536R5581J50607L25333
$$ plain form
6652 7572359 8062394 8678175 9419460 9864988 10131964 10795550 11718692 12112847 12432124 12273420
6642 12273420 12183351 11792393 11724179 11248396 10642128 9849427 9692092 8992846 8589237 8571780
6632 8571780 8030196 8396677 8033991 7898948 7936530 8419730 8615609 8404130 8565257 8341812
6622 8341812 8618524 8667073 8504754 8539744 8745329 8813216 8368779 8652960 8409553 8439879
6612 8439879 8551137 8163088 8618992 8604706 9050099 8844203 9277922 9851223 10410463 11236620
6602 11236620 12129767 12646572 12740530 13465359 13575555 13759367 13677659 13446999 12979162 12371191
6592 12371191 11951714 10917737 10206250 9004779 8551141 8020678 7386638 7572627 7049566
6583 7049566 6720107 6647025 7122358 7374237 7505834 8486276 8821743 9431838 10762112 11054185
$$ packed form
6652G572359M90035O15781P41285M45528K66976O63586R23142L94155L19277j58704
6642A2273420r0069l90958o8214m75783o06268p92701j57335o99246m03609j7457
6632H571780n41584L66481l62686j35043L7582M83200J95879k11479J61127k23445
6622H341812K76712M8549j62319L4990K05585O7887m44437K84181k43407L0326
6612H439879J11258l88049M55904j4286M45393k05896M33719N73301N59240Q26157
6602A1236620Q93147N16805R3958P24829J10196J83812q1708k30660m67837o07971
6592A2371191m19477j033977p11487j201471m53638n30463o34040J85989n23061
6583G049566l29459p3082M75333K51879J31597R80442L35467O10095J330274K92073
$$ plain form
6573 11054185 11786659 12346772 13072059 13876119 13568072 13948785 13364216 13167556 12558188
6564 12558188 11800058 11093851 9667324 9089842 7998773 7740993 6845650 6144968 5912352
6555 5912352 5797563 5545374 5114881 5268096 5515435 5358401 6041105 6511593 7006967 7509435
6545 7509435 7713861 8167594 8636815 9198882 9480219 9574912 9713327 9987821 9360352 9565899
6535 9565899 9006257 8511897 7994765 7634067 6734206 6420295 6277580 5712669 5217835 5293129
6525 5293129 4573393 4113588 4096874 4539082 4585945 4703569 4918098 4897995 5459535 5779966
6515 5779966 6396133 6462279 6750810 7517723 7937370 8390264 9311799 9934659 10660864 10669235
6505 10669235 10811934 11191866 10915363 10606304 10435720 9974397 9446443 9009926 8332155
$$ packed form
6573A1054185P32474N60113P25287Q04060l08047L80713n84569j96660o09368
6564A2558188p58130p06207j426527n77482j091069k57780q95343p00682k32616
6555E912352j14789k52189m30493J53215K47339j57034O82704M70488M95374N02468
6545G509435K04426M53733M69221N62067K81337R4693J38415K74494o27469K05547
6535I565899n59642m94360n17132l60698q99861l13911j42715n64911m94834P5294
6525E293129p19736m59805j6714M42208M6863J17624K14529k0103N61540L20431
6515E779966O16167O6146K88531P66913M19647M52894R21535O22860P26205Q371
6505A0669235J42699L79932k76503l09059j70584m61323n27954m36517o77771
$$ plain form
6496 8332155 7357815 7153561 6561453 6299055 6046724 5552093 5845320 5715228 5351585 5144220
6486 5144220 4869081 5023337 5325461 5424507 5309635 5645178 5801104 5827039 6220821 6597827
6476 6597827 6394959 6890579 7282421 7556888 7214284 7672695 7342045 7353634 6753070 6983963
6466 6983963 6801214 6034646 6078112 5377762 5205381 4813931 4583335 4865662 4185319 4165892
6456 4165892 4041153 3960345 3701369 3845887 3604583 3279237 3613297 3705514 3559367 3295007
6446 3295007 3493931 3397279 3402187 3444888 3966061 3704055 3324982 3794052 4007959 3876421
6436 3876421 4090263 4245683 4332148 4540977 4797177 4558183 5154898 5128423 5540342 5596552
6426 5596552 5913581 6491944 7049027 7080511 7449328 7649494 7983378 7878584 8226481 8033963
$$ packed form
6496H332155r74340k04254n92108k62398k52331m94631K93227j30092l63643k07365
6486E144220k75139J54256L02124R9046j14872L35543J55926K5935L93782L77006
6476F597827k02868M95620L91842K74467l42604M58411l30650J1589o00564K30893
6466F983963j82749p66568M3466p00350j72381l91450k30596K82327o80343j9427
6456D165892j24739q0808k58976J44518k41304l25346L34060R2217j46147k64360
6446C295007J98924r6652M908M2701N21173k62006l79073M69070K13907j31538
6436C876421K13842J55420Q6465K08829K56200k38994N96715k6475M11919N6210
6426E596552L17029N78363N57083L1484L68817K00166L33884j04794L47897j92518
$$ plain form
6416 8033963 8023903 8156276 7964150 7867145 7226719 6895552 7069790 6582352 6490032 6740036
6406 6740036 6650602 6492796 6586671 6511417 6773009 6904589 7806922 7824640 8506748 9016246
6396 9016246 9096998 9516088 10395465 10500908 11510946 11751861 12133920 12473828 12364499 12661549
6386 12661549 12666438 12367713 12273676 11418763 11262850 10745188 10043355 9315974 9115088 8840372
6376 8840372 8159194 7952390 7576121 7654667 7324586 7189534 7478174 7425835 7679333 7606792
6366 7606792 8153224 8020645 8621428 9142633 9469153 10261072 10244238 10449803 11190776 11240988
6356 11240988 11642197 11586971 11071606 11171172 11107819 10891009 10514607 10508583 10250357 10132763
6346 10132763 10361359 9752343 10005016 9893688 9824375 9787552 10529817 10137821 10994228 10955065
$$ packed form
6416H033963j0060J32373j92126r7005o40426l31167J74238m87438r2320K50004
6406F740036q9434j57806R3875p5254K61592J31580R02333J7718O82108N09498
6396I016246Q0752M19090Q79377J05443J010038K40915L82059L39908j09329K97050
6386A2661549M889k98725r4037q54913j55913n17662p01833p27381k00886k74716
6376H840372o81178k06804l76269P8546l30081j35052K88640n2339K53498p2541
6366G606792N46432j32579O00783N21205L26520P91919j6834K05565P40973N0212
6356A1240988M01209n5226n15365R9566o3353k16810l76402o024k58226j17594
6346A0132763K28596o09016K52673j11328o9313l6823P42265l91996Q56407l9163
$$ plain form
6336 10955065 11276496 10935779 11764989 11901583 11994189 11846412 12047310 12772250 12653073 12834606
6326 12834606 12830726 12493608 12417589 12456659 12492490 11926774 11744289 11915400 11383705 11168189
6316 11168189 10784806 10798962 10803603 10575512 10639455 10158747 10149698 10681221 9853756 10109945
6306 10109945 10461875 10261837 10483877 10089523 10579523 10432569 10578570 11150506 11257387
6297 11257387 11062449 11176562 11621550 11146048 11436492 11064117 11554463 11274852 11704077
6288 11704077 11664547 11973618 12199150 12797776 11784860 12428744 11967785 12638512 12857187
6279 12857187 13256070 13122505 13412787 13833168 14087116 14167626 14537990 14757692 15303710 15497993
6269 15497993 15425850 16037696 16750844 16826112 17480894 17878884 18229331 19429022 19952565 20382025
$$ packed form
6336A0955065L21431l40717Q29210J36594R2606j47777K00898P24940j19177J81533
6326A2834606l880l37118p6019L9070L5831n65716j82485J71111n31695k15516
6316A1168189l83383J4156M641k28091O3943m80708r049N31523q27465K56189
6306A0109945L51930k00038K22040l94354M90000j46954J46001N71936J06881
6297A1257387j94938J14113M44988m75502K90444l72375M90346k79611M29225
6288A1704077l9530L09071K25532N98626j012916O43884m60959O70727K18675
6279A2857187L98883j33565K90282M20381K53948Q0510L70364K19702N46018J94283
6269A5497993p2143O11846P13148P5268O54782L97990L50447J199691N23543M29460
$$ plain form
6259 20382025 21415619 22604828 23835366 24981807 26378904 27972327 30443691 33202274
6251 33202274 36621883 40640803 45727849 51182792 57537193 64481654 72413277 80543754
6243 80543754 90277466 99553744 109060446 117883829 125946283 133302627 138926870 142183510
6235 142183510 144266175 144397918 142092282 138176383 133306967 127473172 120921806 114762958
6227 114762958 110113129 106660435 105383140 106750435 110348857 116531014 125529528 137397578
6219 137397578 150621130 166344168 184493292 204556380 225771745 247135708 268061955
6212 268061955 286260804 301409311 312244030 319075368 321434266 316513771 306900089 293592974
6204 293592974 276776172 256394500 233173452 209851531 187568942 169175771 153933728
$$ packed form
6259B0382025J033594J189209J230538J146441J397097J593423K471364K758583
6251C3202274L419609M018920N087046N454943O354401O944461P931623Q130477
6243H0543754R733712R276278R506702Q823383Q062454P356344N624243L256640
6235A42183510K082665J31743k305636l915899m869416n833795o551366o158848
6227A14762958m649829l452694j277295J367295L598422O182157Q998514J1868050
6219A37397578J3223552J5723038J8149124K0063088K1215365K1363963K0926247
6212B68061955J8198849J5148507J0834719O831338K358898m920495r613682j3307115
6204B93592974j6816802k0381672k3221048k3321921k2282589j8393171j5242043
$$ plain form
6197 153933728 141125916 131756035 125688623 122217048 121501093 123988323 128094631 135285010
6189 135285010 143040684 153077368 162909477 172005461 180316891 186948943 191800502 193468136
6181 193468136 191683908 187427491 180958406 171570013 159349959 145286299 130611302 115920136
6173 115920136 102088239 89605360 78267878 68262209 58688809 51265954 44770266
6166 44770266 39364003 34795438 31422100 27588997 25201853 23172808 21154248 19543352
6158 19543352 18050715 17157217 16672760 15692887 15474518 14538419 14346905 13301615 13353314
6149 13353314 12926467 12943010 12694046 12056265 11620910 11842411 11588981 11510921 11560400 10875709
6139 10875709 11491668 11493630 11140447 11317584 11330385 12079740 11236700 11965455 12312896 12759270
$$ packed form
6197A53933728j2807812r369881o067412l471575p15955K487230M106308P190379
6189A35285010P755674J0036684R832109R095984Q311430O632052M851559J667634
6181A93468136j784228m256417o469085r388393j2220054j4063660j4674997j4691166
6173A15920136j3831897j2482879j1337482j0005669r573400p422855o495688
6166D4770266n406263m568565l373338l833103k387144k029045k018560j610896
6158A9543352j492637q93498m84457r79873k18369r36099j91514j045290N1699
6149A3353314m26847J6543k48964o37781m35355K21501k53430p8060M9479o84691
6139A0875709O15959J962l53183J77137J2801P49355q43040P28755L47441M46374
$$ plain form
6129 12759270 12695106 12834088 13309133 12942945 12841498 12782692 12626245 12563418 11892164 11489111
6119 11489111 11150898 10895986 10462285 10180762 9514928 9383242 9045299 8931388 8940844 9431924
6109 9431924 9568276 9648756 9899607 10159948 10807539 11079893 11569171 12037006 12804931 13127803
6099 13127803 13811826 14158898 14070163 14518435 14426955 14222264 14003448 13641353 13333163 12363907
6089 12363907 11562037 10925171 10593806 9952965 9417404 9139753 8529875 8082454 8065761 7599947
6079 7599947 7641078 7290954 7370005 7228229 7438309 7431188 7408429 8022678 8219179 8169018 8525374
6068 8525374 8735455 9022904 9138209 9180444 9581385 9301268 9228508 9131339 8399021 8545872
6058 8545872 8815581 8099264 8351373 7682488 7707536 7256694 7159491 6889435 7033409 7036887
$$ packed form
6129A2759270o4164J38982M75045l66188j01447n8806j56447o2827o71254m03053
6119A1489111l38213k54912m33701k81523o65834j31686l37943j13911R456M91080
6109I431924J36352Q0480K50851K60341O47591K72354M89278M67835P67925L22872
6099A3127803O84023L47072q8735M48272r1480k04691k18816l62095l08190r69256
6089A2363907q01870o36866l31365o40841n35561k77651o09878m47421j6693m65814
6079G599947M1131l50124P9051j41776K10080p121k2759O14249J96501n0161L56356
6068H525374K10081K87449J15305M2235M00941k80117p2760r7169p32318J46851
6058H545872K69709p16317K52109o68885K5048m50842r7203k70056J43974L478
$$ plain form
6048 7036887 6749005 6850032 6911881 6877352 6812681 7116337 7459586 7552784 7815861 7897299
6038 7897299 8541860 8373049 8923195 9590133 9564408 10565719 10894365 11500355 11987534 11896451
6028 11896451 12694574 12758074 12549034 12804619 12843516 12639010 12192989 11861797 11672438 11587233
6018 11587233 11077565 11284817 11458439 10995300 11184604 11147620 11144891 10963124 11255612 12044864
6008 12044864 12542200 13041093 13373481 13877664 14522068 15394199 16179195 17472651 18020993
5999 18020993 18610404 19740511 20599705 21176035 21519256 22397680 22543375 22709484 22424047
5990 22424047 22596812 22378625 22340918 21793394 21663304 21514549 21518665 21717709 21790162 22466280
5980 22466280 23052105 24030972 24393369 25896095 27026886 28764284 30985507 32967694 35943573
$$ packed form
6048G036887k87882J01027O1849l4529o4671L03656L43249R3198K63077Q1438
6038G897299O44561j68811N50146O66938k5725J001311L28646O05990M87179r1083
6028A1896451P98123O3500k09040K55585L8897k04506m46021l31192j89359q5205
6018A1587233n09668K07252J73622m63139J89304l6984k729j81767K92488P89252
6008A2044864M97336M98893L32388N04183O44404Q72131P84996J293456N48342
5999A8020993N89411J130107Q59194N76330L43221Q78424J45695J66109k85437
5990B2424047J72765k18187l7707n47524j30090j48755M116J99044P2453O76118
5980B2466280N85825R78867L62397J502726J130791J737398K221223J982187K975879
$$ plain form
5971 35943573 39550300 44033442 49937215 56588109 64156641 72742290 82659538 93489862
5963 93489862 105324884 118243442 131784821 145486438 159653936 171826553 183146796
5956 183146796 191867499 198119348 201316930 201294571 198922065 194061613 186373164 176630049
5948 176630049 165416446 153824457 143593958 134776509 128373759 125090870 125115880 127748782
5940 127748782 132829062 141299564 152124897 166172031 182424203 201923249 223162186
5933 223162186 243538369 264118005 282260436 298933746 311739673 317948232 319388051
5926 319388051 317632418 310255418 297587546 279815007 258209147 235179746 211539889
5919 211539889 190254207 169458098 151893357 136749943 124422137 114753427 107991311
$$ packed form
5971C5943573L606727M483142N903773O650894P568532Q585649R917248J0830324
5963I3489862J1835022J2918558J3541379J3701617J4167498J2172617J1320243
5956A83146796Q720703O251849L197582k2359k372506m860452p688449r743115
5948A76630049j1213603j1591989j0230499q817449o402750l282889K5010K632902
5940A27748782N080280Q470502J0825333J4047134J6252172J9499046K1238937
5933B23162186K0376183K0579636J8142431J6673310J2805927O208559J439819
5926C19388051j755633p377000j2667872j7772539k1605860k3029401k3639857
5919B11539889k1285682k0796109j7564741j5143414j2327806r668710o762116
$$ plain form
5912 107991311 104082309 102457490 102802691 104573215 108752022 113390626 118883835 124842641
5904 124842641 130291633 134508579 137259598 139344388 138958314 137014153 133214572 126671846
5896 126671846 119023571 110671835 100621001 90405373 80622798 71084022 62594835 55305916
5888 55305916 48891314 42862914 38380862 34260314 30366857 28051440 25621503 23236012
5880 23236012 21961983 20248631 19256950 17732016 17451623 16641606 15822617 15540703 14813174
5871 14813174 14832960 14303772 13488557 13371762 13338978 13070421 12853923 12577488 12343630 12407047
5861 12407047 12153045 11985994 11833303 11297071 11407554 11302540 10926585 10853866 10797977 10196761
5851 10196761 10144992 10218536 10276752 9559940 9859068 9751691 9426268 9438571 9705502 9608107
$$ packed form
5912A07991311l909002j624819L45201J770524M178807M638604N493209N958806
5904A24842641N448992M216946K751019K084790l86074j944161l799581o542726
5896A26671846p648275q351736j0050834j0215628r782575r538776q489187p288919
5888E5305916o414602o028400m482052m120548l893457k315417k429937k385491
5880B3236012j274029j713352r91681j524934k80393q10017q18989k81914p27529
5871A4813174J9786n29188q15215j16795l2784k68557k16498k76435k33858O3417
5861A2407047k54002j67051j52691n36232J10483j05014l75955p2719n5889o01216
5851A0196761n1769P3544N8216p16812K99128j07377l25423J2303K66931r7395
$$ plain form
5841 9608107 9139821 9105590 9375451 9055526 8634530 9124384 8855142 9177602 8524323 8500900
5831 8500900 8713201 8555842 8419216 8254789 8258320 8281782 8219245 8223431 8273215 8422867 8282533
5820 8282533 8249546 8258955 8006665 8095341 8379082 8318596 8119022 8827167 8475892 8476006 8454832
5809 8454832 8690739 8635640 8625268 9032144 8573948 8848651 8898581 9192803 9278563 9460796
5799 9460796 9542972 9286619 9627660 9646818 9539730 9498763 10189374 9846668 10140984 10139164
5789 10139164 10140319 10681130 10467545 10746972 11345894 11721769 11909629 11702042 11984026 12513989
5779 12513989 12963093 13354868 14004780 14211416 14446390 15064705 15582397 15646800 15950112 16106918
5769 16106918 16454471 16253846 16819451 16838644 17058721 16858602 16742248 17021789 16867919 16764504
$$ packed form
5841I608107m68286l4231K69861l19925m20996M89854k69242L22460o53279k3423
5831H500900K12301j57359j36626j64427L531K3462o2537M186M9784J49652j40334
5820H282533l2987R409k52290Q8676K83741o0486j99574P08145l51275J14k1174
5809H454832K35907n5099j0372M06876m58196K74703M9930K94222Q5760J82233
5799I460796Q2176k56353L41041J9158j07088m0967O90611l42706K94316j820
5789A0139164J155N40811k13585K79427N98922L75875J87860k07587K81984N29963
5779A2513989M49104L91775O49912K06636K34974O18315N17692O4403L03312J56806
5769A6106918L47553k00625N65605J9193K20077k00119j16354K79541j53870j03415
$$ plain form
5759 16764504 17004260 17603066 17546728 18038750 18080694 19131368 19108794 19580294 19881334 20855510
5749 20855510 21683881 22291390 22697202 23688155 24302460 25354557 25781570 26802441 27400132
5740 27400132 27844019 28509736 28774968 29508656 29666463 29635158 30331465 30821243 30512460 31302672
5730 31302672 31032003 31731280 32595353 33410134 34416417 35798949 37087622 38948502 41173546
5721 41173546 44020709 46875195 50174338 54604217 59220834 64970553 71143475 78367459
5713 78367459 85492337 93797068 102847713 111446283 120914546 130268449 139102816 147437419
5705 147437419 154627066 160855865 165471599 168908193 170375158 170783668 168805225 166597932
5697 166597932 162670165 158042345 153429174 149066796 144717423 140978046 138478739 137561891
$$ packed form
5759A6764504K39756N98806n6338M92022M1944J050674k2574M71500L01040R74176
5749B0855510Q28371O07509M05812R90953O14305J052097M27013J020871N97691
5740B7400132M43887O65717K65232P33688J57807l1305O96307M89778l08783P90212
5730C1302672k70669O99277Q64073Q14781J006283J382532J288673J860880K225044
5721D1173546K847163K854486L299143M429879M616617N749719O172922P223984
5713G8367459P124878Q304731R050645Q598570R468263R353903Q834367Q334603
5705A47437419P189647O228799M615734L436594J466965M08510j978443k207293
5697A66597932l927767m627820m613171m362378m349373l739377k499307r16848
$$ plain form
5689 137561891 137584447 139951205 143754437 149266180 157380769 166386581 177414068 190508870
5681 190508870 204562305 219958296 236474742 252458054 268774514 283295020 296599913
5674 296599913 307181120 315702488 320554920 322073393 320757601 315967145 307671771 297015513
5666 297015513 284876441 270692655 256058260 241192684 227554889 214373681 202565900
5659 202565900 193103033 184848306 178745854 175155336 173367496 174043521 176077260 180827270
5651 180827270 186754399 194555777 203667810 213941892 224854093 235758271 246874675
5644 246874675 257255169 267382511 275985725 282527495 288242251 291568358 292873383 292748381
5636 292748381 290179539 287320175 282228267 276608693 270976120 264435257 258210223 252250512
$$ packed form
5689A37561891K2556K366758L803232N511743Q114589R005812J1027487J3094802
5681A90508870J4053435J5395991J6516446J5983312J6316460J4520506J3304893
5674B96599913J0581207Q521368M852432J518473j315792m790456q295374j0656258
5666B97015513j2139072j4183786j4634395j4865576j3637795j3181208j1807781
5659B02565900r462867q254727o102452l590518j787840O76025K033739M750010
5651A80827270N927129P801378R112033J0274082J0912201J0904178J1116404
5644B46874675J0380494J0127342Q603214O541770N714756L326107J305025j25002
5636B92748381k568842k859364n091908n619574n632573o540863o225034n959711
$$ plain form
5628 252250512 246189157 241268591 237455647 235019247 233168777 233306323 234508064 237589916
5620 237589916 241959747 247333189 254108738 262165222 270284076 279058267 287123643 294253125
5612 294253125 301076620 306210277 309715076 311408908 310906998 308450147 303543107 297153964
5604 297153964 288987861 280058446 269602251 258981471 248826873 238830469 229670716 222169813
5596 222169813 214910947 209244830 205156471 202276274 200733990 199761847 199441085 199660846
5588 199660846 200210215 200602763 200148894 199495008 198067196 195993450 192353971 188214675 183019719
5579 183019719 177107195 169710025 162709340 154929089 147047057 139167081 131558049 123717951
5571 123717951 116536093 110061553 103921290 97684331 92876103 89001507 85095629 81973189
$$ packed form
5628B52250512o061355m920566l812944k436400j850470J37546J201741L081852
5620B37589916M369831N373442O775549Q056484Q118854Q774191Q065376P129482
5612B94253125O823495N133657L504799J693832n01910k456851m907040o389143
5604B97153964q166103q929415j0456195j0620780j0154598r996404r159753p500903
5596B22169813p258866n666117m088359k880197j542284r72143l20762K19761
5588A99660846N49369L92548m53869o53886j427812k073746l639479m139296n194956
5579A83019719n912524p397170p000685p780251p882032p879976p609032p840098
5571A23717951p181858o474540o140263o236959m808228l874596l905878l122440
$$ plain form
5563 81973189 79584967 77731153 76417670 75649728 75682638 76471750 77537883 79487225 82079661
5554 82079661 86081357 89402479 94711443 99718113 105583338 112111590 119155980 126539738
5546 126539738 133797768 140858126 148033875 154138248 159693087 164531593 168146833 170094198
5538 170094198 170657020 170076147 168522435 165838475 161412039 157770400 152912198 148156524
5530 148156524 144012265 140693838 138645827 137237903 137807139 139974507 143535684 149228409
5522 149228409 156770498 165778958 176434802 188280175 200730611 213943323 227470731
5515 227470731 240643449 253012072 263702804 272566065 278771640 282806145 284240056 281797086
5507 281797086 276456995 269089279 259435432 247362051 234665181 220556802 207104611
$$ packed form
5563H1973189k388222j853814j313483p67942L2910P89112J066133J949342K592436
5554H2079661M001696L321122N308964N006670N865225O528252P044390P383758
5546A26539738P258030P060358P175749O104373N554839M838506L615240J947365
5538A70094198N62822n80873j553712k683960m426436l641639m858202m755674
5530A48156524m144259l318427k048011j407924N69236K167368L561177N692725
5522A49228409P542089R008460J0655844J1845373J2450436J3212712J3527408
5515B27470731J3172718J2368623J0690732Q863261O205575M034505J433911k442970
5507B81797086n340091p367716r653847j2073381j2696870j4108379j3452191
$$ plain form
5500 207104611 193335895 181356974 169302891 159679143 151250035 145094827 141232481 138435886
5492 138435886 137758488 138214403 140846023 144055225 148462802 153251721 158391703 163347320
5484 163347320 167729444 171150730 173645941 174982474 174452052 171908391 167809472 162485043
5476 162485043 155124853 146986471 137328780 128013949 117302776 107336531 97457380 88126347
5468 88126347 79592001 71770518 64557893 58033976 52804548 48104853 43791311 40082195
5460 40082195 36831595 34775900 32448475 30317910 28499771 27522056 26039907 25163088
5452 25163088 24385362 23259156 22720149 22035488 21822582 21334899 20532729 20431382 19755195
5443 19755195 19869584 19148350 18787426 18895759 18494749 18788433 18370892 18022172 17855991
$$ packed form
5500B07104611j3768716j1978921j2054083r623748q429108o155208l862346k796595
5492A38435886o77398M55915K631620L209202M407577M788919N139982M955617
5484A63347320M382124L421286K495211J336533n30422k543661m098919n324429
5476A62485043p360190q138382r657691r314831j0711173r966245r879151r331033
5468H8126347q534346p821483p212625o523917n229428m699695m313542l709116
5460D0082195l250600k055695k327425k130565j818139r77715j482149q76819
5452B5163088p77726j126206n39007o84661k12906m87683q02170j01347o76187
5443A9755195J14389p21234l60924J08333m01010K93684m17541l48720j66181
$$ plain form
5434 17855991 17737826 17616080 17685904 17267240 17162985 17139658 16479281 17022642 16779767 17095143
5424 17095143 16850022 16742204 16965749 17224378 16869255 16789541 17082151 17012283 17057777 17070705
5414 17070705 17368669 17868671 18046636 17903643 18112507 18075173 18816666 18781327 18858391 18972310
5404 18972310 19156941 19507080 19999851 20027903 20591348 20501056 21241391 21577091 22238586 22294859
5394 22294859 23338374 23448060 24431922 24549907 25279208 25224881 26428779 26546668 27278341
5385 27278341 28003738 27988280 28778014 29412749 30116274 30878795 31737943 32251111 33715355
5376 33715355 34436825 35616815 36278098 38052624 39089623 40629845 42362947 44178088
5368 44178088 46007457 48523827 50754171 53198097 55653219 59053247 63093580 66686293
$$ packed form
5434A7855991j18165j21746O9824m18664j04255k3327o60377N43361k42875L15376
5424A7095143k45121j07818K23545K58629l55123p9714K92610o9868M5494J2928
5414A7070705K97964N00002J77965j42993K08864l7334P41493l5339P7064J13919
5404A8972310J84631L50139M92771K8052N63445r0292P40335L35700O61495N6273
5394B2294859J043515J09686R83862J17985P29301n4327J203898J17889P31673
5385B7278341P25397j5458P89734O34735P03525P62521Q59148N13168J464244
5376C3715355P21470J179990O61283J774526J036999J540222J733102J815141
5368D4178088J829369K516370K230344K443926K455122L400028M040333L592713
$$ plain form
5360 66686293 70683038 75447406 80764476 86714101 92465405 99535878 106107659 113326654
5352 113326654 120399220 127269636 134247341 140716916 146473141 151347636 155618191 159081596
5344 159081596 161880843 163274957 165069916 165802838 166313456 166944339 167685512 168627501 170654965
5335 170654965 174140167 178167561 183483803 190501246 198092250 206963389 216285323 226462551
5327 226462551 237091432 247162931 257186215 265713216 272668969 277930074 282011783 282919945
5319 282919945 282236765 279912733 274864197 268496569 260756891 252189732 243705601 234706981
5311 234706981 226231953 218202409 210875763 204623213 199281657 195356989 191541413 188573952
5303 188573952 186548518 184259758 182205774 179962074 177170203 173596058 169312122 164560358
$$ packed form
5360F6686293L996745M764368N317070N949625N751304P070473O571781P218995
5352A13326654P072566O870416O977705O469575N756225M874495M270555L463405
5344A59081596K799247J394114J794959P32922N10618O30883P41173R41989K027464
5335A70654965L485202M027394N316242P017443P591004Q871139R321934J0177228
5327B26462551J0628881J0071499J0023284Q527001O955753N261105M081709R08162
5319B82919945o83180k324032n048536o367628p739678q567159q484131q998620
5311B34706981q475028q029544p326646o252550n341556l924668l815576k967461
5303A88573952k025434k288760k053984k243700k791871l574145m283936m751764
$$ plain form
5295 164560358 158077585 151892062 144085717 136359165 127767370 118881902 110233641 101804521
5287 101804521 93421538 85308043 77798337 71168775 64837454 59145699 53886512 49401243
5279 49401243 45111959 41401103 38588570 35687348 33281573 30983758 28839510 27337466
5271 27337466 26053677 24804258 23602712 22881494 21871327 20893083 19816426 19461821 18932732
5262 18932732 18082369 17642094 17349355 16931545 16182849 16034997 15879532 15229557 15297066 14484404
5252 14484404 14584903 13872207 14153822 13627935 13226440 13168948 12677942 12554252 12136146 11648490
5242 11648490 11413666 11459262 11300121 10838998 10374322 10565518 10233902 9994923 9563570 9326800
5232 9326800 9333856 9280663 9076011 8702046 8498495 8627019 7898657 8315910 8457573 8143610
$$ packed form
5295A64560358o482773o185523p806345p726552q591795q885468q648261q429120
5287A01804521q382983q113495p509706o629562o331321n691755n259187m485269
5279D9401243m289284l710856k812533k901222k405775k297815k144248j502044
5271B7337466j283789j249419j201546p21218j010167r78244j076657l54605n29089
5262A8932732q50363m40275k92739m17810p48696j47852j55465o49975O7509q12662
5252A4484404J00499p12696K81615n25887m01495n7492m91006j23690m18106m87656
5242A1648490k34824M5596j59141m61123m64676J91196l31616k38979m31353k36770
5232I326800P056n3193k04652l73965k03551J28524p28362M17253J41663l13963
$$ plain form
5222 8143610 8045260 7915450 7413212 7878935 7652942 7306955 7355475 6984047 7278717 7225448
5212 7225448 6703192 6663304 6511580 6212666 6169528 6178341 6289074 6180486 6182075 6018543 5713093
5201 5713093 5933128 5655268 5658400 5641081 5441310 5506066 5321250 5266934 5001786 5146906
5191 5146906 4650954 4731686 4815186 4752055 4832896 4692035 4527837 4601326 4513173 4382613 4173032
5180 4173032 3477432 3838744 4001926 4037643 4294891 3941816 3775898 3912248 4002407 3816656
5170 3816656 3678093 4069436 4066170 4010144 3614044 3561267 3790421 4190391 4071616 3738082
5160 3738082 3981643 3936199 3839696 3923209 3765930 3780439 3892718 3937662 3427406 3613734
5150 3613734 3951603 3649289 3603863 3796325 3732519 3987039 3922487 3745538 3558352 3737386
$$ packed form
5222H143610r8350j29810n02238M65723k25993l45987M8520l71428K94670n3269
5212G225448n22256l9888j51724k98914m3138Q813J10733j08588J589j63532l05450
5201E713093K20035k77860L132j7319j99771O4756j84816n4316k65148J45120
5191E146906m95952Q0732Q3500o3131Q0841j40861j64198P3489q8153j30560k09581
5180D173032o95600L61312J63182L5717K57248l53075j65918J36350R0159j85751
5170C816656j38563L91343l266n6026l96100n2777K29154L99970j18775l33534
5160C738082K43561m5444r6503Q3513j57279J4509J12279M4944n10256J86328
5150C613734L37869l02314m5426J92462o3806K54520o4552j76949j87186J79034
$$ plain form
5140 3737386 3684985 3728475 3689237 3890175 3815945 3977617 3904585 4012385 4383397 3978775
5130 3978775 4140478 4096690 4287136 3921457 4264494 4472825 3936912 4258439 4020322 4092187
5120 4092187 3905456 4312760 4376365 4756990 4529388 4142262 4309789 4121215 4325766 4530076
5110 4530076 4763695 4964896 4398609 4702419 4814353 5098668 4865924 5415649 5610250 5190481
5100 5190481 5225225 5839966 5602613 5799486 6304263 6438931 6342722 6322602 6390859 6764085
5090 6764085 7230409 7235703 7432633 7392564 8035931 7847946 7827666 8283374 8187009 8124752 8485895
5079 8485895 8675472 8500548 8909100 9236273 9247135 8909771 9245861 9501867 9772965 9623369
5069 9623369 10440442 10374641 10930711 10936593 11831940 12355901 12313270 12631117 13038530 13567818
$$ packed form
5140C737386n2401M3490l9238K00938p4230J61672p3032J07800L71012m04622
5130C978775J61703m3788J90446l65679L43037K08331n35913L21527k38117P1865
5120D092187j86731M07304O3605L80625k27602l87126J67527j88574K04551K04310
5110D530076K33619K01201n66287L03810J11934K84315k32744N49725J94601m19769
5100E190481L4744O14741k37353J96873N04777J34668r6209k0120O8257L73226
5090F764085M66324N294J96930m0069O43367j87985k0280M55708r6365o2257L61143
5079H485895J89577j74924M08552L27173J0862l37364L36090K56006K71098j49596
5069I623369Q17073o5801N56070N882Q95347N23961m2631L17847M07413N29288
$$ plain form
5059 13567818 13522788 14045273 14367883 14706865 14858858 14798138 14678075 15410848 14612563 14672893
5049 14672893 14664548 14319778 14410596 14428748 14563536 14540327 14542120 14602307 14660438 15375368 15588811
5038 15588811 15778538 16624342 16610578 17497301 18160728 19056407 19921015 20433420 21376397 22337515
5028 22337515 22855328 23748039 24461488 25419948 26194838 27252780 27956042 29240013 30157375
5019 30157375 31989243 33507431 35290802 37581134 40249465 43009198 45833427 49122289
5011 49122289 52130008 55562098 58564970 61208731 63724814 66104826 67875790 68852579
5003 68852579 69799238 70097306 69493344 69173597 68118798 67107200 66375585 66196855 66099264
4994 66099264 66520432 67913923 69565281 71944590 75369603 79822114 85284655 90990697
$$ packed form
5059A3567818m5030N22485L22610L38982J51993o0720j20063P32773p98285O0330
5049A4672893q345l44770R0818J8152J34788k3209J793O0187N8131P14930K13443
5038A5588811J89727Q45804j3764Q86723O63427Q95679Q64608N12405R42977R61118
5028B2337515N17813Q92711P13449R58460P74890J057942P03262J283971R17362
5019C0157375J831868J518188J783371K290332K668331K759733K824229L288862
5011D9122289L007719L432090L002872K643761K516083K380012J770964R76789
5003F8852579R46659K98068o03962l19747j054799j011598p31615j78730r7591
4994F6099264M21168J393491J651358K379309L425013M452511N462541N706042
$$ plain form
4986 90990697 98159202 105964975 114332106 122822923 132449176 141925061 150907580 159806010
4978 159806010 166523496 172757847 176999019 179883477 180303571 178483391 174519707 170361441
4970 170361441 164536367 157648935 150827141 143164709 136721478 131555181 127562447 124748910
4962 124748910 123753629 124427965 126824063 130980050 136754283 144068212 153227027 163640430
4954 163640430 175100406 187572398 200592419 213923372 226168386 238820972 249628039
4947 249628039 258979536 264861528 267441473 267503782 264990540 258793697 249167396 237239214
4939 237239214 224426925 209924188 194632908 179517508 165065584 152797735 143053714
4932 143053714 135194631 128759920 124568313 122029443 121058574 121955688 123716275 126729407
$$ packed form
4986I0990697P168505P805773Q367131Q490817R626253R475885Q982519Q898430
4978A59806010O717486O234351M241172K884458M20094j820180l963684m158266
4970A70361441n825074o887432o821794p662432o443231n166297l992734k813537
4962A24748910r95281O74336K396098M155987N774233P313929R158815J0413403
4954A63640430J1459976J2471992J3020021J3330953J2245014J2652586J0807067
4947B49628039R351497N881992K579945O2309k513242o196843r626301j1928182
4939B37239214j2812289j4502737j5291280j5115400j4451924j2267849r744021
4932A43053714p859083o434711m191607k538870r70869Q97114J760587L013132
$$ plain form
4924 126729407 130371517 134998712 139711782 144762332 148569815 152240717 155116470 156465085
4916 156465085 156163576 154988639 151125008 146676868 140518541 133555883 125571467 117271522
4908 117271522 109101608 100906550 93402507 86976082 80990979 75806459 70963340 66787346
4900 66787346 64034052 61841511 59681344 57491219 56671245 55874033 54983107 54965358 55071934
4891 55071934 54682549 54507653 54482786 54296213 53531979 52547632 51696460 49605309 47951802
4882 47951802 45777458 43657501 40800516 38276478 36141174 33218432 31137467 29052245
4874 29052245 27533463 26194670 24684380 23388579 22536120 21461040 20734868 19973708 20175927
4865 20175927 19398844 19540869 18964060 18581335 18163506 18175865 17798108 17731689 17348749 17877343
$$ packed form
4924A26729407L642110M627195M713070N050550L807483L670902K875753J348615
4916A56465085l01509j174937l863631m448140o158327o962658p984416q299945
4908A17271522q169914q195058p504043o426425n985103n184520m843119m175994
4900F6787346k753294k192541k160167k190125q19974p97212q90926j7749J06576
4891E5071934l89385j74896k4867j86573p64234r84347q51172k091151j653507
4882D7951802k174344k119957k856985k524038k135304k922742k080965k085222
4874B9052245j518782j338793j510290j295801q52459j075080p26172p61160K02219
4865B0175927p77083J42025n76809l82725m17829J2359l77757o6419l82940N28594
$$ plain form
4855 17877343 17715059 18083947 17535640 17774709 17934481 17682121 18062249 17948159 18310028
4846 18310028 18250711 18666433 18853115 19091583 19471485 20036098 20209610 20566921 20911790 21478527
4836 21478527 22154991 22572623 23297447 23688389 24757876 25786525 26663377 27696272 29129393
4827 29129393 30255762 32147994 33844844 35221348 37244411 39611215 41660218 43997548
4819 43997548 46329130 48594892 50792785 53352854 55468735 57251920 59651078 61753090
4811 61753090 63740118 65743104 68165078 70284189 72509202 75163243 77905339 80365338
4803 80365338 83374677 85998612 89417723 92516927 96020644 99240799 102834582 105721694
4795 105721694 109251384 112195266 116092731 119762527 122710259 126588216 130261474 133338257
$$ packed form
4855A7877343j62284L68888n48307K39069J59772k52360L80128j14090L61869
4846A8310028n9317M15722J86682K38468L79902N64613J73512L57311L44869N66737
4836B1478527O76464M17632P24824L90942J069487J028649Q76852J032895J433121
4827B9129393J126369J892232J696850J376504K023063K366804K049003K337330
4819D3997548K331582K265762K197893K560069K115881J783185K399158K102012
4811F1753090J987028K002986K421974K119111K225013K654041K742096K459999
4803H0365338L009339K623935L419111L099204L503717L220155L593783K887112
4795A05721694L529690K943882L897465L669796K947732L877957L673258L076783
$$ plain form
4787 133338257 137229318 141387194 144795760 149245442 153407913 157818837 161772098 166743678
4779 166743678 170515840 174448445 178969655 182522091 185698594 188283564 191421203 193029559
4771 193029559 194711639 196052849 196843124 198318723 199145712 200253864 201253778 202695657
4763 202695657 204856997 206929196 209743864 212874402 216945408 221450617 227141718 232694239
4755 232694239 238899273 245536576 252072588 257687221 264182690 270180323 275540896 279943251
4747 279943251 283907274 287553688 290497358 292620292 294293399 295213877 295731503 296815680
4739 296815680 296959741 297258423 297622074 297660523 297511872 297503806 297416427 297500010 297642704 297006969
4729 297006969 296990347 296695248 296059372 295679310 294970123 293710542 292820783 292244184 291266493
$$ packed form
4787A33338257L891061M157876L408566M449682M162471M410924L953261M971580
4779A66743678L772162L932605M521210L552436L176503K584970L137639J608356
4771A93029559J682080J341210P90275J475599Q26989J108152R99914J441879
4763B02695657K161340K072199K814668L130538M071006M505209N691101N552521
4755B32694239O205034O637303O536012N614633O495469N997633N360573M402355
4747B79943251L964023L646414K943670K122934J673107R20478N17626J084177
4739B96815680J44061K98682L63651L8449j48651q066q7379Q3583J42694o35735
4729B97006969j6622k95099o35876l80062p09187j259581q89759n76599r77691
$$ plain form
4720 291266493 289934823 288882655 287622458 285192120 283158132 280304938 277276486 273384851
4712 273384851 268858961 264290491 258897085 253104227 247071141 240520702 233805330 227587161
4704 227587161 221425263 215430182 210307832 205390917 200865996 197177616 193886069 191811120
4696 191811120 189739895 188096552 186731072 184966421 183626292 182595616 181192794 179875570
4688 179875570 177798771 175732717 173620131 171203109 167760220 164233988 161044718 156922125
4680 156922125 152884523 148745928 144179880 140353616 135980708 131847535 127087237 123873809
4672 123873809 120237527 116612410 113008979 109513441 106337373 102869163 99678436 96935005
4664 96935005 93561282 90731500 87615690 84801567 81685871 79666943 76856522 74787879
$$ packed form
4720B91266493j331670j052168j260197k430338k033988k853194l028452l891635
4712B73384851m525890m568470n393406n792858o033086o550439o715372o218169
4704B27587161o161898n995081n122350m916915m524921l688380l291547k074949
4696A91811120k071225j643343j365480j764651j340129j030676j402822j317224
4688A79875570k076799k066054k112586k417022l442889l526232l189270m122593
4680A56922125m037602m138595m566048l826264m372908m133173m760298l213428
4672A23873809l636282l625117l603431l495538l176068l468210l190727k743431
4664I6935005l373723k829782l115810k814123l115696k018928k810421k068643
$$ plain form
4656 74787879 72037048 69709287 67439516 65247234 62914513 60782549 58737120 56808275
4648 56808275 54544185 53185331 51135955 49212038 47316550 45521828 43523749 41333375
4640 41333375 39539113 37712885 35934509 34690164 32604573 31422681 29999800 28649459
4632 28649459 27794945 26843797 26044669 25009730 24058359 23361971 23043187 22395668 22212702
4623 22212702 21339894 20710216 20433242 19885476 19633560 19717116 18597136 18798125 17978568
4614 17978568 17520824 17456539 16694682 16283866 16384369 15666678 15594482 15448373 14929495 14632040
4604 14632040 14761943 14060813 14138414 13425209 13486315 13087539 12361825 12596450 12340292 12091959
4594 12091959 11654678 11468602 11376965 11543467 11390654 10413801 10478590 10086296 10332177 9596160
$$ packed form
4656G4787879k750831k327761k269771k192282k332721k131964k045429j928845
4648E6808275k264090j358854k049376j923917j895488j794722j998079k190374
4640D1333375j794262j826228j778376j244345k085591j181892j422881j350341
4632B8649459q54514r51148p99128j034939r51371o96388l18784o47519j82966
4623B2212702q72808o29678k76974n47766k51916Q3556j119980K00989q19557
4614A7978568m57744o4285p61857m10816J00503p17691p2196j46109n18878k97455
4604A4632040J29903p01130P7601p13205O1106l98776p25714K34625k56158k48333
4594A2091959m37281j86076r1637J66502j52813r76853O4789l92294K45881p36017
$$ plain form
4584 9596160 10018086 9380747 9380445 8988517 9102056 8310611 8207284 8099725 8072509 7571170
4574 7571170 7614190 7020010 6969896 7055540 6458452 6242208 6543722 6237631 6200697 6313295
4564 6313295 6020674 5776137 6175287 5820171 5656724 5925327 5738365 5769663 5657223 4979191
4554 4979191 5120965 5260081 5219232 5116835 5208720 5006810 4831990 4909216 4682034 4830316
4544 4830316 4685467 4971012 4308898 4759150 5124898 4614780 4538618 4555976 4376370 4950000
4534 4950000 4477629 4489352 4235598 4868792 4576941 4564287 4623625 4504042 4476705 4323808
4524 4323808 3863080 4402994 4011681 3930761 4146769 4183892 3945076 4285251 4283205 3963398
4514 3963398 4235255 4048870 4013392 4057798 4209984 4185801 4065132 4108604 4556154 4544727
$$ packed form
4584I596160M21926o37339l02l91928J13539p91445j03327j07559k7216n01339
4574G571170M3020n94180n0114Q5644n97088k16244L01514l06091l6934J12598
4564F313295k92621k44537L99150l55116j63447K68603j86962L1298j12440o78032
4554D979191J41774J39116m0849j02397R1885k01910j74820P7226k27182J48282
4544D830316j44849K85545o62114M50252L65748n10118p6162J7358j79606N73630
4534D950000m72371J1723k53754O33194k91851j2654N9338j19583k7337j52897
4524D323808m60728N39914l91313q0920K16008L7123k38816L40175k046l19807
4514C963398K71857j86385l5478M4406J52186k4183j20669M3472M47550j1427
$$ plain form
4504 4544727 4145988 4331573 4404758 4359045 4266907 4221429 4409736 4686854 4063438 4647507
4494 4647507 4068791 4188754 3975877 4406109 4468243 4373231 4242442 4314840 4331845 4244227
4484 4244227 4536285 4638463 4647896 4791686 4453621 4283164 4495531 4729164 5024646 4609164
4474 4609164 5060057 4851535 5484268 5489259 4921181 5102531 5499926 5719594 5204042 5477779
4464 5477779 5665547 5455482 5541672 5381164 5438923 5470860 5564345 5545278 5488454 5984803 5623181
4453 5623181 5593448 5558531 5769172 5709460 5813041 5846918 6155657 5506067 6031975 5982139
4443 5982139 6081444 6380057 5864367 5991874 6078846 6650784 6448310 6118667 6090515 6264296
4433 6264296 6647329 6322263 6503150 6377518 6576006 6841640 6549796 6625861 7191251 7090902
$$ packed form
4504D544727l98739J85585P3185m5713r2138m5478J88307K77118o23416N84069
4494D647507n78716J19963k12877M30232O2134r5012j30789P2398J7005q7618
4484D244227K92058J02178R433J43790l38065j70457K12367K33633K95482m15482
4474D609164M50893k08522O32733M991n68078J81350L97395K19668n15552K73737
4464E477779J87768k10065Q6190j60508N7759L1937R3485j9067n6824M96349l61622
4453E623181k9733l4917K10641n9712J03581L3877L08739o49590N25908m9836
4443E982139R9305K98613n15690J27507Q6972N71938k02474l29643k8152J73781
4433F264296L83033l25066J80887j25632J98488K65634k91844P6065N65390j00349
$$ plain form
4423 7090902 6660371 7279539 7101010 7597261 7775503 7408320 7430656 7722506 7837152 8283231
4413 8283231 8032406 8706808 8245666 8923942 9183905 9415918 10225040 10711357 11676771 12490081
4403 12490081 12715874 14411092 15012102 16257019 17360486 19316262 20187116 22060036 23539980
4394 23539980 24985304 26425648 27802632 28824365 30440079 31007219 31860360 32298078 32510407
4385 32510407 32210337 32483496 31062762 30772970 29906415 29406442 29129964 28730835 28365515
4376 28365515 27890422 28613688 29278482 29734175 31844555 33035680 35311283 37355985 39776073
4367 39776073 42739998 45578986 48497516 51267682 53339633 55872406 57379939 58803703
4359 58803703 59839706 60223368 59797014 59403349 58779141 56853566 55038823 54012776 53168992
$$ packed form
4423G090902m30531O19168j78529M96251J78242l67183K2336K91850J14646M46079
4413H283231k50825O74402m61142O78276K59963K32013Q09122M86317R65414Q13310
4403A2490081K25793J695218O01010J244917J103467J955776Q70854J872920J479944
4394B3539980J445324J440344J376984J021733J615714N67140Q53141M37718K12329
4385C2510407l00070K73159j420734k89792q66555m99973k76478l99129l65320
4376B8365515m75093P23266O64794M55693K110380J191125K275603K044702K420088
4367C9776073K963925K838988K918530K770166K071951K532773J507533J423764
4359E8803703J036003L83662m26354l93665o24208j925575j814743j026047q43784
$$ plain form
4350 53168992 52006436 50442331 48866366 47447132 47508651 46676859 46236389 45945376 46272217
4341 46272217 46235919 45940375 46513777 46682288 47241270 47807766 48717685 49597359 50803330
4332 50803330 51547429 53048395 54350819 55940225 57557544 59030223 60748168 62613501
4324 62613501 65203790 68211056 71935546 74699212 78157709 81665169 85332338 88508716
4316 88508716 90753484 92375964 93802240 94687270 93718458 91920301 89188630 85862781
4308 85862781 81924151 77849663 73315433 69076082 63928236 58617195 54453008 50802674
4300 50802674 47587301 44421865 41819355 39635674 38439922 37080236 36256880 35862639
4292 35862639 35512120 35001235 34785160 34243093 33935191 33120488 32167963 31507666 29878676
$$ packed form
4350E3168992j162556j564105j575965j419234O1519q31792m40470k91013L26841
4341D6272217l6298k95544N73402J68511N58982N66496R09919Q79674J205971
4332E0803330P44099J500966J302424J589406J617319J472679J717945J865333
4324F2613501K590289L007266L724490K763666L458497L507460L667169L176378
4316H8508716K244768J622480J426276Q85030r68812j798157k731671l325849
4308H5862781l938630m074488m534230m239351n147846n311041m164187l650334
4300E0802674l215373l165436k602510k183681j195752j359686q23356l94241
4292C5862639l50519n10885k16075n42067l07902q14703r52525o60297j628990
$$ plain form
4283 29878676 28227258 26917145 25632197 24560272 23004048 21938624 20907702 19926625
4275 19926625 18548797 17789998 16839539 16764155 15722787 15241106 15057714 14735498 14106305
4266 14106305 13439168 13281949 12866630 13197367 12780741 12362158 12554427 12034767 11941978 11717224
4256 11717224 11605914 11523875 10738614 10817894 10440738 10229929 9901918 9485997 9485355 9100933
4246 9100933 8583297 8637187 8160551 7845585 7697852 7717384 7645281 7626858 7563805 7983024
4236 7983024 7729396 7852662 7442834 7973736 7783971 7937823 8080481 7924243 7978345 7817634
4226 7817634 7723670 7823968 7512546 7150595 7304721 6840167 6425909 6371398 6348104 6311404
4216 6311404 5992758 6040165 6015279 5783064 5592803 5429288 5634276 5686046 5690568 5566706
$$ packed form
4283B9878676j651418j310113j284948j071925j556224j065424j030922r81077
4275A9926625j377828p58799r50459p5384j041368m81681j83392l22216o29193
4266A4106305o67137j57219m15319L30737m16626m18583J92269n19660r2789k24754
4256A1717224j11310q2039p85261P9280l77156k10809l28011m15921o42l84422
4246I100933n17636N3890m76636l14966j47733J9532p2103j8423o3053M19219
4236G983024k53628J23266m09828N30902j89765J53852J42658j56238N4102j60711
4226G817634r3964J00298l11422l61951J54126m64554m14258n4511k3294l6700
4216F311404l18646M7407k4886k32215j90261j63515K04988N1770M522j23862
$$ plain form
4206 5566706 5846547 5791797 5732538 5471362 5388437 5419467 5214766 5274002 5393894 5060727
4196 5060727 4705416 4575663 4398397 4579216 4334527 4006905 4236029 4123970 3767363 3907288
4186 3907288 4086691 3278811 3799301 3590183 3442437 3350261 3130218 3249887 3433744 3381306
4176 3381306 3551612 2985701 2825461 3182976 2977464 2909964 2977725 3142367 2802181 2566238
4166 2566238 3056290 2522902 2516814 2535218 2461283 2799796 2835449 2607584 2424266 2372646 2450422
4155 2450422 2285619 2078372 2379764 2386504 2381697 2514421 2103568 2497157 2071373 2389767
4145 2389767 1828819 2117057 2193517 2477893 2198038 2475259 2303833 2219019 2121720 2211402
4135 2211402 2448160 2423758 2137864 2374249 2088454 2539007 2523262 2918451 2478841 2174949
$$ packed form
4206E566706K79841n4750n9259k61176q2925L1030k04701N9236J19892l33167
4196E060727l55311j29753j77266J80819k44689l27622K29124j12059l56607J39925
4186C907288J79403q07880N20490k09118j47746r2176k20043J19669J83857n2438
4176C381306J70306n65911j60240L57515k05512o7500O7761J64642l40186k35943
4166B566238M90052n33388o088J8404p3935L38513L5653k27865j83318n1620P7776
4155B450422j64803k07247L01392O740m807J32724m10853L93589m25784L18394
4145B389767n60948K88238P6460K84376k79855K77221j71426q4814r7299Q9682
4135B211402K36758k4402k85894K36385k85795M50553j5745L95189m39610l03892
$$ plain form
4125 2174949 2508106 2777695 2485892 2382494 2349396 2200943 2240290 2606833 2220905 2487471
4115 2487471 2659724 2518272 2088072 2837533 2468401 2228888 2372782 2734678 2364591 2474905
4105 2474905 2826838 2631347 2962843 2551025 2641935 2787633 2568955 2870995 2774809 3070236
4095 3070236 2685857 2747364 2973896 2745868 2871501 2738061 2943192 2994420 2693274 2846950
4085 2846950 2859762 3129361 3283088 3096222 2949405 3276650 3391198 3129675 2925092 3676305
4075 3676305 3199782 3374147 3263146 3609483 3104726 3405940 3709418 3602591 3475558 3371435
4065 3371435 3445613 3753988 3624416 3992219 3647847 3845332 3567355 3932899 3653814 4135003
4055 4135003 4491456 4938441 4406403 4768367 4661079 4974103 5411239 5188762 5337187 5479598
$$ packed form
4125B174949L33157K69589k91803j03398l3098j48453L9347L66543l85928K66566
4115B487471J72253j41452m30200P49461l69132k39513J43894L61896l70087J10314
4105B474905L51933j95491L31496m11818R0910J45698k18678L02040r6186K95427
4095C070236l84379O1507K26532k28028J25633j33440K05131N1228l01146J53676
4085B846950J2812K69599J53727j86866j46817L27245J14548k61523k04583P51213
4075C676305m76523J74365j11001L46337n04757L01214L03478j06827j27033j04123
4065C371435P4178L08375j29572L67803l44372J97485k77977L65544k79085M81189
4055D135003L56453M46985n32038L61964j07288L13024M37136k22477J48425J42411
$$ plain form
4045 5479598 5840804 5902781 5707291 5940698 6305912 6670380 6368165 6822513 6792033 7312679
4035 7312679 6607100 6999636 7444285 7788148 7686809 7533405 7667785 8177387 8322964 8513851
4025 8513851 8881302 9138022 9080620 9469918 10049867 9816189 10215564 10188661 10524642 10864524
4015 10864524 10589616 10731732 10631661 10399321 10870469 10538078 10398855 10334718 10109505 10073505
4005 10073505 9865371 9833730 10292565 10186018 10126509 10502936 10428666 11036869 10984704 11428470
3995 11428470 11156133 11653264 11362504 11232179 11659360 11543998 11327060 11055030 10733549
3986 10733549 11035534 10617883 10301740 9754138 10020391 9814669 9566040 9377394 9085581
3977 9085581 9232332 9209072 8963219 8879001 8563653 8494062 8564898 8211075 7996911 7690646
$$ packed form
4045E479598L61206O1977j95490K33407L65214L64468l02215M54348l0480N20646
4035G312679p05579L92536M44649L43863j01339j53404J34380N09602J45577J90887
4025H513851L67451K56720n7402L89298N79949k33678L99375k6903L35981L39882
4015A0864524k74908J42116j00071k32340M71148l32391j39223o4137k25213l6000
4005A0073505k08134l1641M58835j06547n9509L76427p4270O08203n2165M43766
3995A1428470k72337M97131k90760j30325M27181j15362k16938k72030l21481
3986A0733549L01985m17651l16143n47602K66253k05722k48629j88646k91813
3977I085581J46751k3260k45853q4218l15348o9591P0836l53823k14164l06265
$$ plain form
3967 7690646 7831079 7549117 7068188 6789289 6448031 6557449 6289425 5982600 5468731 5327733
3957 5327733 4888735 4684695 4189613 4399443 3677659 3079531 3564162 3652793 3144975 3250431
3947 3250431 3161970 2856707 2882288 2690444 2815178 2409794 2609632 2483408 2119944 1874455
3937 1874455 2237496 1922848 1755781 1629247 1148160 1391375 1483888 1978344 1187535 1199881
3927 1199881 1375387 1167767 915793 838091 855131 1021485 1262862 1244834 1015201 1189038
3917 1189038 919117 1171524 1159974 894509 1288472 852346 1109756 740731 818472 656701
3907 656701 612197 797054 596177 474304 795045 398143 308749 529465 139372 480919
3897 480919 -64924 228621 -27660 447011 57839 650007 294728 241042 270510 39648
$$ packed form
3967G690646J40433k81962m80929k78899l41258J09418k68024l06825n13869j40998
3957E327733m38998k04040m95082K09830p21784n98128M84631Q8631n07818J05456
3947C250431q8461l05263K5581j91844J24734m05384J99838j26224l63464k45489
3937A874455L63041l14648j67067j26534m81087K43215R2513M94456p90809J2346
3927A199881J75506k07620k51974p7702J7040J66354K41377j8028k29633J73837
3917A189038k69921K52407j1550k65465L93963m36126K57410l69025P7741j61771
3907F56701m4504J84857k00877j21873L20741l96902q9394K20716l90093L41547
3897D80919n45843K93545k56281M74671l89172N92168l55279n3686K9468k30862
$$ plain form
3887 39648 77997 208948 372346 465906 496893 141873 318592 450312 657169 145024
3877 145024 268433 150656 121207 199225 -129730 -27599 -68763 -224978 -309659 -239148 -319653
3866 -319653 -207491 -775962 -102973 -257471 -400285 -328400 -424649 -552426 -378648 -441836
3856 -441836 -207322 -554500 -353315 -311158 -250451 -699575 -262650 -83918 -220053 -322386
3846 -322386 -222122 -730579 -449200 -591876 -585500 -841392 -435879 -713559 -643367 -893670
3836 -893670 -208483 -718073 -561379 -880329 -586162 -598425 -832836 -689705 -693371 -502340
3826 -502340 -472370 -816999 -643606 -851239 -877635 -766164 -835917 -642293 -839978 -445850
3816 -445850 -648335 -767580 -783917 -808556 -937773 -770959 -720854 -1061488 -812969 -890938
$$ packed form
3887C9648L8349J30951J63398R3560L0987l55020J76719J31720K06857n12145
3877A45024J23409j17777k9449P8018l28955J02131m1164j56215q4681P0511q0505
3866c19653J12162n68471O72989j54498j42814P1885r6249j27777J73778o3188
3856d41836K34514l47178K01185M2157O0707m49124M36925J78732j36135j02333
3846c22386J00264n08457K81379j42676O376k55892M05513k77680P0192k50303
3836h93670O85187n09590J56694l18950K94167j2263k34411J43131l666J91031
3826e02340K9970l44629J73393k07633k6396J11471o9753J93624j97685L94128
3816d45850k02485j19245j6337k4639j29217J66814N0105l40634K48519p7969
$$ plain form
3806 -890938 -463490 -265129 -379044 -696042 -704649 -688950 -150001 -556098 -263840 -734895
3796 -734895 -912888 -669947 -459087 -735365 -351041 -714599 -662329 -410548 -484559 -1063387
3786 -1063387 -806645 -774733 -701828 -725763 -701525 -698203 -540658 -769176 -806356 -567579 -767543
3775 -767543 -571382 -548672 -663773 -592512 -561156 -644963 -555120 -406620 -661030 -410160 -554040
3764 -554040 -702825 -121670 -640425 -396756 -422628 -183343 -432965 -782829 -127801 -128813
3754 -128813 -430604 -605399 -279709 -458585 -21802 -368807 -654184 -532661 -703195 -560806
3744 -560806 -601798 -892710 -471604 -511421 -222716 -6358 -546764 -293124 -121860 -232787
3734 -232787 -465682 -647522 -350145 -358094 -104833 -381062 -322399 -507450 -306458 -475515
$$ packed form
3806h90938M27448J98361j13915l16998q607J5699N38949m06097K92258m71055
3796g34895j77993K42941K10860k76278L84324l63558N2270K51781p4011n78828
3786a063387K56742L1912P2905k3935K4238L322J57545k28518l7180K38777j99964
3775g67543J96161K2710j15101P1261L1356q3807Q9843J48500k54410K50870j43880
3764e54040j48785N81155n18755K43669k5872K39285k49622l49864O55028j012
3754a28813l01791j74795L25690j78876M36783l47005k85377J21523j70534J42389
3744e60806m0992k90912M21106l9817K88705K16358n40406K53640J71264j10927
3734b32787k32895j81840K97377p949K53261k76229N8663j85051K00992j69057
$$ plain form
3724 -475515 -743496 -558506 -591884 -207413 -941569 -680775 -742428 -430016 -540486 -877570
3714 -877570 -521380 -221965 -509491 -528539 -699441 -295228 -444417 -200386 -867065 -702319
3704 -702319 -703089 -857774 -672924 -607784 -590898 -525157 -594761 -793079 -777963 -573574 -624136
3693 -624136 -233820 -703208 -455681 -559540 -855067 -545995 -914032 -565082 -888456 -934468
3683 -934468 -846983 -382718 -610407 -885398 -638964 -677090 -797804 -665486 -854474 -969411
3673 -969411 -891842 -843320 -690408 -756508 -645061 -947175 -945494 -1088894 -1034071 -923658 -953631
3662 -953631 -563348 -757455 -828541 -982724 -946264 -500963 -727056 -893024 -883830 -433868
3652 -433868 -1310035 -690116 -490444 -682160 -726910 -760433 -1043018 -593046 -772604 -443333
$$ packed form
3724d75515k67981J84990l3378L84471p34156K60794o1653L12412j10470l37084
3714h77570L56190K99415k87526j9048j70902M04213j49189K44031o66679J64746
3704g02319p70j54685J84850O5140J6886O5741o9604j98318J5116K04389n0562
3693f24136L90316m69388K47527j03859k95527L09072l68037L48950l23374m6012
3683i34468Q7485M64265k27689k74991K46434l8126j20714J32318j88988j14937
3673i69411P7569M8522J52912o6100J11447l02114J681j43400N4823J10413k9973
3662i53631L90283j94107p1086j54183L6460M45301k26093j65968R194M49962
3652d33868q76167O19919J99672j91716m4750l3523k82585M49972j79558L29271
$$ plain form
3642 -443333 -668159 -1043083 -568780 -756323 -830248 -555063 -511214 -646218 -532275 -608137
3632 -608137 -1039418 -802448 -958898 -861623 -719448 -777085 -818865 -659239 -207765 -150826
3622 -150826 -463906 -786671 -568341 -433804 -272608 -607111 -443822 -399265 -387255 10829
3612 10829 -240679 -69956 -137738 -167047 -300435 -372341 -60540 -478424 -109615 -245402
3602 -245402 -289642 -230304 -669918 -527651 -451945 -598276 -245261 -399071 -866031 -732431
3592 -732431 -846250 -619455 -289341 -862128 -687415 -1109900 -623109 -690291 -1032208 -780154
3582 -780154 -883244 -793521 -841216 -954926 -595173 -690691 -756813 -744606 -768459 -622382 -459711
3571 -459711 -744870 -488920 -422589 -637372 -580629 -668256 -387129 -812275 -505750 -656257
$$ packed form
3642d43333k24826l74924M74303j87543p3925K75185M3849j35004J13943p5862
3632f08137m31281K36970j56450R7275J42175n7637m1780J59626M51474N6939
3622a50826l13080l22765K18330J34537J61196l34503J63289M4557J2010L98084
3612A0829k51508J70723o7782k9309j33388p1906L11801m17884L68809j35787
3602b45402m4240N9338m39614J42267P5706j46331L53015j53810m66960J33600
3592g32431j13819K26795L30114n72787J74713m22485M86791o7182l41917K52054
3582g80154j03090Q9723m7695j13710L59753r5518o6122J2207k3853J46077J62671
3571d59711k85159K55950O6331k14783N6743q7627K81127m25146L06525j50507
$$ plain form
3561 -656257 -892093 -860650 -265117 -787078 -473265 -725809 -516084 -657830 -679810 -767341
3551 -767341 -654163 -601970 -531967 -350678 -623338 -739841 -601309 -713528 -826078 -454882
3541 -454882 -174779 -235075 -436592 -411791 -501771 -381050 16062 66963 127663 -27238 -298729
3530 -298729 131151 34039 81778 406612 921773 1101529 1060620 1253739 1526663 1418340
3520 1418340 1586910 1521527 1324970 1502964 1477087 1168405 986396 1469715 1267807 1369477
3510 1369477 917722 925086 1134519 766244 768119 1446432 848694 813737 692663 557268
3500 557268 210616 534927 183592 15780 -275694 282221 348047 243871 -111359 74527
3490 74527 -219554 -165631 -191941 -171531 -118377 -210897 -926486 -59411 -239101 -277523 -383751
$$ packed form
3561f56257k35836L1443N95533n21961L13813k52544K09725j41746k1980q7531
3551g67341J13178N2193P0003J81289k72660j16503J38532j12219j12550L71196
3541d54882K80103o0296k01517K4801q9980J20721L97112N0901O0700j54901k71491
3530b98729M29880r7112M7739L24834N15161J79756m0909J93119K72924j08323
3520A418340J68570o5383j96557J77994k5877l08682j82009M83319k01908J01670
3510A369477m51755P364K09433l68275J875O78313n97738l4957j21074j35395
3500E57268l46652L24311l51335j67812k91474N57915O5826j04176l55230J85886
3490G4527k94081N3923k6310K0410N3154r2520p15589Q67075j79690l8422j06228
$$ plain form
3479 -383751 -645026 -675516 -687199 -418178 -455387 -109365 -455406 127422 -158283 -231952
3469 -231952 -11593 -60235 5752 129288 -2939 -17821 39184 -57010 182125 -58391 39435
3458 39435 -182633 -274867 379910 -85271 -255509 -82568 -244603 -419840 -137254 55203
3448 55203 -54672 -286729 159449 163278 130962 289753 405015 568077 652656 587179 499046
3437 499046 907428 1263106 1353634 1502657 2070290 2147381 3031487 3296586 3237226 4313585
3427 4313585 4493303 5496414 6186655 6510447 7043345 7543819 8134365 8847396 8735908
3418 8735908 8727404 8568151 8234486 8141098 7261272 6829813 6266641 5596785 4694186 4321969
3408 4321969 3949667 3473220 3119184 3066561 2431419 2754459 3014073 3215515 3231674 2927145
$$ packed form
3479c83751k61275l0490j1683K69021l7209L46022l46041N82828k85705p3669
3469b31952K20359m8642O5987J23536j32227j4882N7005r6194K39135k40516R7826
3458C9435k22068r2234O54777m65181j70238J72941j62035j75237K82586J92457
3448E5203j09875k32057M46178L829l2316J58791J15262J63062Q4579o5477q8133
3437D99046M08382L55678R0528J49023N67633P7091Q84106K65099n9360J076359
3427D313585J79718J003111O90241L23792N32898N00474N90546P13031j11488
3418H735908q504j59253l33665r3388q79826m31459n63172o69856r02599l72217
3408D321969l72302m76447l54036n2623o35142L23040K59614K01442J6159l04529
$$ plain form
3398 2927145 3257409 3795681 3847349 4217877 4167583 5103542 5985329 6414144 7245312 8783291
3388 8783291 10442285 12409963 14401616 16369103 18535891 21176305 24568613 28650602
3380 28650602 32193790 35177966 37708616 39812891 42236683 43147489 43069885 42114656 40543368
3371 40543368 38964586 35833411 31557412 27368483 23388282 20152263 17031298 14607227
3363 14607227 12431072 10764535 8645516 7176723 6094733 5359673 4655986 3747733 3115690
3354 3115690 3007451 2698235 2096401 1715296 1689967 1284445 1471563 1276656 1112470 1082333
3344 1082333 988395 766976 1228664 1001542 992389 1082430 1390772 1356529 1785228 1389992
3334 1389992 1323518 1566430 2245541 2506039 3161639 3785149 4816259 5133895 5971481 6806827
$$ packed form
3398B927145L30264N38272N1668L70528n0294R35959Q81787M28815Q31168J537979
3388H783291J658994J967678J991653J967487K166788K640414L392308M081989
3380B8650602L543188K984176K530650K104275K423792R10806p7604r55229j571288
3371D0543368j578782l131175m275999m188929l980201l236019l120965k424071
3363A4607227k176155j666537k119019j468793j081990p35060p03687r08253o32043
3354C115690j08239l09216o01834l81105k5329m05522J87118j94907j64186l0137
3344A082333r3938k21419M61688k27122r153R0041L08342l4243M28699l95236
3334A389992o6474K42912O79111K60498O55600O23510J031110L17636Q37586Q35346
$$ plain form
3324 6806827 7665503 9524519 10371216 11276212 11878525 12649487 13120630 13058401 13158579 12625991
3314 12625991 12053921 11264032 9884526 8646720 7003986 6719522 5298135 4088339 3690792
3305 3690792 2605180 2431938 1533963 766284 891719 805931 289192 552625 202844 34474
3295 34474 -288518 -506949 -298893 -301042 -153879 -186572 -282757 -277982 -378302 -309092 -464363
3284 -464363 -571414 -324951 -30892 -548151 -28318 -343712 -899170 -403906 -688238 -744049
3274 -744049 -398216 -646140 -667545 -555088 -487183 -833321 -642533 -918520 -736651 -584884
$$ packed form
3324F806827Q58676J859016Q46697R04996O02313P70962M71143o2229J00178n32588
3314A2625991n72070p89889j379506j237806j642734k84464j421387j209796l97547
3305C690792j085612j73242q97975p67679J25435q5788n16739K63433l49781j68370
3295C4474l22992k18431K08056k149J47163l2693r6185M775j00320O9210j55271
3284d64363j07051K46463K94059n17259N19833l15394n55458M95264k84332n5811
3274g44049L45833k47924k1405J12457O7905l46138J90788k75987J81869J51767
$$ [...]
##END NTUPLES=NMR SPECTRUM
##END=
