##TITLE=abcd
##JCAMPDX= 6.0         $$ Bruker NMR JCAMP-DX V2.0
##DATA TYPE= NMR SPECTRUM
##DATA CLASS= NTUPLES
##ORIGIN= UXNMR, Bruker Analytische Messtechnik GmbH
##OWNER= root
$$ XWIN-NMR		Version 3.5
$$ Mon Mar 16 16:55:07 2026 Russian Standard Time (UT+4h)  servis@DPX200
##.OBSERVE FREQUENCY= 200.131235884673
##.OBSERVE NUCLEUS= ^1H
##.ACQUISITION MODE= SIMULTANEOUS
##.ACQUISITION SCHEME= undefined
##.AVERAGES= 32
##.DIGITISER RES= 18
##SPECTROMETER/DATA SYSTEM= spect
##.PULSE SEQUENCE= zg
##.SOLVENT NAME= DMSO
##.SHIFT REFERENCE= (INTERNAL, DMSO, 0, 16.4885)
##AUDIT TRAIL= $$ (NUMBER, WHEN, WHO, WHERE, WHAT)
$$ ##TITLE= Audit trail, XWIN-NMR		Version 3.5
$$ ##JCAMPDX= 5.01
$$ ##ORIGIN= Bruker BioSpin GmbH
$$ ##OWNER= servis
$$ F:\spectra/data/av/nmr/H1/1/pdata/1/auditp.txt
$$ ##AUDIT TRAIL=  $$ (NUMBER, WHEN, WHO, WHERE, WHAT)
(   1,<2026-03-16 16:54:18.60 +0400>,<servis>,<DPX200>,
      <created by zg, POWCHK disabled, PULCHK disabled
       configuration hash MD5:
       00 E9 B6 7A A2 85 ED C7 34 08 36 98 17 FE 4E 26
       data hash MD5: 32K
       01 2B 54 49 81 E4 D8 44 F9 8F 9B 21 9F ED F2 52>)
(   2,<2026-03-16 16:54:20.07 +0400>,<servis>,<DPX200>,
      <Start of raw data processing
       efp BC_mod = 2 LB = 0.05 FT_mod = 6 PKNL = 1 PHC0 = -254.5951 PHC1 = -0.898437 SI = 16K 
       data hash MD5: 16K
       90 C1 13 16 CE F5 68 D7 BC 81 74 89 48 49 90 B7>)
(   3,<2026-03-16 16:54:35.42 +0400>,<servis>,<DPX200>,
      <pk PHC0 = -4.6 PHC1 = 0 
       data hash MD5: 16K
       AE 46 28 C1 0C 21 BA 36 A8 44 62 90 91 93 E8 86>)
$$ ##END=
$$ 
$$ hash MD5
$$ B2 06 BC 62 71 2A FF 3F F2 D3 4E C5 61 91 5A FA
##$RELAX= 
##$RELAX= 
##$RELAX= 
##$RELAX= 
##$RELAX= 
##$RELAX= 
##$RELAX= 
##$RELAX= 
$$ Bruker specific parameters
$$ --------------------------
##$DU= <F:\spectra>
##$EXPNO= 1
##$NAME= <H1>
##$PROCNO= 1
##$TYPE= <nmr>
##$USER= <av>
##$AMP= (0..31)
100 100 100 100 100 100 100 100 100 100 100 100 100 100 100 100 100 100 
100 100 100 100 100 100 100 100 100 100 100 100 100 100 
##$AQSEQ= 0
##$AQ_mod= 1
##$AUNM= <au_zg>
##$AUTOPOS= <>
##$BF1= 200.13
##$BF2= 200.13
##$BF3= 200.13
##$BF4= 200.13
##$BF5= 500.13
##$BF6= 500.13
##$BF7= 500.13
##$BF8= 500.13
##$BYTORDA= 1
##$CFDGTYP= 0
##$CFRGTYP= 5
##$CHEMSTR= <none>
##$CNST= (0..31)
1 1 145 1 1 1 1 1 1 1 1 1 1 1 1 1 1 1 1 1 1 1 1 1 1 1 1 1 1 1 1 1 
##$CPDPRG= <>
##$CPDPRG1= <>
##$CPDPRG2= <>
##$CPDPRG3= <>
##$CPDPRG4= <mlev>
##$CPDPRG5= <mlev>
##$CPDPRG6= <mlev>
##$CPDPRG7= <mlev>
##$CPDPRG8= <mlev>
##$CPDPRGB= <>
##$CPDPRGT= <>
##$D= (0..31)
0 2 0 0 0 0 0 0 0 0.06 0 0 0 0 0 0 0.0002 0 0 0 0 0 0 0 0 0 0 0 0 0 0 
0 
##$DATE= 1773665658
##$DBL= (0..7)
120 120 120 120 120 120 120 120 
##$DBP= (0..7)
150 150 150 150 150 150 150 150 
##$DBP07= 0
##$DBPNAM0= <>
##$DBPNAM1= <>
##$DBPNAM2= <>
##$DBPNAM3= <>
##$DBPNAM4= <>
##$DBPNAM5= <>
##$DBPNAM6= <>
##$DBPNAM7= <>
##$DBPOAL= (0..7)
0.5 0.5 0.5 0.5 0.5 0.5 0.5 0.5 
##$DBPOFFS= (0..7)
0 0 0 0 0 0 0 0 
##$DE= 6
##$DECBNUC= <off>
##$DECIM= 32
$$ [...]
##$SUBNAM4= <"">
##$SUBNAM5= <"">
##$SUBNAM6= <"">
##$SUBNAM7= <"">
##$SUBNAM8= <"">
##$SUBNAM9= <"">
##$SW= 20.6817932712277
##$SWIBOX= (0..15)
0 0 3 0 0 0 0 0 0 0 0 0 0 0 0 0 
##$SW_h= 4139.07284768212
##$TD= 32768
##$TD0= 1
##$TE= 0
##$TE2= 300
##$TE3= 300
##$TEG= 300
##$TL= (0..7)
0 120 120 120 120 120 120 120 
##$TP= (0..7)
150 150 150 150 150 150 150 150 
##$TP07= 0
##$TPNAME0= <>
##$TPNAME1= <>
##$TPNAME2= <>
##$TPNAME3= <>
##$TPNAME4= <>
##$TPNAME5= <>
##$TPNAME6= <>
##$TPNAME7= <>
##$TPOAL= (0..7)
0.5 0.5 0.5 0.5 0.5 0.5 0.5 0.5 
##$TPOFFS= (0..7)
0 0 0 0 0 0 0 0 
##$TUNHIN= 0
##$TUNHOUT= 0
##$TUNXOUT= 0
##$USERA1= <user>
##$USERA2= <user>
##$USERA3= <user>
##$USERA4= <user>
##$USERA5= <user>
##$V9= 5
##$VALIST= <valist>
##$VCLIST= <CCCCCCCCCCCCCCC>
##$VD= 0
##$VDLIST= <DDDDDDDDDDDDDDD>
##$VPLIST= <PPPPPPPPPPPPPPP>
##$VTLIST= <TTTTTTTTTTTTTTT>
##$WBST= 1024
##$WBSW= 30
##$XGAIN= (0..3)
0 0 0 0 
##$XL= 0
##$YL= 0
##$YMAX_a= 677507
##$YMIN_a= -586687
##$ZGOPTNS= <>
##$ZL1= 120
##$ZL2= 120
##$ZL3= 120
##$ZL4= 120
##$ABSF1= 0
##$ABSF2= 0
##$ABSG= 0
##$ABSL= 0
##$ALPHA= 0
##$AQORDER= 0
##$ASSFAC= 0
##$ASSFACI= 0
##$ASSFACX= 0
##$ASSWID= 0
##$AUNMP= <proc_1d>
##$AZFE= 0.1
##$AZFW= 0.1
##$BCFW= 0
##$BC_mod= 2
##$BYTORDP= 0
##$COROFFS= 0
##$CY= 18.4799938201904
##$DATMOD= 1
##$DC= 0
##$DFILT= <>
##$DTYPP= 0
##$F1P= 9.9274215381318
##$F2P= -0.165520771350173
##$FCOR= 1
##$FTSIZE= 16384
##$FT_mod= 6
##$GAMMA= 0
##$GB= 0
##$INTBC= 1
##$INTSCL= 4.127829e-11
##$ISEN= 128
##$LB= 0.05
##$LEV0= 0
##$LPBIN= 0
##$MAXI= 10000
##$MC2= 0
##$MEAN= 0
##$ME_mod= 0
##$MI= 50
##$NCOEF= 0
##$NC_proc= -6
##$NLEV= 6
##$NOISF1= 3.799351
##$NOISF2= 2.8
##$NSP= 0
##$NTH_PI= 0
##$NZP= 0
##$OFFSET= 16.48848
##$PC= 4
##$PHC0= -259.1951
##$PHC1= -0.898437
##$PH_mod= 1
##$PKNL= yes
##$PPARMOD= 0
##$PSCAL= 4
##$PSIGN= 0
##$REVERSE= no
##$SF= 200.130005582386
##$SI= 16384
##$SIGF1= 3
##$SIGF2= 2
##$SINO= 400
##$SIOLD= 16384
##$SREGLST= <1H.CDCl3>
##$SSB= 0
##$STSI= 16384
##$STSR= 0
##$SW_p= 4139.07284768211
##$SYMM= 0
##$S_DEV= 0
##$TDeff= 32768
##$TDoff= 0
##$TI= <>
##$TILT= no
##$TM1= 0
##$TM2= 0
##$TOPLEV= 0
##$USERP1= <user>
##$USERP2= <user>
##$USERP3= <user>
##$USERP4= <user>
##$USERP5= <user>
##$WDW= 1
##$XDIM= 16384
##$YMAX_p= 356702349
##$YMIN_p= -1104606
$$ End of Bruker specific parameters
$$ ---------------------------------
##NTUPLES= NMR SPECTRUM
##VAR_NAME=  FREQUENCY,     SPECTRUM/REAL,   SPECTRUM/IMAG
##SYMBOL=    X,             R,               I
##VAR_TYPE=  INDEPENDENT,   DEPENDENT,       DEPENDENT
##VAR_FORM=  AFFN,          ASDF,            ASDF
##VAR_DIM=   16384,         16384,           16384
##UNITS=     HZ,            ARBITRARY UNITS, ARBITRARY UNITS
##FACTOR=    0.252644378177508, 1,           1
##FIRST=     3299.83951724647, 0,            0
##LAST=      -839.233330435636, 0,           0
##MIN=       -839.233330435636, -1104606,    0
##MAX=       3299.83951724647, 356702349,    0
$$ Real data points
##PAGE= N=1
##DATA TABLE= (X++(R..R)), XYDATA
$$ [...]
9097A816330N5927K6099k2538j71013M5912o4158k24710K11390k58067J70658
9087A585830k68518J15489J40710k35225p4829J59798j36910j38698J14983j53840
9077A108790M3591k8339J48845l22088N3215k16190K71943k90601K89235l8524
9067A019877n8273j33742J48108O6992k32777l4003j12424J96269j78043p6794
9057F05190L00647j40671l8373p4508J19362j84729J74501r2009o7405m6391m6393
9046E09221R505K28629j30992k7169l483j01998J65310m6410j57509l7399J08124
9035E15829J3053p4397n1829R8187n6242J29324p8046n6812m706q9643R2070k33329
9023B03459J17181O8691j41980o6787J44178K2471k32720k9116J16186J17484
$$ plain form
9097 1816330 1872257 1898356 1875818 1704805 1750717 1686559 1461849 1673239 1415172 1585830
9087 1585830 1317312 1432801 1573511 1338286 1263457 1423255 1286345 1147647 1262630 1108790
9077 1108790 1152381 1124042 1272887 950799 1004014 787824 1059767 769166 1058401 1019877
9067 1019877 961604 827862 975970 1042962 810185 776182 663758 860027 681984 605190
9057 605190 905837 765166 726793 652285 771647 586918 761419 669410 602005 555614 509221
9046 509221 518726 747355 616363 589194 585711 483713 649023 602613 445104 407705 515829
9035 515829 528882 454485 402656 500843 444601 573925 495879 439067 434361 344718 436788 203459
9023 203459 320640 389331 247351 180564 324742 347213 114493 85377 201563 319047
9013C19047J05426j63427p5133p3588J19903q2002q3470j65012L48172r3104k8790
9002A28022j34823M2502j9288R2079j31176J20682j26108K08094o5283k5371q7444
8991A886O5701j65716R4784k38149N8012L42905k41994j0287M2345m8112J6201
8980h2424l1503j5971L5042r6677Q6243k9156l8788Q1414j0192m5939P9933j9105
8968h7123J03198k12462J89502j09625O8672q6123P0280M280Q6432j27268q80
8957a01117j98465R5196J79684j12099Q9338k0208j50600L7740J47386j29728
8947a62873k2943J49372p7639K9348L296o4496N5730j66769J58072J7021l4512
8936a16393k23742J51565Q0655o7330L5369J7023j67527J12676j06455k4982j07499
$$ plain form
9013 319047 424473 261046 185913 112325 232228 150226 66756 -98256 249916 156812 128022
9002 128022 -6801 35701 16413 108492 -22684 97998 -28110 179984 114701 89330 1886
8991 1886 67587 -98129 -3345 -241494 -183482 159423 -82571 -92858 -50513 -98625 -82424
8980 -82424 -113927 -129898 -94856 -191533 -105290 -134446 -173234 -91820 -102012 -147951 -68018 -87123
8968 -87123 16075 -196387 -6885 -116510 -47838 -133961 -63681 -59401 27031 -100237 -101117
8957 -101117 -299582 -204386 -24702 -136801 -47463 -67671 -218271 -180531 -33145 -162873
8947 -162873 -185816 -36444 -114083 -84735 -81439 -145935 -90205 -256974 -98902 -81881 -116393
8936 -116393 -340135 -188570 -107915 -175245 -139876 -122853 -290380 -177704 -284159 -309141 -416640
8925d16640J55401o7369K661J82447j05651J67739j27013J19486K1674l09349
8915c76614J83767L7936j10594O0525j02303K84305k48770j42508J47482Q4209
8905a82565n8710J13212k12778O5074j76372o731N5510J66866j58985N0050N3483
8894b91946j35505O9751P616K2751O1621q6914N706O0535k12074P1537K53358
8883a73564k60725O9794j90119J76908N5518l7832j18995L20024k1440r1460j20785
8872c92676K09473j60716p9202n4771J20443l4879J07228j63718Q0884K31549
8862a36385k68010O94J23781k7981o8776j15910J37000M286R6601r9898J28839
8851b25759n5889j9865J33152l08714Q9985m0904q1982N9898R079J62655j25469
$$ plain form
8925 -416640 -261239 -328608 -325947 -143500 -249151 -81412 -208425 -88939 -67265 -376614
8915 -376614 -192847 -154911 -265505 -204980 -307283 -22978 -271748 -414256 -266774 -182565
8905 -182565 -241275 -128063 -340841 -275767 -452139 -458870 -403360 -236494 -395479 -345429 -291946
8894 -291946 -427451 -357700 -350084 -327333 -265712 -352626 -346920 -286385 -498459 -426922 -173564
8883 -173564 -434289 -364495 -554614 -377706 -322188 -360020 -479015 -158991 -180431 -271891 -392676
8872 -392676 -183203 -343919 -423121 -477892 -357449 -392328 -285100 -448818 -367934 -136385
8862 -136385 -404395 -403701 -279920 -307901 -376677 -492587 -355587 -351301 -254700 -354598 -225759
8851 -225759 -281648 -301513 -168361 -477075 -387090 -427994 -509976 -450078 -440999 -278344 -403813
8840d03813J09959j76562Q5554m5359m2954l9608J81817l0821j12220j65262L96823
8829b42446k20809J24733J3998m7573q9361k5470K89999k03164M4031k9970r1311
8818d77343j4959J87098k42112L22350j35113n1980P1408l1543j53732j735J80354
8807c47307J3611j98454j4411M1308m1847K8511J32266R8697j38842P5048o518
8796c57938m5838K1134o659r5099L8713J7019Q5536L1015K5007j54708j70489
8785f12307L3631J45348n0178j5739J46234p5486j2961j57388Q4809J35462j53538
8774e32113K98492j47378j51316J13357m2856j21866M5225J10069j33716K58917
8764c03185j35687J30230j265j11982J60312M5356j36786j82028J59499R5306
$$ plain form
8840 -403813 -293854 -470416 -384862 -430221 -473175 -512783 -330966 -361787 -474007 -639269 -242446
8829 -242446 -463255 -338522 -324524 -372097 -461458 -486928 -196929 -400093 -356062 -386032 -477343
8818 -477343 -492302 -305204 -547316 -224966 -360079 -412059 -340651 -372194 -525926 -527661 -347307
8807 -347307 -333696 -532150 -546561 -505253 -547100 -518589 -386323 -287626 -426468 -351420 -357938
8796 -357938 -403776 -382642 -389301 -484400 -445687 -428668 -343132 -312117 -287110 -441818 -612307
8785 -612307 -578676 -433328 -483506 -499245 -353011 -428497 -441458 -598846 -514037 -378575 -532113
8774 -532113 -233621 -380999 -532315 -418958 -461814 -583680 -538455 -428386 -562102 -303185
8764 -303185 -438872 -308642 -309907 -421889 -261577 -216221 -353007 -535035 -375536 -280230
8754b80230r676m6583k4120J1256j57158J01477J21565k06682J61105k73760L32888
8743b69918n4521q7069J27653K0081n1587M8408l39433P9661K27007k7891o6704
8732c94313J90780k11635j00027r809K27149j52658K040K01710k48591N3734P0586
8721c71034p680N1758j20389N7277j46479Q3016M1648j04341M5424n4466R4622
8710d30644J43241j67649j5558j36337L07265k87098J42005O6501j50080q779
8700e37133K2364j15534L32473j59822n4489O5630o2852K8221o766J39786j21333
8689d69455j29978J29743k4878P3833M7614k11194J88025j67425n343R8193R4737
8678c76128O637l3892m1054k7659J08480j51496J06415j56420L2298N0741J476
$$ plain form
8754 -280230 -289906 -336489 -360609 -349353 -506511 -405034 -283469 -490151 -329046 -602806 -269918
8743 -269918 -324439 -411508 -283855 -263774 -315361 -266953 -606386 -526725 -299718 -327609 -394313
8732 -394313 -203533 -415168 -515195 -525004 -297855 -450513 -448473 -246763 -495354 -441620 -371034
8721 -371034 -378714 -326956 -447345 -390068 -536547 -453531 -411883 -516224 -470800 -525266 -430644
8710 -430644 -287403 -455052 -470610 -606947 -299682 -586780 -444775 -378274 -528354 -537133
8700 -537133 -514769 -630303 -297830 -457652 -512141 -446511 -509363 -481142 -487908 -348122 -469455
8689 -469455 -599433 -469690 -494568 -420735 -373121 -584315 -396290 -563715 -569058 -470865 -376128
8678 -376128 -369491 -403383 -444437 -472096 -363616 -515112 -408697 -565117 -532819 -482078 -480602
8667d80602r0669J75749r9808j9653O5115j60075j5899J11451k20463N2022K13120
8656d69712L7818p0711J77027j28597p5641M0916k4386j21304J4628R0195P2367
8645d57400j46016L53587l11576k6955J5326j31696J27655J3021J19720l1188
8635d75522q3386J23341l9288j1895j66362J47717J95814j04851j63710L981J07437
8624d66724K0353o2904j84260L24911o7620j48128J21056j5962p4591J78376k85428
8613f60921R7058R2212J8227O3222j66739k1090j77657P8866K762J82359J47905
8602c43796j46200j80917P520J41617J9024m0009O7156j78776O9791P2021N6954
8591d55615O041J60428p0960r2269n9980q4103Q7401j3463P5960j1302j68585
$$ plain form
8667 -480602 -571271 -395522 -495330 -514983 -449868 -609943 -625842 -514391 -734854 -682832 -469712
8656 -469712 -431894 -502605 -325578 -454175 -529816 -488900 -513286 -634590 -619962 -529767 -457400
8645 -457400 -603416 -249829 -561405 -588360 -573034 -704730 -577075 -564054 -444334 -475522
8635 -475522 -558908 -435567 -474855 -486750 -653112 -505395 -309581 -414432 -578142 -574161 -466724
8624 -466724 -446371 -509275 -693535 -368624 -436244 -584372 -463316 -479278 -553869 -375493 -660921
8613 -660921 -563863 -471651 -453424 -390202 -556941 -578031 -755688 -676822 -674060 -491701 -343796
8602 -343796 -489996 -670913 -663393 -521776 -502752 -542761 -475605 -654381 -584590 -512569 -455615
8591 -455615 -449574 -289146 -360106 -452375 -512355 -596458 -509057 -522520 -446560 -457862 -626447
8580f26447J9554L5687j8923J18591j50136P9551m1996J16250K292n7240k2955
8569e45772M0325k11300K02088K7890j11152K27905k32020n761K07334n3673J5984
8558d38152j86075l089Q804L04407j95283K6246n4212K3079n4861N3855n7219
8547e72500J00128p8340J92469j71176l9544N8769Q5684J7941k76240K47896J743
8536d33170k0004j5425J5952o206O3816M4342K81626j015590K83003L11432j39963
8525f30187K13737k44452J82927j05886O6757j11129K36878N8263k49822p5841
8515f58755J09574o5679P6166J47782j76692j8528P8878m2092k1458j20402P3780
8504f17426J47961o3133J72121j88752M5250M6014l8943j60743J15347K9187P4317
$$ plain form
8580 -626447 -606893 -571206 -590129 -471538 -621674 -542123 -584119 -467869 -465577 -522817 -545772
8569 -545772 -505447 -716747 -514659 -486769 -597921 -370016 -602036 -607797 -400463 -454136 -438152
8558 -438152 -624227 -627316 -618512 -314105 -509388 -483142 -537354 -514275 -569136 -515281 -572500
8547 -572500 -472372 -550712 -358243 -529419 -568963 -510194 -424510 -406569 -682809 -434913 -433170
8536 -433170 -453174 -468599 -452647 -458853 -395037 -350695 -69069 -1084659 -801656 -490224 -630187
8525 -630187 -416450 -660902 -477975 -583861 -517104 -628233 -391355 -333092 -582914 -658755
8515 -658755 -549181 -614860 -538694 -390912 -567604 -586132 -507254 -549346 -570804 -691206 -617426
8504 -617426 -469465 -532598 -360477 -549229 -503979 -457965 -496908 -657651 -542304 -513117 -438800
8493d38800l81624K69322J50373K7567j7710l89980K30343J46022j6351k04806
8483f25644J40429o4340K8334R622l9650l7166J29219L797J1008o6385j20590
8472f31366K43972L3071k05996j15264J49991k39769K24749o3999L9884J14103
8462d50624k46040L05242j01464L1079O6171j98126L2094l2395J30996k91728
8452g54795J12752J74042m5721m7084O1358R7630j18394K2435p4206J4646q83
8441e58220Q8478M5719j15323r6711M3667R2967O7537J8446n0230J45061k28494
8430e47103L0781J47666N471L2633j64672J78061j95506p4331L7310r2386R9052
8419e43024M7397J65137k75798L07515j90908O9559J84757k31974J15570N0178
$$ plain form
8493 -438800 -820424 -551102 -400729 -373162 -390872 -780852 -550509 -404487 -420838 -625644
8483 -625644 -485215 -549555 -521221 -511599 -551249 -588415 -459196 -455399 -444391 -510776 -631366
8472 -631366 -387394 -354323 -560319 -675583 -525592 -765361 -540612 -604611 -564727 -450624
8462 -450624 -696664 -391422 -492886 -461807 -395636 -593762 -561668 -594063 -463067 -754795
8452 -754795 -642043 -468001 -513722 -560806 -499448 -401818 -520212 -497777 -571983 -557337 -558220
8441 -558220 -469742 -424023 -539346 -636057 -592390 -499423 -431886 -413440 -463670 -318609 -547103
8430 -547103 -516322 -368656 -363185 -330552 -495224 -317163 -512669 -587000 -549690 -642076 -543024
8419 -543024 -495627 -330490 -606288 -298773 -489681 -420122 -235365 -467339 -351769 -301591
8409c01591k03877J37124l3228J06240j9451j22119N0890k53121L95447k35114
8399d78800K2019k22531L31142r0830J01605j4515j51235j38149N0012K07368
8389c83914l09445L48109k87296L838K19348m7042r0664L3362O8151P6718k13375
8378e82210K06621j77781k735J59242l6675j17618N318k23803K84046q4625M9585
8367e20635q9409J52466j94706j85639K31576l7865p3148K37979j03676P6434
8357e06623j16525J80145k12733J10104n348j716K40949k95730J07116o1293N0321
8346e11333m7760m3749L7911K7644j0124j3839P9585j8553n9154R5558o1067j9973
8334e44854n9626N0523j24780L10015Q7256j77281j25160M5889m8172P9704J24478
$$ plain form
8409 -301591 -505468 -368344 -401572 -295332 -314783 -436902 -386012 -639133 -243686 -478800
8399 -478800 -456781 -679312 -348170 -439000 -337395 -351910 -503145 -641294 -591282 -383914
8389 -383914 -693359 -345250 -632546 -628708 -409360 -456402 -547066 -513704 -445553 -368835 -582210
8378 -582210 -375589 -553370 -556105 -396863 -433538 -551156 -545838 -769641 -485595 -570220 -520635
8367 -520635 -610044 -457578 -652284 -837923 -606347 -644212 -717360 -479381 -583057 -506623
8357 -506623 -623148 -443003 -655736 -545632 -550980 -552696 -311747 -607477 -500361 -561654 -511333
8346 -511333 -559093 -602842 -564931 -537287 -547411 -561250 -481665 -500218 -559372 -463814 -524881 -544854
8334 -544854 -604480 -553957 -678737 -368722 -281466 -458747 -583907 -538018 -586190 -506486 -382008
8323c82008n4585q3483J14249q9719o0294p9863M0168j7359J11381J13570k24381
8312f12324K7001O544O2180o9214j46591R3344J84842j11147J19953j38721N1769
8301e32364m4410J19017Q9674k21250K23044k63999J63031k17593J36146n7627
8291f06331J82521j67192J12496q2874k5339Q5125Q1780k05824O7640P9383N5140
8280d23475p3229m3279P5234j60689N1769l7463j904K5291J27306o7228n2909
8269e80576o9786K74663j95916q336j4724R8662j08796q9380J15776k3337K43297
8258c58453q1077l6393j55282J45104k43403L59129n786q2951j11892j5110j23081
8247g09195L45848j83979N6324M6599L0774K9599k51420J95444k00666P6859N4141
$$ plain form
8323 -382008 -436593 -520076 -405827 -495546 -555840 -635703 -595535 -612894 -501513 -387943 -612324
8312 -612324 -585323 -578779 -516599 -585813 -732404 -639060 -454218 -565365 -445412 -584133 -532364
8301 -532364 -576774 -457757 -368083 -589333 -366289 -630288 -467257 -684850 -548704 -606331
8291 -606331 -423810 -591002 -478506 -561380 -586719 -501594 -419814 -625638 -557998 -478615 -423475
8280 -423475 -496704 -539983 -464749 -625438 -573669 -611132 -613036 -587745 -460439 -527667 -580576
8269 -580576 -650362 -375699 -571615 -579951 -594675 -496013 -604809 -694189 -578413 -601750 -358453
8258 -358453 -439530 -475923 -631205 -486101 -729504 -370375 -376161 -459112 -571004 -586114 -709195
8247 -709195 -363347 -547326 -491002 -444403 -413629 -384030 -635450 -440006 -640672 -563813 -509672
8236e09672R7974N2618j26052j45070K10590l4509O5818j4921k31291R8777K37954
8225b97784k23464j45812K64186j9953K2928j50973R2143R7630J67466k16051
8215d09684k56543K21628l3400j7746Q7766j52368k8522q5050R8286K00890j78816
8204e53559p234J2163K73640l6436p0460L5886r6525j95298K77150j66724K34379
8193b93018j1464q4341p11376N11314j96229j88823L96661K10065k49872J16184
8183e00899k67158J08670J8336J58809o5851l0764j27538R8985P8016j98963L68536
8172c59821l47052L46795k58241K9894R9701o3455j47139k8999P8915J36480k3508
8161e36430m222N6413k18836J21972K87964k96431N8751j53300K40233j68847
$$ plain form
8236 -509672 -411698 -359080 -485132 -630202 -419612 -454121 -388303 -403224 -634515 -535738 -297784
8225 -297784 -521248 -667060 -402874 -422827 -399899 -550872 -458729 -361099 -193633 -409684
8215 -409684 -666227 -444599 -477999 -495745 -407979 -560347 -588869 -673919 -575633 -374743 -553559
8204 -553559 -560793 -548630 -274990 -311426 -381886 -346000 -442525 -637823 -360673 -527397 -293018
8193 -293018 -304482 -388823 -1100199 -588885 -785114 -973937 -577276 -367211 -617083 -500899
8183 -500899 -768057 -659387 -641051 -482242 -548093 -578857 -706395 -607410 -529394 -728357 -359821
8172 -359821 -706873 -360078 -618319 -588425 -488724 -552179 -699318 -728317 -649402 -512922 -536430
8161 -536430 -540652 -484239 -703075 -581103 -293139 -589570 -530819 -684119 -443886 -612733
8151f12733Q8043Q008j23369k8904N9445m1590L4515N8797L89244k91278j96691
8140f56513l9563J00877j75684L10861j67997l9265J35466M8369j07463j16211
8130g07123K34428j67462J85200j66455J06723j21441O7648N1242J49484j75515
8120e43271L4304j47165K10501j57205K01368j32371J03831o3522K808j43176
8110f33898J58965m5855p4228M6486j5127J24499m177j37427J29095J53202j17920
8099d16385O6034n6566k27639N8163k2954P7112L7427J73555k35653j1357J18877
8088d39386n9885L4462o4672K32013m86500K83522Q062j5015Q6906J46223l98290
8077f72560M2917P4864j88937K34018J96175j43808j31230K4558m3348J51710
$$ plain form
8151 -612733 -524690 -516682 -640051 -668955 -609510 -651100 -616585 -557788 -168544 -459822 -656513
8140 -656513 -696076 -595199 -770883 -460022 -628019 -667284 -531818 -483449 -590912 -707123
8130 -707123 -472695 -640157 -454957 -621412 -514689 -636130 -568482 -517240 -367756 -543271
8120 -543271 -508967 -656132 -445631 -602836 -401468 -533839 -430008 -493530 -490722 -633898
8110 -633898 -474933 -520788 -595016 -548530 -563657 -439158 -443335 -580762 -451667 -298465 -416385
8099 -416385 -350351 -406917 -634556 -576393 -599347 -522235 -484808 -311253 -546906 -558263 -439386
8088 -439386 -499271 -464809 -529481 -297468 -783968 -500446 -492384 -507399 -420493 -274270 -672560
8077 -672560 -629643 -554779 -743716 -509698 -313523 -457331 -588561 -564003 -607351 -455641
8067d55641j09270J27666m2221M9981R8861N9836J6109j59774j3141J63393j86128
8056d50329J1993l5788j4379O1709j05294J73190j74604K24264r5876j61937r3760
8045f60811K05567j21827J76116m1191J05200o070j08432n373j7484R741j22772
8034e87336N9957L8251r8017l7340J11044P6829q6236N3788k40002J35956O9182
8023e03924J49282j75076O0584m4766K3355l9742P0854r0191J90201j18757m7748
8012e25928L0320K4429k067Q6285r6626q7706J9907R0728l2370j43240M3577N5167
8000e37524J56814q8607n4237R959J19230Q6049l18850K4856M7858J44266j95967
7989f06153J75409n4405J182q7670J45497l1672J71381j62558j10875R9575q5748
$$ plain form
8067 -455641 -564911 -437245 -479466 -429485 -330624 -270788 -254679 -414453 -427594 -264201 -450329
8056 -450329 -438336 -474124 -488503 -426794 -532088 -358898 -533502 -309238 -405114 -567051 -660811
8045 -660811 -455244 -577071 -400955 -442146 -336946 -343016 -451448 -456821 -474305 -464564 -587336
8034 -587336 -527379 -489128 -587145 -624485 -513441 -436612 -522848 -469060 -709062 -573106 -503924
8023 -503924 -354642 -529718 -469134 -513900 -490545 -530287 -459433 -549624 -359423 -478180 -525928
8012 -525928 -495608 -471179 -473246 -386961 -483587 -571293 -551386 -460658 -493028 -636268 -592691 -537524
8000 -537524 -380710 -469317 -523554 -513595 -394365 -308316 -627166 -602310 -554452 -410186 -606153
7989 -606153 -430744 -485149 -483967 -571637 -426140 -457812 -286431 -448989 -559864 -460289 -546037
7978e46037p385j40733L06938q0975j30558P8930J31558o9105M3263j38485q5128
7967f37717J7651K08015k86389Q9419N8958J41620j67357K59230o9494j35429
7957e21493q4957J96442k35843J27381J83991j86865K55322n5307j52078J48849
7947c24558J18644j81053l2491k0101j10485P119J09903j6402L6660J01007r9159
7936d10916L3697o6845L0708M1512O7605K5534j49988j4386o1032P1538R8129
7925c34444o698j02583k7036J17138P3757k34137q6151L21613k14394m1941J69004
7914c65872j06032j17473J74474K0693j64391J52190P1831m2130R536L1182j14048
7903d50040n8522r872J76696P1229p8726k36820J38256n9420O8129j58814L15598
$$ plain form
7978 -546037 -553422 -694155 -387217 -468192 -598750 -519820 -388262 -457367 -414104 -552589 -637717
7967 -637717 -620066 -412051 -698440 -609021 -550063 -408443 -575800 -316570 -386064 -521493
7957 -521493 -606450 -410008 -645851 -518470 -334479 -521344 -266022 -321329 -473407 -324558
7947 -324558 -205914 -386967 -419458 -439559 -550044 -542925 -433022 -449424 -412764 -311757 -410916
7936 -410916 -377219 -444064 -413356 -371844 -304239 -278705 -428693 -443079 -504111 -432573 -334444
7925 -334444 -341142 -443725 -470761 -353623 -279866 -514003 -600154 -278541 -492935 -534876 -365872
7914 -365872 -471904 -589377 -414903 -394210 -558601 -406411 -334580 -376710 -367174 -335992 -450040
7903 -450040 -508562 -518434 -341738 -270509 -349235 -586055 -447799 -507219 -439090 -597904 -282306
7892b82306j50481r1688K73349k50208K35613k11790L04268l79569J45211q7578
7882d95179J5083r9961R1575r5325J44829Q6072Q0720k74729J46945r2009j20490
7871f12469K7254J32835M7876o0943M0848Q7416j24198m8417j11710J44971N3565
7860d22972k5811k40644k23209j36070J310465j351671J067593k63227j35302
7851d20848N4962k3644P9562J18292k19938J32508J2268j10224J04049k04333
7841d77346J27537j34898O6689K9261l4397P9217j49461j8599J38037J00422j07831
7830c81369J30508Q4310l04861J78619k73269J62037K1878j9432R4895o7181Q2673
7819b91192L1397o5048p0517O6128j29400K06889K2836K6493k358j5790j01531
$$ plain form
7892 -282306 -432787 -524475 -251126 -501334 -265721 -477511 -173243 -552812 -407601 -495179
7882 -495179 -480096 -580057 -488482 -583807 -438978 -352906 -272186 -546915 -399970 -491979 -612469
7871 -612469 -585215 -452380 -404504 -465447 -424599 -337183 -461381 -509798 -621508 -476537 -422972
7860 -422972 -448783 -689427 -912636 -1048706 261759 -1089912 -22319 -285546 -420848
7851 -420848 -365886 -389530 -309968 -191676 -411614 -279106 -266838 -377062 -273013 -477346
7841 -477346 -349809 -484707 -418018 -388757 -423154 -343937 -493398 -511997 -373960 -273538 -381369
7830 -381369 -250861 -166551 -471412 -292793 -566062 -404025 -382147 -401579 -306684 -373865 -291192
7819 -291192 -259795 -324843 -395360 -329232 -458632 -251743 -228907 -202414 -204772 -220562 -322093
7808c22093j32006J86220j20067P3534q0879j5201o5250Q3802J2777j7760J76669
7797b20254j17005J8091j03820J19759q2246J26966m4172R2289L2885j89315m8775
7786d15597K33452j4114j02757p4685P1064j06075K2098J25169M3168n0264j44952
7775d13493J05559K81960k55856k8418j8021j4372K2506l8595L9017r4497L7125
7764c77085N042O7818O329m0580J27231j23900O4170r7109J56413J27157m7131
7753a31645m6091K941j80355J30462R4660j43756J36555j06433M0386j61991J74197
7742a91070j7600j14937J45261j94025J34990K8125l6709o0166M2727l1005N5781
7731b38628L4506M5654j41776j30774K29741J55348o9830j84608N8264O1194j31853
$$ plain form
7808 -322093 -454099 -267879 -387946 -314412 -395291 -410492 -475742 -391940 -379163 -396923 -220254
7797 -220254 -337259 -319168 -422988 -303229 -385475 -258509 -302681 -210392 -177507 -366822 -415597
7786 -415597 -182145 -196259 -299016 -373701 -302637 -408712 -386614 -261445 -218277 -268541 -413493
7775 -413493 -307934 -25974 -281830 -310248 -328269 -342641 -320135 -358730 -319713 -414210 -377085
7764 -377085 -372043 -304225 -297896 -338476 -211245 -335145 -270975 -368084 -211671 -84514 -131645
7753 -131645 -177736 -174795 -355150 -224688 -130028 -273784 -137229 -243662 -203276 -365267 -191070
7742 -191070 -208670 -323607 -178346 -372371 -237381 -209256 -245965 -306131 -263404 -294409 -238628
7731 -238628 -204122 -158468 -300244 -431018 -201277 -45929 -115759 -300367 -242103 -180909 -312762
7720c12762J26039k81684L84271J02723k84262K00143k63531J83130K6372l8633
7710a58194p8040J19634J98496k82974k6476k069J00555K3571O9113n8847j5808
7699a11039K52074k98255k0440Q273j10959n0908K73764m2569r8053N6302J12730
7688b9080j9499j04281O6656k5989L576j17723K38606j51034J68411l12205Q9360
7677a93202J55980n192N147L4349p9854J8111j40802L6922L20433m3670j55596
7666d7374K64635l07515j5689j47207J8106K89929j88575J14185j38733N1663
7656a06575K59164k15118q8588J04955J02107n6872Q9656p1656Q203J70965l29380
7645a33139J21518q0891l8897J75697J08469j08876l3306r2019J40762m928m0418
$$ plain form
7720 -312762 -186723 -468407 -84136 18587 -265675 -65532 -329063 -145933 -119561 -158194
7710 -158194 -236234 -116600 81896 -201078 -227554 -229623 -129068 -105497 -36384 -95231 -111039
7699 -111039 141035 -157220 -177660 -169387 -280346 -331254 -57490 -100059 -198112 -141810 -29080
7688 -29080 -48579 -152860 -86204 -112193 -108617 -226340 12266 -138768 29643 -282562 -193202
7677 -193202 -37222 -42414 -37267 -2918 -82772 -64661 -205463 -168541 151892 108222 -47374
7666 -47374 217261 -90254 -105943 -253150 -235044 54885 -133690 -19505 -158238 -106575
7656 -106575 152589 -62529 -151117 -46162 55945 -927 88729 17073 25276 196241 -133139
7645 -133139 -11621 -92512 -131409 44288 152757 43881 10575 -81444 59318 54390 13972
7634A3972J85214k28581J23992n750L7051P782p4455K4493m1013q1578J15367
7623G6494j87396K09260o3061Q2811k1189J67283l34737J75261L0697K6933J09747
7612B72103j77160R1298J32173l26950L27612j51725J02264Q0002k18434K85293
7602D16476j23136l9748n0357K13332k68536q7800K22889k2849J5424m2028l3230
7591B00437j99952K40633m2905n2444J20455n4930o2851J95602k89703K40143
7581B94485j58319M2183J31519J16766j77765l6415J91551k4395j31977l6399
7571B11234J08295P7496j02696l6737O1651J64714j18205r4548J51166j70421
7561B51949K4694K47299k57194j68902K18987J04125J05914j64926J76405o783
$$ plain form
7634 13972 199186 -29395 94597 88847 125898 133680 59225 83718 42705 -38873 76494
7623 76494 -110902 98358 35297 118108 96919 264202 -70535 104726 135423 162356 272103
7612 272103 94943 186241 318414 -8536 319076 167351 269615 349617 131183 416476
7602 416476 293340 253592 203235 416567 148031 60231 283120 260271 275695 233667 200437
7591 200437 485 241118 198213 145769 266224 211294 148443 344045 54342 294485
7581 294485 136166 178349 309868 426634 248869 212454 404005 379610 247633 211234
7571 211234 319529 397025 294329 257592 319243 483957 365752 271204 422370 251949
7561 251949 276643 523942 266748 97846 316833 420958 526872 361946 538351 531568
7551E31568j70972K28324l27629M4922K87316p0332j2272m5641j20576J71798
7541E16506N5225M7646k34238J97011j23635J33902Q0112k03238L5078J71265
7531F75634j13243k0742o0611J12847O2923m3402k2100j41337J40523n9721J33977
7520F64748q5273J23225m4478j6075j19563J18224P2124p0723R6259p194k36888
7509D94386J60776k607J92934k06699n8795o8595L6647q060O4175O4274J50677
7498H19113j33357J40317r1940L3922q9012J83800q0715j65335k1403K44829K1321
7487H61540j59942j3929R1157O2471k8727k40346J29818J03243j70980J03474
7477G37779R5969k80054K51129j23011k6798K92654j22860k1176j60544k0138
$$ plain form
7551 531568 360596 588920 261291 306213 593529 523197 510925 465284 344708 516506
7541 516506 571731 619377 385139 582150 458515 592417 672529 469291 504369 675634
7531 675634 562391 541649 481038 593885 656808 613406 591306 449969 590492 530771 664748
7520 664748 579475 702700 658222 642147 522584 640808 712932 642209 738468 731274 494386
7509 494386 655162 652555 845489 638790 579995 511400 548047 539987 604162 668436 819113
7498 819113 685756 826073 734133 768055 679043 862843 782128 616793 595390 840219 861540
7487 861540 701598 687669 778826 841297 812570 572224 702042 805285 634305 737779
7477 737779 833748 553694 804823 681812 655014 947668 824808 803632 643088 622950
7467F22950J21653j5335J45647J53522l18206O9157J36013J48068k25035j41693
7457F96741J99078k37263J31220J00193J28709j28913O6721J54195l85118K65532
7447I91095q2469n2941q7460J22327M5271J27319k23365R514j330J49851j36625
7436H61187O110J04144R7677m2471q9093P8475j5830K1809L7318K6800r6224k8104
7424I61798J21844R2924l32439J46137J92808r1400Q078J59751j27569k0511M0550
7413A151971O1576p8716j52964J00491m3724J05746K0566j68793K76304k16255
7403A056202K01946r8749n3531K09823j93886Q6354o6077K01862k08171N6852
7393A192625N9860j2809j68057J13469m1070J35949N433o4930K06935r6603N8094
$$ plain form
7467 622950 744603 729268 874915 1028437 710231 779388 915401 1063469 838434 696741
7457 696741 895819 658556 789776 889969 1018678 889765 956486 1110681 725563 991095
7447 991095 908626 855685 768225 890552 935823 1063142 839777 849291 847961 997812 861187
7436 861187 867297 971441 1069118 1026647 937554 1016029 1000199 1022008 1059326 1086126 989902 961798
7424 961798 1083642 1176566 844127 990264 1183072 1091672 1099750 1259501 1131932 1111421 1151971
7413 1151971 1213547 1134831 981867 1082358 1038634 1144380 1164946 996153 1272457 1056202
7403 1056202 1258148 1159399 1105868 1315691 1121805 1208159 1142082 1343944 1135773 1192625
7393 1192625 1252485 1239676 1071619 1185088 1144018 1279967 1285400 1220470 1427405 1330802 1388896
7382A388896R9973j78562L9101M0381j95071K3556M1005n8747J57517K9505J52774
7371A540328l85517J30115r9398J20303J8689k37385L53539j87336O5826k13245
7361A105919J52664L088L7792p1828N5003l9808J46413n1324j1331j99371O1260
7350A188477K53501o2068j18708J06066j13209N2788N1994L318O0831M6161o7868
7339A401283j97058N4915K09772j70532J60979r4479j32175R7516j36201J28616
7329A322636l0745l0086Q2016j45620k11928L20355M4639J69149l71720P7561
7319A226257M1494m419p6291J53512j71956K05029k8033j14237M4105p595P1774
7308A339640J8081j9829m2706j04816J16608L7610j07374K2935N6578p8500K1111
$$ plain form
7382 1388896 1488869 1310307 1349408 1389789 1194718 1218274 1259279 1200532 1358049 1387554 1540328
7371 1540328 1154811 1284926 1185528 1305831 1324520 1087135 1440674 1253338 1319164 1105919
7361 1105919 1258583 1261671 1299463 1227635 1282638 1242830 1389243 1337919 1326588 1127217 1188477
7350 1188477 1441978 1379910 1261202 1367268 1254059 1306847 1358841 1362159 1422990 1469151 1401283
7339 1401283 1204225 1259140 1468912 1298380 1459359 1364880 1232705 1330221 1194020 1322636
7329 1322636 1291891 1261805 1343821 1198201 986273 1306628 1351267 1520416 1148696 1226257
7319 1226257 1267751 1263332 1187041 1340553 1168597 1373626 1345593 1231356 1275461 1267866 1339640
7308 1339640 1357721 1337892 1295186 1190370 1306978 1344588 1237214 1260149 1316727 1238227 1259338
7297A259338R4324M8419l21881K23035j18488K18007J07676l7382l18135L9338
7287A194251N9877J23708j64226L21564l26701r356J52592j57325l2180R6110
7277A258314K17811r9558j32871Q5883J06413r7025P3320k30218J81796m3890
7267A319975n8450J24222K03361k70025n6668L32725l04685P7903j44892j4019
7257A209447J84274K0591j09609R7862J6410P5038j36651K1667K8210R3358q6341
7246A414256J34622l09737j738J84151j26016J67784o5101Q7063r58j24423p6562
7235A283341J64677O4477n5809J04556j0430r0434M7050q7127Q8848l3862r4203
7224A381084J01786R4053R720p6746J76623j98308J4190n4639J95698j45682O5452
$$ plain form
7297 1259338 1353662 1402081 1080200 1303235 1184747 1402754 1510430 1473048 1154913 1194251
7287 1194251 1254128 1377836 1213610 1535174 1208473 1199117 1351709 1194384 1162204 1258314
7277 1258314 1476125 1376567 1243696 1329579 1435992 1338967 1412287 1182069 1363865 1319975
7267 1319975 1261525 1385747 1589108 1319083 1262415 1595140 1290455 1368358 1223466 1209447
7257 1209447 1393721 1414312 1304703 1402565 1418975 1494013 1357362 1379029 1407239 1500597 1414256
7246 1414256 1548878 1239141 1237403 1421554 1295538 1463322 1398221 1485284 1484326 1359903 1283341
7235 1283341 1448018 1512495 1456686 1561242 1550812 1460378 1507428 1420301 1509149 1475287 1381084
7224 1381084 1482870 1576923 1586643 1509897 1686520 1488212 1502402 1447763 1643461 1497779 1563231
7213A563231J71496j61325N0531J17204j24027o3888R0840J18442j68510K06021
7203A800015J08640k85791M5440M6879J33890k68259K43232j56678L1130K57854
7193A956352j81566m6206r0692K38786j14142J4826K07901j40585J41655r1046
7183A895283J85620p0414j33418l7707J71142n2886N4555M5954P5141K6638o6258
7172B093650r5106L11543l83746K36686l5151q9177J16569J57699q6434q708k7203
7161B190622J99575j37238J76051L3402m7646K14041p0957j98066O8288r8144
7151B329928K10208j28439L2948Q7774j10405O9257K65610O5246J4355Q8771j91390
7140B733863N8095j57192J12131Q9074l3274J77803j34470R3186N4724j23614
$$ plain form
7213 1563231 1734727 1573402 1623933 1741137 1617110 1553222 1644062 1762504 1593994 1800015
7203 1800015 1908655 1622864 1668304 1715183 1849073 1580814 1824046 1667368 1698498 1956352
7193 1956352 1774786 1728580 1637888 1876674 1762532 1777358 1985259 1844674 1986329 1895283
7183 1895283 2080903 2010489 1877071 1839364 2010506 1957620 2012175 2058129 2133270 2159908 2093650
7172 2093650 1998544 2310087 1926341 2163027 2127876 2038699 2155268 2312967 2226533 2217825 2190622
7161 2190622 2390197 2252959 2429010 2462412 2414766 2628807 2557850 2359784 2428072 2329928
7151 2329928 2540136 2411697 2444645 2532419 2422014 2491271 2756881 2822127 2836482 2925253 2733863
7140 2733863 2791958 2634766 2746897 2835971 2802697 2980500 2846030 2939216 2993940 2870326
7130B870326J24422j1561M5930J31432J48921k20770L64179k53363J35427J53741
7120C488684j41872J4698O8417Q0605j41601K06546M698J18680j52694N8987J46143
7109C751291N7184M9055M3354J5849p638J21821j40650K0700O9407J0277K58900
7098D249550K8930l9711J05988j9744J75019L0595l2108J97448j15518n3382K31077
7087D758144K10595p7931R2537k1375K28800r8744K34510k38844J40720O0936
7077E289348K07599j35672J90605J20551N4251J90811J6388K45998k19881O1207
7067F021205Q8181R6391J32148M6088J72886K8162N0253N6659L76146q6960q9448
7056F891711J35329L27015j9415J41291r1570J50633o1665J08502K60927J13576
$$ plain form
7130 2870326 2994748 2983187 3029117 3160549 3309470 3088700 3452879 3199516 3334943 3488684
7120 3488684 3346812 3361510 3429927 3510532 3368931 3575477 3580175 3698855 3546161 3605148 3751291
7109 3751291 3808475 3857530 3900884 3916733 3909095 4030916 3890266 3910966 3980373 3990650 4249550
7098 4249550 4278480 4238769 4344757 4325013 4500032 4530627 4498519 4695967 4580449 4527067 4758144
7087 4758144 4968739 4890808 4983345 4961970 5190770 5092026 5326536 5087692 5228412 5289348
7077 5289348 5496947 5361275 5551880 5672431 5726682 5917493 5933881 6179879 5959998 6021205
7067 6021205 6109386 6205777 6337925 6384013 6556899 6585061 6635314 6691973 7068119 6981159 6891711
7056 6891711 7027040 7354055 7334640 7475931 7384361 7534994 7473329 7581831 7842758 7956334
7046G956334J62706j18146K86456J48796J24527l9056O1311K59127M3710K10718
7036I096483J21286j43004L52337L2765p788L23897K20962j26281K01599p1615
7026A0000641K43202J91177n1077K55089J84122J18083N5779J75393Q459J82768
7016A1363636L08695L270K0388L42804l0239J73504P9590J93070p8568J38027
7006A2514177K95315R6988P9987J5569R0415J41376J44911q1222L00950L3241
6996A3631707K1905K33638j36620J84678J14256J21228J74815K65382j61365J76227
6986A4625851p6298K74312r8090K09562J38541j07038r9321j04004J7185J47916
6976A4928616k5952O251K68086N1635Q4312j99383j30891J34536n9685j0067K7847
$$ plain form
7046 7956334 8119040 8000894 8287350 8436146 8560673 8521617 8582928 8842055 8885765 9096483
7036 9096483 9217769 9074765 9427102 9459867 9452079 9775976 9996938 9870657 10072256 10000641
7026 10000641 10243843 10435020 10383943 10639032 10823154 10941237 10997016 11172409 11180868 11363636
7016 11363636 11672331 11675601 11695989 12038793 12008554 12182058 12261648 12454718 12376150 12514177
7006 12514177 12809492 12906480 12986467 13002036 13092451 13233827 13378738 13297516 13598466 13631707
6996 13631707 13653612 13887250 13750630 13935308 14049564 14170792 14345607 14610989 14449624 14625851
6986 14625851 14549553 14823865 14725775 14935337 15073878 14966840 14867519 14763515 14780700 14928616
6976 14928616 14902664 14908915 15177001 15228636 15312948 15113565 14982674 15117210 15057525 15047458 15075305
6965A5075305p887j3993o9210M9180k504q0643J02054j67849L3793j19069n0325
6954A4748852K6940J89022K6379k77410k6147j06374j11268j6955j05678k93566
6944A4053795j10098j0019k35829o74L0466k48331p5587j75575j13980j82674
6934A2931494r0684P990m418j74703j47503j38427K7107l21432m802j58121j27413
6923A1799088j11939N780j44639n5984j18087p4131q2569m3589k00199J06552
6913A1080283k07276J6469l52749k95632J9672j04179j71722P5058j96871n1663
6903I811390k34630M593l9297k40976q6152m8171k08739n5704j6559p116j98530
6892H680109M8618q5273k57908k0405k01701O8234O1955J22520K45383J82833
$$ plain form
6965 15075305 15067418 15053425 14984215 15033395 15030891 14950248 15052302 14884453 14918246 14799177 14748852
6954 14748852 14775792 14964814 14991193 14713783 14687636 14581262 14469994 14453039 14347361 14053795
6944 14053795 13943697 13933678 13697849 13697175 13727641 13479310 13403723 13228148 13114168 12931494
6934 12931494 12840810 12848800 12844382 12669679 12522176 12383749 12410856 12089424 12084622 11926501 11799088
6923 11799088 11687149 11692929 11548290 11492306 11374219 11300088 11217519 11173930 10973731 11080283
6913 11080283 10873007 10889476 10536727 10241095 10260767 10156588 9984866 10059924 9863053 9811390
6903 9811390 9576760 9581353 9542056 9301080 9214928 9166757 8958018 8902314 8885755 8878639 8680109
6892 8680109 8728727 8643454 8385546 8365141 8163440 8231674 8293629 8416149 8661532 8844365
6882H844365j85555m7687j28718l03194j29318j73406l22148J43897j78162l35019
6872G185055K85284k71593m6851q7324j0632j04410j47796J87690k70055P5922
6862F795290o1882N2463p9833K77818K30184L40279J171107O34202J64656q8094
6852I436190o94056j006715m25372n02154j35919l76461K419l68461l8111J4461
6842E905821j8604j65012o3718J60056j60373K1637M1575l71528J47560P8546
6832E575960J768j32035L33045M96102P50734J045830L12769k46493p09005p25808
6822F702867n72528l63797m58934j60887r5785j4485l77837q469k605j76984M5584
6811D516140j65517K42804o3105j42443j28622K4142K01523k45692J66203L1226
$$ plain form
6882 8844365 8658810 8611123 8482405 8179211 8049893 7876487 7554339 7698236 7520074 7185055
6872 7185055 7470339 7198746 7151895 7064571 7053939 6949529 6801733 6989423 6719368 6795290
6862 6795290 6733408 6785871 6706038 6983856 7214040 7554319 8725426 9359628 9524284 9436190
6852 9436190 8742134 7735419 7310047 6807893 6671974 6295513 6297932 5929471 5891360 5905821
6842 5905821 5887217 5722205 5658487 5818543 5658170 5679807 5721382 5349854 5497414 5575960
6832 5575960 5577728 5445693 5778738 6274840 7025574 8071404 8384173 8137680 7428675 6702867
6822 6702867 6130339 5766542 5307608 5146721 5050936 5036451 4658614 4650145 4647540 4470556 4516140
6811 4516140 4350623 4593427 4530322 4387879 4259257 4283399 4484922 4239230 4405433 4436659
6801D436659j88461K83201M03812m1236j55208k18558j35404k09196j92993m43798
6791C538818j3627R4758k03410M9143l48925K51181k89859K00187l59704K15852
6781C134414p4445m708l41612M96933l6990j93758l4338r8359J71451o5916r1942
6770B860730L8934j39711j38747K11522m6763P3523j11604q5498J11537J59004
6760B932927j37571j08696p2824P5540j35708R2795j04485j26960J9261o4102
6750B370177J18399j6755j85557O7056L4795l7424N2829K8161K8740j42852Q3249
6739B400818j5277n2363K7228J24073P284K662Q7555n0643j1792N1392N0446k00463
6727B420920q3438k76819K36499j57759J29777j18263J08408j48593l2570J13415
$$ plain form
6801 4436659 4248198 4531399 4935211 4893975 4738767 4520209 4384805 4175609 3982616 3538818
6791 3538818 3525191 3619949 3416539 3465682 3116757 3367938 3078079 3278266 2918562 3134414
6781 3134414 3059969 3055261 2713649 3210582 3173592 2979834 2945496 2847137 3018588 2952672 2860730
6770 2860730 2899664 2759953 2621206 2832728 2785965 2859488 2747884 2662386 2773923 2932927
6760 2932927 2795356 2686660 2613836 2689376 2553668 2646463 2541978 2415018 2434279 2370177
6750 2370177 2488576 2471821 2286264 2353320 2388115 2350691 2403520 2431681 2460421 2317569 2400818
6739 2400818 2385541 2333178 2360406 2484479 2491763 2494425 2581980 2531337 2519545 2570937 2621383 2420920
6727 2420920 2337482 2060663 2297162 2139403 2269180 2150917 2259325 2110732 2078162 2191577
6717B191577j402K6483j569j10286P1229k8821j44145J80593o9030N5322K02430
6706B372381N7155K47171j84073K0553j33003j5311j43251k9424p1502q2264J62742
6695B201174l13135K06709j42799p0850J25416Q1103j47761M913j48779N8259
6685A854250P3054K08959k77515o177J65993n1561M02015r5835K31470m0320j08788
6674B355545p8495j55473j76353j65693K01239r3542k8900l19151L19941k34819
6664A624299P2215m9685l7311J02543k85794N0896N4173L1373r4148K16158K6411
6653A711130n6881K2805j7028M9397Q5589J0889r7337R8189j58959p3660J03997
6642A678131J47854k15869J51905k77749O8176M4143j6624q6285p2915K4460K20204
$$ plain form
6717 2191577 2190175 2216658 2215089 2104803 2176032 2147211 2003066 2183659 2114629 2169951 2372381
6706 2372381 2429536 2676707 2492634 2513187 2380184 2364873 2221622 2192198 2120696 2038432 2201174
6695 2201174 1888039 2094748 1951949 1881099 2006515 2087618 1939857 1944770 1795991 1854250
6685 1854250 1927304 2136263 1858748 1852571 2018564 1967003 2369018 2273183 2504653 2464333 2355545
6674 2355545 2277050 2121577 1945224 1779531 1980770 1887228 1858328 1539177 1859118 1624299
6664 1624299 1696514 1646829 1609518 1712061 1426267 1477163 1531336 1562709 1468561 1684719 1711130
6653 1711130 1654249 1677054 1660026 1709423 1795012 1805901 1708564 1806753 1647794 1574134 1678131
6642 1678131 1825985 1610116 1762021 1484272 1552448 1596591 1579967 1493682 1420767 1445227 1665431
6631A665431j46529P6133J16149l16382Q8072j2007O2475O3712k2357q733j07470
6620A458494j67511L12602j76656K8754J45403k4182m0253j22475K52004J27604
6610A793784j94954K44832j75673P5582j64255J87890k03125R3492o8710J67344
6600A756207o8589L6610O5032j97342j78739K25804L0494M7901j28561k1914j01417
6589A465486J48924p8590L18276j41468j47269J15924J56556L65085J16288O2581
6579B381793k67941r5577j72107j35428m2262J60650q3522j5199K14273j80611
6569A764069J09726j22275K20728p8084K4851M4340K1499L81322M72222J132096
6559C970494O14536l3035k75285n23316m02793j41557j32963j65135l31391k23799
$$ plain form
6631 1665431 1518902 1595035 1711184 1394802 1482874 1470867 1533342 1597054 1574697 1565964 1458494
6620 1458494 1290983 1603585 1426929 1455683 1601086 1576904 1536651 1414176 1666180 1793784
6610 1793784 1598830 1843662 1667989 1743571 1579316 1767206 1564081 1657573 1588863 1756207
6600 1756207 1687618 1724228 1789260 1591918 1413179 1638983 1669477 1717378 1588817 1566903 1465486
6589 1465486 1614410 1535820 1854096 1712628 1565359 1681283 1837839 2202924 2319212 2381793
6579 2381793 2113852 2018275 1846168 1710740 1668478 1829128 1745606 1730407 1944680 1764069
6569 1764069 1873795 1751520 1972248 1894164 1919015 1963355 1984854 2366176 2838398 3970494
6559 3970494 4585030 4551995 4276710 3753394 3350601 3209044 3076081 2910946 2579555 2355756
6549B355756j08021o3901k50513K68715j05631Q2775n3213k8598J08031Q8668
6539B294068j57123K03910P7396L38195K11537P40283J478373K436858K188797
6530I812294M61600j496309j684594j524368p38308p52069n42590l78758l70121
6521B786777k45646J07568j44957j07593k29176J6228j49902J86832j14918L39704
6511B444917O6390Q6870J79762J25522J25653M95026J322678K325994K511329
6502I684141J056145q25152k163503j550075j224608r07370m82815o79247j90831
6493B716685k81339k35791J68105o2378j57346L04252l79893J56035j03579j55546
6483A969205K99949O818L9543L29030r8155N0161M03886O02393R51954L62728
$$ plain form
6549 2355756 2247735 2183834 1933321 2202036 2096405 2179180 2125967 2097369 2205400 2294068
6539 2294068 2136945 2340855 2418251 2756446 2967983 3708266 5186639 7623497 9812294
6530 9812294 10273894 8777585 7092991 5568623 4830315 4078246 3535656 3156898 2786777
6521 2786777 2541131 2648699 2503742 2396149 2166973 2183201 2033299 2220131 2105213 2444917
6511 2444917 2511307 2598177 2777939 2903461 3029114 3524140 4846818 7172812 9684141
6502 9684141 10740286 9915134 7751631 6201556 4976948 4069578 3586763 2907516 2716685
6493 2716685 2435346 2199555 2367660 2305282 2147936 2452188 2072295 2228330 2124751 1969205
6483 1969205 2269154 2275972 2315515 2644545 2546390 2596551 3000437 3602830 4554784 4917512
6473D917512q2158p61349m28779o11705j98612k94514m7415m20761R6614k4002
6463B144831k38934J19525L0630K6112n2351j44921m4330Q5417j19481R4396R7198
6452A998092r1390k21919J93660o3348J83312j54471J16743j73721J18021o5233
6442A839746J03145j33329K18657j47133J73830j34344J55289K76158l20563J15522
6432B146978N2201j16211K65546m16444K61423r4105J88448r6067k46694K23305
6422B168380K9666m3223J10043L8806k9166J85501o5901J53698J3166j70479K07796
6411B598287Q4905K11653j19450m8939M0309n9284J90041k24789o0403J26932
6401B739262j02193q8860K51932l2620l9876J29449k01784P046K52613k05161
$$ plain form
6473 4917512 4835354 4074005 3645226 3033521 2834909 2540395 2492980 2072219 2168833 2144831
6463 2144831 1905897 2025422 2056052 2082164 2029813 1884892 1840562 1925979 1806498 1900894 1998092
6452 1998092 1906702 1684783 1878443 1815095 1998407 1843936 1960679 1786958 1904979 1839746
6442 1839746 1942891 1809562 2028219 1881086 2054916 1920572 2075861 2352019 2031456 2146978
6432 2146978 2199179 2082968 2348514 1932070 2193493 2099388 2287836 2191769 1945075 2168380
6422 2168380 2198046 2154823 2264866 2303672 2274506 2460007 2394106 2547804 2560970 2390491 2598287
6411 2598287 2683192 2894845 2775395 2726456 2766765 2707481 2897522 2672733 2612330 2739262
6401 2739262 2637069 2548209 2800141 2767521 2727645 2857094 2655310 2662356 2914969 2709808
6391B709808K2601J11476J741j3226n3276R3705R3402j72010j71806J61080j95220
6380B588275Q6338j1303M8226j53016K47931j09648p4514Q740j5506P5487n1959
6369B639051j05115J37913p4852R9293k36482J71674J95030k09479R2585k32539
6359B477079Q6350K33654j86584J40879j14542O2939O5515j22418o7122K03014
6349B778764L5128O0377j02510P4500o6764n3451K80945j19350k38466L46951
6339B996124L9224o3797j3168j21932J27805n87O0657J19327j92137p7798L17632
6328C191350N9548J37817j52740Q5023N5003m4454j25489r9651L71797j69070
6318C309134j15097K22621n7610P5397j3036m243N1800J27037o2049K8831l7562
$$ plain form
6391 2709808 2732409 2843885 2845626 2832400 2779124 2872829 2966231 2794221 2622415 2783495 2588275
6380 2588275 2674613 2663310 2711536 2558520 2806451 2696803 2622289 2631029 2615523 2691010 2639051
6369 2639051 2533936 2671849 2596997 2696290 2459808 2631482 2826512 2617033 2709618 2477079
6359 2477079 2563429 2797083 2610499 2751378 2636836 2699775 2765290 2642872 2575750 2778764
6349 2778764 2813892 2874269 2771759 2846259 2779495 2726044 3006989 2887639 2649173 2996124
6339 2996124 3035348 2971551 2958383 2836451 2964256 2963669 3024326 3143653 2951516 2873718 3191350
6328 3191350 3250898 3388715 3235975 3320998 3376001 3331547 3206058 3106407 3478204 3309134
6318 3309134 3194037 3416658 3359048 3434445 3421409 3417166 3468966 3596003 3533954 3562785 3525223
6307C525223Q2576J20005K4934o5650k5116K30708K40230k26734K93619j44883
6297D054912O9320j22585J86877o7662J38515q6544J31539Q3345r2312M4l415
6286D292034L2376k9156L32663p9028P8285N8322J51437n3276K87724j05390M69710
6275E435701p1747j27621J03217j04817K04732Q5472q9183J5234K28888L9808
6265E719684J9777K06214J74940l3295j22369P6434L1350J48051K01875K74069
6255F696730M7538o1951K38665P2111L2707r9807K26632P5491J13377K61518K52815
6244G855826j4247K09042K62661J73682M5453K63353k09856J1119J02169K43995
6234H943197Q7615p3600L53583K16998N9062J55393J74629J14772K44763K82832
$$ plain form
6307 3525223 3607799 3727804 3752738 3687088 3661972 3892680 4132910 3906176 4199795 4054912
6297 4054912 4124232 4001647 4188524 4120862 4259377 4172833 4304372 4387717 4295405 4295449 4292034
6286 4292034 4324410 4295254 4627917 4548889 4627174 4685496 4836933 4783657 5071381 4965991 5435701
6275 5435701 5363954 5236333 5339550 5234733 5439465 5524937 5435754 5450988 5679876 5719684
6265 5719684 5739461 5945675 6120615 6087320 5964951 6041385 6072735 6220786 6422661 6696730
6255 6696730 6744268 6682317 6920982 6993093 7025800 6925993 7152625 7228116 7341493 7603011 7855826
6244 7855826 7841579 8050621 8313282 8486964 8532417 8795770 8585914 8597033 8699202 8943197
6234 8943197 9030812 8957212 9310795 9527793 9586855 9742248 9916877 10031649 10276412 10559244
6224A0559244J46483N21814Q1928M34249J10929M61258M57724N46878M49176O85370
6214A4455053P60576R09207P32772Q52090O52589N55036L26392j36333L1516K25622
6204A9364520l77798J07189K91496J68269L58370O19388Q04868O07513J025740
6195B2969555P49086P61172J047384N71622P63730O16665M77323L07419K50330
6186B8514286J52849J55766J25967K95117M7728J82607L60367P4817O53382P33030
6176C1295916P25440R26836J099324J206454J422188J459292J464834J542692
6168D1142976J251723J011299Q82334P84747R32489R39791J298836J131264J399650
6159E0775109J585930J802639K151902K053568K637962K645716K814187K927424
$$ plain form
6224 10559244 10705727 11227541 11309469 11743718 11854647 12315905 12773629 13320507 13769683 14455053
6214 14455053 15215629 16124836 16857608 17709698 18362287 18917323 19243715 19107382 19138898 19364520
6204 19364520 18986722 19093911 19385407 19553676 19912046 20531434 21336302 21943815 22969555
6195 22969555 23718641 24479813 25527197 26098819 26862549 27479214 27956537 28263956 28514286
6186 28514286 28667135 28822901 28948868 29243985 29291713 29474320 29834687 29909504 30562886 31295916
6176 31295916 32021356 32948192 34047516 35253970 36676158 38135450 39600284 41142976
6168 41142976 42394699 43405998 44288332 45073079 46005568 46945359 48244195 49375459 50775109
6159 50775109 52361039 54163678 56315580 58369148 61007110 63652826 66467013 69394437
6151F9394437L202894L302643L574793M265769M239744M830708N127866N767101
6143A03705955O662583P189525Q531960R176785J0877189J2294020J4155644J5836431
6135A88430092J7839563J9283171K0835017K1571781K0692513J9387374J6879760
6128C24919271J3558429R956273O091731K176645j416081m628074p513575j0115412
6120C33029207j2078533j3581323j4454537j4863468j4428592j4184110j3455279
6113B35983365j2414990j1795485j0973840r960067r478099q631067q161364p493770
6105A57074683p249113o555598o529818n902637n697219n822776n401317m754782
6097A09161423m720425m352329m202092l964222l717791l821049l256232l204055
$$ plain form
6151 69394437 72597331 75899974 79474767 83740536 87980280 92810988 97938854 103705955
6143 103705955 110368538 117558063 126090023 135266808 146143997 158438017 172593661 188430092
6135 188430092 206269655 225552826 246387843 267959624 288652137 308039511 324919271
6128 324919271 338477700 348433973 354525704 356702349 355286268 350658194 343144619 333029207
6120 333029207 320950674 307369351 292914814 278051346 263622754 249438644 235983365
6113 235983365 223568375 211772890 200799050 190838983 181360884 172729817 164568453 157074683
6105 157074683 149825570 143269972 136740154 130837517 125140298 119317522 113916205 109161423
6097 109161423 104440998 100088669 95886577 91922355 88204564 84383515 81127283 77923228
6089G7923228k707594k701159k373165k408545k243520j772697j889570j683322
6081F0143656j667680j564289j470970j392607j241109j452889j324866q90877
6073D9138369j299375q23123r70966j085215o35439o88204l48635p60405j172179
6064D1354828q77451j544150m50611r56690q48434p67872r87159m87148q12083
6055C3623230o32946o31246n94102n21136l47152n92998n60071k66406l96722
6046B9080451m51781m42002q9576l59683J15527k39220Q9816K46618j07806m25954
6036B7416390p19167k61140n58105m30431n20933k01005j68216n67257o5040l3257
6026B3891839M9501j47737l5341j12651N0318L29997m5745L38818O59956J407205
$$ plain form
6089 77923228 75215634 72514475 70141310 67732765 65489245 63716548 61826978 60143656
6081 60143656 58475976 56911687 55440717 54048110 52807001 51354112 50029246 49138369
6073 49138369 47838994 47015871 46044905 44959690 44324251 43636047 43287412 42527007 41354828
6064 41354828 40477377 38933227 38482616 37525926 36677492 35909620 34922461 34435313 33623230
6055 33623230 32990284 32359038 31764936 31243800 30896648 30303650 29743579 29477173 29080451
6046 29080451 28628670 28186668 28097092 27737409 27852936 27613716 27703532 27950150 27842344 27416390
6036 27416390 26697223 26436083 25877978 25447547 24926614 24725609 24557393 23990136 23925096 23891839
6026 23891839 23941340 23793603 23758262 23645611 23695929 24025926 23980181 24318999 24978955 26386160
6016B6386160K228784K265161J693452p97620j489613j871278j368489j318675
6008B5727882j088759q45157l35691m69312j55317k85172m8458p8375j66858J34029
5998B2388812j05424N3342J26967o4009K32231J15209L06307m1296K59715m7016
5988B3224838O2855j51059J14805O5301L2700J14641J51176L2352J88852L08529
5978B4144990K25142J12382K66691J10696Q68M30916J48185K47297L33789R525
5968B6030481N33356J90984L20801J41830O23977J40427M16675J17492L64499
5959B8880522M48003K08668N60528K69871N12042L82771K43657N40959O10448
5950C2657469K76493N31213O26939Q22152K67642N60436Q66709M79355O49278
$$ plain form
6016 26386160 28614944 30880105 32573557 31775937 30286324 28415046 27046557 25727882
6008 25727882 24639123 23793966 23458275 22988963 22833646 22548474 22500016 22421641 22254783 22388812
5998 22388812 22283388 22336730 22463697 22399688 22631919 22747128 23053435 23012139 23271854 23224838
5988 23224838 23287693 23136634 23251439 23316740 23349440 23464081 23615257 23647609 23836461 24144990
5978 24144990 24370132 24482514 24749205 24859901 24860769 25291685 25439870 25687167 26020956 26030481
5968 26030481 26563837 26754821 27075622 27217452 27841429 27981856 28398531 28516023 28880522
5959 28880522 29328525 29537193 30097721 30367592 30879634 31262405 31506062 32047021 32657469
5950 32657469 32933962 33465175 34092114 34914266 35181908 35742344 36609053 37088408 37737686
5941C7737686O97461N23021Q01256P66720P50484P85760Q79470Q26325P83948
5932D4552131Q33273J026438Q70871J054172J228964J216045Q79555J209611J181205
5923E4052265J318938J296935J193226J402531J524104J597680J293741J759055
5915F5438475J838980J569568J851533J803340K067855K020203J982209K200806
5907H0772969J963583K386847K502065K479665K663943K448216K705067K476504
5899A00398859K986180L066587L093054K743710L054526L154580L132173L282757
5891A24912426L208253L017306L140378L177246L003577K921175K915814K763615
5883A49059790K686153K478990K398100J822988K083415J599251J309467J019325
$$ plain form
5941 37737686 38435147 38958168 39759424 40526144 41276628 42062388 42941858 43768183 44552131
5932 44552131 45385404 46411842 47282713 48336885 49565849 50781894 51661449 52871060 54052265
5923 54052265 55371203 56668138 57861364 59263895 60787999 62385679 63679420 65438475
5915 65438475 67277455 68847023 70698556 72501896 74569751 76589954 78572163 80772969
5907 80772969 82736552 85123399 87625464 90105129 92769072 95217288 97922355 100398859
5899 100398859 103385039 106451626 109544680 112288390 115342916 118497496 121629669 124912426
5891 124912426 128120679 131137985 134278363 137455609 140459186 143380361 146296175 149059790
5883 149059790 151745943 154224933 156623033 158446021 160529436 162128687 163438154 164457479
5875A64457479M85477N61505j06517m02354m61347r76111j113387j514842j960387
5866A58969516j924599k237483k357929k747877k646925k993841k595337k925089
5858A38540436l293816k993650l136385l053927l102586l333298k911553k918955
5850A13796266l037126l042804k721689k985761k722286k650635k760060k520903
5842I1355002k585694k607745k246638k052256k302351j904811k108307j927459
5834G3619741j915307j925432j558776j972901j810988j524948j675308j601552
5826E9634529j552237j372319j328906j410897j067602j472090r64099j259801
5818D9206578r31049j145381q92352j173243p09508r08688r09805o89826j138468
$$ plain form
5875 164457479 164942956 165504461 165397944 164995590 164534243 163558132 162444745 160929903 158969516
5866 158969516 157044917 154807434 152449505 149701628 147054703 144060862 141465525 138540436
5858 138540436 135246620 132252970 129116585 126062658 122960072 119626774 116715221 113796266
5850 113796266 110759140 107716336 104994647 102008886 99286600 96635965 93875905 91355002
5842 91355002 88769308 86161563 83914925 81862669 79560318 77655507 75547200 73619741
5834 73619741 71704434 69779002 68220226 66247325 64436337 62911389 61236081 59634529
5826 59634529 58082292 56709973 55381067 53970170 52902568 51430478 50466379 49206578
5818 49206578 48275529 47130148 46237796 45064553 44355045 43446357 42536552 41846726 40708258
5809D0708258q00856p77714q46772p88778q21164q17415p27321q76139o03802
5800C3648297o10115o79721o37501l87249q83182l98214o05733l68192l85938
5791B8692452l45307n71862l57712k36630m02982k45791n54656l95127k28189
5782B5354196n03999n47273k09051n13229m13655o07723j61343m69765m23275
5773B1504883k54126l03445l68697l51926j8727m50011k38390j49399K2094l53447
5763A9038809J4683l9264j94129k33627l19916m50390l78706k69132k33148j57139
5753A6778041k74067l33864j42387k19855j1029m35968Q2076j07217l7840l88573
5743A4909317j12262j5163j21039k32646J45901l36132k749j52441j4781k46059
$$ plain form
5809 40708258 39907402 39129688 38282916 37494138 36672974 35855559 35128238 34252099 33648297
5800 33648297 33038182 32358461 31720960 31333711 30450529 30052315 29446582 29078390 28692452
5791 28692452 28347145 27775283 27417571 27180941 26777959 26532168 25977512 25582385 25354196
5782 25354196 24850197 24302924 24093873 23580644 23166989 22559266 22397923 21928158 21504883
5773 21504883 21250757 20947312 20578615 20226689 20207962 19757951 19519561 19370162 19392256 19038809
5763 19038809 19053492 19014228 18820099 18586472 18266556 17816166 17437460 17168328 16935180 16778041
5753 16778041 16503974 16170110 16027723 15807868 15796839 15360871 15442947 15335730 15297890 14909317
5743 14909317 14797055 14781892 14660853 14428207 14574108 14237976 14235227 14082786 14068005 13821946
5733A3821946k02708Q2559j1989j63164k0950j22936m0617K50205l09428O0229
5723A3343147q7070k30155J56993J415J34719j01434L1209p1768J62569j79296
5713A3160329j76209J47774K14897p7889l30831J25017P468J44712k12373L90250
5703A3393145n3809J66338Q6757J72889K49527K29216M25858m0429O02917O5164
5693A5297573K88912K36930J02456K78450K2729p4974j06507J67481l52914M1652
5683A5901788k48621P0649p5142o6205R1012k46139K70510M5174n729K50073J27407
5672A6114777M80791K14708M00231L94311O04720O35459N14921M21978N37844
5663B0319740M45264L75432M47805L29970K5608J28730k15281j33018J76385J2714
$$ plain form
5733 13821946 13619238 13701797 13689808 13526644 13505694 13382758 13342141 13592346 13282918 13343147
5723 13343147 13256077 13025922 13182915 13184330 13319049 13217615 13248824 13177056 13339625 13160329
5713 13160329 12984120 13131894 13346791 13268902 12938071 13063088 13070556 13215268 13002895 13393145
5703 13393145 13339336 13505674 13592431 13765320 14014847 14244063 14669921 14629492 15232409 15297573
5693 15297573 15586485 15823415 15925871 16204321 16227050 16152076 16045569 16213050 15860136 15901788
5683 15901788 15653167 15723816 15648674 15582469 15673481 15427342 15697852 15743026 15737297 15987370 16114777
5672 16114777 16595568 16810276 17210507 17604818 18209538 18844997 19359918 19781896 20319740
5663 20319740 20765004 21140436 21588241 21918211 21943819 22072549 21857268 21724250 21900635 21913349
5653B1913349j51694L12801K8130M71175K32888M97637P22108O26494Q61282P86234
5643B6300404O11039Q23036J107430P75342J073167J140784R93106J481078J499551
5634C5804937J376084K216573J916360K456198K540646K726641L448189M335933
5626E6821561M397041N138531N385034N895947N935317N335069M693488L175911
5618I6777899K389611Q35574m29869j268441k054444k187709k092644k149370
5610H9820607j611559j873807j512469j077444o23489P051O09126J415667K393704
5601H7547387L256615M111882N502276O522423Q020048R516454J0657773J2010191
5593A47145049J2155636J2638425J1297170R444252O024435K553758p84824m501374
$$ plain form
5653 21913349 21761655 22074456 22102586 22573761 22806649 23304286 24026394 24652888 25514170 26300404
5643 26300404 26911443 27734479 28841909 29617251 30690418 31831202 32824308 34305386 35804937
5634 35804937 37181021 39397594 41313954 43770152 46310798 49037439 52485628 56821561
5626 56821561 61218602 66357133 71742167 77638114 83573431 88908500 93601988 96777899
5618 96777899 99167510 100003084 99573215 98304774 96250330 94062621 91969977 89820607
5610 89820607 88209048 86335241 84822772 83745328 83121839 83128890 83738016 85153683 87547387
5601 87547387 90804002 94915884 100418160 106940583 114960631 124477085 135134858 147145049
5593 147145049 159300685 171939110 183236280 192680532 198704967 201258725 200473901 195972527
5585A95972527p133865r013539r892957r854417r444177q145777o976735n564053
5577A29947007l879052k698560j099533N7255J161429K305010L354299L765859
5569A32913714M668302N004210N663376O332571O748507P679451P494714Q107727
5561A84612572P587248O685845N588325L607433K141002L88018p96538j608985
5553B08204920k094590k661279k096219j843664k018075j179814r95156m48723
5545A94867400K14105O08714J543555K288593L040423L733220M815236N201048
5537B16312294O377629O671155O882470P259163P237971O631128N681209M251440
5529B67304459K499610L31142j997638m072356o290445p848019q895282r686197
$$ plain form
5585 195972527 188838662 179825123 169932166 160077749 150633572 142487795 135511060 129947007
5577 129947007 126067955 123369395 122269862 122327117 123488546 125793556 129147855 132913714
5569 132913714 137582016 142586226 148249602 154582173 161330680 169010131 176504845 184612572
5561 184612572 192199820 198885665 204473990 208081423 210222425 210610443 209813905 208204920
5553 208204920 206110330 203449051 201352832 199509168 197491093 196311279 195316123 194867400
5545 194867400 195081505 195690219 197233774 199522367 202562790 206296010 211111246 216312294
5537 216312294 222689923 229361078 236243548 243502711 250740682 257371810 263053019 267304459
5529 267304459 269804069 270135211 268137573 264065217 257774772 249926753 241031471 231345274
5521B31345274j0228438r340139r278267q080359p323957n890595m433682l225426
5513A73544411k451850r48949L57307K12376J036172J805541J086567Q97866K39249
5504A75778690o00217j929294l351449m444472n933398p051236p548855p982602
5496A36937167p874230q020849p844241p048169o723634o210985n498384m993349
5488H2723326m440555m167469l276891l407865k977622k637269k463874j952608
5480E7399173k069897k162540j278140j721497j442805j318219j035622j157960
5472D5212493j022273r57185j168188j114864r05685p40664j069476p69677p71257
5463C6693224q26325q49504l63858r20006l04070p34576n96813l02052n32655
$$ plain form
5521 231345274 221116836 211776697 202498430 194418071 187094114 181203519 176769837 173544411
5513 173544411 171092561 170143612 170500919 170713295 171749467 173555008 174641575 175539441 175778690
5504 175778690 175178473 173249179 169897730 165453258 159519860 152468624 144919769 136937167
5496 136937167 129062937 121042088 113197847 106149678 99426044 93215059 87716675 82723326
5488 82723326 78282771 74115302 70838411 67430546 64452924 61815655 59351781 57399173
5480 57399173 55329276 53166736 51888596 50167099 48724294 47406075 46370453 45212493
5472 45212493 44190220 43233035 42064847 40949983 40044298 39303634 38234158 37464481 36693224
5463 36693224 35866899 35017395 34653537 33733531 33429461 32694885 32098072 31796020 31263365
5454C1263365k44335m19031l62744j83890l18471m54253m38717j69492j33800
5445B8538632m45571l0373j39444k39682l9061k4556r2872Q9048j82456J45468
5435B7579133R2028L73452J81655K01871K08027N38214N36164Q01614L07665Q48888
5425C1668711R11660R65185J094598R82822J257093J607844J448685J828162J875333
5416D3640093K146643K438063K690066K500684K898786K710052L154483L046137
5408F5225007K637993K803885K454887K101997J750849J657138J131453R52255
5400H0715464O06834J094391N63625P29569J211414J117943J722098J984813K592078
5391I2338229K772650L556205L600484M087066M363263M327623M327800M156668
$$ plain form
5454 31263365 31019030 30599999 30237255 30053365 29734894 29280641 28841924 28672432 28538632
5445 28538632 28093061 28062688 27923244 27683562 27644501 27619945 27527073 27616121 27433665 27579133
5435 27579133 27671161 28044613 28226268 28428139 28636166 29174380 29710544 30512158 30819823 31668711
5425 31668711 32580371 33545556 34640154 35622976 36880069 38487913 39936598 41764760 43640093
5416 43640093 45786736 48224799 50914865 53415549 56314335 59024387 62178870 65225007
5408 65225007 67863000 70666885 73121772 75223769 76974618 78631756 79763209 80715464
5400 80715464 81322298 82416689 82980314 83709883 84921297 86039240 87761338 89746151 92338229
5391 92338229 95110879 98667084 102267568 106354634 110717897 115045520 119373320 123529988
5383A23529988L491136K871548K189050J452444K64263n31286j646732k079227
5375A29541184k991889l041760l511133l496707l305650k928718k883452k814328
5367A04567547k126017j922387j730781j372868j386658j390563j174952j212617
5359I2250704j686093j728251k200099k530961k792736l061736l319929l337666
5351G1593233l683546l322882l685369l600808l305958k880035k919328k533166
5343D5662141k373492k352720k016150j829597j584767j672694j269921j196837
5335C1365963j156819r29695o53927r66652p57410p66421m24503o86901l41184
5326B4682451l85273p4191j56943K67309N16032J100501J969721J781036J771959
$$ plain form
5383 123529988 127021124 129892672 132081722 133534166 133798429 133267143 131620411 129541184
5375 129541184 126549295 123507535 119996402 116499695 113194045 110265327 107381875 104567547
5367 104567547 102441530 100519143 98788362 97415494 96028836 94638273 93463321 92250704
5359 92250704 90564611 88836360 86636261 84105300 81312564 78250828 74930899 71593233
5351 71593233 67909687 64586805 60901436 57300628 53994670 51114635 48195307 45662141
5343 45662141 43288649 40935929 38919779 37090182 35505415 33832721 32562800 31365963
5335 31365963 30209144 29279449 28625522 27658870 26901460 26135039 25710536 25023635 24682451
5326 24682451 24297178 24222987 24066044 24333353 24849385 25949886 27919607 29700643 31472602
5317C1472602M32282k94085o723J176857K918795L860621L563194Q62426r24112
5308D3061857j888834l92566J857311L926012M565647J482124k529270m173630
5300D5908651l809770j936354L48829J366016K4238j882539l684264m185637l049993
5291B9099177j669552o53088p25905j122776k276885k491633j985611j919187
5283A6254540j380614j167058r33020n39901m75251m22045l98418m05295l32467
5274A0200471k28855j16423r5044k60371k81338r5827m55584k9769k89944l1872
5264H315444j38423m36426L54269o05237j1313m23657O2525j09887O2389m05577
5254F664107R5291k50097Q7636j78385q8588J04349l58030N7272m790k93791J4134
$$ plain form
5317 31472602 31904884 31610799 31604076 32780933 35699728 39560349 43123543 43985969 43061857
5308 43061857 41173023 40780457 42637768 46563780 51129427 52611551 50082281 45908651
5300 45908651 42098881 40162527 40511356 41877372 41901610 40019071 36334807 32149170 29099177
5291 29099177 27429625 26776537 26050632 24927856 22650971 20159338 18173727 16254540
5283 16254540 14873926 13706868 12773848 12233947 11758696 11336651 10938233 10532938 10200471
5274 10200471 9971616 9855193 9760149 9499778 9218440 9122613 8667029 8637260 8347316 8315444
5264 8315444 8177021 7740595 8094864 7489627 7478314 7054657 7117182 7007295 7069684 6664107
5254 6664107 6759398 6509301 6596937 6418552 6329964 6434313 6076283 6133555 6128765 5834974 5849108
5243E849108n0448j26139k87288K41444n018l09295L8154p6911k1567k44098K05953
5232E213895l39644J01587j77438r6719M6895q4529k31180n5054r4297K21991
5222D505507j45145N5706j74659P827R1069j11660j7414O037o5101M7375j58883
5211D040659P2703j61291J27668k26755r3768J45030k77397l4352j69676m5751
5201C377070j62402P6884r4193j1161M1854J15549l22394L58394j86814k49893
5191B942894K55488k56613J97369j84178J26756q9503j0209l4454o900M6027j9979
5180B966698m6540k22594Q5153k92247J74755q7027m06m3177J60707j34944K8717
5169B589095j58496J59041j82877J9689k46427J19429K24329j12004R2799n7681
$$ plain form
5243 5849108 5798660 5672521 5385233 5626677 5621659 5312364 5350518 5273607 5252040 5007942 5213895
5232 5213895 4874251 4975838 4798400 4701681 4748576 4664047 4432867 4377813 4283516 4505507
5222 4505507 4360362 4416068 4241409 4249236 4340305 4228645 4211231 4217268 4152167 4199542 4040659
5211 4040659 4113362 3952071 4079739 3852984 3759216 3904246 3626849 3592497 3422821 3377070
5201 3377070 3214668 3291552 3197359 3186198 3228052 3343601 3021207 3379601 3192787 2942894
5191 2942894 3198382 2941769 3139138 2954960 3081716 2992213 2982004 2947550 2940650 2986677 2966698
5180 2966698 2920158 2697564 2782717 2490470 2665225 2578198 2577792 2534615 2695322 2560378 2589095
5169 2589095 2430599 2589640 2406763 2426452 2180025 2299454 2523783 2411779 2504578 2446897
5159B446897J30076j44564O2031K0499j53004J42343J639N2939j92744o106K11147
5148B571153j05405K13917j06728K14885l92331J29182j16909J77707n7476j69267
5138B358728N7778r8054J11070j76409J80435J79632j26993j35637l0126J66713
5128B487137k7293j65840m4632L45742l3698Q214l9576j22290O237K63322k32814
5117B444509K62913j47399j78374K38354k42646J17613j13285O3690N224P6139
5107B526738j13557j21760M14944l84045K34616p0565k2455K12495j64981o2646
5097B448784k40424K79173M9684j15780m4199J68472l4080p961p771J87394k01359
5086B481933J67793j86850M424K48266j49364M5397Q9907K44494k71516K13927
$$ plain form
5159 2446897 2576973 2432409 2494440 2514939 2361935 2504278 2505917 2558856 2366112 2360006 2571153
5148 2571153 2465748 2679665 2572937 2787822 2395491 2524673 2407764 2585471 2527995 2358728
5138 2358728 2416506 2318452 2429522 2253113 2433548 2613180 2486187 2350550 2320424 2487137
5128 2487137 2459844 2294004 2249372 2595114 2561416 2569630 2530054 2407764 2414001 2677323 2444509
5117 2444509 2707422 2560023 2381649 2620003 2377357 2494970 2381685 2445375 2450599 2526738
5107 2526738 2413181 2291421 2706365 2322320 2556936 2486371 2463916 2676411 2511430 2448784
5097 2448784 2208360 2487533 2537217 2421437 2377238 2545710 2511630 2503669 2495898 2683292 2481933
5086 2481933 2649726 2462876 2467300 2715566 2566202 2611599 2701506 2946000 2674484 2888411
5076B888411K1064k7419J49516j23977j7215J97749J29737J12840j9876L0503
5066C341333n0027J77245J54990o8176J21166J75186R2870J94508r2707M56762
5056D503150j26915K05528M0224j84216O9212p8568j7361P1439J9055K21331j09510
5045D613369K93294O9233r5712Q0394K94827J16286P3760K11985L7250K53438
5035E948124j06062K25645N17417M18342L83265K35372K67894P47174K89052J91853
5025I118076K88326j68984l84082j89333j08682k90253l4623M3179J73976O5413
5015H513013M52173j63864K67066L70940J48556K17426K75249L36071M08181L90325
5005A1215136O50010N19339R26733O82600Q66878J006454J226108J086085J356525
$$ plain form
5076 2888411 2909475 2882056 3031572 2907595 2890380 3088129 3217866 3330706 3310830 3341333
5066 3341333 3291306 3468551 3623541 3555365 3676531 3851717 3944587 4139095 4046388 4503150
5056 4503150 4376235 4581763 4621987 4437771 4506983 4428415 4411054 4482493 4501548 4722879 4613369
5045 4613369 4906663 4975896 4880184 4960578 5255405 5371691 5445451 5657436 5694686 5948124
5035 5948124 5842062 6067707 6585124 7003466 7386731 7622103 7889997 8637171 8926223 9118076
5025 9118076 9406402 9237418 8853336 8664003 8555321 8265068 8230445 8273624 8447600 8513013
5015 8513013 8965186 8801322 9068388 9439328 9587884 9805310 10080559 10416630 10824811 11215136
5005 11215136 11865146 12384485 13311218 13993818 14860696 15867150 17093258 18179343 19535868
4996A9535868J472700J063559J039592Q77881J295175J188883J705568J580906
4988B9760132J670205J461797J093933N90453K82094j73824m21447p69523o48820
4979C2845000m94775l11151k25888J14140M21713P93231P43483J076533J552552
4970C6514838K026681K106525K476954L069182L103038L450016L686747M546004
4962F0979985M799081N408525N341902N297993M648068K910452J937416j12963
4954I1210459j687009k949879l830786l881428l879724l723937l140117k602127
4946F5515452j760024j599571o15330l95160m0132P72541J054401J881837K149361
4937F6963375K938370L542948M252374M804354N651598O368162O431279O298270
$$ plain form
4996 19535868 21008568 22072127 23111719 23989600 25284775 26473658 28179226 29760132
4988 29760132 31430337 32892134 33986067 34576520 34858614 34684790 34263343 33493820 32845000
4979 32845000 32350225 32039074 31813186 31927326 32349039 33142270 33885753 34962286 36514838
4970 36514838 38541519 40648044 43124998 46194180 49297218 52747234 56433981 60979985
4962 60979985 65779066 71187591 76529493 81827486 86475554 89386006 91323422 91210459
4954 91210459 89523450 86573571 82742785 78861357 74981633 71257696 68117579 65515452
4946 65515452 63755428 62155857 61540527 61145367 61105235 61877776 62932177 64814014 66963375
4937 66963375 69901745 73444693 77697067 82501421 88153019 94521181 100952460 107250730
4929A07250730N694899M093553K476386k97049k434698m203239o071932o676146
4921I9832504o832244o411440n689833n216765m235991l606954k791526k296041
4913F2751710j958728j153025o69750o59357k01470P55813O03233J438225J775664
4904F2682315K450375K762601L244676L288658L315839K611145J766770M52775
4896H2575154j042159p57344J312186O243034P444207O19791j0066015j2859282
4888G3469572j0873959q522559n930869m673354l657276k683731k060958j685799
4880C3381067j071074j172730o00540p08596l21985l85357j4387N6368R4807K13324
4870B9470897P5153R3388K36152m36167p29957q58866j235584j200316j255251
$$ plain form
4929 107250730 112945629 117039182 119515568 119218519 116783821 112580582 106508650 99832504
4921 99832504 93000260 86588820 80898987 75682222 71446231 67839277 65047751 62751710
4913 62751710 60792982 59639957 58970207 58310850 58109380 58865193 59468426 60906651 62682315
4904 62682315 65132690 67895291 71139967 74428625 77744464 80355609 82122379 82575154
4896 82575154 81532995 80775651 82087837 88330871 95775078 96394869 86328854 73469572
4888 73469572 62595613 54073054 48142185 43468831 39811555 37127824 35066866 33381067
4880 33381067 32309993 31137263 30536723 29828127 29506142 29120785 29106398 29162766 29257573 29470897
4870 29470897 29546050 29639438 29875590 29439423 28709466 27850600 26615016 25414700 24159449
4861B4159449j391286j305644j083283j093335p65283q56649o06492m48421n96699
4852A6012357m19261n70216j79580m92452n7306k80366k220k59274m8597j44127
4842A3558958R279k41498o3386J00318j02620J86245J00771O3625O93416J526549
4832A5831657J496141J055145j77689r81484j167467o95670k85372m15608R2256
4823A4751909l0605J12467M60672k321K73743L73123L11550P22717O12798O34713
4813A8220766R12286P73884Q23845J280135R63584R96831J090412J262960R20090
4804B7244793R25109R17008J137978J048614Q27450R81918J022947Q90946J357648
4795C6354411J147345J600455J652614J382705J563796J298252J214090J149495
$$ plain form
4861 24159449 22768163 21462519 20379236 19285901 18520618 17663969 17057477 16609056 16012357
4852 16012357 15593096 15022880 14843300 14350848 14293542 14013176 14010956 13751682 13703085 13558958
4842 13558958 13568237 13326739 13263353 13363671 13261051 13447296 13548067 13611692 14305108 15831657
4832 15831657 17327798 18382943 18205254 17223770 16056303 15360633 15075261 14659653 14751909
4823 14751909 14721304 14833771 15294443 15292122 15565865 15938988 16250538 16973255 17586053 18220766
4813 18220766 19133052 19906936 20730781 22010916 22974500 23971331 25061743 26324703 27244793
4804 27244793 28169902 29086910 30224888 31273502 32100952 33082870 34105817 34996763 36354411
4795 36354411 37501756 39102211 40754825 42137530 43701326 44999578 46213668 47363163
4787D7363163J119747J488870J585966J515080J802002J885220J714837J794201
4779F0269086J769786J774592K074446K188806K069803K603660K882047L013944
4771G8646170L752597L688938L734610L483852K456273J888551J332282R99949
4763I9983222O51637Q82143J080725J461394J508321K092107K082667J848655
4755A11590871J323329J663161J920243K810859L288938L533937L870548M580964
4747A34582850O037028P396150P885774Q276901P294121O487529N079084M371423
4739A87410860L047186J894078J225323J06742q48604j613552k484804k386906
4731A86350323k672363k054836j712897j379111j071743o39827j01684K49814
$$ plain form
4787 47363163 48482910 49971780 51557746 53072826 54874828 56760048 58474885 60269086
4779 60269086 62038872 63813464 65887910 68076716 70146519 72750179 75632226 78646170
4771 78646170 82398767 86087705 89822315 93306167 95762440 97650991 98983273 99983222
4763 99983222 100634859 101517002 102597727 104059121 105567442 107659549 109742216 111590871
4755 111590871 112914200 114577361 116497604 119308463 122597401 126131338 130001886 134582850
4747 134582850 140619878 148016028 155901802 164178703 171472824 177960353 183039437 187410860
4739 187410860 190458046 192352124 193577447 193684189 192835585 191222033 188737229 186350323
4731 186350323 183677960 181623124 179910227 178531116 177459373 176819546 176717862 176967676
4723A76967676Q33821J584848K248010K078298K428447K061275J093946N33161
4715A89829482m68937j483469k467014m097867m794314o561079p420638p878217
4707A54657947q142192p687090p031936o066550n222480m076784l781097k804530
4699A09845288k445083k281058j877861j466409j497681j498882j344565j422747
4691I6011002j104400r31488p72157r19731j394527j713779k502370k670880l209469
4682H0792201l139310l005006k849150k630364k593157k532438k391545k172423
4674E9478808k009033j996505k012230j785130j054208j668727j249237j444496
4666D6259242p25919j296152j004596q56421j389791j201214j559904j759763
$$ plain form
4723 176967676 177801497 179386345 181634355 183712653 186141100 188202375 189296321 189829482
4715 189829482 189360545 187877076 185410062 181312195 176517881 169956802 162536164 154657947
4707 154657947 146515755 138828665 131796729 125730179 120507699 116430915 112649818 109845288
4699 109845288 107400205 105119147 103241286 101774877 100277196 98778314 97433749 96011002
4691 96011002 94906602 93975114 93202957 92283226 90888699 89174920 86672550 84001670 80792201
4682 80792201 77652891 74647885 71798735 69168371 66575214 64042776 61651231 59478808
4674 59478808 57469775 55473270 53461040 51675910 50621702 48952975 47703738 46259242
4666 46259242 45533323 44237171 43232575 42376154 40986363 39785149 38225245 36465482
4658C6465482j420173j607170j014158j340185j073483j106782r80370j251356
4650B6671805j017285p97769j055190j010982p74049p71017r96715r89477r25576
4641A8333745r64289r17316p85775o83766p17412p43426m39390p07766l53824
4632A2020781n82169l93496l22048m57219k13613m27433j94046l12875l89375
4623H728507j20350j91591k86240l13929o5053l40110N4537k75336m75134N2227
4613F767528j95342q8232j18162k07523j46409j4081l76850J43401l32723k6213
4603E405394j09849j14288k82312j76511N3051M5427k57234j81624o5019p7543
4593D239492j64519p5789j17121l9914l2845Q1495k96786r8540l64O9252k43184
$$ plain form
4658 36465482 35045309 33438139 32423981 31083796 30010313 28903531 27923161 26671805
4650 26671805 25654520 24856751 23801561 22790579 22016530 21245513 20248798 19259321 18333745
4641 18333745 17369456 16452140 15666365 14982599 14265187 13521761 13082371 12374605 12020781
4632 12020781 11438612 11045116 10723068 10265849 10052236 9624803 9430757 9117882 8728507
4623 8728507 8608157 8416566 8130326 7816397 7751344 7411234 7465771 7190435 6715301 6767528
4613 6767528 6572186 6483954 6365792 6158269 6011860 5997779 5620929 5764330 5431607 5405394
4603 5405394 5295545 5181257 4898945 4722434 4775485 4820912 4563678 4382054 4317035 4239492
4593 4239492 4074973 3999184 3882063 3842149 3809304 3890799 3594013 3495473 3495109 3564361 3321177
4582C321177l218r0678J37928j00160j31868k04540N8512o4783j21770J11002
4572B911602p7042j43372J62154k57034j37955J81376j0567m5999n6664k6726
4562B499773j74446r966R5381k61535m6090J03765j25128k4368q2814K17275l59726
4551A832121K66252k71000n4553J49008M6594L5460k54193O5289J44517n7128
4541A902367p3743l672j5714q7049l5832Q4079k08761J95982l48061K6598J28249
4530A564443K17413l13253J3153Q8312j31241K8409k7350J53612j28259Q6860
4520A552099L0829N3593o2248L0592k3140k60483P8606J06045R4232r1998M2102
4509A550229q4262j29418R1816o6552J6475J48103r722p6526m8881O8594o1273
$$ plain form
4582 3321177 3317959 3227281 3365209 3265049 3133181 2928641 2987153 2922370 2800600 2911602
4572 2911602 2834560 2691188 2853342 2596308 2458353 2639729 2629162 2583163 2526499 2499773
4562 2499773 2325327 2315361 2410742 2149207 2103117 2206882 2081754 2057386 1974572 2191847 1832121
4551 1832121 2098373 1827373 1772820 1921828 1968422 2003882 1749689 1814978 1959495 1902367
4541 1902367 1828624 1824952 1809238 1722189 1686357 1770436 1561675 1757657 1409596 1436194 1564443
4530 1564443 1781856 1468603 1481756 1570068 1438827 1467236 1439886 1593498 1465239 1552099
4520 1552099 1582928 1636521 1574273 1604865 1581725 1321242 1399848 1505893 1600125 1508127 1550229
4509 1550229 1465967 1336549 1428365 1361813 1378288 1526391 1516669 1440143 1391262 1459856 1398583
4498A398583q221Q685j49630P1307J13395r5446M8395k2935Q7339j33219j70895
4487A147358J93795l2281J01720k8678p7296j2435j48785J31445L5181O0362j52076
4476A218310O4702O4196j33390O1015k9063L8268P6040K452k6028j85815J96605
4465A347292j80826j591K4032M498r8363J18278q2035J91020J2261j62250q4618
4454A087698Q2443L28652p2651k82787K7241L8997Q7820J0046j28922l8552M223
4443A144208J95101j71979j34948N3188P1902P3105n6365j3730n8927O7538j91985
4432I77108K86845l6525M8586o043j72646j37314K44891m8378r4499J48797N2047
4421A262869j5983j13645J06310O155p5199j04769j1083r0429J94713J5320K17617
$$ plain form
4498 1398583 1390362 1399047 1249417 1320724 1434119 1338673 1387068 1364133 1451472 1318253 1147358
4487 1147358 1341153 1308872 1410592 1381914 1304618 1292183 1143398 1274843 1310024 1370386 1218310
4476 1218310 1283012 1347208 1213818 1274833 1245770 1284038 1360078 1362530 1336502 1150687 1347292
4465 1347292 1166466 1164875 1188907 1193405 1095042 1213320 1131285 1322305 1334566 1172316 1087698
4454 1087698 1170141 1498793 1426142 1143355 1170596 1209593 1297413 1307459 1178537 1139985 1144208
4443 1144208 1339309 1167330 1032382 1085570 1157472 1230577 1174212 1160482 1101555 1169093 977108
4432 977108 1263953 1227428 1276014 1269971 1097325 960011 1204902 1156524 1062025 1210822 1262869
4421 1262869 1246886 1133241 1239551 1245706 1170507 1065738 1054655 964226 1158939 1174259 1391876
4410A391876k25951O7468N8844K84106k00909L6865k390J0644J60561m9229Q2911
4399A614796L863L8681J39210L8314j06505J0781r535m6092J01166J5765J92303
4388A992747J47169K41021J64782K06903M083j11854m9024j13791M7329k29115
4378B300250J18787q3815Q9895J4808J67495q8941L0302Q8219K54578p202L82327
4367C266703L1979K28306l5711l41741K21771j52468j88556N6681M87273K80373
4357C854610L18518J86361m38783j82575m19786J1934j02447k10373p550m5188
4347B964721J82199K352J8413N298K41817N2211K08495M33795M65294K7371j86544
4336D415422l19788k55195j00622j66500J1922o8899L12799J57530J36189j07562
$$ plain form
4410 1391876 1165925 1233393 1292237 1576343 1375434 1412299 1409909 1420553 1581114 1531885 1614796
4399 1614796 1618659 1657340 1796550 1834864 1728359 1739140 1729605 1683513 1784679 1800444 1992747
4388 1992747 2139916 2380937 2545719 2752622 2756705 2644851 2595827 2482036 2529365 2300250
4378 2300250 2419037 2335222 2425117 2439925 2607420 2518479 2548781 2637000 2891578 2884376 3266703
4367 3266703 3298682 3526988 3491277 3149536 3371307 3218839 3030283 3086964 3574237 3854610
4357 3854610 4173128 4359489 3920706 3738131 3318345 3330279 3227832 3017459 3009909 2964721
4347 2964721 3146920 3149272 3167685 3172983 3414800 3467011 3675506 4109301 4574595 4601966 4415422
4336 4415422 4095634 3840439 3739817 3573317 3585239 3516340 3829139 3986669 4122858 4015296
4326D015296K93151J06748L54097J964799L226490L217707L68233k084503k320222
4317I141796j804481j064054q94271n01072J1218m0778J02996m481J82236m5953
4307E083156k04638J48621J05574K52824L67981K16200M50990M11354L93588J12188
4297G337838k8038M45062K576051N492272O274146J914306m142448m834691l830192
4288A1204306k964358j875865j261860q28438p16458l34356k80937l00091r3322
4279B548621J8388N6075J11933k52371O1198l41050K83193k1080j75674J44959
4269B434192J93894M57714R41419K518577L296610J806532j507635k254558k160169
4260E726576j476530j100958l60083o45416j68416l82862M7081k12332K0026m0545
$$ plain form
4326 4015296 4308447 4415195 4769292 6734091 9960581 13178288 13546521 11462018 9141796
4317 9141796 7337315 6273261 5378990 4877918 4889136 4848358 4951354 4946873 5129109 5083156
4307 5083156 4878518 5027139 5132713 5385537 5753518 5969718 6420708 6832062 7225650 7337838
4297 7337838 7309800 7754862 10330913 15823185 22097331 24011637 19869189 15034498 11204306
4288 11204306 8239948 6364083 5102223 4273785 3557327 3222971 2942034 2641943 2548621
4279 2548621 2567009 2623084 2735017 2482646 2543844 2202794 2485987 2464907 2289233 2434192
4269 2434192 2628086 3085800 4027219 6545796 9842406 11648938 10141303 7886745 5726576
4260 5726576 4250046 3149088 2789005 2143589 1975173 1592311 1639392 1427060 1447086 1406541
4250A406541K82280j18364P7388k48930j76759o083k33069m9202j43220j16681
4240F73901m5420L7891J30394j21081K24620l09328j5333P8395j22577J07999
4230F39461k13319J02687m3860P2002k8963k79386L00780j31413K85009j28021
4220E74977J72003j50021m5529J14901j47960p6023m4200k9476M5326O1787N8541
4209E34326l1361J94718K70673M55806M75950N6322l60226m20755l68974l38729
4199D67750J2124j67769K2546o1885q1541J36553p5953K04578q6718j44627L6957
4188B62015r8960J17314O4711R819p746J4592J25815P3884M46081O00420J171991
4177B779936M64570n69232n01116o52193l91733m05286k06808j89622n0646K9100
$$ plain form
4250 1406541 1688821 1570457 1647845 1398915 1222156 1216073 983004 933802 790582 673901
4240 673901 628481 666372 796766 675685 900305 590977 575644 654039 531462 639461
4230 639461 426142 528829 484969 556971 528008 248622 549402 417989 702998 574977
4220 574977 746980 596959 551430 666331 518371 442348 398148 368672 413998 475785 534326
4209 534326 502965 697683 968356 1424162 1900112 1956434 1596208 1175453 806479 467750
4199 467750 479874 312105 334651 272766 191225 327778 251825 456403 369685 225058 262015
4188 262015 163055 280369 345080 354899 347153 361745 487560 561444 1007525 1607945 2779936
4177 2779936 3244506 2675274 2174158 1521965 1130232 724946 518138 328516 277870 306970
4167C06970O217n7720q9724k49680K29426J00635l5482r9481o1675J25473j05641
4156F9318m751J38230l6330J05806J82224N77963L94545M8729j90418n88951k16129
4145D80236o8195k25419k6830j13812N7666k17239K01853j79019J43872k9719
4135B3394q4323N8094O0578p7478m3607K05473o0972P0709j56173k54692K93733
4124C4736j87216P0156m6540M4214r0425J21992j33851Q0577P6462j7687o5027
4113a12609l44579L84156j93709P8248p7359J20734j18078K13575j52078J43568
4103e8131m4994p0785j47783L8966J89956R0174k03931j24833J85303j29036M6310
4092b28784N067J09055J3355l1956n473l4339P2047j81756J07605J34301j24394
$$ plain form
4167 306970 313187 255467 165743 -83937 145489 246124 210642 111161 49486 174959 69318
4156 69318 64567 202797 166467 272273 454497 1032460 1427005 1475734 1285316 696365 480236
4145 480236 412041 186622 159792 45980 103646 -113593 88260 -90759 53113 23394
4135 23394 -60929 -2835 57743 -19735 -63342 142131 81159 151868 -4305 -258997 34736
4124 34736 -152480 -82324 -128864 -84650 -175075 -53083 -186934 -106357 -29895 -47582 -112609
4113 -112609 -457188 -73032 -266741 -188493 -265852 -145118 -263196 -49621 -201699 -58131
4103 -58131 -103125 -173910 -321693 -282727 -92771 -2597 -206528 -331361 -146058 -275094 -228784
4092 -228784 -223717 -114662 -101307 -133263 -138736 -173075 -101028 -282784 -175179 -40878 -165272
4081a65272n8823J29590r756J02969m21025L55478n0162J88005k42118R584M9027
4070a12503j09807J80886q3283r6239j44921n1169M26394j43181j4900R5491j4228
4059f7460j78346o0361r1750L94291o4376k8639Q9001j57233J73552p4797K0198
4048d5920n0622K19166j47062P4297j40472J17833N5369j694q0131J00519k1024
4037H0259R2890j85081j53416P5737J01471j50497j4748J41629n857n2594K99314
4026B29107j30288Q5215k44605J61523N8397p0421l9879R4080K14058j18406R6832
4015C35613M8542K07588m14356J87862j39429j34124l0416N9856o5087j68231
4005a12182J52268j05721L7837j00314q1006N2357j1792j09341K58758J00335
$$ plain form
4081 -165272 -224095 -94505 -104261 -1292 -422317 -66839 -117001 71004 -171114 -161530 -112503
4070 -112503 -222310 -41424 -124707 -220946 -365867 -417036 9358 -133823 -148723 -53232 -67460
4059 -67460 -245806 -306167 -397917 -3626 -68002 -96641 -7640 -164873 8679 -66118 -45920
4048 -45920 -96542 122624 -24438 49859 -90613 27220 82589 80895 764 101283 80259
4037 80259 173149 -11932 -165348 -89611 11860 -138637 -153385 -11756 -17613 -70207 229107
4026 229107 98819 184034 -60571 100952 159349 88928 49049 143129 357187 238781 335613
4015 335613 384155 591743 177387 365249 225820 91696 61280 121136 56049 -112182
4005 -112182 40086 -65635 -27798 -128112 -209118 -156761 -168553 -277894 -19136 81199
3995H1199j50268L3999J39456o1856o1871K36550P1010o3904k15116n8304J66120
3984A17015J2724k38620M9205j30707m859J76365r4736n1638j66183Q3482K67412
3973A9460r1554k25073L00739l53354l0235L12944k12306M552O0166K746j46979
3962c58894O7392J72748j46782j05219R392K71961k50484J34467j50864m6325
3952d02608n3443K51822k09036n7273J6695O2818r146J41199q1331j56343J59370
3941c37276k8045J11182o5088p715j16561N1606J05525j14996J93286k73320J00339
3930c81063j5030J24571l56917L53201L3808j47041j14816j30685K64349j45562
3920e15185J34232j29590k422J37771j24038K88347k37716o6149J41561j09539
$$ plain form
3995 81199 -69069 -35070 104386 42530 -19341 217209 288219 224315 9199 -49105 117015
3984 117015 129739 -108881 -59676 -190383 -195242 -18877 -113613 -165251 -331434 -247952 19460
3973 19460 -72094 -297167 3572 -349782 -380017 -67073 -279379 -274827 -214661 -211915 -358894
3962 -358894 -291502 -118754 -265536 -370755 -361363 -89402 -339886 -205419 -356283 -402608
3952 -402608 -456051 -204229 -413265 -470538 -453843 -391025 -400171 -258972 -340303 -496646 -337276
3941 -337276 -365321 -254139 -319227 -326942 -443503 -391897 -286372 -401368 -208082 -481402 -381063
3930 -381063 -396093 -271522 -628439 -275238 -241430 -388471 -503287 -633972 -369623 -515185
3920 -515185 -380953 -510543 -512965 -375194 -499232 -210885 -448601 -514750 -373189 -482728
3910d82728j4326m2504K25054r9711R8435k09177Q4075l8270n8774J30134J80119
3899b27673n9046k31970L10137k33818j175n881k5809J9096P0729j35559J46514
3888c74455r6858L8408j06051L6122J51298j4776n4162K8979q9086P8444j47100
3877e49237J09939Q8777m9056j49424J67212k6511L8071L1409j98052O2430K5280
3866d49162o891N0474o383j85323J41834J48841j98398q3906Q0661J42278j81400
3855e47375J15275K5368L9643k40980L03420j14400J4211k398K08031k03481j79744
3844e82430J57229Q5646q7230L56q834m8091P0973J656K3182j12486J49180n3052
3832d03901M5405j03898k4742j2982L3656L133l7953p7559K9846J43451j71629
$$ plain form
3910 -482728 -497054 -539558 -314504 -414215 -315780 -524957 -440882 -479152 -537926 -407792 -227673
3899 -227673 -286719 -518689 -208552 -442370 -443545 -449426 -475235 -456139 -385410 -520969 -374455
3888 -374455 -471313 -432905 -538956 -502834 -351536 -366312 -420474 -391495 -480581 -402137 -549237
3877 -549237 -439298 -350521 -399577 -549001 -381789 -408300 -370229 -338820 -536872 -474442 -449162
3866 -449162 -456053 -405579 -411962 -597285 -455451 -306610 -505008 -588914 -508253 -365975 -547375
3855 -547375 -432100 -406732 -367089 -608069 -304649 -419049 -404838 -407236 -199205 -402686 -582430
3844 -582430 -425201 -339555 -426785 -426429 -435263 -483354 -412381 -410725 -387543 -500029 -350849 -403901
3832 -403901 -358496 -462394 -487136 -500118 -466462 -463329 -501282 -578841 -548995 -405544 -577173
3821e77173n3969Q1312J3640M0727n2916o7556J82028m7361M4402m1410p1244
3810e49520J449m38N0653j34423Q0033j00145Q5404q3543J04360l9428j00861
3799f86459J15801J56147k90762O4899L7951K10619k51904K68482Q9468j07160
3789c92918k69624K17330j1191n0452J04949o5077j14425m2881J25672M5069j57072
3778f10620Q9090j2954N850K25564j48077o6413J10362p5192p1354P6880L3870
3767d42994O3895r8873k632l3063R3694j40598L4444J06269Q1368j58060K0019
3756d76531O4344k4368j03783j1750P7332J11527j34534q1410L25709j69805k210
3745d25479m9840K01260k81775J02531k4598R473O1420r0176K544Q600j1467j00043
$$ plain form
3821 -577173 -631142 -549830 -536190 -495463 -548379 -615935 -433907 -481268 -436866 -478276 -549520
3810 -549520 -548071 -548509 -497856 -632279 -552246 -652391 -566987 -650530 -546170 -585598 -686459
3799 -686459 -570658 -414511 -705273 -640374 -602423 -391804 -643708 -375226 -285758 -392918
3789 -392918 -662542 -445212 -456403 -506855 -401906 -466983 -581408 -624289 -498617 -453548 -610620
3778 -610620 -521530 -534484 -528634 -303070 -451147 -517560 -407198 -482390 -553744 -476864 -442994
3767 -442994 -379099 -477972 -480604 -513667 -419973 -560571 -526127 -419858 -338490 -496550 -476531
3756 -476531 -412187 -436555 -540338 -552088 -474756 -363229 -497763 -579173 -253464 -423269 -425479
3745 -425479 -475319 -274059 -555834 -453303 -477901 -468428 -407008 -497184 -494640 -486040 -497507 -597550
3733e97550M541J85188R8408k69791J05920l2614K5929R3553k51427J72469j5738
3722d81112j09352l5637J7168p2231K11054q7329L2746j18314Q1835k1951J48773
3711d34350J6615N704j46262m7268L8686J57275j08857P337K37258m8240k15162
3700e37264L9571p3683p7857P8689j02096J44498j83456J15689O8235L0665l7535
3689e34544J29934K230O9896j67555l460K31026j03486r6330n1727K4896Q2046
3678d17074j31305J22886r2394j7799L5970Q373J88173j54223m7277P898l9335
3667e36107r2297J33550p122K25674l62661J99533J4347j82279O3859R7436j9485
3656d65552q6573J3586r5907J2264J37635k0026J15456k80753K71010q3274R463
$$ plain form
3733 -597550 -593009 -407821 -309413 -579204 -473284 -505898 -479969 -386416 -637843 -465374 -481112
3722 -481112 -590464 -626101 -608933 -681164 -470110 -557439 -524693 -643007 -561172 -583123 -434350
3711 -434350 -417735 -412031 -558293 -605561 -566875 -409600 -518457 -511120 -273862 -322102 -537264
3700 -537264 -497693 -571376 -649233 -570544 -672640 -528142 -711598 -595909 -527674 -497009 -534544
3689 -534544 -404610 -402380 -332484 -500039 -503499 -272473 -375959 -472289 -524016 -499120 -417074
3678 -417074 -548379 -425493 -517887 -535686 -499716 -491343 -303170 -457393 -504670 -496772 -536107
3667 -536107 -628404 -494854 -501976 -276302 -638963 -439430 -425083 -607362 -543503 -446067 -465552
3656 -465552 -552125 -538539 -634446 -622182 -484547 -504573 -389117 -669870 -398860 -482134 -472671
3645d72671q9245j21128K55918j23077R7681o2491o980m8720J8450Q1594j52706
3634f23375Q5663Q8405L9783l9801r0829N5123j41990K19816j07685j16661j01167
3623g32718J02866O3844o1644J09488o3586j04466N2536N611J99341p4204P3584
3612d29348n4924K2136K7300j18990R1185o1807j6099N216Q543Q3565R8162L7026
3600c08035k51166P3061P0916j69193K98980q9786j54702J12479j96337K48496
3590c65287K4493j56322o3434q642J61518k9333j47760q3402J82225O6724p1268
3579d90488q0337q0446K20141Q4480l5880j40264P5878k7435L7771o0115J90484
3568c06211j83495Q1117j16700j7785n0967J53193l7056K54768j75785j6112j5319
$$ plain form
3645 -472671 -561916 -683044 -427126 -550203 -452522 -515013 -521993 -570713 -552263 -470669 -623375
3634 -623375 -537712 -449307 -409524 -449325 -540154 -485031 -627021 -407205 -514890 -631551 -732718
3623 -732718 -629852 -566008 -627652 -518164 -581750 -686216 -633680 -628069 -428728 -502932 -429348
3612 -429348 -484272 -462136 -434836 -553826 -462641 -524448 -540547 -535331 -526788 -443223 -345061 -308035
3600 -308035 -559201 -486140 -415224 -584417 -285437 -375223 -529925 -417446 -613783 -365287
3590 -365287 -340794 -497116 -560550 -569192 -407674 -437007 -584767 -668169 -485944 -419220 -490488
3579 -490488 -570825 -651271 -431130 -346650 -382530 -522794 -446916 -474351 -436580 -496695 -306211
3568 -306211 -489706 -408589 -525289 -543074 -594041 -440848 -477904 -223136 -398921 -415033 -430352
3557d30352K16579J2182N4586N0951J2492J20431r9187l8324o9490k04600R8980
3546b75752j22344J42430k70776O5486k3763J32130k5965J2343m0312l6969r9889
3535e43381J9554O722O4697l6596m7893K9408K1978J53293l57j18632N0070p3181
3523d74318O9298r062J02238k74727l017J23809N6586j20271Q3223J06851n261
3512c44651k07512J31922n7213J34071j74646k8853P9451q2870O3248J19340j3601
3501c81314j0694m4419K6268N8228j762q5262J31777k60535M7711Q0700J8929
3490d20373L02798k34601j6487m904j0185j62654K95945k24297K56766j95038
3480d13030N5630Q065r641N4345r2492K5504j01412M3809R5507j5225J33752j1801
$$ plain form
3557 -430352 -213773 -201591 -147005 -96054 -83562 36869 -62318 -100642 -170132 -374732 -275752
3546 -275752 -398096 -255666 -526442 -460956 -484719 -352589 -378554 -366211 -406523 -443492 -543381
3535 -543381 -523827 -517105 -452408 -489004 -536897 -507489 -485511 -332218 -332575 -451207 -401137 -474318
3523 -474318 -405020 -414082 -311844 -586571 -589588 -465779 -409193 -529464 -446241 -339390 -344651
3512 -344651 -552163 -420241 -477454 -343383 -518029 -546882 -467431 -550301 -487053 -367713 -381314
3501 -381314 -392008 -436427 -410159 -351931 -353693 -438955 -307178 -567713 -520002 -439302 -420373
3490 -420373 -117575 -352176 -368663 -373567 -383752 -546406 -250461 -474758 -217992 -413030
3480 -413030 -357400 -349335 -358976 -304631 -397123 -371619 -473031 -429222 -333715 -348940 -215188 -226989
3468b26989k03844K58861j21039j53455J27509p3590J03396j23460l7457n4929
3458e04997O0431J67309o1810j24297m1124P3218Q2107O7102Q6887N4643j05735
3447b46266p0540o5803K96774k39604O7702J08451O4584k18681K1494p0361L5006
3436c17244n0914J07014p484j47622L06059l15478j8550M1705m8498J05096J7840
3425c28076J02367j92077J24382Q6332O0673O6509j09889j55960L6242K92014
3415a7483m7545p8010J05475j00272l6814J62464k55564J60647n4149j59655J13378
3404b07528K0532P581P7667p9971P1274J54629P3265j57019m9845J10190L9572
3393F0347M979J5140j2263m4565O7231k25972K32269Q1407p620o4259k21885L08837
$$ plain form
3468 -226989 -430833 -171972 -293011 -446466 -318957 -392547 -289151 -412611 -450068 -504997
3458 -504997 -444566 -277257 -339067 -463364 -504488 -431270 -349163 -282061 -195174 -140531 -246266
3447 -246266 -316806 -382609 -85835 -325439 -257737 -149286 -84702 -303383 -281889 -352250 -317244
3436 -317244 -368158 -261144 -268628 -416250 -110191 -425669 -444219 -402514 -451012 -345916 -328076
3425 -328076 -225709 -417786 -293404 -207072 -146399 -79890 -189779 -345739 -309497 -17483
3415 -17483 -65028 -143038 -37563 -137835 -174649 -12185 -267749 -107102 -161251 -320906 -207528
3404 -207528 -186996 -179415 -101748 -181719 -110445 44184 117449 -39570 -89415 20775 60347
3393 60347 65326 80466 68203 23638 90869 -135103 97166 178573 170953 106694 -115191 193646
3381A93646r8514J33691k12985k0967J59511K850K8373k4428n5902Q2150L91103
3370E78528j63102m7763p0352K2838P7444J42109J39844J544j19550R3199k7657
$$ plain form
3381 193646 95132 228823 15838 -5129 154382 157232 185605 161177 105275 187425 578528
3370 578528 415426 367663 297311 320149 397593 539702 679546 681090 561540 654739 627082
$$ [...]
##END NTUPLES=NMR SPECTRUM
##END=
