##TITLE=abcd
##JCAMPDX= 6.0         $$ Bruker NMR JCAMP-DX V2.0
##DATA TYPE= NMR SPECTRUM
##DATA CLASS= NTUPLES
##ORIGIN= UXNMR, Bruker Analytische Messtechnik GmbH
##OWNER= root
$$ XWIN-NMR		Version 3.5
$$ Fri Mar 20 17:13:01 2026 Russian Standard Time (UT+4h)  servis@DPX200
##.OBSERVE FREQUENCY= 200.131235884673
##.OBSERVE NUCLEUS= ^1H
##.ACQUISITION MODE= SIMULTANEOUS
##.ACQUISITION SCHEME= undefined
##.AVERAGES= 32
##.DIGITISER RES= 18
##SPECTROMETER/DATA SYSTEM= spect
##.PULSE SEQUENCE= zg
##.SOLVENT NAME= CDCl3
##.SHIFT REFERENCE= (INTERNAL, CDCl3, 0, 16.4885)
##AUDIT TRAIL= $$ (NUMBER, WHEN, WHO, WHERE, WHAT)
$$ ##TITLE= Audit trail, XWIN-NMR		Version 3.5
$$ ##JCAMPDX= 5.01
$$ ##ORIGIN= Bruker BioSpin GmbH
$$ ##OWNER= servis
$$ F:\spectra/data/av/nmr/H1/1/pdata/1/auditp.txt
$$ ##AUDIT TRAIL=  $$ (NUMBER, WHEN, WHO, WHERE, WHAT)
(   1,<2026-03-20 17:11:13.39 +0400>,<servis>,<DPX200>,
      <created by zg, POWCHK disabled, PULCHK disabled
       configuration hash MD5:
       00 E9 B6 7A A2 85 ED C7 34 08 36 98 17 FE 4E 26
       data hash MD5: 32K
       AE B6 32 54 07 24 C7 81 B4 00 56 22 B3 2F 43 AD>)
(   2,<2026-03-20 17:12:33.45 +0400>,<servis>,<DPX200>,
      <Start of raw data processing
       efp BC_mod = 2 LB = 0.05 FT_mod = 6 PKNL = 1 PHC0 = -256.1951 PHC1 = -0.898437 SI = 16K 
       data hash MD5: 16K
       C8 BC D2 4F 7E F9 2D DE 56 C9 05 F6 53 84 3D 72>)
$$ ##END=
$$ 
$$ hash MD5
$$ BD 7A 98 0E 32 8B 0F 70 1E 8D 79 75 50 4A 03 DA
##$RELAX= 
##$RELAX= 
##$RELAX= 
##$RELAX= 
##$RELAX= 
##$RELAX= 
##$RELAX= 
##$RELAX= 
$$ Bruker specific parameters
$$ --------------------------
##$DU= <F:\spectra>
##$EXPNO= 1
##$NAME= <H1>
##$PROCNO= 1
##$TYPE= <nmr>
##$USER= <av>
##$AMP= (0..31)
100 100 100 100 100 100 100 100 100 100 100 100 100 100 100 100 100 100 
100 100 100 100 100 100 100 100 100 100 100 100 100 100 
##$AQSEQ= 0
##$AQ_mod= 1
##$AUNM= <au_zg>
##$AUTOPOS= <>
##$BF1= 200.13
##$BF2= 200.13
##$BF3= 200.13
##$BF4= 200.13
##$BF5= 500.13
##$BF6= 500.13
##$BF7= 500.13
##$BF8= 500.13
##$BYTORDA= 1
##$CFDGTYP= 0
##$CFRGTYP= 5
##$CHEMSTR= <none>
##$CNST= (0..31)
1 1 145 1 1 1 1 1 1 1 1 1 1 1 1 1 1 1 1 1 1 1 1 1 1 1 1 1 1 1 1 1 
##$CPDPRG= <>
##$CPDPRG1= <>
##$CPDPRG2= <>
##$CPDPRG3= <>
##$CPDPRG4= <mlev>
##$CPDPRG5= <mlev>
##$CPDPRG6= <mlev>
##$CPDPRG7= <mlev>
##$CPDPRG8= <mlev>
##$CPDPRGB= <>
##$CPDPRGT= <>
##$D= (0..31)
0 2 0 0 0 0 0 0 0 0.06 0 0 0 0 0 0 0.0002 0 0 0 0 0 0 0 0 0 0 0 0 0 0 
0 
##$DATE= 1774012272
##$DBL= (0..7)
120 120 120 120 120 120 120 120 
##$DBP= (0..7)
150 150 150 150 150 150 150 150 
##$DBP07= 0
##$DBPNAM0= <>
##$DBPNAM1= <>
##$DBPNAM2= <>
##$DBPNAM3= <>
##$DBPNAM4= <>
##$DBPNAM5= <>
##$DBPNAM6= <>
##$DBPNAM7= <>
##$DBPOAL= (0..7)
0.5 0.5 0.5 0.5 0.5 0.5 0.5 0.5 
##$DBPOFFS= (0..7)
0 0 0 0 0 0 0 0 
##$DE= 6
##$DECBNUC= <off>
##$DECIM= 32
##$DECNUC= <off>
##$DECSTAT= 4
##$DIGMOD= 1
##$DIGTYP= 9
##$DL= (0..7)
0 120 120 120 120 120 120 120 
##$DP= (0..7)
150 150 150 150 150 150 150 150 
##$DP07= 0
$$ [...]
##$SUBNAM4= <"">
##$SUBNAM5= <"">
##$SUBNAM6= <"">
##$SUBNAM7= <"">
##$SUBNAM8= <"">
##$SUBNAM9= <"">
##$SW= 20.6817932712277
##$SWIBOX= (0..15)
0 0 3 0 0 0 0 0 0 0 0 0 0 0 0 0 
##$SW_h= 4139.07284768212
##$TD= 32768
##$TD0= 1
##$TE= 0
##$TE2= 300
##$TE3= 300
##$TEG= 300
##$TL= (0..7)
0 120 120 120 120 120 120 120 
##$TP= (0..7)
150 150 150 150 150 150 150 150 
##$TP07= 0
##$TPNAME0= <>
##$TPNAME1= <>
##$TPNAME2= <>
##$TPNAME3= <>
##$TPNAME4= <>
##$TPNAME5= <>
##$TPNAME6= <>
##$TPNAME7= <>
##$TPOAL= (0..7)
0.5 0.5 0.5 0.5 0.5 0.5 0.5 0.5 
##$TPOFFS= (0..7)
0 0 0 0 0 0 0 0 
##$TUNHIN= 0
##$TUNHOUT= 0
##$TUNXOUT= 0
##$USERA1= <user>
##$USERA2= <user>
##$USERA3= <user>
##$USERA4= <user>
##$USERA5= <user>
##$V9= 5
##$VALIST= <valist>
##$VCLIST= <CCCCCCCCCCCCCCC>
##$VD= 0
##$VDLIST= <DDDDDDDDDDDDDDD>
##$VPLIST= <PPPPPPPPPPPPPPP>
##$VTLIST= <TTTTTTTTTTTTTTT>
##$WBST= 1024
##$WBSW= 30
##$XGAIN= (0..3)
0 0 0 0 
##$XL= 0
##$YL= 0
##$YMAX_a= 278667
##$YMIN_a= -198137
##$ZGOPTNS= <>
##$ZL1= 120
##$ZL2= 120
##$ZL3= 120
##$ZL4= 120
##$ABSF1= 0
##$ABSF2= 0
##$ABSG= 0
##$ABSL= 0
##$ALPHA= 0
##$AQORDER= 0
##$ASSFAC= 0
##$ASSFACI= 0
##$ASSFACX= 0
##$ASSWID= 0
##$AUNMP= <proc_1d>
##$AZFE= 0.1
##$AZFW= 0.1
##$BCFW= 0
##$BC_mod= 2
##$BYTORDP= 0
##$COROFFS= 0
##$CY= 18.4799938201904
##$DATMOD= 1
##$DC= 0
##$DFILT= <>
##$DTYPP= 0
##$F1P= 9.9274215381318
##$F2P= -0.165520771350173
##$FCOR= 1
##$FTSIZE= 16384
##$FT_mod= 6
##$GAMMA= 0
##$GB= 0
##$INTBC= 1
##$INTSCL= 4.127829e-11
##$ISEN= 128
##$LB= 0.05
##$LEV0= 0
##$LPBIN= 0
##$MAXI= 10000
##$MC2= 0
##$MEAN= 0
##$ME_mod= 0
##$MI= 50
##$NCOEF= 0
##$NC_proc= -9
##$NLEV= 6
##$NOISF1= 3.799351
##$NOISF2= 2.8
##$NSP= 0
##$NTH_PI= 0
##$NZP= 0
##$OFFSET= 16.48848
##$PC= 4
##$PHC0= -256.1951
##$PHC1= -0.898437
##$PH_mod= 1
##$PKNL= yes
##$PPARMOD= 0
##$PSCAL= 4
##$PSIGN= 0
##$REVERSE= no
##$SF= 200.130005582386
##$SI= 16384
##$SIGF1= 3
##$SIGF2= 2
##$SINO= 400
##$SIOLD= 16384
##$SREGLST= <1H.CDCl3>
##$SSB= 0
##$STSI= 16384
##$STSR= 0
##$SW_p= 4139.07284768211
##$SYMM= 0
##$S_DEV= 0
##$TDeff= 32768
##$TDoff= 0
##$TI= <>
##$TILT= no
##$TM1= 0
##$TM2= 0
##$TOPLEV= 0
##$USERP1= <user>
##$USERP2= <user>
##$USERP3= <user>
##$USERP4= <user>
##$USERP5= <user>
##$WDW= 1
##$XDIM= 16384
##$YMAX_p= 492961051
##$YMIN_p= -4449590
$$ End of Bruker specific parameters
$$ ---------------------------------
##NTUPLES= NMR SPECTRUM
##VAR_NAME=  FREQUENCY,     SPECTRUM/REAL,   SPECTRUM/IMAG
##SYMBOL=    X,             R,               I
##VAR_TYPE=  INDEPENDENT,   DEPENDENT,       DEPENDENT
##VAR_FORM=  AFFN,          ASDF,            ASDF
##VAR_DIM=   16384,         16384,           16384
##UNITS=     HZ,            ARBITRARY UNITS, ARBITRARY UNITS
##FACTOR=    0.252644378177508, 1,           1
##FIRST=     3299.83951724647, 0,            0
##LAST=      -839.233330435636, 0,           0
##MIN=       -839.233330435636, -4449590,    0
##MAX=       3299.83951724647, 492961051,    0
$$ Real data points
##PAGE= N=1
##DATA TABLE= (X++(R..R)), XYDATA
$$ [...]
9416 4191703 3898874 4632129 4050188 5349202 5235106 4692190 4622959 4817955 4588618 3521644
9406 3521644 4333612 5741094 5290648 5053895 4195810 4221321 4215013 5203725 3798179 5190350
9396 5190350 4629754 4908291 4366141 4757482 3274480 4508207 5098178 4076686 5253484
9387 5253484 4491816 4529127 5087747 3753445 4586416 4048630 5832081 4247818 3721722
9378 3721722 4724235 1823014 4740168 4795699 4684612 5642323 5692042 4897987 3537470
9369 3537470 5288623 3164803 5471599 5421411 5578811 5375137 4519292 4863873 4542282
9360 4542282 4717001 4715762 4829740 4725782 5159842 5049796 4256239 4107992 5248434 6066909
9350 6066909 4034766 6909476 5308216 3110290 3306233 4584586 5965919 5433094 3406987
9341 3406987 5032051 4370141 5141672 3839943 4797909 4972639 5452786 4243616 3496922
9332 3496922 5491411 4144890 5464275 5681163 3994052 5331256 5960199 6318414 4177113
9323 4177113 4729775 3735397 4569385 5972303 4367057 5339460 5924919 5434909 6182474
9314 6182474 5845332 3917252 5212877 4413612 3409665 5853705 5043507 6590976 4131821
9305 4131821 5196407 3420809 5001162 5116284 4576818 5639181 4848807 5184926 5156180
9296 5156180 3807262 4779944 5778368 4856553 4009713 4260751 3708142 5738333 3862628
9287 3862628 6396491 6440250 5674796 5327897 5427137 5211441 5768345 4482508 5132320 5322080
9277 5322080 4424456 6481349 3847146 5987704 5251259 6981661 5049957 6073142 5110521
9268 5110521 5806276 5015484 6767797 4632624 5126472 3508759 5214003 5509919 5387679
9259 5387679 6192688 5315185 5676424 4746632 6082939 6052745 4665457 5402320 5675454
9250 5675454 4646381 5687280 6476312 6056632 6462333 6586338 4804491 6114264 4708759
9241 4708759 4759604 5988708 5254145 6132435 5678751 5699802 5175475 5714095 6287796 5749116
9231 5749116 5005195 5851261 6641460 5874665 5741749 4987582 5434393 4981741 5740788 4649455
9221 4649455 5160264 5013011 5852962 5718368 5779243 7143987 5526738 5635197 5409815
9212 5409815 6543249 5858566 8492488 5004947 7396665 6821535 6712048 6620221 6605858
9203 6605858 6202153 5724624 5414620 6515527 6038552 6769583 7051256 7372200 6260204
9194 6260204 7608688 6487513 6632957 6696993 5537233 8513961 7285747 6363305 5911526
9185 5911526 6534808 7796728 6945523 7553045 7509975 7657979 7835884 7636986 6888350 8164634
9175 8164634 7376452 7771470 8269566 7743660 8447172 8827867 8774005 7350184 9009648
9166 9009648 7821408 9299067 9523132 9214443 9410961 9182825 10572966 10502802 9485266
9157 9485266 9620296 9664681 11536942 9150398 9539086 11807333 10691219 9493921 9585265
9148 9585265 9902286 10981722 9370556 11645340 11516365 10105072 11269174 12202682 10987566
9139 10987566 11960553 11872298 14749853 13867624 11877423 13246636 12877487 13730173 13729676 13024796
9129 13024796 14851470 15228776 14822417 15145748 14203225 13835873 16622719 17509625 17641642
9120 17641642 19049753 19106427 20004827 20105456 19061360 21859787 21171675 21945723 22663552
9111 22663552 23887183 24226311 26845245 29518632 31900873 34990971 37831641 41358807
9103 41358807 45259245 53039816 59595443 69845079 84598123 97699899 112980384 129978921
9095 129978921 148194581 167788895 198610839 228833899 270451030 310608270 347036491
9088 347036491 367740935 369501628 368479274 360782963 351699630 333399485 312626777 287365839
9080 287365839 251606072 213292064 178863456 154488450 127702920 110014601 92600290
9073 92600290 77700758 63744916 52458102 41183764 33538540 28010426 23937519 23500193
9065 23500193 21925791 20655974 20297956 19869126 19527401 16975626 16779825 14395183 15760983
9056 15760983 14952966 15468336 15326554 13676228 13589398 12722851 12506363 13167160 12654797
9047 12654797 12921233 12823964 12213233 12636726 11804860 12788610 11470673 12012209 11784739
9038 11784739 10084631 11258787 10646552 10071900 10240212 9933332 10127370 10460902 8592092
9029 8592092 10981645 9170669 11666992 10338662 9471991 8970442 10789895 9532993 9444140
9020 9444140 8969952 9172406 8728118 9929276 8924167 8764183 7380798 8730633 8886906
9011 8886906 9358022 8734023 8862645 9211059 8614754 7500124 8339903 7346397 6905951
9002 6905951 9092890 7333932 7300058 9723328 7971864 7927118 8460425 9368240 7843776
8993 7843776 7544701 7534468 7957056 6525385 5685231 7469890 8681731 7547143 8662578
8984 8662578 7555832 7077218 6620009 8023434 7030706 8558895 8707206 7912486 8065512
8975 8065512 8128622 7985396 7443993 7042081 6266995 5788591 6059018 8057340 7160965 9121110
8965 9121110 7153523 7438314 8053224 8559378 7693427 6579896 5451104 7752432 7904155
8956 7904155 7650014 6330307 7133122 6418425 5895557 6841197 6756681 7113557 6917134 7489357
8946 7489357 6043217 6536613 7074491 6502516 6592292 7232214 7326317 5819110 7450609
8937 7450609 7740973 6991163 6127353 7114286 6300693 5066415 6644842 7543192 5984277
8928 5984277 6773328 4814417 6311752 7089441 7504647 6165184 6141565 5515540 6681637
8919 6681637 7093515 7231731 7147651 8131749 6756515 5974170 6217632 5740205 5531121 9102845
8909 9102845 6391667 5864568 6353651 7787161 6494541 6553349 4825155 7609931 6235713
8900 6235713 7124752 5069540 6798381 7086677 5538310 7351966 6211012 7829605 7177272
8891 7177272 6344112 6035223 4968859 6195559 7013271 6213092 5609316 5520346 5924691
8882 5924691 6621589 6596730 6041293 6366800 5691248 5860940 6657336 6148384 5681702 6257691
8872 6257691 5323025 6341807 6016670 5295323 5718665 6315118 6120138 5689540 5952559
8863 5952559 6918942 5093539 5800551 7545102 6695512 5145058 7826140 7888936 6324167
8854 6324167 6172871 5802381 6935649 7018605 5969662 7351823 6746694 6497864 5392602
8845 5392602 6658017 5278461 6389462 8117641 6365715 6578245 5537280 6555064
8837 6555064 7438327 7704892 7247284 6459895 6593431 6318575 7314925 5718757 6463515
8828 6463515 6724904 5794116 6176171 6998834 6693675 8266320 7899091 7374292 7266013
8819 7266013 6189477 5142309 6485586 7194393 5899653 6615405 7973380 6374390 6679714
8810 6679714 5452217 6855005 6179947 5368793 6243361 6166574 5584792 5043410 6238835
8801 6238835 6131871 6889380 6296465 6429385 7090711 6855965 7521661 8160741 6565867
8792 6565867 7321220 5438880 5494729 5673686 6462042 7522425 6466900 7308719 6728659
8783 6728659 7202617 5765536 6293648 7635220 7699607 5384802 5846219 5421898 7113536
8774 7113536 7103807 6939301 5880733 6537854 5560365 6379554 6705242 6862679 7492653 6925122
8764 6925122 8235849 7147756 6954771 6768663 5339478 7637641 5300401 6553002 7932405
8755 7932405 4625376 5937367 5762832 6469899 7086902 7171130 7346034 8497605 6422367
8746 6422367 4549629 6550128 6697995 8309552 6456765 5631101 5235394 5435564 6724646
8737 6724646 5206207 6833052 6985877 5306079 7159398 5237764 8025328 6910270
8729 6910270 6852777 6147012 6942923 7948780 6298960 7047483 7379219 6475913 6406853 6657061
8719 6657061 5352690 6699929 6378540 7382310 7490721 6628564 5608304 7551132 6827963
8710 6827963 6510694 7581059 4517741 7032876 7138467 7279097 7833189 8348097 6543539
8701 6543539 6208657 7365159 7159708 8451793 7655560 8135980 7195713 5593865 7618019
8692 7618019 5836071 6740863 6152684 7409705 8296477 6791540 7415180 5992334 8259632
8683 8259632 7626363 6497706 7256981 7351035 8708852 8966702 8379638 8781446 8139539
8674 8139539 7279011 8485376 8352293 7837791 9899369 8361881 9513979 8276930 7109577
8665 7109577 8592587 8079886 8056440 6609144 7451849 9620541 7587974 7514721 5894022
8656 5894022 7836189 7799397 8623378 7452149 7411132 7082975 7368089 8130377 7130846 6220106
8646 6220106 8356198 5960222 6173352 6367500 7012559 5772307 7110423 8867879 6183315
8637 6183315 6911631 7664947 6497475 7424207 7776043 6896927 6521466 7180083 6781704
8628 6781704 7413637 5439612 6312707 6940530 6677660 7397455 7356631 7593604 6772797 6862903
8618 6862903 7085683 7287577 6453190 7310615 5395739 6132524 8004230 6246417 8726175
8609 8726175 7499706 7967729 6689880 6914701 7717835 6734894 7682250 7900169 6990339
8600 6990339 7062558 6915005 6389707 6687747 7411484 6572564 8338458 6798109 8689721
8591 8689721 7342689 6179875 6598310 7848175 6511475 6311515 6889093 5186161 7659216
8582 7659216 7623915 7548867 6642737 8173951 6725529 8409070 7751620 7699846 7671257 6024040
8572 6024040 7910248 7996765 6392584 7258357 7418986 8078232 9066608 7149086 7564547
8563 7564547 6648812 7832539 5949377 6962811 6521146 7500930 7073968 7945067 6977430
8554 6977430 6221074 6344755 6058973 8008705 7527448 8076833 8745036 8580877 7176013
8545 7176013 7162791 7933364 7294447 6868967 5734812 6627509 7920643 8590432 7411985
8536 7411985 7931058 7521790 13477478 4398498 9330664 7496560 5423774 7501752 7235264
8527 7235264 6263141 7370038 7037303 7753166 5874878 6382636 6757184 6364248 5987041
8518 5987041 6647487 7310938 7730261 7114123 8330506 7876338 7446850 8075528 6411532
8509 6411532 6144342 8589731 6818010 6614128 8336827 8447002 5443413 8134168 7790038
8500 7790038 8011088 7011854 6619826 7851853 7137391 7908903 8136351 7469807 7672810
8491 7672810 8034797 6083766 5995356 7234686 8373038 7359265 6847214 7842382 8122507
8482 8122507 7938499 6870064 6396381 7024542 5733086 7829830 6883911 5823992 5970689
8473 5970689 7273261 7110079 7005261 6729662 6151737 8641287 7373443 7602288 9063435
8464 9063435 6845895 7772553 5924311 8639471 6845666 6781058 7729771 7415743 6062326
8455 6062326 7662798 8215296 7660695 7593462 7320462 7657375 6434755 6955769 7473430
8446 7473430 7806509 7225290 7782806 7763566 9039772 7491486 7092330 8639515 8316970
8437 8316970 7968514 8585546 8538465 7153212 7416319 8825335 8159795 7755866 7305442
8428 7305442 8728089 7454456 6915080 7748349 9050517 9011785 9962812 9651141 8696595
8419 8696595 8375935 7988845 9721246 7732179 9542357 8377307 7653439 9183334 8612217
8410 8612217 8871253 9206799 8421782 8005064 8482017 8087270 8456938 8674950 9187997 9880036
8400 9880036 9840882 8993192 8870384 8808677 9663907 9254345 10053194 9702905 8483365 10432488
8390 10432488 9606863 10452294 8920977 9917160 10487832 10746967 10198575 11674016 11274659
8381 11274659 11472372 11897395 11570516 10218984 13029966 12000217 12776585 10464533 11936883
8372 11936883 11695463 10412281 11952075 11056403 12278304 12457959 12325513 11914742 14166924
8363 14166924 11950564 12264960 11464235 11302051 10136144 10318906 10162198 10255663 11587316
8354 11587316 11074722 11024719 10095854 10116956 11077047 11140565 10575982 10353514 10451246 10404922
8344 10404922 9867061 9149290 10230937 11765198 9862270 10066913 10395285 9778132 9319855
8335 9319855 9722814 8987603 8658231 9883280 9776169 9870333 6736746 7701002 8202846
8326 8202846 8640623 8472921 8840824 9267732 8831353 8750989 8762827 8903425 9925872 7364061
8316 7364061 9081235 8561828 7614789 8732932 9000684 9302399 8448768 6892329 8845525
8307 8845525 7595361 7570027 7983810 7201287 8244863 10217285 7470447 7996355 6918062
8298 6918062 8642761 8148491 7294643 9426321 6419314 7789775 8481677 9437755 9051980
8289 9051980 7947080 7442400 7890375 7920962 8385412 8728960 7369752 7791778 7306721
8280 7306721 7193287 8888270 8239291 5669071 7699355 7896288 9240168 6760439 10573180
8271 10573180 8496080 9047583 7889731 7713194 9232670 7473271 7270425 7353937 8032639
8262 8032639 7904648 6741033 6943723 7033229 8443261 8553179 8146964 7763396 9061308
8253 9061308 7687250 8125640 8063091 8696451 8363013 8490689 8444957 9355994 8566659 7263675
8243 7263675 7562969 9077402 9047388 8868035 8209543 8019709 8572040 8220974 7538711 9221241
8233 9221241 9147492 7691301 8175635 8207704 7277023 8300716 6563361 8222878 7395297
8224 7395297 7130314 7442096 6619063 9004141 6869673 7073051 8474207 6348627 10127079
8215 10127079 8608525 7663944 8150961 7403615 8631208 8605977 8513255 7124271 9605769
8206 9605769 8548872 7320862 9414670 8316641 9606346 9500191 8477417 7420898
8198 7420898 9421382 7724575 8193225 10637139 7303172 10363695 10696059 6273129 7945426
8189 7945426 6702205 5910355 8248328 7438607 7456490 8580139 8194768 7505248 7422653
8180 7422653 7170885 8053250 8159320 7398022 7588291 8293836 8665635 9506299 7173580
8171 7173580 8607608 8032101 7704442 7054823 7751736 6291003 7456904 8506850 7705583
8162 7705583 8845890 8836563 6204094 8952080 7763831 5977935 8921450 7554639 7434639
8153 7434639 7840453 7718539 7385763 8694704 8555455 7865868 7696231 9706742 8539979
8144 8539979 7565589 9028400 7934919 8639271 8122018 9406909 9487547 9740932 6900140
8135 6900140 8664259 7398543 6027070 8009335 7829288 6201948 8662304 7304753
8127 7304753 8055310 8737127 7255927 9069906 8008760 7555253 9394234 9392477 7020848
8118 7020848 5471865 6215479 7134403 7041994 8146110 7969979 8685343 8342648 8151338
8109 8151338 8095776 8422630 8332039 7702733 8342729 9632519 7691121 6933961 7299119 8146237
8099 8146237 7286768 8059722 5994367 8387025 9114066 6197847 8721232 8547788 8481748
8090 8481748 7981559 7239407 8833844 8571140 7734826 7374740 8435552 6635403 8083007
8081 8083007 9326163 8514197 8395256 7825564 7876468 8361953 8338488 8987486 8045609 7511712
8071 7511712 8083401 7268853 8703103 8445341 8754594 9313917 7652562 9171078 7848547
8062 7848547 8371963 8379379 8006088 8121407 7528942 7789189 7304264 8186058 8331928 6991493
8052 6991493 6841556 7117503 8248013 7603461 8366351 6882220 6916843 8897386 7627210
8043 7627210 7428917 8303727 8213891 7450089 6442084 7509947 8308172 8776636 7311472
8034 7311472 6874035 8042702 8203802 8057160 8771245 8380049 7744535 7915512 6986047
8025 6986047 6955783 7217139 8070836 8992677 9268654 9493880 7293682 8145552 7379410 7221664
8015 7221664 7616838 7596917 7506113 8014769 6495246 7745091 7733813 8217470 8736839 7810435
8005 7810435 7589602 7813147 7061010 7721289 7723271 8404214 8634741 8996161 8711220 8290021
7995 8290021 7739563 7790585 8954772 7523062 7826498 8140413 7461279 8876043 7960860
7986 7960860 7984607 8338363 8638575 8703936 8012600 7459255 7870517 7940548 8199383 8034954
7976 8034954 7774597 9052885 7789034 9343419 7751291 7849652 7852518 7325200 7385695 8782858
7966 8782858 7310994 7587434 8741167 8125442 7291318 7923447 8449420 7782749 7861869
7957 7861869 7072667 8740867 7010193 7704490 7636447 8328524 9170531 6624674 8932885
7948 8932885 8488337 9347665 8839039 8329041 7712372 7313293 8981687 8546954 8564954 7841367
7938 7841367 10785842 9059867 9217196 8608008 9125200 9376699 9203288 9693534 7833816
7929 7833816 9265575 8090505 8541770 7803808 9640303 6527920 8550859 7719033 7854369
7920 7854369 8394855 6946993 8348163 9561236 7459533 8960752 8294036 7594583 6976030
7911 6976030 7903176 8349202 7954498 8752421 7583004 9160270 8037028 7819248 7048008
7902 7048008 7837515 6475169 7010463 7111836 8212449 7026277 7322903 8585665 6545946
7893 6545946 7783939 9334444 8317982 8407936 9071462 6578149 7422168 8565806 7927859
7884 7927859 7879426 7897315 8719132 7870520 8150965 7620073 8727136 8383457 7894197 6986428
7874 6986428 7100773 9467549 8120264 7304728 6884736 7162307 9472794 6206474 8333975
7865 8333975 7536924 7684044 7337469 8125615 8263871 8392375 9887827 8530265 7584906
7856 7584906 7061789 8519611 7219917 8915229 11516227 8141426 11752778 8914483
7848 8914483 7400079 7870243 8466591 7905376 8374995 7123744 6345790 8478249 8373985
7839 8373985 7657262 7636398 10122283 7818398 7298298 8428337 7757677 7568427 7076222
7830 7076222 6819475 7421215 6482740 6347346 7440993 7781260 7069768 8515455 7053369
7821 7053369 6393442 8777370 7396665 8125062 6424152 6750736 7391848 8216038 7503603
7812 7503603 6888463 7558884 7016073 6641969 5892125 6032797 6207745 6642642 7859259
7803 7859259 7756142 8563923 7301726 8457088 7522828 8050918 7488668 7734686 7581676
7794 7581676 6986916 6861641 7078357 7585070 7779053 8024369 7823246 8876474 6901818
7785 6901818 5678966 6766181 7615669 6693288 6309884 8192816 8516914 6836409 6952287
7776 6952287 7517432 7429929 7831707 7453136 6163751 7593769 6692633 7327970 7238482 6638358
7766 6638358 8954822 9324003 8349944 6854383 7524066 6412284 6950394 6812356 7952964
7757 7952964 7566410 7185391 6945148 6189210 6775366 6343565 6746717 6926958 7492145 6667300
7747 6667300 7771010 6843580 7682027 7614465 7544003 7658544 6682908 9440246 7135416
7738 7135416 7169523 7628408 7455282 8291457 7690886 6929443 5822618 7850483 6871876
7729 6871876 7592605 7630772 7548890 7174796 6002547 6356712 7304562 8003926 6414521 5452139
7719 5452139 6185870 8749790 8123670 7755769 8030504 7766031 7750620 8133613 8502160 7587136
7709 7587136 6828384 7950193 8522532 6984287 8414870 8470512 7187555 6522503 7084573
7700 7084573 7418068 8101469 6566789 7533674 7232580 6614990 7865409 6902994 7138234
7691 7138234 7089671 7426782 7414065 7388359 8610870 7253552 6628042 6597970 8465372 7483253
7681 7483253 7596448 7405584 7788319 8273060 7229448 7730423 8082661 7971472 6445078
7672 6445078 8340175 7537827 7085619 6685278 6979347 7173105 5528274 7595027 6954243
7663 6954243 8468659 9198247 6904344 7933228 8757207 6050263 7038512 6316196 6379285
7654 6379285 7187188 7093164 7338332 7746968 7892708 8082628 7178016 6616165 8072086 6417909
7644 6417909 7151377 9437639 8461044 8039746 7145798 7668464 8117438 7559995 7082274
7635 7082274 6921807 7572828 6753976 7261099 7090439 7949830 6975383 6686927 6202391 7260098
7625 7260098 6222744 6005144 7076787 6028976 6865688 5672736 7023590 8675682 8064689
7616 8064689 6223093 6045159 8039497 7033691 6714594 7648387 8511653 8771624 6473690
7607 6473690 6975759 6912914 8332732 7686450 6532403 7786062 6243768 8007404 9902638
7598 9902638 5192464 6375983 7548985 6406721 7222682 9063884 8334388 6665255 6726833
7589 6726833 7137742 6582158 8041353 6635302 7368093 6662614 8355672 8485695 7250931
7580 7250931 7750910 7821610 7590618 8330189 8044247 7815642 7394454 7189265 8004655 7307319
7570 7307319 6834102 7089423 6586284 6228060 8907415 6129288 7884790 10123517 7510703
7561 7510703 8369074 7658989 8643342 8477281 8672411 8056331 8329569 8377873 7807671 7788078
7551 7788078 7848441 8143409 8141245 8529196 8120037 8016443 7460681 8837042 6394538 7010830
7541 7010830 7886158 6764365 6912420 7180449 8374297 9137013 6732838 8319366 7744709
7532 7744709 7636981 9051594 8995414 8288295 8286767 7185632 8178101 7647739 8009686 6556073
7522 6556073 9166399 7190814 7526872 7404712 7862193 6559410 6656726 8945240 9296662
7513 9296662 7752873 7114751 8633292 8024727 8087388 7690109 7994962 7330278 8583873
7504 8583873 8117507 8205906 7953299 7793272 8032838 8700049 7780534 6493612 8794029
7495 8794029 8122706 9511783 8456260 8575071 8561956 7608644 7569617 7716562 7496924 7474920
7485 7474920 8210770 9750766 8585821 7031011 7781700 7457432 8767196 7488537 8123030
7476 8123030 8382798 8408768 7413072 7160550 8354482 8450620 7920156 6913140 8129142
7467 8129142 9587364 8271865 6782029 8187856 8226547 8270433 8616675 7437632 8726392
7458 8726392 6506148 7229337 8931434 9303971 7044822 8622763 7652492 9129521 8911010
7449 8911010 8363424 9120884 7855188 8447225 7644089 7554181 7949983 7833496 6985051 8406075
7439 8406075 7806740 8703465 8794259 8103653 7884697 8184454 8541192 7177455 9976046
7430 9976046 8130084 7029472 7923687 8386909 8872166 8055197 9009013 9390592 9565854
7421 9565854 7887976 8665774 8066899 7668357 8230197 9876406 9218397 9616869 7335261
7412 7335261 9900562 9148959 8337845 8401965 9821061 8783393 8528787 8745193 9381080
7403 9381080 8189121 8309139 8633338 9759735 7874151 8637522 7365121 8594908 7165793
7394 7165793 9335529 8641425 9747464 8662481 9348846 8766764 7353056 8574243 8238590
7385 8238590 7942646 9590369 8529430 9263960 8284599 9327563 9332694 10079051 7325532
7376 7325532 9314301 10004383 8722878 11175509 9684193 7900950 10603994 8657830
7368 8657830 10473816 7122349 9199888 8738281 8656378 8372916 8804743 9070302 6370138
7359 6370138 7447082 9118598 7679631 8688217 10196419 7950511 8625263 6720315
7351 6720315 8409146 8292007 9128508 7989269 9323031 7972703 9198902 8004951 7970710
7342 7970710 7336245 8642504 6998222 8024864 8649364 8071063 6693920 8928386 7919423
7333 7919423 7494086 7123349 7588919 8140404 6817783 7014470 9007818 7255420 7230895
7324 7230895 8811167 9001079 7119785 7192963 6531925 6810055 6937705 6779220 7498520
7315 7498520 8022111 6482245 7138895 6956275 6818129 6721522 6062514 7590255 7685415 8734538
7305 8734538 6091935 6138824 6874366 8518946 6714647 7672495 5800347 7911701 6285200
7296 6285200 7507028 8673032 6302315 7212365 6761688 5693346 8447506 6884905 7542076
7287 7542076 7247632 7518313 7652997 7088842 7764060 7474099 7397652 6830329 7976135 7236897
7277 7236897 6439823 7305843 7958678 7536767 7374184 5915011 6594308 6224067 8243376
7268 8243376 6533072 7074822 7203040 7163946 5856959 7491988 7531482 8029060 6038168
7259 6038168 7218652 7459905 8298356 5826316 5931181 7608654 6725214 7530317 6915577
7250 6915577 7096859 7227663 6279621 6584788 4976421 6271287 6229350 6833968 5921034
7241 5921034 7039719 7171933 5904785 6260005 5839836 6839175 5827314 5894186 7778446
7232 7778446 6267546 6309485 6709665 6553063 7000738 6589133 6481160 6799737 6574859 6127626
7222 6127626 5414936 6952638 6227497 6166857 6654117 6291347 7829616 8246717 8522067
7213 8522067 7309030 6531730 6792445 6648890 6581424 7427549 4663165 6991211 6218453
7204 6218453 7019972 6982999 6067483 7713775 7465629 7340585 6580151 5999734 7736550
7195 7736550 6621548 8001353 7673894 5131128 8254924 7561739 6160999 7038071 7430090
7186 7430090 6613325 6797014 7227667 8373224 7125343 5444915 6280440 7840098 5322276
7177 5322276 6124999 8033176 7858616 5675109 7418227 5684175 7985849 6709355 6806794
7168 6806794 6279036 6242765 6730283 6692411 8521344 6914847 6630562 5532615 7112498
7159 7112498 6686076 7063896 7778693 5711271 6441486 6069512 8176037 7880629 7658842
7150 7658842 6543459 6510402 7708935 7209868 6534796 6733322 8403600 8564443 7389440
7141 7389440 7278169 7008339 5549503 7699356 7320704 8528988 6946521 6917054 7115859
7132 7115859 9288890 6451565 7269307 8192723 7117999 8309263 8021542 8666872 8571388
7123 8571388 7658256 8416665 7209848 8662384 7838202 8033436 8023628 9797632 8183682
7114 8183682 7626494 6674296 7660490 7308302 8585529 7194407 7677026 8806057 7605946
7105 7605946 9593678 8632357 9373181 8801632 10098278 8401620 10250557 8530345 8599935
7096 8599935 8563000 9874634 8550095 8443498 9861507 8995029 10207067 9449471 9133880
7087 9133880 11035721 9844442 8903092 10263400 11344127 10588606 10334317 10284763 11755283
7078 11755283 10900111 9921907 9621775 9696862 10220392 11389787 9799453 10041369 8433346
7069 8433346 9533213 9754203 10036307 7962502 9680344 9174390 9510173 9821284 10398422
7060 10398422 10213917 10586155 10936518 10324982 10749581 10402166 8657146 10863282 10847480
7051 10847480 11091714 11210155 11223002 10435639 10771773 10678021 11514969 12095364 11885534 10534911
7041 10534911 12695560 11365106 12415852 13595432 11658405 11857436 11965794 12559129 11815982
7032 11815982 12427894 12088591 12987281 13358275 13619832 13137799 11709843 13868872 12559580
7023 12559580 12588015 12725818 14115281 14445865 14943975 14916988 15900084 14397606 14859246
7014 14859246 14932127 15472806 14219239 15576525 17636461 16110933 15996315 16092726 15241291
7005 15241291 17077222 17338123 15594973 17353031 17530093 18122530 16912852 18684565 18522712
6996 18522712 18902690 17952633 19838362 19643623 19985177 19152322 20932409 20750918 20786586
6987 20786586 22071982 22275958 23331626 23600364 24517960 24159066 25010551 24477943 26367491
6978 26367491 26055753 24082835 25559662 24307083 27022528 26511604 27180655 26635706 26876336
6969 26876336 26969191 25641699 26434162 27817731 28076760 27918900 28204028 27602362 28953698
6960 28953698 28993670 30263622 30976925 32499190 33453322 33485081 34768278 35505047 35595659
6951 35595659 37225860 36419152 36539496 37955840 36692033 36346134 36676658 36389038 34894917
6942 34894917 35703200 34780669 33288842 33180407 34771124 34860326 33093823 33001633 34337657
6933 34337657 35964772 35776027 36472753 36807352 37567063 38584945 39504371 40287220 40754852
6924 40754852 41939442 42571257 41238121 42541007 41701190 40768883 41272199 40635033 40108347
6915 40108347 40772502 38052055 37044148 37487623 37125780 37122977 36007729 35726176 37368357
6906 37368357 34983734 36740210 37298112 36962872 37287187 38529952 38337121 38886842 38659658
6897 38659658 39904932 39831844 39907176 39096341 40320561 40066125 39054609 38371422 39864243
6888 39864243 38019846 38086088 37741106 37572866 37180707 38302129 36907132 34525718 35215568
6879 35215568 35910497 35250553 35534181 35495731 34963520 35280232 36186592 34384669 33612076
6870 33612076 35735995 35886961 36940593 35757969 36792729 35333816 34897908 36731798
6862 36731798 34694297 35370370 34298305 35445115 34744687 34596122 34314415 34947661 32574708
6853 32574708 33315528 34212671 33634489 32578731 32971059 34026382 31932741 30724010 31536474
6844 31536474 31144460 31819775 32130593 32294566 30798525 30814763 31096513 32107704 30746038
6835 30746038 30824652 31799090 31609815 29470929 30850634 29357020 29354272 30929773 28756985
6826 28756985 30200571 29373273 29792342 27873313 28022510 28129880 26455782 28790328 28362495
6817 28362495 29571904 27230741 28624329 28472131 27253375 27796213 28265837 27728656 27586390
6808 27586390 28645430 28116244 25863669 25393231 25837922 26553511 26634767 24606398 26121915
6799 26121915 27715309 26630838 26829714 26787449 27351707 26902625 26695457 27942165 25170064
6790 25170064 27067348 25505903 26111805 25622163 26238159 27487695 25886587 26580486 25328488
6781 25328488 26685985 26871213 28220508 27733097 26184466 27003509 27197181 27114138 26622205
6772 26622205 26721071 28110186 28698508 27990466 28594275 28710336 28096122 29560096 29823933
6763 29823933 28856599 29625633 29876533 30983664 28612618 30601380 30558412 29453274 30013099
6754 30013099 32613595 32651272 32699374 31143328 32884779 33988443 33567190 34885378 34018472
6745 34018472 34183232 34744129 33823321 36200502 34694959 34617793 33869564 34952066 36286758
6736 36286758 34619606 35741263 35996411 34314269 35698458 36061202 33833942 34334907 35624370
6727 35624370 35509982 36572945 35427938 37221204 35826984 36154026 36454490 35775600 37953483
6718 37953483 38073006 38876118 38813816 40614358 41401527 40738859 41042303 43430370 42250960
6709 42250960 41847985 42411566 41684783 42703401 43729023 43846691 43577896 42513666 42961184
6700 42961184 42520214 44352344 45625587 45338620 45766477 45150502 47604332 49349171 50424194
6691 50424194 51101245 50001493 53321492 53807668 56521372 55260972 58400547 58512757 58346736
6682 58346736 59165620 58506349 58600328 57610060 56961011 55591535 56250143 55751887 53973857
6673 53973857 53487483 53833850 54768850 53714532 53158784 53937030 55338769 54812438 55394711
6664 55394711 57181174 57126247 58868769 59357021 61390923 62597354 63282605 65438492 67353515
6655 67353515 65109776 67371042 67711407 66324255 66608165 67857004 67163073 66728519 65220737
6646 65220737 67218592 68990480 68284702 69121169 70510882 72672577 73658803 74446689 77109292
6637 77109292 78197019 81916126 83661237 85433365 87607731 88531050 88943934 89043091 89754347
6628 89754347 88101273 90524232 88494024 85926409 86255390 84713923 84177626 83964129 84461902
6619 84461902 84586310 85646566 86830168 89267818 89515625 92178969 94852437 97729769
6611 97729769 100917305 105219427 110352559 114729174 121596843 124302335 125917192 127855753
6603 127855753 126751546 127880659 125797397 124013283 120084292 117329724 113210279 110200401
6595 110200401 103712551 101833841 98324564 98713561 97166707 94948530 95038387 95906125 97122322
6586 97122322 100269398 100227232 103553638 108107586 111681560 116213228 120418750 127445214
6578 127445214 131399087 132708439 133975402 134689069 131319658 129984385 129545903 125395650
6570 125395650 120275594 116188253 111666573 105989061 100787244 98587712 96952827 92250494
6562 92250494 89808610 88103911 86988468 85723154 84166964 82843078 82630743 84281678
6554 84281678 85087635 86665684 86753459 87980414 87667089 89514499 90731086 89406747 88820229
6545 88820229 88056369 85152317 84675178 82723991 78577089 77500832 75154674 72420506
6537 72420506 71731601 69634967 67635740 67763220 66604462 62878911 62596812 61079284 59368082
6528 59368082 58816201 58840650 58317042 57515193 57341054 56041794 55614916 53753013 54136140
6519 54136140 52751860 51746258 51712227 52236464 50900892 50231602 50053590 49003557 50341730
6510 50341730 47795988 47342878 46629256 45447314 47014068 45796338 45177724 46201982 43750513
6501 43750513 44046888 43881570 43628060 43197003 40922463 42002142 42692802 43301795 42203084
6492 42203084 43052889 42760740 41687401 41097401 40776713 40349586 40676451 39522185 40599431
6483 40599431 39883744 39057588 39692989 40353804 40167815 37590689 37601208 39361228 37205592
6474 37205592 37250286 36422829 38194394 38699010 38220656 37119847 38646712 37170268 39325683
6465 39325683 38001927 36824571 37183710 37242133 36106962 38237344 37592283 37401150 36410732
6456 36410732 37954941 38605327 38481258 36169047 38584592 37932609 36790885 38692950 38022272
6447 38022272 36700454 39217699 38344014 37346625 37510838 39931372 40051299 39217742 40451920
6438 40451920 38639291 39144637 39935943 39550157 40354880 41233841 40951937 41670860 41164258
6429 41164258 40731339 41018324 41739007 42709842 41986154 44597750 45034975 42814825 43841443
6420 43841443 43664811 44185669 46288477 44228054 44200435 44430235 45091159 45699541 45825502
6411 45825502 46063413 46632659 47314157 48327295 46554247 48224494 47663400 49062271 48317011
6402 48317011 50297649 49810639 51810332 50711331 49789141 51579632 51826137 51687806 52246014
6393 52246014 53429009 53123259 53289581 54688982 55029680 54467399 54415394 54182928 57795737
6384 57795737 57810960 58951966 59277619 58883880 59157815 60009392 60048751 61095858 61019962 62304776
6374 62304776 62592692 63897681 64923676 66498767 65524888 66378335 68825925 67615720 68548426
6365 68548426 69999468 70279292 70170827 71821061 71621638 72755437 73095531 75818319 75570280
6356 75570280 74684177 75977949 77353557 77655659 76897403 79948248 79546324 79848075 81040471
6347 81040471 84306270 82213818 84753643 85289014 84460118 85925834 86978589 86604595 89771572
6338 89771572 88849584 89482522 90622500 92485440 93568296 93966479 94822989 94884952 97337116
6329 97337116 99278863 99316056 101291239 103491218 104904140 105655318 108020944 108447022 111770451
6320 111770451 112516143 115908172 116783704 119072491 120482005 121337879 124124313 126439788
6312 126439788 126693765 127856532 129033432 129561397 127323121 128974451 129856288 130815783 130381655
6303 130381655 131615562 131143908 130827710 132204816 132305422 132900997 134772522 134165159 135158839
6294 135158839 138087815 138083245 139895179 140451404 139828229 139193991 139852908 139858390 138283330
6285 138283330 138906313 140324935 138525540 139552103 138973084 139609805 140175420 141626032 141546928
6276 141546928 144120127 145120686 148426007 147118100 151039536 153669189 153943761 155117354
6268 155117354 155434527 156264511 157597972 157680327 156478918 155536540 155599458 155144526 154221308
6259 154221308 151692150 150166631 151001729 150655769 149952103 147591316 148681575 148318818 147716712
6250 147716712 145900074 147791003 146840145 144796293 142982051 142579367 139762692 137998219
6242 137998219 133775147 130780882 127179010 125723231 122074005 118823167 114002556 111430582
6234 111430582 108645626 105875486 102771011 100396433 98296784 96318954 94595774 92208284
6226 92208284 91273036 90976726 89502727 87606702 87668735 86994219 86151253 84553746 83422505
6217 83422505 83853292 83079773 85048502 81879222 83142106 81778180 83894917 84357359 84506973
6208 84506973 84397111 84482733 86191677 85425004 84702144 85573515 86726818 85968086 87837529
6199 87837529 87600720 86896731 89283540 88936205 90229763 88849995 89699173 90095200 91587831
6190 91587831 91519385 93236387 91996780 93955883 94322727 94488811 96744774 95684881 98887666
6181 98887666 99175309 98800473 101653134 100189219 98335753 101517553 103657100 102724634 103897606
6172 103897606 106363332 108009272 107293421 111320441 113848058 115702350 119196670 122315504
6164 122315504 125065990 126759183 131403129 133120707 137474659 140010651 140928439 141147737
6156 141147737 142921350 143047994 139981123 138604978 136734803 135630301 133200925 128510867
6148 128510867 126186402 122009897 121008627 117908743 114608421 112026254 109157082 107121582
6140 107121582 106070929 103259317 102791311 101314157 100043544 99928784 100691971 100068131 99217936
6131 99217936 100304711 101225174 103700294 105171642 107462584 109665367 113015546 117573423
6123 117573423 120139179 123729202 128355013 133210037 137486755 142721891 146910196 149366304
6115 149366304 153648923 155811513 154963681 154158403 151398260 148293023 145297430 139805876
6107 139805876 133971044 128965056 124477059 118015647 110456075 106257791 100659446 95283835
6099 95283835 90385798 86105116 81972020 79033867 77320321 74537863 71348556 72875160
6091 72875160 68613669 66797803 65656432 66499183 66178073 66618899 66815428 66768153 66631446
6082 66631446 67168950 69828268 70478242 71257335 73203441 74339270 77077546 77666197 80927208
6073 80927208 81337389 82977616 84666569 84128699 83444741 82340831 82221120 79669464 78695703
6064 78695703 75061977 73114894 68749970 66925718 63929640 61562789 59874874 56924713
6056 56924713 53448385 50788804 49421211 48728620 46646570 45043714 45271974 43210178
6048 43210178 42400714 42358483 40573440 38877896 38353801 38018312 39169513 38157124 37175244
6039 37175244 37612202 36153622 37005271 37236542 36230463 37268511 38075152 36911492 35038219
6030 35038219 36977019 35487092 36313316 35913589 36554438 36226087 35896421 36341542 34477043
6021 34477043 37227652 35721052 37014934 36568861 36487635 37155030 35013786 36353713 35528019
6012 35528019 36372504 37311002 36307783 37401768 37143948 38079273 39388342 37847999 37184097
6003 37184097 37469954 38251738 38891406 39711910 38710823 39445694 40328635 38365812 40733329
5994 40733329 40900305 41774256 39899662 41688406 41969579 42195463 42482296 42990729 43247431
5985 43247431 43070581 43525768 45442323 42615037 42894391 43301882 43958031 43604178 44796136
5976 44796136 43594747 44610706 45927935 43520585 45097128 44269403 46036709 45270128
5968 45270128 46282705 46835626 45837362 46826001 47475174 46413397 47265133 48029902 49808989
5959 49808989 49198895 50893433 50928308 51454855 52286331 52293924 52080718 51317124 52869606 53245161
5949 53245161 53412126 53715845 52903439 56452439 54442251 54243155 54085958 55123570 54671873
5940 54671873 55130567 56103629 56215529 55947721 55370472 56769512 55703323 57707714 56576110
5931 56576110 59824392 58788011 60890384 59310021 60616561 60740518 61325300 62100325 64740890
5922 64740890 63418688 64874644 66997946 66014625 66814360 67917703 68849182 69716772 70793384
5913 70793384 70067198 71962346 72765863 72352117 74745776 74013675 77718711 75887670 77071927
5904 77071927 79999265 80588602 80823703 82293462 82451337 82442014 84715171 87413847 87377590
5895 87377590 88721459 88988253 91273277 91648452 93068550 93246872 94140953 95969317 96675735
5886 96675735 98312589 98608552 100021982 98789784 99408861 101255499 102116522 102448920 103572096
5877 103572096 105474143 105461313 104995735 106002952 107459123 108171836 109862772 110811952 112749417
5868 112749417 112011550 112489713 114051856 114919378 116312428 116480943 116728247 117558195 119021369
5859 119021369 119977422 120303295 121417788 121860018 122795453 124003583 125139083 123424897 126140516
5850 126140516 124516304 124830922 126778602 126331187 126041845 126301975 127926010 130753370 130187873
5841 130187873 132973064 132462834 133707598 134906293 135203292 137257330 138927528 141488201
5833 141488201 142964517 143834747 146728692 149393748 150592695 151629450 154683399 158131259
5825 158131259 160564055 161081265 165065875 167243612 170939543 173662169 175802615 178799984
5817 178799984 180392070 183673041 185853502 187590112 191537920 192822823 194808225 196365088
5809 196365088 199182869 199653936 201729629 203871573 204660985 207989389 210381799 211946705
5801 211946705 213034922 217716755 220262408 221418440 225016764 228945630 232612498 236967757
5793 236967757 238494684 244613663 248424884 252190870 256152998 259273611 262255829 265586619
5785 265586619 269782339 272828448 273689974 277348793 277528197 278267321 278935214 277908514 277159310
5776 277159310 276193968 275191273 271845409 269981755 268098548 265585239 262794726 260517834
5768 260517834 259578358 256413476 253053555 251209820 249777385 248616925 247383938 246684966
5760 246684966 245523612 245184281 244823515 243829898 241356520 242298831 241079940 239891134 237525077
5751 237525077 237370910 236285923 233953376 231596843 230764249 227712663 225921995 224748173
5743 224748173 221945108 220542757 220239576 217580008 215012920 215017674 213184441 212989023 212143712
5734 212143712 212097945 210960157 211783876 211878990 211916234 212518297 214822696 215040142 215425989
5725 215425989 217288019 218127833 222066514 224213198 225584530 227551056 229228697 233322321
5717 233322321 237640087 239956037 242891313 246396264 251632157 254185414 258947610 264286965
5709 264286965 268424513 272827858 277171534 281773879 285333735 290126472 293468663 296039320
5701 296039320 298760278 302028628 303142104 304410194 304665422 305570629 306878768 307308496
5693 307308496 306757962 304905656 304865295 304159800 303805546 303020394 303421960 301767209 300535378
5684 300535378 300774157 300160905 298702925 297223719 296273098 295356365 294516259 293860461 291811686
5675 291811686 287872478 286065175 284554411 281666539 277771515 274155608 271099349 268662640
5667 268662640 263278813 259179594 254714036 250302690 247930809 242130533 237180985 232783011
5659 232783011 229623112 225754197 222049183 218958054 216163750 211368613 209671373 206152032
5651 206152032 204024700 201796814 199723303 197370959 196113870 194215892 191750168 192062425
5643 192062425 190052244 189117251 189292013 188147163 187470839 187002694 187336143 186756166 184489846
5634 184489846 183713951 183432342 182481004 180288098 178872329 178328049 177170232 175495901 174308763
5625 174308763 171441879 171492928 169461189 168894453 166703842 166038936 166823983 166220504 165357436
5616 165357436 164306142 163730859 163917472 165626805 164208895 165814645 165731593 166519284 164980075
5607 164980075 167107116 164297758 163689083 162997627 163292494 160912798 158954782 158439549 156479809
5598 156479809 152742953 151185264 147675123 146502392 144579802 143982393 140554881 140685873
5590 140685873 139269488 138751747 136544144 136823269 135951862 134307440 134088444 135449925 134086270
5581 134086270 134890538 135988877 134936248 134439859 133811261 134204258 134388794 133289902 132559058
5572 132559058 129937378 130431388 127883209 126688362 126553605 126296199 125247923 123168879
5564 123168879 121500045 120822651 121370754 119333894 119254977 119077765 119744168 121945401 120527689
5555 120527689 121264689 122230173 123949342 125305212 124802922 127939410 130355635 130943406 134283980
5546 134283980 133514682 136457715 138993144 138397606 141777515 144536473 146225055 147854876
5538 147854876 148791291 151537215 154635247 155563212 158376962 162392820 165110071 168305205
5530 168305205 172352530 174822631 177699299 181719597 183695112 188155794 193460199 195408632
5522 195408632 198588554 202628624 205957932 208220330 209485975 214994022 218005538 220006844
5514 220006844 223790172 223945729 226202619 229936674 232071997 231365383 234395095 235852747
5506 235852747 237713816 238010483 237547514 239930983 241443873 241228381 240385347 239455312 240492375
5497 240492375 237416894 236260244 236189102 235477195 232893618 230416090 227693677 225746780
5489 225746780 223577556 219658539 215110030 213709367 211544578 207296390 205240180 202112563
5481 202112563 198683115 195567560 191954275 189033879 186687806 182675952 179879299 173808306
5473 173808306 173258609 169712057 166146997 163044788 159533133 154643627 152283764 149639132
5465 149639132 147562798 143706275 142229152 138491058 137313068 134402326 132000519 129879259
5457 129879259 128462283 125103762 125742907 123011028 122813732 119303420 120431297 119215068
5449 119215068 118182536 116317964 116728131 114777372 116211325 115369966 113549491 113286526
5441 113286526 113082993 112567881 111361892 110675658 112968987 111450615 110529507 110576251 111048180
5432 111048180 111977522 110212916 109705236 109729578 106360822 107026751 106759580 105779032 107494000
5423 107494000 106380876 106312968 107985119 104782173 105525316 105406054 104369475 104364127 105530925
5414 105530925 104462351 103589219 104355800 104386845 104659811 106337089 103978587 104053319 102405192
5405 102405192 103463830 104232163 102113386 103235431 102258616 100994127 100896261 102058655 99552098
5396 99552098 98270437 98847126 98213410 98408550 97579030 96124658 97027500 96250065 94247841
5387 94247841 93019830 92703358 93355731 90648007 91053117 91810199 89799626 88631766 87684081
5378 87684081 87619426 85696392 84493859 84156655 83609691 82039086 81951068 82356091 80664563
5369 80664563 80774922 79622692 77432303 77738424 76344340 76208925 75722510 73624471 74892339
5360 74892339 73455466 73323548 73265868 73068025 73402355 71968923 72763567 72060197 72215010
5351 72215010 70169056 69380840 68838455 70330930 70662690 69652898 69790284 69704580 68967313
5342 68967313 70094276 68322087 68380866 68578433 66467663 67746928 67747323 65033016 66247787
5333 66247787 65562126 63983250 63335466 63349757 65191116 63064284 62315002 62961342 62173952
5324 62173952 61423998 60820045 60715645 59748322 59168356 60468290 58306545 57121068 57257226
5315 57257226 58082562 56208475 55625602 55273434 54569905 55808746 54336856 53796983 52154660
5306 52154660 51332464 52777386 53449247 52866621 50360779 50909785 50824627 48960012 50566765
5297 50566765 50041787 48967619 49364734 47087391 46727356 47394688 47834847 48056122 47556065
5288 47556065 47241118 47501288 46180623 46588541 47120425 44906192 45440551 45102673 44100367
5279 44100367 45216472 44536931 44277691 44871861 43220860 42851244 42052274 41323468 41698249
5270 41698249 42716182 42242090 41800923 41276743 41060353 38843961 40214360 39828166 40341042
5261 40341042 39699083 38127616 38438248 37764964 37402598 38337054 36922666 36111085 35668503
5252 35668503 35038504 36626441 36965987 35344867 36064472 36293571 35198736 35380699 34623676
5243 34623676 34202683 34392395 35770981 33283163 34567747 34087627 33381167 34266365 33794677
5234 33794677 34093407 33550440 34046863 32788977 31986417 33482064 33806161 32662130 31926469
5225 31926469 32048060 32762126 32858716 31852805 33982105 32634654 33741532 31642711 32335658
5216 32335658 32433611 32214481 32114693 33787323 31918599 32480456 32708210 32940745 32307873
5207 32307873 33485378 32373336 32265841 32819315 33258076 32295804 32684019 32019384 32039558
5198 32039558 33549949 33157415 31107828 32153344 31989142 32979773 31685705 33234125 32767825
5189 32767825 32875220 31280732 31827359 32517182 32618634 31393241 33125488 32872855 33074143
5180 33074143 33678652 34280708 32467694 33350426 32979626 33494922 33863966 32871650 34347163
5171 34347163 34228506 35299419 33838761 35411291 36251632 36415244 35299056 35515051 34879071
5162 34879071 35707735 36146875 36917939 37188683 38320819 36221596 36146788 36155764 38713040
5153 38713040 38899311 38252454 38713554 40916387 38833259 40554520 41031681 42276093 42267015
5144 42267015 40560934 41729561 42382696 42708509 43776835 43209769 44873669 45504999 45334073
5135 45334073 46323323 47631888 47512310 49002840 49954046 52255975 52630957 53310272 53395437
5126 53395437 54456552 56180965 57900862 58452591 59889035 60641068 62719419 63721470
5118 63721470 64231484 67141701 68370587 69852151 71679262 75200342 74619881 77475464
5110 77475464 78055507 82483325 82419967 84000239 85646180 88534570 89944562 91759190 93880802
5101 93880802 94220888 98819282 100962321 103374407 104980696 106120224 110150688 110174227 112752536
5092 112752536 116130460 117216011 119640694 122682575 123817646 126688399 127919023 129721591
5084 129721591 131571653 132807566 134581477 137249677 140158334 141915863 142956616 143732524
5076 143732524 147540336 147466541 151771721 153340151 153980793 154649231 157639815 160866432 160754444
5067 160754444 163384835 164315346 166942941 168851039 167393439 172243301 172406532 173584869
5059 173584869 173776304 176997062 177687188 179871049 181310351 182065529 182974365 184917078 188305016
5050 188305016 188243633 190721226 192808359 194460842 194686793 196377628 196519076 197666538 199849213
5041 199849213 200195233 201174525 202775094 203377487 204253183 203510155 202491835 202761363 202727782
5032 202727782 204166762 203751163 204549839 205697846 205691244 205272817 205576132 206286944 207050518
5023 207050518 207159187 207043067 209842312 208892730 209911763 212144351 212642785 213579479 212215863
5014 212215863 213621320 213320609 213932583 212780185 213618968 212194567 210564616 209424206
5006 209424206 208819896 207499184 206554156 205769042 204036957 202295293 201677416 201873531 200702421
4997 200702421 201292012 201022756 200268884 201823465 201376329 200494063 201615282 201502982 201277321
4988 201277321 201339518 201270605 199399303 198759306 199911367 198454156 198244013 195840917 194363487
4979 194363487 192161457 192173759 188285077 185919815 184116427 181246726 180497535 176590704
4971 176590704 175859963 175985473 175578363 175173665 176583776 176807103 177829584 178076703 182995272
4962 182995272 190522005 196499891 204398844 212195241 224051555 235028912 249392713 266771536
4954 266771536 286278974 309830561 331992094 349515206 356934922 354417916 350011710
4947 350011710 342845076 332828293 320044651 302925351 282972995 256590102 232976294
4940 232976294 210915772 192351776 177932903 164936252 152050634 141441006 132870257
4933 132870257 124316926 116613203 111316825 106629235 106666880 102265601 99659349 99200556
4925 99200556 97363142 95378035 92875535 92796457 91023840 91929481 90753956 87512898 88154272
4916 88154272 88004592 85032700 85104731 84193333 83022199 82228762 81217204 81028894 80133006
4907 80133006 78405114 80799205 79647766 78428643 79877040 78407583 79024865 77505478
4899 77505478 76555135 78490386 78226768 76416340 76683591 77291506 77930700 76308031 76865992
4890 76865992 78286157 79938536 77994084 79205803 78348782 79260513 79857050 80883389 81438076
4881 81438076 82782082 81728312 81503763 84885144 85772748 85078952 85153219 85342420 86740845
4872 86740845 89037433 89549123 89591596 90626128 91973818 93599964 94113040 95393173 98001645
4863 98001645 98964317 100331754 101553195 100431946 102954353 106213555 106853102 108768867
4855 108768867 110288985 111833134 113265308 116297355 116485167 121198560 123294042 126777624
4847 126777624 127810128 128682490 132031964 135736878 138527509 140786737 144392055 148112236
4839 148112236 150281168 154238488 157005310 160564722 162946223 165994672 171493396 173231992
4831 173231992 179433689 181188988 184822406 190819368 193726828 197626750 200618133 204857847
4823 204857847 211417173 213331728 218251634 223175385 227383016 231480943 236630201 240920272
4815 240920272 246783236 251322737 255759295 260722643 264372776 269532307 274774662 279016369
4807 279016369 284417961 290031695 294057407 300152282 305751127 310559171 316208982 322105870
4799 322105870 325941616 330258399 336784407 342387843 347027396 350283305 356370027 361737173
4791 361737173 366386566 374267025 379480687 386473577 392002548 397427771 404412907 407697831
4783 407697831 413439086 420343068 424827780 429526371 433466778 438156223 442763064 446335741
4775 446335741 451485807 453001004 456762913 460212810 463945430 467328381 470943657 472988124
4767 472988124 476355425 478955715 483516599 484132122 485833888 489474400 490554324 491380538
4759 491380538 492908228 491188801 492565091 492961051 491504487 489348914 489539210 488739729
4751 488739729 485370990 484654492 484861115 482978278 480955422 478765107 477076655 477437554
4743 477437554 475926121 473029088 471949875 469319870 468661337 466292469 464565826 462747544
4735 462747544 461430198 457199148 456147903 452572753 449097294 447540652 443811129 439437273
4727 439437273 437657140 434602346 432319186 428007498 424779283 421527831 418782631 414249102
4719 414249102 413015451 409504100 404759837 401404950 400027015 397459203 395170206 391002280
4711 391002280 389097836 385626116 382319575 379681866 375580533 372884989 371303039 368843329
4703 368843329 364313168 361362346 357876649 356103463 353612645 352190968 348960282 347770470
4695 347770470 343596127 340773581 338611469 337317078 334380894 330746041 328542796 327228159
4687 327228159 322867973 323375785 319060835 318219941 315988817 312415104 310786049 308801166
4679 308801166 307155770 304355279 302680214 301368699 297303517 294576684 292314984 288963020
4671 288963020 287343614 281602466 279959459 278091915 272928138 270874349 267640153 262911539
4663 262911539 262354082 258273847 255704626 250339495 248999065 245604962 240882662 239157933
4655 239157933 234740554 231444139 227977429 224934183 223083586 219300220 216171277 214289859
4647 214289859 212605288 209736773 206566921 205544939 204410603 203465491 201705885 201680932
4639 201680932 201314844 200324564 198500303 199138434 199486252 199644315 195344826 197950392 197475436
4630 197475436 197222440 196847393 197039205 196653931 196374616 196673753 196308316 195235598 193779253
4621 193779253 194124896 192908918 190878544 189403192 189932090 188327707 185445767 183540776
4613 183540776 182858057 180651944 177091053 176609301 175462296 171923953 171579512 169469400
4605 169469400 167129237 165971771 163144696 161179316 158443863 157549939 155037921 152042146
4597 152042146 149901738 149702481 146610470 146211421 141737437 141514307 140979340 139099921 137076031
4588 137076031 135794029 134082639 133846170 133617862 131948067 131652122 131658922 129901752 128768080
4579 128768080 129087605 129694363 129177785 127276732 127855537 126763253 128142897 127947110 126416647
4570 126416647 126629617 126625838 128433410 128423062 128542046 128661066 129087541 130897412 129740810
4561 129740810 129222255 129827474 132128585 131731589 132159493 131923496 131550136 132051344 131566099
4552 131566099 132894935 133091883 131370279 133036563 131821034 129657854 129955760 129397115
4544 129397115 126598021 126941561 125204813 124891941 124477912 122337590 121452876 119725802 119988642
4535 119988642 117975829 117050991 115930516 114503465 114963555 113508823 110469009 110971845
4527 110971845 110831344 110815428 109566321 108737806 107586294 107021095 107412655 106113956 106553312
4518 106553312 104585440 106310970 106126822 106435155 106571091 106647522 106813938 108123824 108544112
4509 108544112 110855601 109796161 109352089 110495357 110838112 110410474 110383497 109297484 109113788
4500 109113788 106144115 106046919 107141054 104117814 102721411 100947251 100045052 97731059
4492 97731059 96781862 96145885 96299607 93730830 92833637 91571250 89840860 90605692 89895903
4483 89895903 89589147 89017989 88158827 89577629 88475822 88636700 88049858 86531379 85350504
4474 85350504 85274489 82435826 80229874 78648350 76328493 76496128 71620691 70295942 67944051
4465 67944051 67441107 65002698 63972526 62842827 61466844 61385924 60025688 60288791 58424737
4456 58424737 59741254 59130379 59724818 59188968 58766155 61318224 59589559 59740234 58657304
4447 58657304 60086448 59351995 59214464 57507388 58656773 56290535 55312860 52773644 52949775
4438 52949775 52210501 53428813 51024204 50968903 49706449 48602649 50276846 48268346 48517676
4429 48517676 49382019 49453937 48698365 49984592 48924548 48850780 49644290 50982147 52382761
4420 52382761 54197619 50876467 52889944 51440213 52881751 53057602 53669794 52310320
4412 52310320 52574753 52244048 50035846 51609406 50928363 52958438 51871659 52578208 51949391
4403 51949391 54527433 55801412 57981370 59869092 62223495 63647792 64725279 65623780
4395 65623780 67904832 68890455 70026140 72087186 70696727 72172904 69703087 68003469
4387 68003469 67257225 66042621 66023667 64620144 63068525 62377902 60148599 61668021 60668018
4378 60668018 61257334 61512970 63821330 63680623 66041493 68821556 72720559 75278600 78353055
4369 78353055 81885973 82754669 84564113 85797378 87440024 89366595 92458233 92988108
4361 92988108 94384353 95023318 96322665 99812230 103946500 109481345 113915491 117053640
4353 117053640 118228880 117460719 116863840 115106128 112123507 110349505 108509834 103980811
4345 103980811 99807605 95227820 92629226 90608133 89274164 88151960 87773799 88218452
4337 88218452 89705355 92790997 97265436 100743685 105612411 110047084 117637082 127965200
4329 127965200 140299333 153021447 167828725 178411635 183607687 185826026 185044774 183679100
4321 183679100 181728981 177663859 172896251 165784230 151779033 138611246 131164379 119573072
4313 119573072 110996329 102830604 96345111 90563731 85603585 79621913 77310237 74107218
4305 74107218 72758475 73451343 72919950 76623962 78917114 82852181 89132417 93864453
4297 93864453 94081363 93885017 93168444 92263003 89399769 85494647 81332632 77307005 69870388
4288 69870388 64973995 58196918 53218450 48678978 46507887 43435386 41527161 39448668
4280 39448668 36743353 35409483 31229793 31245613 29934361 30067960 28772907 28336950 26375481
4271 26375481 25485426 25832878 26759465 23957750 24601980 23759770 22329583 23655077 22628920
4262 22628920 21996423 22798025 22339327 21096446 22614873 21141173 20202197 20851148 20084054
4253 20084054 20543316 19924317 18859592 19356487 20133206 19809999 20410658 19333799 18121939
4244 18121939 18291300 17691294 19182490 17543631 18666227 17878862 18384872 17511862 18051472
4235 18051472 16836569 16814814 17176149 17427631 17383417 16333630 15934673 16859310 17414389
4226 17414389 15232425 15546299 16260532 15926432 15582815 15758529 17332001 15786519 16328853
4217 16328853 14731560 14267220 15156901 12678683 13615420 12326810 12720534 13741153 12974732
4208 12974732 13117377 11966440 12195952 12866933 12034348 12037619 12206827 12777539 13028130 12267665
4198 12267665 12229635 11870275 11154669 11945661 12182923 12065501 10249241 10332723 11873751
4189 11873751 11834605 11228379 12684917 11015512 12507723 11135002 10622237 10092865 10530335
4180 10530335 9988142 10175182 10179653 9594451 10404217 9819379 10430033 9219101 9507154 9514908
4170 9514908 8296259 8660207 9103153 10154792 8958850 9190533 10362970 8344597 8221189
4161 8221189 8557511 6981084 8545478 8630867 9318146 8356929 8198798 8391883 8406005 9106601
4151 9106601 7519986 9007687 8130411 6528139 8968372 6272992 7667548 7202743 7292550
4142 7292550 7151645 8104377 8226518 8132156 7159616 6751008 5792105 6132557 7356991 5224362
4132 5224362 7450216 7666513 7777690 7480833 7143416 7483357 7076072 5936188 8612003
4123 8612003 6689868 7827543 7763817 6984087 5729857 6584790 6339929 8024965 8632745
4114 8632745 7356816 7192649 7250002 7860387 7256959 8020922 9250167 8714166 6330017
4105 6330017 8458888 8565228 9129483 7709379 9122509 6958377 7355178 7502779 7083325
4096 7083325 8810400 7282254 8466280 8622586 8790071 8059372 7894574 7132541 7175570
4087 7175570 7710125 8008163 8266500 7526140 7692548 9239381 7695083 8432409 8888005
4078 8888005 8509293 8237446 8947949 9005602 8200129 8956305 8425575 7660882 9392023 9872842
4068 9872842 10114468 8929083 9560889 7400750 7742199 7551234 9177798 8782290 9867066
4059 9867066 8674764 9787870 10063005 9506991 9212487 8090944 9065773 10078006 9403371
4050 9403371 10185962 8628915 8932658 10799433 9149117 10303950 10897863 11423847 8902979
4041 8902979 9586633 10577233 9749269 10445285 10557800 10328653 10883872 11914711 10967255
4032 10967255 9842027 10805183 10725246 9482222 9801929 11836930 12138825 12284360 9630172
4023 9630172 10803981 12429612 11088649 11890563 12623080 11331848 10046303 9690667 10871382
4014 10871382 10005088 8887501 7843865 8898842 8162897 9427408 8723979 9638858 10457455
4005 10457455 9186983 9724011 9463948 7855316 10454206 9507429 9469391 11113375 9985367
3996 9985367 9254328 10806148 9749668 9380942 10116989 9475710 9679675 9044038 9813042
3987 9813042 8871523 9817893 7942555 8671199 9286065 7452988 7552850 7543059 6396920 8048351
3977 8048351 6695404 7785883 7150093 5948329 7493287 6775525 7395728 8149679 6239504
3968 6239504 6003203 5843859 5465249 6347556 4610654 6081895 4430322 6336411 4666372
3959 4666372 5715833 4249218 3438031 5046354 3455780 5961853 5745411 4264653 3163566
3950 3163566 3210273 4838989 2648815 3421917 4079084 2583977 4983640 3415426 3302301
3941 3302301 2979234 2158776 4239544 3103043 3389209 1625205 3289833 3798153 4752452
3932 4752452 3232935 2902125 2465591 1635974 1806242 3075245 2821623 2863550 4021646
3923 4021646 2677422 1286889 681924 3014231 3093496 2737113 3704285 3433668 2543920
3914 2543920 2690029 1581414 2796272 2052972 2644260 2011945 1911223 3447594 1453035
3905 1453035 2826304 3139059 2312142 3903515 2805806 2388021 2468231 1818879 1394557
3896 1394557 2579013 2003645 2682887 2609223 2269109 2536905 2040224 3428976 1976646
3887 1976646 1715181 1313503 1098682 1721801 2878925 2754638 1385525 2233258 1233761
3878 1233761 1298587 1465839 107526 1092150 2214900 3245430 1847489 2909131 3133318
3869 3133318 2336768 1059637 1395221 1046869 1485281 381732 1426931 2185906 2325492
3860 2325492 1819165 1273555 1730053 1599368 3847610 750673 887940 12771 724969
3851 724969 1261080 534168 2821611 137925 1026668 1486517 2992390 1675051 1840574
3842 1840574 1034861 1869621 1359041 1108403 1050336 1173901 700993 1270713 1836676 1354940
3832 1354940 2488799 922703 923653 1492909 1943094 1294114 1732117 2360600 3333784 897930
3822 897930 815474 1364801 1682096 1709080 2340442 1893508 1710325 2677762 1171344 2583935
3812 2583935 2248176 1360569 1904065 1096849 1319166 691543 843310 1360327 246139
3803 246139 1637047 2201595 1994091 2909731 1601328 607267 1930890 1823795 1737039
3794 1737039 2534425 1711359 1047530 1281781 2467665 2168859 62782 1552363 2470122
3785 2470122 1237887 1701593 2529100 2635800 1025078 1322232 1780566 1689597 794730
3776 794730 -22433 2092146 1373654 2349145 2289989 1650601 1968316 2290425 363549 1851092
3766 1851092 1023705 3043534 1600307 4002727 1606724 184596 673894 142139 2259653
3757 2259653 1389222 2518618 2687745 1549588 2674564 773720 2648974 1937789 1461503
3748 1461503 2955130 574460 1564986 1176274 874135 251599 1557357 2345317 1812999
3739 1812999 605446 1651656 998918 1962676 4092823 1551671 959176 1869149 2214915
3730 2214915 1914838 1735082 2280918 672152 1478829 1958392 3264586 2321326 2056691
3721 2056691 2067197 2620962 300660 1317341 2757663 1349738 7542 2351402 2024981
3712 2024981 1153413 2290533 -566155 -481608 808261 1392980 1911179 981280 772196
3703 772196 1698784 1224359 1330655 223922 1325105 1440468 1597176 189823 2516502
3694 2516502 1306247 838275 2146606 1609789 697300 1860503 405996 2390451 677821
3685 677821 1011782 878232 2313938 1604472 1026852 1912044 792676 709797 1175004 2598054
3675 2598054 563880 1090748 1198530 1290529 1604875 774320 1052875 1113644 1553100 602702
3665 602702 1910365 998819 826719 876177 1052363 512617 1637513 590708 1498373
3656 1498373 2516400 3548652 307374 1133382 838948 1814838 297769 4158755 876907
3647 876907 1039458 1916678 1370617 1470793 2800653 2995914 1079975 752544 1434139
3638 1434139 1450201 2253062 3164224 765052 1180021 1819603 2695579 2026377 2322998 1424648
3628 1424648 1817732 1718075 2059081 2115066 3665048 2040943 1761414 2146006 3191544
3619 3191544 2802757 2928453 2472431 1652601 1830110 1769049 2032545 2010378 2533570 2689038
3609 2689038 740842 2203485 410958 686718 2617103 1514125 2070474 2551731 383518
3600 383518 1324456 1960498 -67032 2095020 2226274 2390973 1849837 1256517 1505362
3591 1505362 -429641 1175857 215997 2531693 503928 2364564 811001 930912 372604
3582 372604 1200198 399638 904352 37002 1649507 769659 2563473 1562057 1116083
3573 1116083 824113 962850 -11728 2879456 1899258 1321906 890941 3020136 2110963
3564 2110963 2139000 2087942 1827733 2203118 3033860 1981834 2974040 2872285 1438299 3462954
3554 3462954 2805662 2071282 2893434 2011297 2383992 1959064 3180480 3032627 5162376
3545 5162376 2384431 4489617 4038274 3665275 5486493 4092110 4412799 4006082 4795102
3536 4795102 6334248 7373204 7831116 7737141 7850125 7733417 8829770 6912700 8760431
3527 8760431 8376531 8116475 8322999 6652641 7603592 7258839 6725567 5140754 4562376
3518 4562376 6098503 6285624 5435677 6081076 4188840 3065729 4469221 5492777 4639240
3509 4639240 3860600 5246717 4913322 6423502 3263837 3483537 3879182 3598291 4486325
3500 4486325 2656958 3107110 1704815 1856601 1563175 3525018 1340885 1947050 3316588
3491 3316588 2441134 1180945 1106306 2132866 2516546 1603809 1467847 1315153 2038700
3482 2038700 3026077 1532253 2398361 3293663 3081270 2439171 1204947 1338010 1986431
3473 1986431 1078980 2653927 4453432 2196298 1814642 2542831 11602 2735774 3040140
3464 3040140 3589451 4065493 3007699 2664250 2810683 3611985 3523450 3998551 6812384
3455 6812384 5141700 4918890 5109452 5898295 5483019 5626156 7371284 7732320 9412232
3446 9412232 8433435 9702793 9157230 7664542 9974891 9091366 10424922 9912983 10086002
3437 10086002 10462074 11075593 11777336 11682104 14734154 16310261 17844813 20378884 23494030
3428 23494030 24208038 27942487 29134496 29673707 29260729 29232961 28657113 25372949 26439552
3419 26439552 23065085 22601628 17652805 15833811 15404715 12814940 10009327 10047729 7788681
3410 7788681 6271649 6299122 5683938 6302149 6322841 5389362 5452638 4977233 5892480 5310546
3400 5310546 4909231 4213704 4010485 5261881 6687074 4992526 5240796 4271596 5393723
3391 5393723 6798823 7137638 8119691 9702975 9369597 8403221 7479960 10707258 10531722
3382 10531722 11797260 13418238 12749296 12892535 11985547 11392602 12530331 12000082 11688143
3373 11688143 11112440 10957175 8465532 9083787 7520572 8421927 8598694 7945639 7469238
3364 7469238 7392666 7237516 5268637 7339621 8492483 7621065 6743107 5830910 7358690
3355 7358690 7978041 8840871 9853093 8692192 7669021 9353767 10105250 9867413 10778121
3346 10778121 11793551 14006371 13509882 17102337 16036722 20932101 22206267 25261458
3338 25261458 31094254 34714175 40602627 46790671 52436548 59948273 66470519 77616502
3330 77616502 90960764 102820228 120499770 134954907 151672205 156515352 155878780 155420606
3322 155420606 149663824 145877800 137966072 129411671 118201192 102408122 86983171 73981804
3314 73981804 62595494 52754892 46496147 38194903 32232730 25508074 21668180 17177484
3306 17177484 13306288 10837150 9852073 8570116 7843553 7668704 6572683 5603670 6750148
3297 6750148 5704477 5306322 4684489 5140194 3734794 3791922 4160509 3974215 3926894 3912655
3287 3912655 5280588 2013786 2332382 3614150 3709239 1632127 1416455 1253274 1978788
3278 1978788 2657229 3093556 1948946 2392489 2906795 968786 3127100 3366835 3158381
3269 3158381 2609691 1732813 504593 3342171 1776839 1344825 1674576 1801286 1916882
3260 1916882 1735264 1580469 2380655 1548639 647621 2131645 500286 1329746 1936547
3251 1936547 2144111 1477793 1964825 1392294 -244020 -385315 1884780 1366254 635696
3242 635696 970573 1580320 1238009 -293907 2200396 232929 472913 1931649 1115710
3233 1115710 1890307 1014558 705734 1083296 1598384 618000 -61927 1225105 1480542
3224 1480542 -199028 -93007 329310 1212451 164675 454968 1822768 -467938 2352325
3215 2352325 635643 804658 1411719 1567173 1013172 362295 536860 -531269 1046038
3206 1046038 2277018 1794290 1421066 1769680 1289838 895050 443813 1029697 158513
3197 158513 -199311 -1084062 23413 1078421 2404357 1592277 445625 1462935 -288578
3188 -288578 1446568 50031 610878 -282408 992510 1644444 -1212479 866683 -1596357
3179 -1596357 -353588 474087 132131 1074923 -215030 105140 515282 1574437 -107117
3170 -107117 2742917 59376 1523176 -56202 -1120235 -177785 913912 -816575 143770
3161 143770 1746796 451339 123734 -372432 59656 262759 359759 274928 187076 -1066262
3151 -1066262 1362224 585953 115347 448245 -787056 457661 1621636 65898 467191
3142 467191 2233417 -1311162 598762 120218 -635542 343563 -336240 -169540 798200
3133 798200 -579855 34395 -487672 -351888 -170789 -33134 110829 -81105 -116022 374167
3123 374167 -1400829 -605414 1132701 -529801 -290309 878970 161091 -574755 -242474
3114 -242474 1146101 -63409 1014759 1581834 433386 -50655 -279364 -856094 143614
3105 143614 -185028 -148134 244422 -281269 -582093 -570208 1309014 444534 -507409 -610873
3095 -610873 309772 -347336 142991 1922030 2794134 -296711 1705202 1939007 1844005
3086 1844005 537222 187168 1094185 991574 854299 1107810 426530 999343 398516
3077 398516 1011567 973417 194893 -152986 56726 761053 321130 990865 1170927 -1235578
3067 -1235578 -24552 1096913 -199471 717494 -983765 -1458296 612846 170364 654280
3058 654280 -660682 -978183 1123401 448662 106196 -207726 -437937 879915 1129392
3049 1129392 -299964 -258084 -176443 524950 1172396 -1540337 -405606 -392777 264506 724421
3039 724421 817056 -156600 -140123 -169651 -246939 -216994 1226422 438422 2090570 839628
3029 839628 -280363 569763 185481 592489 719708 325713 248511 -987010 -878672 -1148526
3019 -1148526 219687 23205 1060621 321762 330062 78143 -1151136 121289 -186567
3010 -186567 438087 -130723 -2019617 -258061 -1281571 1071910 -46631 15398 159196
3001 159196 -1358253 615928 534499 847501 -702690 486 1005379 665880 554370
2992 554370 587286 -44567 -595498 -729623 -509710 178328 -887728 234643 -11612 -528383
2982 -528383 -9665 -1003566 -1097935 -427506 -164459 148437 86915 -821150 1071446 437099
2972 437099 291733 557621 -436716 -52969 -140806 473202 816912 185799 1670186 -222497
2962 -222497 -424116 680845 -230834 1361167 1435479 103819 -539011 798422 1316382
2953 1316382 2318715 95207 -1301988 73240 406817 -643329 -465024 72216 1018369
2944 1018369 -416161 1514079 899865 1089093 795170 -38579 -386526 579041 -432515
2935 -432515 528471 438268 -886299 662746 1522494 -453705 89657 984759 452531
2926 452531 361690 184086 628511 -254150 170914 -118395 -240497 577392 -1599447 -624777
2916 -624777 19896 391240 -1302574 -890500 722535 -273934 536205 -405563 -203224
2907 -203224 -575562 -797382 -700836 -725243 -481096 -513621 715310 669319 313297 -773533
2897 -773533 380542 -1214494 -951065 368777 872852 -504344 486278 -663601 788135
2888 788135 -376295 1155470 -497830 153675 -1195251 -478540 -779283 1934769 -1032167
2879 -1032167 92705 -1959398 -972076 -250793 -228598 -1268625 -718118 217923 -592614
2870 -592614 312253 299234 -337595 -1006792 -648216 -1194503 -593299 -970241 -428918 53552
2860 53552 -453625 -746240 -302832 67241 893741 377846 552678 -870880 26310 -342948
2850 -342948 288456 -73733 1170910 -260379 -1764369 -710504 155330 82425 -84641
2841 -84641 -356474 -698893 1327002 81210 156846 704476 -548637 -13482 469032 -1740384
2831 -1740384 69538 -49898 -304036 -370547 -307591 840310 816793 484718 156549 -872786
2821 -872786 -277535 -967800 -1265892 -701275 219438 764407 -175867 -679594 -59457 -570084
2811 -570084 -2443882 -314512 419996 959113 431676 -535588 -25592 -257712 -542683
2802 -542683 317813 1371627 -1186805 -740919 -479610 -685018 -682531 -1346279 -532600 -1015248
2792 -1015248 1294224 -1836191 314971 2001492 -82436 1373220 -536793 -1223753
2784 -1223753 -972990 552646 -3384315 -172236 43722 -991274 503014 978231 74291
2775 74291 43611 -418595 236828 1648023 501518 -75228 2594421 -699004 -576106
2766 -576106 624769 -364130 271440 -316691 -1253018 -1497232 193351 -151021 306263
2757 306263 854170 320525 305288 -777755 -2100019 -652297 -498692 694687 920097
2748 920097 92666 1441164 637482 278677 -242519 -563021 -690033 53312 -487984 -292966
2738 -292966 341748 1520302 -2057337 -1112957 -1194524 -11231 960095 446340 -675772
2729 -675772 -157235 24798 -1418152 1671791 -583697 1119172 385848 -64200 -46338
2720 -46338 301187 -987893 129097 859764 -1661022 307800 -713939 -1064760 -832982
2711 -832982 -1112755 -757419 -1684765 499543 -393365 -571712 1463334 408918 243745
2702 243745 -589949 98855 -357469 -486378 -51919 -435415 12423 350091 490511 133325
2692 133325 327373 672078 379381 -1187215 -717562 -405094 635128 905792 -129356
2683 -129356 679699 399789 -141501 85526 -290904 765575 -150686 -210021 -7182 -111893
2673 -111893 -723704 -793210 -273061 -504472 -496059 -496825 630240 2311096 -1621566 189121
2663 189121 -1554754 -618853 484898 140016 126201 -154624 1230920 524584 507667 -1172564
2653 -1172564 -732051 463047 950477 465380 -969599 -260518 842809 861597 -1081399
2644 -1081399 -1067096 326196 474920 242367 -451154 22997 1910206 2123126 -138525
2635 -138525 -63174 731193 -980427 1824850 108249 -367570 1600476 1355391 -592144
2626 -592144 -259370 -2194063 613099 1489733 577632 473714 458918 78136 -641682 459482
2616 459482 2188786 757915 35734 -889185 -51894 -855411 -782202 114922 -1051875
2607 -1051875 152235 -201845 1096555 135502 -966723 -1130895 -408264 787810 -924536
2598 -924536 -480212 -402780 -86304 1000709 1195772 -2203848 890761 22982 -201652
2589 -201652 -246618 1476251 -346147 -1509664 558868 525176 568344 686313 -1679100
2580 -1679100 -1088402 -1766422 -556586 -317626 -919117 -1762955 -708662 -618654 -661241 -1184573
2570 -1184573 962594 -658341 -1499066 -574465 660944 288027 -910216 -142026 -481366
2561 -481366 -608312 -1028314 -638355 340532 -1240378 -55775 592362 -245522 -298448 355390
2551 355390 363384 -532015 -885249 510984 -20744 -11470 -2214339 912586 -1604251 538396
2541 538396 -410657 -1332663 -225163 -893572 -1767786 -898063 520263 -1352745 -1381330
2532 -1381330 -1806324 -3093 -510928 -417647 276284 -225800 1173528 -1058049 550954
2523 550954 -159794 -750072 -1217839 764482 671166 983157 -247943 407776 -32373 793876
2513 793876 1088686 682226 -748382 383911 -2128641 1155377 -1697787 1010451 100570
2504 100570 535035 -55759 -631133 -597406 -1019565 1482404 914018 -858259 892015
2495 892015 -683252 321500 -447363 -128098 243023 -367705 1288328 139617 -79337
2486 -79337 -311067 -992275 -16107 1854660 -101636 -292444 -83066 -470420 -687151 -1219485
2476 -1219485 83636 -89960 1120738 -572300 -87520 -735361 -1241714 -202555 737576
2467 737576 -1003989 331546 964345 -531841 -82018 -230914 -1364032 -1174843 -1155902
2458 -1155902 -1124223 -16910 -1498459 581308 -830448 -856879 -650600 -147188 -632835
2449 -632835 -965688 -522703 547917 -920510 -1339372 -57947 -984749 -1357623 303559
2440 303559 -241962 579130 -1169100 1135727 -877003 69802 -389380 1763336 485021
2431 485021 -738920 130107 -944738 351369 71326 -1105504 -567198 -334339 -526852
2422 -526852 -991310 1156254 -1056678 -2011341 37076 549925 -1330278 -34890 27737
2413 27737 -1025023 -1325685 1053348 901685 -891216 -816631 -283864 623617 411617 1066046
2403 1066046 574485 -510907 222744 -251248 -797412 -960979 -481566 -894349 917972
2394 917972 -634774 -341558 -1020472 -129470 -38678 193427 -1367673 -345343 -278214 -353204
2384 -353204 -864047 -362174 -348389 -506278 -797703 51486 226744 235016 -648120 -295355
2374 -295355 1395328 76731 705492 -825624 -364953 -954867 -986643 -521668 -944790
2365 -944790 757719 -1451597 -10248 1916457 440483 61535 404126 -1339820 -1015141
2356 -1015141 1225545 163420 -1101713 1075232 354377 -433974 1204156 740870 -927997
2347 -927997 -154606 1407666 190572 290710 -66449 -24427 296559 62107 141612 1000811
2337 1000811 -1411489 103485 -978418 926428 -525885 111277 -1366515 -1659705 -1085471
2328 -1085471 -44617 -272719 -315632 -614233 -1360015 379896 77160 78151 -632331 850327
2318 850327 -1977136 54164 -932085 -39325 -694129 -415929 -759906 304226 -810393
2309 -810393 -1467392 1028177 -1471318 -135494 -254458 120672 583711 -219921 429242
2300 429242 -1244534 220989 -530134 275412 -799544 152609 130553 -754783 -1397716
2291 -1397716 -1248863 -320524 -123742 -614162 1257440 1448952 439534 256171 -162239
2282 -162239 810569 -1275549 851832 -1483750 -638773 -296227 861767 -238954 195007
2273 195007 -360793 -231401 851261 521708 -229073 -676237 -2765535 -457226 -375822
2264 -375822 178009 -1990709 -2265965 -962970 -579950 -110762 -825170 1511861 -1848101
2255 -1848101 469092 -584005 118796 -174220 306809 -493934 -2059263 -469779 730356
2246 730356 -1000669 357727 43014 -23319 1086540 217543 -296370 -235613 -947402 -121562
2236 -121562 69896 -201981 827177 99482 23022 -1222711 -310976 -323018 682722 -95752
2226 -95752 -653919 -679546 -176966 -278147 432818 -886349 -99576 -1736106 -492385 -257183
2216 -257183 -1255885 -364250 -438330 -523603 -895674 -346145 36253 -288273 -667979 659112
2206 659112 -1489291 -444557 -709212 -173499 -754530 -1513054 -1249332 -279481 -1622378
2197 -1622378 53227 -1510999 -1143322 1732857 -841506 -1869080 -251289 -1184750 -1016307
2188 -1016307 536120 -630779 91210 -858865 451164 -580511 -1268562 228438 -447649
2179 -447649 -912136 -1406546 -194722 -636370 -330554 -642274 -1222842 -1001015 -379667 180009
2169 180009 -727846 -348393 -1121984 -159386 -949922 -432880 -353837 757268 -569859 -449397
2159 -449397 -1959319 27655 826658 -303250 1208030 -819353 -1641570 738846 63103
2150 63103 -562474 -28181 -860361 -472424 -273601 -352198 -196936 -1228277 -1977667 -1034124
2140 -1034124 -548812 -951520 -1152423 -558522 298139 102918 -108754 53234 856272 -718666
2130 -718666 247780 -655120 -1272183 972297 -697532 -174531 -1232191 -584862 472074
2121 472074 -345365 -776338 227754 -770163 -1553582 188719 923879 -86008 -32278
2112 -32278 1380877 320093 -920072 -675333 -1126267 -209635 1550879 -1609376 -1599396
2103 -1599396 -937351 -1272798 323651 -135714 794965 -2458478 -1773259 -34730 -1171922
2094 -1171922 -829820 1101840 252955 -531191 582481 -323259 -432605 -613527 -23476
2085 -23476 179381 -33537 -703740 280637 -1237372 -266043 -1509163 -1407088 -626300 612013
2075 612013 -144739 370340 -917839 -328841 363216 -403997 -1803077 -171120 141710
2066 141710 -922019 -48077 -1736306 -490049 -139211 -618136 -288847 573973 -1115082
2057 -1115082 -1289559 -535640 343863 -1836505 471887 119811 783370 -825076 432599
2048 432599 -993162 -648510 -1585060 704582 1065804 1240836 -1212852 289789 -1537666
2039 -1537666 -107429 -444502 485723 452478 -1953640 -1907536 -967265 -1885106 -886832 50373
2029 50373 -581146 -112801 -447178 -1081622 -245049 -1297115 543532 60341 -293498 -784885
2019 -784885 122900 329015 -995090 -1001568 -344275 -139643 172331 -478898 -465473 -2128212
2009 -2128212 -335969 -577646 -1013638 -246246 -1366352 -1683317 -1135057 -339174 229860
2000 229860 117530 -368685 697174 727635 587478 -1209398 -853824 -518639 1472090
1991 1472090 261682 74296 -557454 289713 -315553 -1271816 -1003424 -356241 -493228
1982 -493228 -1013567 -1122498 -1166198 -2012212 -709565 -917948 -590633 -1067547 -823758 -40312
1972 -40312 -545252 -1570865 -551727 -1100447 -1183266 -70338 472273 -1778861 621759
1963 621759 -1265429 -1306302 -27945 -30406 -1651721 -281179 -45017 -397311 -1792768
1954 -1792768 574489 -934577 -1452911 -749821 -1543515 71178 94301 -1461833 -294677
1945 -294677 678955 99171 -1922562 -899894 -1133395 -1238654 158491 205179 -1037099
1936 -1037099 117522 -475639 -1166068 785974 864228 362488 -452113 -1710899 -525689
1927 -525689 146871 -474668 -2089041 -2024048 -347238 -1512809 -829728 -505544 -1456276
1918 -1456276 -1785044 -27317 -382739 -966621 -493849 -2219 -708566 -600991 731682
1909 731682 190269 -1114432 -1723544 -243529 -1462664 -1788749 -749804 505709 -1627232
1900 -1627232 -301530 -372585 -555564 -704326 265407 233926 -540552 -633112 115448 587496
1890 587496 -477230 -99469 -1020836 149602 -911990 -486395 184446 -474373 -1263350
1881 -1263350 -511288 -528307 -1508193 9977 -784885 -984326 329603 -2213080 -1593417
1872 -1593417 160254 488630 974790 942008 -360297 461552 -1128139 632179 -286832
1863 -286832 -571638 -627539 993954 10495 -1074955 -1491642 -205011 -633151 -497829
1854 -497829 -24646 2274 -652125 183762 807898 1064388 -518894 -45567 -244841 114029
1844 114029 627693 -961040 -384920 -620037 -320140 878502 -342081 -2180337 -1051794
1835 -1051794 -123994 1287719 -17414 -585777 -597643 -1776835 -636421 205109 230952
1826 230952 -395766 171549 -199569 -78011 -754742 306301 -944175 -550840 -1982548
1817 -1982548 -2328745 -752763 -855272 -21238 -522614 -1291246 -919013 810479 782602
1808 782602 158543 -1105136 -923592 -1124202 -702617 -1175904 -5247 -1757431 -1460467
1799 -1460467 -1439349 -606972 -2378781 98161 717400 -1135975 -328092 -452665 -579627
1790 -579627 -1222489 -1703426 -1349037 -385569 -1035947 -506820 63388 -658771 -852674 -187533
1780 -187533 -646622 -213961 -279686 857225 -737981 583207 -424519 -1358171 201890
1771 201890 415571 -338809 -830800 -1547391 -1392484 -693120 -531372 -238740 -1478035 -757669
1761 -757669 -946959 612909 39135 448976 -407201 2573 -1622388 -1580114 -269723
1752 -269723 870201 454888 666588 -1159083 91075 -1335176 -284223 20588 -1358916
1743 -1358916 411856 258139 -1153946 633800 -1154172 727016 -110029 -29268 -557329
1734 -557329 -969053 -411425 -148138 -1039753 -1272513 -1434502 336207 -1282365 -876881
1725 -876881 -308886 464102 -252611 1052570 396323 -1913173 -499148 1081715 -1523781
1716 -1523781 -503237 -621717 -1514445 -674569 158620 -574836 -574766 465566 -49338 -553304
1706 -553304 -1741103 -231198 -483674 -655183 -459963 749738 -864189 467325 -599383
1697 -599383 -755571 -161869 -620056 -1487663 -853064 -804415 -115777 -1090992 -27879 -2105663
1687 -2105663 -1459396 587903 901216 -223690 784439 -345936 -640297 -999160 -480886
1678 -480886 -182731 -2013054 -790930 902563 1206686 -1187525 -926647 -732355 -868567
1669 -868567 -140372 -1844148 -1563856 -487122 -819350 -585711 -192425 -1075344 -1473019
1660 -1473019 692550 -415812 -372170 -1340741 -2059397 -603759 -620793 92846 -96411
1651 -96411 -60054 271879 365907 -1632045 -1462439 -667298 -850993 34256 -1018091 -1044261
1641 -1044261 -1539164 1096191 -2101400 -534338 -2560670 -615704 441985 -1207836
1633 -1207836 -176729 -1151025 -171842 -1477101 -1039278 -745993 -844273 -2090840 -1212257
1624 -1212257 -231620 -633330 698919 1462169 -1078254 -703488 -1105403 208274 -956230
1615 -956230 1348739 1012031 232799 -467425 -224653 1112468 -1134422 1194168 -650194
1606 -650194 374067 -1928157 287711 -919273 45973 -209732 -697078 -151822 329871
1597 329871 -649352 -801030 -555385 332301 -6449 175782 480068 -1286206 -201250
1588 -201250 312396 -454291 -1150187 -843161 -906598 -385211 -112199 -38240 -2057902 290286
1578 290286 342912 93964 -556568 -1126459 -2098327 -1396372 -170923 586666 -1850544 -312335
1568 -312335 -544760 -1600130 -1484187 -528304 -1040885 171748 -961366 -1126957 -459447
1559 -459447 -1067759 -236732 -867203 -781337 -210445 -608485 -879313 -952995 -834073 707719
1549 707719 457096 -487399 -556170 -790238 -1730631 -533535 -537917 -714680 -420815 -228107
1539 -228107 -422877 -1313722 -1696293 -750377 379957 294447 -255482 -615569 -35883 -359967
1529 -359967 -1368611 -2352441 -1667603 1051613 -2392145 -1479175 -1234579 -1970226 -1668703
1520 -1668703 593534 389088 912758 319545 82226 786419 -721298 521688 -700855
1511 -700855 366084 -171757 -2059204 -337598 859920 389570 -1513526 -151120 -1164892
1502 -1164892 -1068437 -328138 -961581 -944758 383418 288475 -520740 770530 -1423810 -359821
1492 -359821 385949 -1000456 -1411711 -700321 -1208277 -913183 -1163858 -859804 -969874 -618186
1482 -618186 -791250 -9784 -804685 -2387921 497065 -86964 -1902060 -2744819 -1743751
1473 -1743751 -497930 -927038 -616954 -705770 -134023 1127959 -735959 -1489666 -414135
1464 -414135 170196 -166454 -1937632 -608712 -551899 -754134 -1110373 -49681 39879 -363330
1454 -363330 897152 -2979 501195 554739 -298140 -1507078 664765 -477261 -581025
1445 -581025 -1102465 -1703916 -843503 -2006821 451626 1201342 -745901 -2310183 -1331269
1436 -1331269 -373949 -80764 -2276781 -1258836 -203305 381263 223750 1038093 -1693158
1427 -1693158 -1614128 -344091 -221355 288044 -868674 268156 -484156 757143 524347
1418 524347 -1170696 -512386 -674611 422061 382496 -1094013 -919261 -422126 -555003
1409 -555003 -753603 -785567 -685091 174447 -253334 -1726741 -75504 -739890 -1179178 -1501447
1399 -1501447 -1180392 -1289197 1443292 -641622 -1240653 -1010217 652915 -801833 -562855
1390 -562855 430159 -321354 158081 1101248 508362 -1511721 -655688 -90697 -1379608
1381 -1379608 -824851 -366008 -588914 -333273 -1211461 -1475874 -1279158 -2108846 219102
1372 219102 -1170476 14127 -311882 -568300 647988 -1029731 -1360128 498697 694170
1363 694170 -174319 -746768 -2162158 365667 -1964263 -441829 630018 -1954820 -260176
1354 -260176 -654438 -1302472 91606 -1621597 536469 -2373947 -398698 -1043112 -310050
1345 -310050 -680999 590871 514127 -826334 -1223012 -1220068 -285257 58178 142717 -1421844
1335 -1421844 -152375 -1131199 -1048341 -19189 -193612 864864 -565284 -1185038 -476992
1326 -476992 -1449058 -2088371 -1182232 -400706 -694128 295718 133727 -1012804 -1791647 -730125
1316 -730125 -773517 -1012645 -405030 -1233684 -309619 -1115424 -654594 276744 -20003 18099
1306 18099 808093 -1751591 -1442881 -1172513 -1718658 1139775 -995072 -209849 -1651372
1297 -1651372 1027303 -610811 134746 -322896 445723 -662083 -615006 -496767 -202253
1288 -202253 -736796 -157386 -2134488 -1099783 -963455 -828940 -861615 -441653 -970814 -775589
1278 -775589 -807401 414749 -642716 -599166 -525095 329121 291465 -1525376 -103224 -1164308
1268 -1164308 -194899 640767 113931 496726 -409009 414354 89447 -394778 501220 -1350002
1258 -1350002 -2061476 206102 -1202573 -406457 -329282 140229 -1542496 -1276457 -181242
1249 -181242 124005 709115 398261 -754112 -2492993 -1071750 -285300 -418896 -1103220
1240 -1103220 -1639692 -629341 -789275 -1463050 -216287 61701 -1381083 -1140981 -260719
1231 -260719 -2279226 -528679 -252795 -850931 -1425991 -19354 174658 419669 3389
1222 3389 -1314057 -1844910 -1977755 -1861858 -1696160 -178470 751024 -3032601 -226616
1213 -226616 -1545627 -816545 -2221990 -355908 -1588328 -1432290 -2177415 290024 -1116951
1204 -1116951 -525368 -2037013 -1008393 192553 -1684414 -1687285 321412 -255772 -930667
1195 -930667 -649698 479729 -404907 -1896109 -411827 -1123174 -1061293 -1545478 -825418
1186 -825418 -1486172 -376973 159622 -1090656 -1218847 -1246357 -1676691 -1623318 -788824 -465524
1176 -465524 -958697 -1099674 -656305 -882069 -407909 -473203 -188198 -1031859 -844433 -680615
1166 -680615 -1185236 -79170 -181386 267777 204739 -176070 703250 -884318 -563665 -887190
1156 -887190 108142 104119 -840611 -693223 -390549 557202 550227 -2653740 -757043 119314
1146 119314 969517 -802681 -1021271 -1704361 -863532 173478 -1099295 -1561296 -1833714
1137 -1833714 1068599 309530 -699992 -659236 -657272 -1103677 -792149 335784 -382975 -1018110
1127 -1018110 -2404166 -1747273 -918807 -468092 -973945 -1018800 -820462 -1112231 -385890 -892055
1117 -892055 -753253 76207 182188 -1288271 -1524909 -177818 41925 -1935712 -1908035
1108 -1908035 -1021412 -547778 -1613901 -2032509 -1754096 690745 -1504624 -945933 163978
1099 163978 -583016 -527594 -2495544 -605152 -424093 -1757194 -223063 -1323640 698354
1090 698354 -1374633 -1180735 -1702896 -1654292 -461707 -871447 -2413732 -1478889 -74142
1081 -74142 479544 -2080711 -184571 35327 213419 -620805 -30907 51739 749494 520011
1071 520011 -639771 -1712738 -228571 -573483 -640953 -765376 -1846890 -1450237 -1371551
1062 -1371551 27560 10107 -1231764 -1045427 -158701 -1503124 -945356 498397 -2665897
1053 -2665897 -657557 -1120213 -1853793 -432014 -1509658 -914309 -690184 -313857 358825
1044 358825 -384567 -259629 955726 -1375463 -1480427 403179 -42371 366373 -672337
1035 -672337 -1154666 -1021563 -1057540 -759164 -459738 -196187 -454838 -953432 -1736788 -419198
1025 -419198 -792254 -1924016 -1651433 -67477 -32460 -1835088 -644349 -828437 -1097834
1016 -1097834 -1275033 -395373 -2072426 -1935306 -849245 120587 -1023642 -438628 -1532733
1007 -1532733 -159011 352407 -1864178 -188899 -712445 -1124689 1051554 -958218 -1573116
998 -1573116 -942063 -441248 -886898 -890304 423633 -1231612 -641986 883310 -1717279
989 -1717279 582101 -1057692 354357 -953843 -1254856 -429364 -531847 231551 -1138586
980 -1138586 -1922775 -62447 -127648 -490869 -950264 -35105 -1956015 -1932512 588755 -1087012
970 -1087012 -622031 300046 1214685 -138298 745797 -849435 -2024149 -2096128 -1027087
961 -1027087 -851628 -917664 -2165722 -135246 -63641 -219404 291355 -1429181 -514762 -600326
951 -600326 23275 -462468 -224918 -1214495 147720 14428 -1323792 351414 -376526
942 -376526 -420168 -1233924 -1352053 -689804 -727886 -2021980 -1055939 -2136810 -82465 -455647
932 -455647 -811515 -1796106 -833344 -419973 -661713 63728 -1255351 -752693 282692 -807322
922 -807322 -1797766 -1647316 -252591 -1034268 -744721 -1020627 -1330149 -461617 -1197321 -571050
912 -571050 -1473654 -880671 -547411 -513523 -656651 -1558475 -2423360 -1333828 -1677536 -304382
902 -304382 -2082529 -811236 1281057 -1131504 -403029 -946693 -1019078 -1123644 -87269
893 -87269 -2010724 -2419797 212006 -1086792 -462243 298290 72519 -2641266 -973259
884 -973259 -880397 -2261250 -950606 -1059140 110916 -281595 -265262 -1467019 -1318822 -631824
874 -631824 -1626795 -1095705 -1259315 -1066329 1088829 -86216 -394816 -2161215 -1257257
865 -1257257 -2411608 -1061005 100736 -353944 -322771 -752569 -943609 -1469445 1353853
856 1353853 -544951 -557389 1119537 -507222 -575962 -539003 6092 -1662165 -9875
847 -9875 -1155626 -1852896 -390971 -2085527 -534155 -1163989 -877375 -599976 -1265595 -1163464
837 -1163464 931988 -2028438 -20433 384489 -1210108 -361168 -986450 87787 394050
828 394050 -1699113 -408340 -19572 -402156 577297 -883604 -1816099 -546395 -1253591
819 -1253591 -272870 -328069 -783575 -1621321 -1518778 -1181603 -479098 -1878578 -1816452 -622712
809 -622712 -50217 116604 45276 -2210107 -708836 -676728 -799791 -2121458 -46231 188929
799 188929 -1761063 652318 -151472 -191797 -1225728 954406 -929633 -1394541 -1567524
790 -1567524 106722 -805790 -553067 -2317066 -467582 -984833 -537351 -618001 -802221
781 -802221 -1444317 -891551 -1606066 -741916 1980313 -548205 288250 -1184908 -635047
772 -635047 -2486851 -1402484 950088 -724970 -366312 -1361427 -2556522 -1522122 -1047812
763 -1047812 -1252847 -1841549 -986085 -1845864 -308829 -147167 -1178193 -1074462 -1888580
754 -1888580 -1395269 -571843 -1083498 -2915908 -1631755 -701852 -718339 -1975186 -660568
745 -660568 -2227207 -876400 -1625463 -997851 -718483 -517753 -3629754 -74688 -1441551
736 -1441551 -1771696 -1210822 -2355137 -1655141 -80573 -1056984 -1143828 -347266 -2340614
727 -2340614 -1147252 -869261 -643066 -664955 -2003539 -616121 -1391813 -1449740 15821
718 15821 401506 -1189821 534680 286242 -953283 38424 -1272665 -450287 -1760115
709 -1760115 -2257847 -411966 111116 -990201 -1587993 -953824 -968481 -1936161 -1067887 -1131630
699 -1131630 1155871 -1055976 -969223 93598 -1216418 -523780 -1838381 -988812 -533542
690 -533542 -1737668 -1022906 -188657 234343 -1589634 -1792697 -579609 -930389 -1178542
681 -1178542 -2362772 -1279850 605674 -1506415 -2723466 -1252422 -1295475 -726402 -572724
672 -572724 -1257562 -1919307 -375045 -621217 977725 -1214677 -2183024 43010 -386848
663 -386848 -950270 -902806 -670851 -1256333 221410 -1457469 -758613 -1282032 -401348 -1510325
653 -1510325 -933144 -673073 -1255110 421279 237679 -169082 -735995 -1843847 -659581
644 -659581 -1519111 -221230 -528553 -1123562 301076 -908736 502931 -1433826 -138522
635 -138522 -1749851 -48889 -1212280 -1843643 -268421 -2480959 313522 -962885 -199998
626 -199998 -1202656 -901163 -1673831 -723799 -45775 -972071 -2881685 -1495727 -1098569
617 -1098569 -715694 -2019026 -2048449 -80678 678583 -899859 -2082355 -275439 -242267
608 -242267 -970798 -1523619 -893973 -1384421 -833565 -426007 -994342 -620885 -398986 -71606
598 -71606 -1381149 102102 -774691 371848 -418419 -586653 -457591 -324293 29998 -367742
588 -367742 56014 -731545 -1277425 163131 -125717 -1214591 -1381661 19010 -34491 -1547471
578 -1547471 -1552064 -539419 -232099 -883510 -845499 -1621089 -65838 -2383360 -1740562 -1144509
568 -1144509 -1732916 -1035282 -237658 -2220539 -1147576 -1639303 1063578 -1141433 -574134
559 -574134 101570 116679 -344559 -919623 -1290341 -2230952 -1999579 -2068669 -1137642 -927777
549 -927777 -817006 -1144259 -1352021 -973841 -396253 -523022 -336453 446555 -114861 -1928021
539 -1928021 30458 -1508443 -714078 -1591763 -1424031 556208 -1206395 -1320194 -706793
530 -706793 -290376 -987910 -2471954 -997030 -2437416 -1452137 410965 -894631 776880
521 776880 276630 81474 -516991 -56136 -367296 -1777066 -1037072 -939569 -1405252 1059280
511 1059280 336523 -1991726 -1299876 -231753 -863942 -1245577 -285205 -899512 -1211856
502 -1211856 -796225 -475382 -258576 -1347413 -1786259 -2451877 -1269205 -575722 -1480128
493 -1480128 -1651872 -1367488 -1868016 -694587 -457759 -2134372 -813616 -950546 -1097029
484 -1097029 436329 182781 -908346 -485141 1123402 498046 210207 -2619122 -1733089
475 -1733089 -1772760 -582793 -628209 -415685 188959 -1261209 -268702 -1223147 66412 -798536
465 -798536 336193 -1717243 -2745950 -971638 -924046 -801660 -604033 -1302724 -1416760
456 -1416760 -143698 -1716547 -750182 -752175 -721007 -451973 47562 -528645 -116009 -1303479
446 -1303479 -373726 -88240 -1635809 -1437146 -675146 -274103 349952 -1200389 -811481
437 -811481 752 -1095340 -621440 -1211410 -2120610 119785 -2158333 -2094126 388706
428 388706 -1189063 -1930317 -589111 -2103552 -1065642 -1031727 -980013 -2005387 -15921
419 -15921 -1509193 -1489306 -967473 -1248718 -470526 -868330 -1910508 173202 467779 -1948414
409 -1948414 -1264241 -406112 -2111395 -916573 -860386 515710 -1428119 235774 -231911
400 -231911 728327 -3147048 -1095588 -1585391 433424 -501117 -267608 393200 -186569
391 -186569 -704470 -150881 -691203 -1270906 944175 -1346382 -478607 336892 211633 453788
381 453788 -954884 -475826 -747443 -62512 -2634422 -59757 -743789 -700395 -1426669 -1603733
371 -1603733 -1527361 -1134068 -1679749 -1161351 -2393289 -279186 -390935 -1533887 -866468
362 -866468 -1264586 -8532 -511822 -879429 -1520747 -74713 -517953 -767168 -2264599
353 -2264599 -1465004 411707 -181273 -324736 -1225534 23206 -582333 -2605322 -171265
344 -171265 -1152861 -1198407 -1030912 -1565824 584928 386874 -1714619 -847578 -918316 -663430
334 -663430 -62341 -1456666 -1023921 -139609 -793906 -1495373 -529939 460362 -1274935 -576501
324 -576501 420844 -479345 129860 -436401 -1208561 -478066 134938 -380714 -2496792 -411750
314 -411750 -2423516 -199206 -675279 -505192 -729226 -1875262 -26228 -2828499 201246
305 201246 183836 -354862 -1825806 -1290199 -1322277 -1169439 -232071 -598841 -1016471 -318228
295 -318228 -204630 -964385 1514624 -265266 426185 -819163 -984849 -1238616 89682
286 89682 -1731017 -1627908 -839627 -634447 -2115701 644053 -2581907 -1788243 -674347
277 -674347 -1650587 -1207083 -638712 -1836704 -535755 -962506 -530787 -390136 -1727982
268 -1727982 -579329 -1263043 -1032774 -753524 -1685079 -768226 -1963219 -1941690 -21554
259 -21554 -2539165 -1001290 -2198311 -488130 226641 -1540891 -1326586 -2510278 -841106
250 -841106 -844788 -1073800 -429223 -1625222 -1491723 512448 -524400 -1129626 -974876 -896514
240 -896514 -609936 400914 -948771 857173 -392085 -1015325 -3748233 7882 -1191115
231 -1191115 -1267588 -1269763 -1365547 -607023 -446163 -1698323 -1159614 -1038797 -761015 -1619509
221 -1619509 323077 -697972 -2003528 -1191292 -1393138 -750619 -2397899 -1097765 -1862006
212 -1862006 -163812 -1861823 -1814509 -1197306 -1618384 -1177532 -1507332 -1196075 -979668 -308562
202 -308562 -2128205 -504782 -1257641 -904555 -171646 -1095700 -246002 -2180809 -991589
193 -991589 -616018 -935959 -1535126 597547 -900564 -1191194 -370163 -818464 -1316359 -502718
183 -502718 -702475 -1322828 -908312 -2543012 -1532133 -431886 -1173717 -2136593 -1485969
174 -1485969 -1628777 -1651149 -2279749 -1715521 -1071051 -818067 -1513958 -361363 -518578 -1385532
164 -1385532 -944013 -1049681 -754387 -2135699 -465201 -798847 -889047 -1634134 -795670 -1178965
154 -1178965 -581490 -1108561 -769136 -1519808 -573004 -130054 -2061061 -2049928 -2075994 -1243449
144 -1243449 -179589 -1597675 -1064406 -1932865 -925277 -2512485 -630886 -1446742 -1578608
135 -1578608 -211568 -600313 -1763206 -1122468 -2310369 -1439019 -1068513 -1106618 -1333969
126 -1333969 -2214564 -223590 -1427054 -989842 -2151331 -2481572 -1836242 124931 -1521412
117 -1521412 -588120 -1443221 -1550027 -492071 -733317 -1448453 -2276481 -1898027 -1961423 -835117
107 -835117 -710604 -926540 -1590149 -1128025 -1999856 -1579980 -1581504 -1760470 -2234198 -1552177
97 -1552177 -1016971 -1250004 -1519780 -2606962 -1078132 -1092562 -1943218 -1164433 -796723 67633
87 67633 -1540447 -753772 -1628149 -997525 -2111690 -2172356 -1464933 -1587097 -1771676 -1151174
77 -1151174 -1554959 -2078349 -2510437 -1799153 -842444 -2209364 -557713 -1200414 -1038217 -737286
67 -737286 -1745995 -1127384 -1320563 -1085199 426494 -2033284 -2203993 -1372750 -1420968 -1466168
57 -1466168 -2473820 -997748 -1452404 -1457668 -1805786 -1462404 -1889976 -1819898 -1444731 -1806109
47 -1806109 -779030 -1863356 -1948665 -2093785 -2625295 -1217868 -1613357 -1807612 -771560
38 -771560 -1809840 -2130267 -1936717 -1605243 -1605899 -1114833 -1913271 -2510071 -1899696 -1695798
28 -1695798 -1910192 -1630507 -1440854 -990098 -2629369 -1694911 -1527438 -2548082 -1080376
19 -1080376 -1031557 -760368 -1381111 -1534545 -707366 -2135647 -1750409 -2179841 -700098 -1842296
9 -1842296 -1954643 -1163602 -1117822 -1233287 -1759678 -1520676 -2664796 -1962955 -1862486
0 -1862486
$$ Imaginary data points
##PAGE= N=2
##DATA TABLE= (X++(I..I)), XYDATA
16383 -5183472 -4240471 -5745692 -4615446 -4912164 -5274594 -5250156 -4756690 -4416263 -3638675
16374 -3638675 -4743601 -4418504 -3418146 -3112688 -4006885 -4869365 -3019111 -4715142 -3640878
16365 -3640878 -2827254 -3996090 -2546767 -3147324 -3228519 -2466442 -2538495 -3422036 -3467696 -1770625
$$ [...]
##END NTUPLES=NMR SPECTRUM
##END=
