##TITLE=abcd
##JCAMPDX= 6.0         $$ Bruker NMR JCAMP-DX V2.0
##DATA TYPE= NMR SPECTRUM
##DATA CLASS= NTUPLES
##ORIGIN= UXNMR, Bruker Analytische Messtechnik GmbH
##OWNER= root
$$ XWIN-NMR		Version 3.5
$$ Tue Aug 25 17:32:53 2026 Russian Standard Time (UT+4h)  servis@DPX200
##.OBSERVE FREQUENCY= 200.131235884673
##.OBSERVE NUCLEUS= ^1H
##.ACQUISITION MODE= SIMULTANEOUS
##.ACQUISITION SCHEME= undefined
##.AVERAGES= 32
##.DIGITISER RES= 18
##SPECTROMETER/DATA SYSTEM= spect
##.PULSE SEQUENCE= zg
##.SOLVENT NAME= CDCl3
##.SHIFT REFERENCE= (INTERNAL, CDCl3, 0, 16.4885)
##AUDIT TRAIL= $$ (NUMBER, WHEN, WHO, WHERE, WHAT)
$$ ##TITLE= Audit trail, XWIN-NMR		Version 3.5
$$ ##JCAMPDX= 5.01
$$ ##ORIGIN= Bruker BioSpin GmbH
$$ ##OWNER= servis
$$ F:\spectra/data/av/nmr/H1/1/pdata/1/auditp.txt
$$ ##AUDIT TRAIL=  $$ (NUMBER, WHEN, WHO, WHERE, WHAT)
(   1,<2026-08-25 17:32:02.76 +0400>,<servis>,<DPX200>,
      <created by zg, POWCHK disabled, PULCHK disabled
       configuration hash MD5:
       00 E9 B6 7A A2 85 ED C7 34 08 36 98 17 FE 4E 26
       data hash MD5: 32K
       45 DA F3 F8 1B 19 1D B2 F1 BD A6 AF 14 4D 00 BD>)
(   2,<2026-08-25 17:32:19.87 +0400>,<servis>,<DPX200>,
      <Start of raw data processing
       efp BC_mod = 2 LB = 0.05 FT_mod = 6 PKNL = 1 PHC0 = -415.9518 PHC1 = 3.101563 SI = 16K 
       data hash MD5: 16K
       7A 51 8C 32 06 DB 8C 4C 50 A1 F8 46 7F 43 CE 91>)
$$ ##END=
$$ 
$$ hash MD5
$$ CF BF BF 77 7B A6 77 76 EF 87 3F DB AA 85 60 2F
##$RELAX= 
##$RELAX= 
##$RELAX= 
##$RELAX= 
##$RELAX= 
##$RELAX= 
##$RELAX= 
##$RELAX= 
$$ Bruker specific parameters
$$ --------------------------
##$DU= <F:\spectra>
##$EXPNO= 1
##$NAME= <H1>
##$PROCNO= 1
##$TYPE= <nmr>
##$USER= <av>
##$AMP= (0..31)
100 100 100 100 100 100 100 100 100 100 100 100 100 100 100 100 100 100 
100 100 100 100 100 100 100 100 100 100 100 100 100 100 
##$AQSEQ= 0
##$AQ_mod= 1
##$AUNM= <au_zg>
##$AUTOPOS= <>
##$BF1= 200.13
##$BF2= 200.13
##$BF3= 200.13
##$BF4= 200.13
##$BF5= 500.13
##$BF6= 500.13
##$BF7= 500.13
##$BF8= 500.13
##$BYTORDA= 1
##$CFDGTYP= 0
##$CFRGTYP= 5
##$CHEMSTR= <none>
##$CNST= (0..31)
1 1 145 1 1 1 1 1 1 1 1 1 1 1 1 1 1 1 1 1 1 1 1 1 1 1 1 1 1 1 1 1 
##$CPDPRG= <>
##$CPDPRG1= <>
##$CPDPRG2= <>
##$CPDPRG3= <>
##$CPDPRG4= <mlev>
##$CPDPRG5= <mlev>
##$CPDPRG6= <mlev>
##$CPDPRG7= <mlev>
##$CPDPRG8= <mlev>
##$CPDPRGB= <>
##$CPDPRGT= <>
##$D= (0..31)
0 2 0 0 0 0 0 0 0 0.06 0 0 0 0 0 0 0.0002 0 0 0 0 0 0 0 0 0 0 0 0 0 0 
0 
##$DATE= 1787664722
##$DBL= (0..7)
120 120 120 120 120 120 120 120 
##$DBP= (0..7)
150 150 150 150 150 150 150 150 
##$DBP07= 0
##$DBPNAM0= <>
##$DBPNAM1= <>
##$DBPNAM2= <>
##$DBPNAM3= <>
##$DBPNAM4= <>
##$DBPNAM5= <>
##$DBPNAM6= <>
##$DBPNAM7= <>
##$DBPOAL= (0..7)
0.5 0.5 0.5 0.5 0.5 0.5 0.5 0.5 
##$DBPOFFS= (0..7)
0 0 0 0 0 0 0 0 
##$DE= 6
##$DECBNUC= <off>
##$DECIM= 32
##$DECNUC= <off>
##$DECSTAT= 4
##$DIGMOD= 1
##$DIGTYP= 9
##$DL= (0..7)
0 120 120 120 120 120 120 120 
##$DP= (0..7)
150 150 150 150 150 150 150 150 
##$DP07= 0
##$DPNAME0= <>
$$ [...]
##$SUBNAM4= <"">
##$SUBNAM5= <"">
##$SUBNAM6= <"">
##$SUBNAM7= <"">
##$SUBNAM8= <"">
##$SUBNAM9= <"">
##$SW= 20.6817932712277
##$SWIBOX= (0..15)
0 0 3 0 0 0 0 0 0 0 0 0 0 0 0 0 
##$SW_h= 4139.07284768212
##$TD= 32768
##$TD0= 1
##$TE= 0
##$TE2= 300
##$TE3= 300
##$TEG= 300
##$TL= (0..7)
0 120 120 120 120 120 120 120 
##$TP= (0..7)
150 150 150 150 150 150 150 150 
##$TP07= 0
##$TPNAME0= <>
##$TPNAME1= <>
##$TPNAME2= <>
##$TPNAME3= <>
##$TPNAME4= <>
##$TPNAME5= <>
##$TPNAME6= <>
##$TPNAME7= <>
##$TPOAL= (0..7)
0.5 0.5 0.5 0.5 0.5 0.5 0.5 0.5 
##$TPOFFS= (0..7)
0 0 0 0 0 0 0 0 
##$TUNHIN= 0
##$TUNHOUT= 0
##$TUNXOUT= 0
##$USERA1= <user>
##$USERA2= <user>
##$USERA3= <user>
##$USERA4= <user>
##$USERA5= <user>
##$V9= 5
##$VALIST= <valist>
##$VCLIST= <CCCCCCCCCCCCCCC>
##$VD= 0
##$VDLIST= <DDDDDDDDDDDDDDD>
##$VPLIST= <PPPPPPPPPPPPPPP>
##$VTLIST= <TTTTTTTTTTTTTTT>
##$WBST= 1024
##$WBSW= 30
##$XGAIN= (0..3)
0 0 0 0 
##$XL= 0
##$YL= 0
##$YMAX_a= 171734
##$YMIN_a= -343951
##$ZGOPTNS= <>
##$ZL1= 120
##$ZL2= 120
##$ZL3= 120
##$ZL4= 120
##$ABSF1= 0
##$ABSF2= 0
##$ABSG= 0
##$ABSL= 0
##$ALPHA= 0
##$AQORDER= 0
##$ASSFAC= 0
##$ASSFACI= 0
##$ASSFACX= 0
##$ASSWID= 0
##$AUNMP= <proc_1d>
##$AZFE= 0.1
##$AZFW= 0.1
##$BCFW= 0
##$BC_mod= 2
##$BYTORDP= 0
##$COROFFS= 0
##$CY= 18.4799938201904
##$DATMOD= 1
##$DC= 0
##$DFILT= <>
##$DTYPP= 0
##$F1P= 9.9274215381318
##$F2P= -0.165520771350173
##$FCOR= 1
##$FTSIZE= 16384
##$FT_mod= 6
##$GAMMA= 0
##$GB= 0
##$INTBC= 1
##$INTSCL= 4.127829e-11
##$ISEN= 128
##$LB= 0.05
##$LEV0= 0
##$LPBIN= 0
##$MAXI= 10000
##$MC2= 0
##$MEAN= 0
##$ME_mod= 0
##$MI= 50
##$NCOEF= 0
##$NC_proc= -7
##$NLEV= 6
##$NOISF1= 3.799351
##$NOISF2= 2.8
##$NSP= 0
##$NTH_PI= 0
##$NZP= 0
##$OFFSET= 16.48848
##$PC= 4
##$PHC0= -415.9518
##$PHC1= 3.101563
##$PH_mod= 1
##$PKNL= yes
##$PPARMOD= 0
##$PSCAL= 4
##$PSIGN= 0
##$REVERSE= no
##$SF= 200.130005582386
##$SI= 16384
##$SIGF1= 3
##$SIGF2= 2
##$SINO= 400
##$SIOLD= 16384
##$SREGLST= <1H.CDCl3>
##$SSB= 0
##$STSI= 16384
##$STSR= 0
##$SW_p= 4139.07284768211
##$SYMM= 0
##$S_DEV= 0
##$TDeff= 32768
##$TDoff= 0
##$TI= <>
##$TILT= no
##$TM1= 0
##$TM2= 0
##$TOPLEV= 0
##$USERP1= <user>
##$USERP2= <user>
##$USERP3= <user>
##$USERP4= <user>
##$USERP5= <user>
##$WDW= 1
##$XDIM= 16384
##$YMAX_p= 389521325
##$YMIN_p= -1060767
$$ End of Bruker specific parameters
$$ ---------------------------------
##NTUPLES= NMR SPECTRUM
##VAR_NAME=  FREQUENCY,     SPECTRUM/REAL,   SPECTRUM/IMAG
##SYMBOL=    X,             R,               I
##VAR_TYPE=  INDEPENDENT,   DEPENDENT,       DEPENDENT
##VAR_FORM=  AFFN,          ASDF,            ASDF
##VAR_DIM=   16384,         16384,           16384
##UNITS=     HZ,            ARBITRARY UNITS, ARBITRARY UNITS
##FACTOR=    0.252644378177508, 1,           1
##FIRST=     3299.83951724647, 0,            0
##LAST=      -839.233330435636, 0,           0
##MIN=       -839.233330435636, -1060767,    0
##MAX=       3299.83951724647, 389521325,    0
$$ Real data points
##PAGE= N=1
##DATA TABLE= (X++(R..R)), XYDATA
$$ [...]
$$ plain form
7150 2307786 2605979 2938893 2627986 2456934 2697145 2328887 2464063 2417443 2490281 2546855
7140 2546855 2570438 2373146 2162738 2527757 2409193 2296865 2607658 2616055 2404775 2550323
7130 2550323 2566613 2535446 2511987 2149353 2611422 2347827 2380630 2419583 2637989 2749061
7120 2749061 2776326 2555241 2534797 2801375 2916931 2573248 2762275 2876617 2898740 2450438
7110 2450438 2638434 2811763 2727504 2559282 2671457 2386446 2606939 2255003 2465492 2373582
7100 2373582 2369162 2686245 2223197 2747878 2310935 2595476 2270200 2603165 2278058 3053960
7090 3053960 3011181 2938007 2875680 2598727 2928103 3002772 2827127 2769432 2731721 2195053 2608389
7079 2608389 2626222 2621964 2767362 2701794 2579128 2547693 2542159 2533503 2618048 2616588 2492570 2876344
$$ packed form
7150B307786K98193L32914l10907j71052K40211l68258J35176m6620P2838N6574
7140B546855K3583j97292k10408L65019j18564j12328L10793Q397k11280J45548
7130B550323J6290l1167k3459l62634M62069k63595L2803L8953K18406J11072
7120B749061K7265k21085k0444K66578J15556l43683J89027J14342K2123m48302
7110B450438J87996J73329q4259j68222J12175k85011K20493l51936K10489r1910
7100B373582m420L17083m63048N24681m36943K84541l25276L32965l25107P75902
7090C053960m2779p3174o2327k76953L29376P4669j75645n7695l7711n36668M13336
7079B608389J7833m258J45398o5568j22666l1435n534q656Q4545j460j24018L83774
$$ plain form
7067 2876344 2593914 2706480 2998690 2743106 2934848 2990713 2718138 2962950 2972034 2751423
7057 2751423 3027005 2395118 2522575 2738384 2878389 3014130 2645744 2761773 2808350 2402271
7047 2402271 2845006 2883544 2756254 3003599 2873323 2681432 3037848 2735255 2977331 3107684
7037 3107684 2742718 2989094 2723693 2657188 3108964 2886248 2909775 3177242 2809268 2795353
7027 2795353 2572516 2680256 2576250 2729351 2661338 2551050 2264279 2404525 2830969 2876275
7017 2876275 2708604 3278658 2671345 3073142 2716170 3068390 2845963 2497838 2582969 2611694
7007 2611694 2766884 2811296 2513138 2563702 2997877 2765913 2786267 2972050 2633817 3221738
6997 3221738 2688261 2818295 3109873 3206471 2902429 2725517 3197658 3628579 3309492 2932476
$$ packed form
7067B876344k82430J12566K92210k55584J91742N5865k72575K44812R084k20611
7057B751423K75582o31887J27457K15809J40005J35741l68386J16029M6577m06079
7047B402271M42735L8538j27290K47345j30276j91891L56416l02593K42076J30353
7037C107684l64966K46376k65401o6505M51776k22716K3527K67467l67974j3915
7027B795353k22837J07740j04006J53101o8013j10288k86771J40246M26444M5306
7017B876275j67671N70054o07313M01797l56972L52220k22427l48125Q5131K8725
7007B611694J55190M4412k98158N0564M34175k31964K0354J85783l38233N87921
6997C221738n33477J30034K91578R6598l04042j76912M72141M30921l19087l77016
$$ plain form
6987 2932476 3045705 3016692 3005624 2632650 3018691 2782446 2722363 2967099 2782957 2562685
6977 2562685 2947631 3065815 3340657 3555639 3802800 3687514 3464123 3734144 3630665 3675829
6967 3675829 3572548 4199640 3783764 3630671 3860686 3904445 4158888 3517248 3292394 3631138
6957 3631138 3466960 3732612 3232072 3308217 2904891 3409727 2933325 3476367 3336973 3721613
6947 3721613 3494411 3169854 3320650 3704821 3591337 4082287 4049928 4284590 4659922 4877196
6937 4877196 5579892 6048028 5734897 5270251 4804212 4743120 4481224 4189428 3997953 3788217
6927 3788217 3943732 3593995 3684439 3363161 3910956 3647048 3717665 3300371 3398426 3746898
6917 3746898 3210381 3675298 4049152 4072803 4238468 4513423 5093697 4930049 5718957 6035588
$$ packed form
6987B932476J13229k9013j1068l72974L86041k36245o0083K44736j84142k20272
6977B562685L84946J18184K74842K14982K47161j15286k23391K70021j03479M5164
6967C675829j03281O27092m15876j53093K30015M3759K54443o41640k24854L38744
6957C631138j64178K65652n00540P6145m03326N04836m76402N43042j39394L84640
6947C721613k27202l24557J50796L84171j13484M90950l2359K34662L75332K17274
6937D877196P02696M68136l13131m64646m66039o1092k61896k91796j91475k09736
6927C788217J55515l49737R0444l21278N47795k63908P0617m17294R8055L48472
6917C746898n36517M64917L73854K3651J65665K74955N80274j63648P88908L16631
$$ plain form
6907 6035588 5416227 5644351 5279977 5346416 4915805 4763638 4310371 4163728 4275934 4096842
6897 4096842 4283839 3777320 3933527 4089561 3932289 4126677 3704223 3956562 4012763 3933715
6887 3933715 3955164 3968434 4462043 4162673 4002258 4535158 4690075 4408976 4185647 4508434
6877 4508434 4223294 4012855 4052583 3874900 3951509 3783817 3788745 4197075 4118110 4073110 4001755
6866 4001755 3829991 4290065 3903971 4117360 4576925 4554425 4098382 4441781 4424235 4334417
6856 4334417 4693853 4471232 4460680 4918642 4349836 4301412 4304258 4386797 4440007 4173968 4114464
6845 4114464 4340244 4742496 4209404 4488654 4483458 4517610 4972627 4250817 4620531 4672752
6835 4672752 4824192 4972599 5307713 5162364 5838266 5885331 6604058 6373922 6471086 6169866
$$ packed form
6907F035588o19361K28124l64374O6439m30611j52167m53267j46643J12206j79092
6897D096842J86997n06519J56207J56034j57272J94388m22454K52339N6201p9048
6887C933715K1449J3270M93609k99370j60415N32900J54917k81099k23329L22787
6877D508434k85140k10439L9728j77683P6609j67692M928M08330p8965m5000p1355
6866D001755j71764M60074l86094K13389M59565k2500m56043L43399j7546q9818
6856D334417L59436k22621j0552M57962n68806m8424K846Q2539N3210k66039n9504
6845D114464K25780M02252n33092K79250n196L4152M55017p21810L69714N2221
6835D672752J51440J48407L35114j45349O75902M7065P18727k30136R7164l01220
$$ plain form
6825 6169866 6141013 6243500 6062959 5734577 5720757 5576432 5670903 5485804 5569631 4986632
6815 4986632 5484942 5268863 5475529 5055090 5560876 5623117 5235513 5567149 5811099 5899204
6805 5899204 5995488 6059685 6286074 6889127 7104753 7298020 7379827 7140187 6913552 6975468
6795 6975468 6671119 6560321 6161785 6152844 6208771 5875432 5979591 5841720 5461543 6225047
6785 6225047 5635103 6042247 6242462 5849985 6021561 5937570 6053297 6079059 6015685 6415911
6775 6415911 6054669 6055841 6524352 6372443 6594769 6295902 6044239 5797357 5984266 6077456
6765 6077456 6041796 5780410 5886550 5768859 5541725 5789460 5463211 5629235 5502638 5731944
6755 5731944 5374274 5487789 6023772 6473212 6338015 6851179 6333583 6692026 6126723 6488998
$$ packed form
6825F169866k8853J02487j80541l28382j3820j44325R4471j85099Q3827n82999
6815D986632M98310k16079K06666m20439N05786O2241l87604L31636K43950Q8105
6805E899204R6284O4197K26389O03053K15626J93267Q1807k39640k26635O1916
6795F975468l04349j10798l98536q941N5927l33339J04159j37871l80177P63504
6785F225047n89944M07144K00215l92477J71576q3991J15727K5762o3374M00226
6775F415911l61242J172M68511j51909K22326k98867k51663k46882J86909R3190
6765F077456l5660k61386J06140j17691k27134K47735l26249J66024j26597K29306
6755E731944l57670J13515N35983M49440j35197N13164n17596L58443n65303L62275
$$ plain form
6745 6488998 6334880 5820000 5556918 5266333 4958322 5364260 5438661 5678786 5290989 5417170
6735 5417170 5682978 5570636 5234685 5606958 5484045 5331736 5973620 6108613 6330373 6365596
6725 6365596 6926443 7982070 8754866 9033954 8865929 8892760 8518675 8390878 7671450 7613841
6715 7613841 6792217 6744284 5859781 5538413 5688308 5309884 5247769 5234488 5225292 5109783
6705 5109783 4935911 5436342 5399416 5549969 5762008 5872742 5930478 6358533 6899578 7812206
6695 7812206 8459834 9155182 9453813 9134148 8745615 8524169 8238890 7713493 6597635
6686 6597635 6083266 5961851 6048083 5364723 5583736 5028306 5181800 4764077 4626120 4688485
6676 4688485 4784163 4750571 4636637 5033213 4921007 4955620 5197545 5509302 5886207 5422832
$$ packed form
6745F488998j54118n14880k63082k90585l08011M05938P4401K40125l87797J26181
6735E417170K65808j12342l35951L72273j22913j52309O41884J34993K21760L5223
6725F365596N60847J055627P72796K79088j68025K6831l74085j27797p19428n7609
6715G613841q21624m7933q84503l21368J49895l78424o2115j3281r196j15509
6705E109783j73872N00431l6926J50553K12039J10734N7736M28055N41045R12628
6695G812206O47628O95348K98631l19665l88533k21446k85279n25397j115858
6686F597635n14369j21415Q6232o83360K19013n55430J53494m17723j37957O2365
6676D688485R5678l3592j13934L96576j12206L4613K41925L11757L76905m63375
$$ plain form
6666 5422832 6552593 6406826 6415087 6269119 6247824 6264700 5776802 5791981 5914227 5384505
6656 5384505 5306149 4839532 4870157 4771664 4576822 5184765 4850215 4629121 4732965 4277420
6646 4277420 4620663 4361499 4375367 4650511 4635903 4552168 4440821 5141370 4580885 4622874
6636 4622874 5387047 5254741 5350027 5416071 5059242 5337872 5503415 5543566 5365628 5555779
6626 5555779 5102867 4989152 4897915 4980996 5139108 4696267 4894825 4453601 4357388 5278187
6616 5278187 4956158 5340282 5226647 4779381 4804252 4856981 5012947 4944216 5120568 5352901
6606 5352901 5474366 6208957 5754738 5444665 5213223 5410524 5275880 5051660 4840824 4555972
6596 4555972 4945754 4522511 4670344 4581854 4665033 4414846 4638464 4911738 4646836 4854487
$$ packed form
6666E422832J129761j45767Q261j45968k1295J6876m87898J5179J22246n29722
6656E384505p8356m66617L0625r8493j94842O07943l34550k21094J03844m55545
6646D277420L43243k59164J3868K75144j4608q3735j11347P00549n60485M1989
6636D622874P64173j32306R5286O6044l56829K78630J65543M0151j77938J90151
6626E555779m52912j13715r1237Q3081J58112m42841J98558m41224r6213R20799
6616E278187l22029L84124j13635m47266K4871N2729J55966o8731J76352K32333
6606E352901J21465P34591m54219l10073k31442J97301j34644k24220k10836k84852
6596D555972L89782m23243J47833q8490Q3179k50187K23618K73274k64902K07651
$$ plain form
6586 4854487 4743291 4721410 4959955 4574174 4954557 5032564 5095046 4960907 5395621 5746102
6576 5746102 5578062 5464354 5481101 5494087 5760366 5589628 5251478 5271484 5354805 5340779
6566 5340779 5049611 5294917 4949836 4789280 5161323 5186631 4904365 5400475 4883330 5323338
6556 5323338 5603509 5401568 5486165 5406859 5419446 5445643 5621248 5623409 5878031 6157418 5941480
6545 5941480 6036496 5997950 5909001 6120895 5740900 6583944 6540697 6230670 6056166 6616100
6535 6616100 7065675 6281226 6865538 6629115 6935861 7012852 7258203 7047901 7335695 7315570
6525 7315570 6903748 7237532 7334778 6963099 7322229 7008183 7475090 7626715 6596076 6924313
6515 6924313 6953837 7337625 7502767 7164670 7896138 7734860 7776644 7780102 7975918 7603785
$$ packed form
6586D854487j11196k1881K38545l85781L80383P8007O2482j34139M34714L50481
6576E746102j68040j13708J6747J2986K66279j70738l38150K0006Q3321j4026
6566E340779k91168K45306l45081j60556L72043K5308k82266M96110n17145M40008
6556E323338K80171k01941Q4597p9306J2587K6197J75605K161K54622K79387k15938
6545E941480R5016l8546q8949K11894l79995Q43044m3247l10027j74504N59934
6535F616100M49575p84449N84312k36423L06746P6991K45351k10302K87794k0125
6525G315570m11822L33784R7246l71679L59130l14046M66907J51625j030639L28237
6515F924313K9524L83788J65142l38097P31468j61278M1784L458J95816l72133
$$ plain form
6505 7603785 7746763 8189187 7604383 7828180 7993526 7692363 8032687 7930436 8145410 8196161
6495 8196161 7785304 7928615 7820800 8293934 8214753 8206333 8394066 8519450 8717460 8124621
6485 8124621 7889551 8050179 8338201 8068106 8041500 7669924 8190865 7788893 7748688 8078352
6475 8078352 8190782 8317890 8205341 8597440 8830126 8636977 8794512 8485983 8674827 8594015
6465 8594015 8767537 8964132 9654538 9855967 10149140 10334304 10350503 10067241 10312139 10129740
6455 10129740 10355155 10631028 10790966 11517243 12137625 13781044 15440578 17446982 19597944
6446 19597944 20185348 19808559 19030355 17505226 16426096 15020496 13851054 13283280 12887847
6437 12887847 12854228 12876134 13652185 13937016 13785669 14086934 13705106 14097472 14082948 14530438
$$ packed form
6505G603785J42978M42424n84804K23797J65346l01163L40324j02251K14974N0751
6495H196161m10857J43311j07815M73134p9181q420J87733J25384J98010n92839
6485H124621k35070J60628K88022k70095k6606l71576N20941m01972m0205L29664
6475H078352J12430J27108j12549L92099K32686j93149J57535l08529J88844q0812
6465H594015J73522J96595O90406K01429K93173J85164J6199k83262K44898j82399
6455A0129740K25415K75873J59938P26277O20382J643419J659534K006404K150962
6446A9597944N87404l76789p78204j525129j079130j405600j169442n67774l95433
6437A2887847l3619K1906P76051K84831j51347L01265l81828L92366j4524M47490
$$ plain form
6427 14530438 14981696 16346258 17585055 19184731 21400053 25434563 30555572 36777583
6419 36777583 42163160 44731567 43645047 40045313 35898744 32099304 29368639 28514712
6411 28514712 28761330 29856624 31504209 32710774 31712474 29560975 27651655 24726450
6403 24726450 22790212 21352538 20143528 19419805 19500789 19919591 20984534 22189558 24300070
6394 24300070 28130360 33428028 39247702 44812936 48017467 46413438 43325072 39844341
6386 39844341 36662841 35918719 38112128 44156795 50832091 57848306 61710244 59820627
6378 59820627 53935768 46962413 40585844 34682091 29952780 26552866 23507366 21534544
6370 21534544 20067323 19647380 18807256 19363583 19864693 21899390 23111494 25235082 26228712
$$ packed form
6427A4530438M51258J364562J238797J599676K215322M034510N121009O222011
6419C6777583N385577K568407j086520l599734m146569l799440k730665q53927
6411B8514712K46618J095294J647585J206565r98300k151499j909320k925205
6403B4726450j936238j437674j209010p23723Q0984M18802J064943J205024K110512
6394B4300070L830290N297668N819674N565234L204531j604029l088366l480731
6386C9844341l181500p44122K193409O044667O675296P016215L861938j889617
6378E9820627n884859o973355o376569n903753m729311l399914l045500j972822
6370B1534544j467221m19943q40124N56327N01110K034697J212104K123588R93630
$$ plain form
6361 26228712 26432291 25729241 25006902 25339955 25975168 30020982 37743579 45364507 53129301
6352 53129301 57617798 56583482 51107011 44226303 37715040 32275022 27717881 24025348
6344 24025348 20621517 18135520 16959648 14876594 14444961 14227640 13399554 12757215 12300062
6335 12300062 12272921 12281996 12188591 12365032 12720890 12917755 13834700 15204723 17738387 20712445
6325 20712445 22979909 25469199 25399681 23223764 21419282 18970290 17060546 15756764
6317 15756764 14283240 13160003 12542674 11981995 11219324 11328342 10879552 10780663 10432383
6308 10432383 10133212 10032795 10128482 10692018 10339019 11007475 10567107 10460325 10637623 11025841
6298 11025841 11007642 11324265 12142664 12517865 13798747 14797990 15969349 16964612 17248492
$$ packed form
6361B6228712K03579p03050p22339L33053O35213M045814P722597P620928P764794
6352E3129301M488497j034316n476471o880708o511263n440018m557141l692533
6344B4025348l403831k485997j175872k083054m31633k17321q28086o42339m57153
6335A2300062k7141R075r3405J76441L55858J96865R16945J370023K533664K974058
6325B0712445K267464K489290o9518k175917j804482k448992j909744j303782
6317A5756764j473524j123237o17329n60679p62671J09018m48790r8889l48280
6308A0432383k99171j00417R5687N63536l52999O68456m40368j06782J77298L88218
6298A1025841j8199L16623Q18399L75201J280882R99243J171359R95263K83880
$$ plain form
6289 17248492 17438642 17245148 16320750 15440638 14629307 14073831 13427877 13045504 13203302
6280 13203302 12586914 12348588 12280860 12678143 12646045 12822388 13249244 13154779 13695371 14218519
6270 14218519 14649056 15570118 16916582 18106541 20017430 21418026 24723834 28270416
6262 28270416 33099621 38437843 43416783 45209454 44982544 41517002 38975683 36232988
6254 36232988 34155623 32502168 30993163 30457638 29099490 28101499 26777197 25448610
6246 25448610 24632484 23606308 22719261 21957168 22032850 22002350 22553680 24357441 25379293
6237 25379293 27457489 31345947 36929780 46589569 57997896 68354356 74979286 75053592
6229 75053592 70232968 64969238 60811608 56128659 53247389 51855156 51677985 52884546
$$ packed form
6289A7248492J90150j93494r24398q80112q11331n55476o45954l82373J57798
6280A3203302o16388k38326o7728L97283l2098J76343M26856r4465N40592N23148
6270A4218519M30537R21062J346464J189959J910889J400596L305808L546582
6262B8270416M829205N338222M978940J792671k26910l465542k541319k742695
6254C6232988k077365j653455j509005n35525j358148r97991j324302j328587
6246B5448610q16126j026176q87047p62093P5682l0500N51330J803761J021852
6237B5379293K078196L888458N583833R659789J1408327J0356460O624930P4306
6229G5053592m820624n263730m157630m682949k881270j392233j77171J206561
$$ plain form
6221 52884546 53901725 53587348 51688808 48243716 44138717 39524477 35946110 32487626
6213 32487626 30038638 28309591 27633188 27657759 28673746 31727345 36112232 44449285 54565011
6204 54565011 63711485 67734377 66969336 62979331 57951460 54059526 50793496 49585378
6196 49585378 50784330 54377166 59764875 63185297 63330110 59534151 54515640 49775307
6188 49775307 43769136 38213516 33514356 29414256 25804860 23962881 23250721 22585639
6180 22585639 22500125 23972328 26141427 29394309 32069673 33177945 32956401 31062701 30243240
6171 30243240 29469528 29824696 30303235 33942850 38971929 44513273 46705683 45929270 42425758
6162 42425758 38310584 34246090 29791495 25986579 22443548 19362188 17451362 15400193
$$ packed form
6221E2884546J017179l14377j898540l445092m104999m614240l578367l458484
6213C2487626k448988j729047o76403K4571J015987L053599M384887Q337053J0115726
6204E4565011R146474M022892p65041l990005n027871l891934l266030j208118
6196D9585378J198952L592836N387709L420422J44813l795959n018511m740333
6188D9775307o006171n555620m699160m100100l609396j841979p12160o65082
6180B2585639q5514J472203K169099L252882K675364J108272k21544j893700q19461
6171C0243240p73712L55168M78539L639615N029079N541344K192410p76413l503512
6162D2425758m115174m064494m454595l804916l543031l081360j910826k051169
$$ plain form
6154 15400193 14686183 13730379 12895433 12446498 12445786 11899718 11802880 11627111 11110356 11466454
6144 11466454 11971884 12093385 13118049 14058333 15794746 17826390 19911253 21083734 20169985
6135 20169985 19250921 17915934 16381013 15135377 13833049 12253712 11340019 10129734
6127 10129734 10048218 10007228 9288975 9373847 9095885 9290424 8598891 8745109 8372419 8472442
6117 8472442 8312224 8463350 8214716 7895721 7890509 8269011 7911851 8021112 7870561 7801705
6107 7801705 8142340 7799428 8128929 7957321 7837618 7948067 7850294 7916561 7991977 8137367
6097 8137367 7807902 8200481 8184645 8254769 8515637 8224878 8199456 8547107 8383967 8347877
6087 8347877 7827097 8059996 7969446 8108779 7817203 7800131 7784830 8021331 7759618 8230846
$$ packed form
6154A5400193p14010r55804q34946m48935p12n46068r6838j75769n16755L56098
6144A1466454N05430J21501J024664R40284J736413K031644K084863J172481r13749
6135B0169985r19064j334987j534921j245636j302328j579337r13693j210285
6127A0129734q1516m0990p18253Q4872k77962J94539o91533J46218l72690J00023
6117H472442j60218J51126k48634l18995n212L78502l57160J09261j50551o8856
6107G801705L40635l42912L29501j71608j19703J10449r7773O6267P5416J45390
6097H137367l29465L92579j5836P0124K60868k90759k5422L47651j63140l6090
6087H347877n20780K32899r0550J39333k91576j7072j5301K36501k61713M71228
$$ plain form
6077 8230846 8600729 8462596 8721991 8564026 8763613 8857694 9440257 9406112 9938121 10526657
6067 10526657 10870230 11962488 13321179 14423279 16215646 17224052 17226642 16769135 16088211
6058 16088211 15110280 14816495 13460444 12956924 12633921 12263296 11555495 11759914 11627915
6049 11627915 11772958 12250008 12062347 12986278 13344435 14600233 15987241 17968159 19836800
6040 19836800 21786332 23133806 24140924 24589313 25815468 27153741 28385955 28922801
6032 28922801 27645937 25858296 23648885 22302306 20847989 19832449 19437696 19390883 19700464
6023 19700464 19728360 19557284 19519804 19252347 19094707 18942991 19077003 19044554 19345671 20932071
6013 20932071 22610060 24933162 27005880 28133744 27608143 26708843 25459924 24161574
$$ packed form
6077H230846L69883j38133K59395j57965J99587R4081N82563l4145N32009N88536
6067A0526657L43573J092258J358691J102100J792367J008406K590m57507o80924
6058A6088211r77931k93785j356051n03520l23003l70625p07801K04419j31999
6049A1627915J45043M77050j87661R23931L58157J255798J387008J980918J868641
6040A9836800J949532J347474J007118M48389J226155J338273J232214N36846
6032B8922801j276864j787641k209411j346579j454317j015540l94753m6813L09581
6023A9700464K7896j71076l7480k67457j57640j51716J34012l2449L01117J586400
6013B0932071J677989K323102K072718J127864n25601q99300j248919j298350
$$ plain form
6005 24161574 23340472 23117248 22677537 23085334 23497469 23980364 23498717 23225745 23360378
5996 23360378 24472940 25303847 25932005 26137127 25426652 24713658 23730010 22352471 22006933
5987 22006933 21233464 21002661 20211927 19912553 19497254 19742340 19653508 19418354 19799299 20366113
5977 20366113 20628484 21477465 22622690 24777340 27130392 28948214 30132615 30520644 29981311
5968 29981311 29433010 28994479 29133595 28558713 29056384 30284878 32075546 34233952 36084854
5959 36084854 38741661 41570058 43188215 44822247 45504025 45689551 45149653 43522980 42456951
5950 42456951 40391810 38391116 36966343 34793252 33247460 31693973 30812062 29603352
5942 29603352 29453774 28922260 29139613 29471314 30430737 31256603 32572098 34439721 36623139
$$ packed form
6005B4161574q21102k23224m39711M07797M12135M82895m81647k72972J34633
5996B3360378J112562Q30907O28158K05122p10475p12994r83648j377539l45538
5987B2006933p73469k30803p90734k99374m15299K45086q8832k35154L80945N66814
5977B0366113K62371Q48981J145225K154650K353052J817822J184401L88029n39333
5968B9981311n48301m38531J39116n74882M97671J228494J790668K158406J850902
5959C6084854K656807K828397J618157J634032O81778J85526n39898j626673j066029
5950D2456951k065141k000694j424773k173091j545792j553487q81911j208710
5942B9603352j49578n31514K17353L31701R59423Q25866J315495J867623K183418
$$ plain form
5933 36623139 40001857 43655967 48110325 52698866 57827491 62870510 67017197 70238746
5925 70238746 72380446 72925717 72695118 70157109 67288006 63217166 58848348 54119304
5917 54119304 49839011 45324423 42099773 39156774 36760864 34958531 32797308 31986123
5909 31986123 31552703 30869935 30863276 31266099 31766822 33258020 34501958 36231560 38417773
5900 38417773 40683031 43329411 46136065 48397793 50555147 51948747 52672265 52236527
5892 52236527 51556824 49918698 48523661 46187183 44208459 43000433 42160590 41921231 43448140
5883 43448140 46062254 50121170 55061676 59988778 64053694 65617372 65009687 62697883
5875 62697883 58976957 54696430 50361019 45966997 42393821 39452968 36914291 34880414
$$ packed form
5933C6623139L378718L654110M454358M588541N128625N043019M146687L221549
5925G0238746K141700N45271k30599k538009k869103m070840m368818m729044
5917E4119304m280293m514588l224650k942999k395910j802333k161223q11185
5909C1986123m33420o82768o659M02823N00723J491198J243938J729602K186213
5900C8417773K265258K646380K806654K261728K157354J393600P23518m35738
5892E2236527o79703j638126j395037k336478j978724j208026q39843k39359J526909
5883D3448140K614114M058916M940506M927102M064916J563678o07685k311804
5875F2697883l720926m280527m335411m394022l573176k940853k538677k033877
$$ plain form
5867 34880414 33382950 32761134 32645685 32748896 33901577 35203951 37591229 40922299 44591840
5858 44591840 47634889 50713292 52306307 54466898 56541797 59634329 62209412 64173290
5850 64173290 66730367 69858416 71743935 71579122 69258370 65515125 61050493 55396506
5842 55396506 50915629 46744522 43240820 40573779 38300634 37544690 36593357 36933442 37196116
5833 37196116 37982826 39624363 41421421 43307748 43753613 43974953 42836758 41178612 40510901
5824 40510901 39288579 38107845 38248842 38451217 39533852 41113032 42314069 42601031 41856591
5815 41856591 40854505 39338824 37918505 36589224 35777609 35080103 34928015 35005989 35758285
5806 35758285 36594061 37648338 38889790 39831837 40806548 41420275 42399845 43290915 44227948
$$ packed form
5867C4880414j497464o21816j15449J03211J152681J302374K387278L331070L669541
5858D4591840L043049L078403J593015K160591K074899L092532K575083J963878
5850F4173290K557077L128049J885519j64813k320752l743245m464632n653987
5842E5396506m480877m171107l503702k667041k273145p55944r51333L40085K62674
5833C7196116P86710J641537J797058J886327M45865K21340j138195j658146o67711
5824D0510901j222322j180734J40997K02375J082635J579180J201037K86962p44440
5815D1856591j002086j515681j420319j329281q11615o97506j52088P7974P52296
5806C5758285Q35776J054277J241452R42047R74711O13727R79570Q91070R37033
$$ plain form
5797 44227948 45001659 45794759 46430505 46390368 46903741 46504330 46486927 46670373 46654919 46786957
5787 46786957 47196550 48158622 48649171 49051999 50714949 51915145 53795425 55873929 57709705
5778 57709705 59800402 61190074 62996368 64906101 65502808 65867209 65663954 64996397 63368082
5769 63368082 61785287 59438263 56796903 54349807 52122638 50212498 47606082 45877042
5761 45877042 44534775 43076407 41682749 41420772 41039689 40942187 41226640 41197765 41617678
5752 41617678 41699935 41724798 41769289 41200269 40845044 39741530 38415326 37768060 36400988
5743 36400988 34423320 33047495 31416373 30151401 28407150 26961076 25746608 24554608
5735 24554608 24017451 23425005 22343051 21459694 21217731 20218268 20348737 19539726 19081238
$$ packed form
5797D4227948P73711P93100O35746m0137N13373l99411j7403J83446j5454J32038
5787D6786957M09593R62072M90549M02828J662950J200196J880280K078504J835776
5778E7709705K090697J389672J806294J909733N96707L64401k03255o67557j628315
5769F3368082j582795k347024k641360k447096k227169j910140k606416j729040
5761D5877042j342267j458368j393658k61977l81083r7502K84453k8875M19913
5752D1617678Q2257K4863M4491n69020l55225j103514j326204o47266j367072
5743C6400988j977668j375825j631122j264972j744251j446074j214468j192000
5735B4554608n37157n92446j081954q83357k41963r99463J30469q09011m58488
$$ plain form
5726 19081238 18769765 18466589 18111190 17263012 17381325 17078629 16781390 16576636 16420355
5717 16420355 16251665 16152361 15669816 15625799 15657082 15219431 15334740 15111203 15094627 15250643
5707 15250643 15274287 15569846 15765957 15675201 16246432 16480791 16180532 16355933 15487534 16112008
5697 16112008 15690396 15285407 14628213 14591056 14223106 13988785 13657244 13450794 12975587 13122286
5687 13122286 12616483 12639216 12125291 12244430 12352145 11717700 11830917 11841217 12047328 11789884
5677 11789884 11987927 11935162 12054711 12318299 12186495 12354330 12337700 12358545 12225622 12183690
5667 12183690 11939897 11875192 11619663 11592189 11440916 11300181 10944368 10620515 10557461 10454830
5657 10454830 10678618 10447657 10251651 10395538 9890068 9910736 10295255 9736186 9219624 9879996
$$ packed form
5726A9081238l11473l03176l55399q48178J18313l02696k97239k04754j56281
5717A6420355j68690r9304m82545m4017L1283m37651J15309k23537j6576J56016
5707A5250643K3644K95559J96111r0756N71231K34359l00259J75401q68399O24474
5697A6112008m21612m04989o57194l7157l67950k34321l31541k06450m75207J46699
5687A3122286n05803K2733n13925J19139J07715o34445J13217J0300K06111k57444
5677A1789884J98043n2765J19549K63588j31804J67835j6630K0845j32923m1932
5667A2183690k43793o4705k55529k7474j51273j40735l55813l23853o3054j02631
5657A0454830K23788k30961j96006J43887n05470K0668L84519n59069n16562O60372
$$ plain form
5647 9879996 9429848 9438262 9096318 9371958 9318322 9318503 9630469 9619815 9567211 9813073 9579518
5636 9579518 9671284 9877448 9596406 10171901 9736441 9615027 9788397 9938374 9898558 9942611
5626 9942611 10195972 10302705 10402563 10334427 10441246 10704817 11041566 11290144 11537719 11501682
5616 11501682 12118645 12020919 12867686 13297875 14180508 14513789 15255454 16491463 17157452
5607 17157452 18352243 19881302 21608633 23077424 24236886 25771938 27865720 28922563
5599 28922563 29492106 30991176 30875849 31263542 30648873 30484357 29925570 28769692 28180254
5590 28180254 27621020 26884383 25981860 25631645 25549450 25506311 25577822 25569010 26619031 27197008
5580 27197008 28514049 29535166 31462962 34175735 36156511 39205497 41814633 44837772
$$ packed form
5647I879996m50148Q414l41944K75640n3636J81L11966j0654n2604K45862k33555
5636I579518R1766K06164k81042N75495m35460j21414J73370J49977l9816M4053
5626I942611K53361J06733R9858o8136J06819K63571L36749K48578K47575l6037
5616A1501682O16963r7726Q46767M30189Q82633L33281P41665J236009O65989
5607A7157452J194791J529059J727331J468791J159462J535052K093782J056843
5599B8922563N69543J499070j15327L87693o14669j64516n58787j155878n89438
5590B8180254n59234p36637r02523l50215q2195m3139P1511q812J050021N77977
5580B7197008J317041J021117J927796K712773J980776L048986K609136L023139
$$ plain form
5572 44837772 47292200 49670909 51530807 52914905 53106760 53398166 52160902 51058404
5564 51058404 49109538 47229671 44879103 42548018 39521295 37631823 35101969 33418557
5556 33418557 31339717 29821666 28603084 27783887 27520202 27071508 26951742 27513303 28026882
5547 28026882 28720084 29829372 31059934 32421067 34113891 35748059 37009764 37742974
5539 37742974 38178432 38581505 37797464 36724998 34976873 33291141 31154308 29325672 27088849
5530 27088849 25163088 23344228 21658485 19795213 18719024 17466804 16613670 16090560
5522 16090560 15047080 14589590 13928494 13856205 13567602 13162624 12826139 12944881 12682561
5513 12682561 12545726 12411795 12504180 11950258 12577186 12537997 12288271 12000079 12049461 12010921
$$ packed form
5572D4837772K454428K378709J859898J384098J91855K91406j237264j102498
5564E1058404j948866j879867k350568k331085l026723j889472k529854j683412
5556C3418557k078840j518051j218582q19197k63685m48694j19766N61561N13579
5547B8026882O93202J109288J230562J361133J692824J634168J261705P33210
5539C7742974M35458M03073p84041j072466j748125j685732k136833j828636k236823
5530B7088849j925761j818860j685743j863272j076189j252220q53134n23110
5522A6090560j043480m57490o61096p2289k88603m04978l36485J18742k62320
5513A2682561j36835j33931R2385n53922O26928l9189k49726k88192M9382l8540
$$ plain form
5503 12010921 11470634 11799850 11548050 11660852 11459925 11006292 11258565 11290511 11004911 11481190
5493 11481190 11271660 11200960 11290055 10752795 11026028 11180787 11393006 11277997 11264647 11222582
5483 11222582 11068647 11424520 11364485 11530675 11692084 11848431 11399051 11307487 11209220 11134567
5473 11134567 10913286 10853383 10582280 10583824 10352231 10201983 9694880 9487717 9763094 9740537
5463 9740537 9563723 9470198 9200673 9326029 9170736 8855191 8812828 8774190 8662113 8278818
5453 8278818 8264102 8030188 7880534 7971358 7566669 7971307 8007673 7767207 8056295 7572643
5443 7572643 7613860 7596651 7824561 7708938 7446029 7830463 7492380 7831751 7472788 7720173
5433 7720173 7681217 7773697 7882486 7868814 8522174 8513307 8833223 9596069 10710223 11841032
$$ packed form
5503A2010921n40287L29216k51800J12802k00927m53633K52273L1946k85600M76279
5493A1481190k09530p0700Q9095n37260K73233J54759K12219j15009j3350m2065
5483A1222582j53935L55873o0035J66190J61409J56347m49380r1564r8267p4653
5473A1134567k21281n9903k71103J544k31593j50248n07103k07163K75377k2557
5463I740537j76814r3525k69525J25356j55293l15545m2363l8638j12077l83295
5453H278818j4716k33914j49654R0824m04689M04638L6366k40466K89088m83652
5443G572643M1217j7209K27910j15623k62909L84434l38083L39371l58963K47385
5433G720173l8956R2480J08789j3672O53360q867L19916P62846J114154J130809
$$ plain form
5423 11841032 12651777 13484665 14352463 14667776 14530230 14262233 13804134 12506707 12079129
5414 12079129 11214546 10797609 10580542 10379491 9864119 9902295 9915074 10403853 10784472 12375954
5404 12375954 14155989 15025937 15022672 14413653 13595638 12668928 12131218 11462122 10719931 10409636
5394 10409636 10238241 9801633 9774041 10196264 9937145 9983359 10129126 10416413 10770978 11072969
5384 11072969 11492362 11929799 12206517 12953530 13516166 14268437 14921047 16360117 17000586
5375 17000586 18207738 19186513 20320799 21834335 23221088 24459297 25407662 26343694 27389405
5366 27389405 28088788 28200568 28629307 28958979 28859595 29517349 29026780 29354302 29434866 30056959
5356 30056959 30592405 31341027 32923384 33856205 34830632 36666497 38684847 40817090 42508337
$$ packed form
5423A1841032Q10745Q32888Q67798L15313j37546k67997m58099j297427m27578
5414A2079129q64583m16937k17067k01051n15372L8176J2779M88779L80619J591482
5404A2375954J780035Q69948l265o09019q18015r26710n37710o69096p42191l10295
5394A0409636j71395m36608k7592M22223k59119M6214J45767K87287L54565L01991
5384A1072969M19393M37437K76718P47013N62636P52271O52610J439070O40469
5375A7000586J207152R78775J134286J513536J386753J238209R48365R36032J045711
5366B7389405O99383J11780M28739L29672r9384O57754m90569L27522Q0564O22093
5356C0056959N35446P48622J582357R32821R74427J835865K018350K132243J691247
$$ plain form
5347 42508337 44395786 46359737 48183125 49174736 50454105 50741123 51945411 51355212 50701699
5338 50701699 49379523 48294953 47073311 45365754 43871386 42291389 40016784 39101909
5330 39101909 38197529 36954836 36627054 35894792 35646078 35308581 34958451 34406487 33989556
5321 33989556 33811176 33048916 32170475 31554074 30604281 29165212 27757654 26343198 25002886
5312 25002886 23705658 22193160 20227191 18930302 18033766 17410628 15982482 15199427 14138858
5303 14138858 13749630 13222085 12822001 12375874 11859587 12058528 11178741 10876794 10940524 10369288
5293 10369288 10188612 9849502 9792913 9641597 9494462 9210951 9266617 8761533 8892434 8747496
5283 8747496 8870532 8662090 8720563 8648721 8472945 8429361 8616146 8150859 8569419 8078408
$$ packed form
5347D2508337J887449J963951J823388R91611J279369K87018J204288n90199o53513
5338E0701699j322176j084570j221642j707557j494368j579997k274605r14875
5330C9101909r04380j242693l27782p32262k48714l37497l50130n51964m16931
5321C3989556j78380p62260q78441o16401r49793j439069j407558j414456j340312
5312B5002886j297228j512498j965969j296889q96536o23138j428146p83055j060569
5303A4138858l89228n27545m00084m46127n16287J98941q79787l01947O3730n71236
5293A0369288j80676l39110n6589j51316j47135k83511N5666n05084J30901j44938
5283H747496J23036k08442N8473p1842j75776m3584J86785m65287M18560m91011
$$ plain form
5273 8078408 8321837 8429019 8559665 7918942 8085657 7981860 7723666 7903786 7739701 7640433
5263 7640433 7484896 7295798 7241423 6742277 6728061 6938674 6622953 6906414 6387596 6572625
5253 6572625 6241815 5940748 6310420 6188444 6330627 5808850 6120172 5951278 5777991 5825884
5243 5825884 5876326 5547292 5935786 5616962 5820068 6008388 5363151 5094925 5138775 4954457
5233 4954457 4871816 4622636 4971126 5051277 4490527 4681364 4635944 4569820 4556028 4087638
5223 4087638 4277851 4356448 4437554 4478476 4323807 3935906 4452235 4305342 4064151 3508243
5213 3508243 4148466 4151893 4229891 4170625 4004603 3898108 4287285 4033012 4393999 3970190
5203 3970190 4110022 3854525 3948910 3779202 4185011 4260953 4206267 3983472 4170826 4354325
$$ packed form
5273H078408K43429J07182J30646o40723J66715j03797k58194J80120j64085r9268
5263G640433j55537j89098n4375m99146j4216K10613l15721K83461n18818J85029
5253F572625l30810l01067L69672j21976J42183n21777L11322j68894j73287M7893
5243E825884N0442l29034L88494l18824K03106J88320o45237k68226M3850j84318
5233D954457q2641k49180L48490Q0151n60750J90837m5420o6124j3792m68390
5223D087638J90213P8597Q1106M0922j54669l87901N16329j46893k41191n55908
5213C508243O40223L427P7998n9266j66022j06495L89177k54273L60987m23809
5203C970190J39832k55497R4385j69708M05809P5942n4686k22795J87354J83499
$$ plain form
5193 4354325 4558958 3857119 4209369 4648022 4886817 4773221 4479186 4580775 4512294 5006366
5183 5006366 4581933 4927849 5035993 4946956 4625263 4733078 4971289 4707906 4707753 4889425
5173 4889425 5070603 5338510 4976203 4726101 5131843 5110567 5063799 5438417 5296449 4832942
5163 4832942 5373478 5477117 5557281 5704242 6322477 5815632 6355856 6209939 6459328 6897579
5153 6897579 7094362 6942872 7413737 7087648 7724090 7404731 7864942 7734674 7864096 7881099
5143 7881099 8234910 8356167 8023064 8426844 8645185 8717624 9374432 9714139 10016727 9990126
5133 9990126 10450767 11573778 12329363 13490732 14352015 15939578 16860259 17307693 18624955
5124 18624955 18924449 18817226 18744009 18347967 17575192 17607471 17103112 16630435 16782839 16784588
$$ packed form
5193D354325K04633p01839L52250M38653K38795j13596k94035J01589o8481M94072
5183E006366m24433L45916J08144q9037l21693J07815K38211k63383j53J81672
5173D889425J81178K67907l62307k50102M05742k1276m6768L74618j41968m63507
5163D832942N40536J03639Q0164J46961O18235n06845N40224j45917K49389M38251
5153F897579J96783j51490M70865l26089O36442l19359M60211j30268J29422J7003
5143G881099L53811J21257l33103M03780K18341P2439O56808L39707L02588k6601
5133I990126M60641J123011P55585J161369Q61283J587563R20681M47434J317262
5124A8624955K99494j07223p3217l96042p72775L2279n04359m72677J52404J749
$$ plain form
5114 16784588 16839603 16645851 17383899 17487246 18077945 17706358 18126783 19103177 19891966 20508447
5104 20508447 21989736 23224361 25189927 27270796 29983964 33244580 36102362 39419252
5096 39419252 41465446 43332433 44386135 43899453 43273582 42753818 41590329 41044298 39584744
5087 39584744 38105026 35937763 33929293 32633981 31168976 30593030 30114239 30051064 30630274
5078 30630274 32244124 33421870 34148592 34727172 34833065 35643417 37215539 39457344 41695054
5069 41695054 44928837 48554758 52194904 54660166 57189545 57447278 56919340 54923539
5061 54923539 53670582 52273885 51155947 50121859 49527677 49843335 50558283 52716884 52257815
5052 52257815 50685683 47005513 43087338 39297305 36027888 33490370 31564655 29395847
$$ packed form
5114A6784588N5015j93752P38048J03347N90699l71587M20425R76394P88789O16481
5104B0508447J481289J234625J965566K080869K713168L260616K857782L316890
5096C9419252K046194J866987J053702m86682o25871n19764j163489n46031j459554
5087C9584744j479718k167263k008470j295312j465005n75946m78791o3175N79210
5078C0630274J613850J177746P26722N78580J05893Q10352J572122K241805K237710
5069D1695054L233783L625921L640146K465262K529379K57733n27938j995801
5061E4923539j252957j396697j117938j034088n94182L15658P14948K158601m59069
5052E2257815j572132l680170l918175l790033l269417k537518j925715k168808
$$ plain form
5044 29395847 28914886 28310422 28758965 29734290 31229114 32936509 34778441 36317420 37746569
5035 37746569 37815566 37800271 36716600 34779284 32815846 30324908 28135860 25951781 23539592
5026 23539592 21807126 20196009 19063845 18167001 17702910 17149323 16656866 16205669 15968900
5017 15968900 15835709 15168074 15052534 14635681 14446382 14344254 14295465 14954176 14710330 14915173
5007 14915173 15214397 16204907 16031409 15786017 15877058 15430530 15112120 14921593 14317181 14317543
4997 14317543 13948338 13854673 13908264 13991628 14183037 14466333 15217299 16396797 17404632 19970402
4987 19970402 24595490 32051564 44199140 59920506 71833037 74197377 70038974 65406653
4979 65406653 58996972 52565928 45156307 36525707 29908434 23489666 19039696 16008694
$$ packed form
5044B9395847m80961o04464M48543R75325J494824J707395J841932J538979J429149
5035C7746569O8997j5295j083671j937316j963438k490938k189048k184079k412189
5026B3539592j732466j611117j132164q96844m64091n53587m92457m51197k36769
5017A5968900j33191o67635j15540m16853j89299j02128m8789O58711k43846K04843
5007A4915173K99224R90510j73498k45392R1041m46528l18410j90527o04412L62
4997A4317543l69205r3665N3591Q3364J91409K83296P50966J179498J007835K565770
4987A9970402M625088P456074J2147576J5721366J1912531K364340m158403m632321
4979F5406653o409681o431044p409621q630600o617273o418768m449970l031002
$$ plain form
4971 16008694 14222199 13089306 12185141 11302489 10492949 9179454 9059762 8657244 7621130
4962 7621130 7569168 7213336 7204061 7027561 6914130 6669289 6585087 6435704 7042813 7273527
4952 7273527 8652889 9021726 9602195 9246873 9215012 8369290 7969103 7444381 6889330 6236131
4942 6236131 6221886 5577300 5334178 5228123 5145646 5022423 5182903 5167377 5149336 5154728 5023946
4931 5023946 4737261 4985459 5038452 4862784 4749519 4576851 4740627 5022113 4595149 4606533
4921 4606533 4771931 4592227 4794572 4855814 4870336 4961548 5017828 4800363 5115258 4751429
4911 4751429 4841709 4745607 5397556 5127761 5364588 5512261 5716817 5136760 5557195 5314579
4901 5314579 5492060 5547834 5564044 5154212 5391248 5397553 5570624 5188689 5364267 5642620
$$ packed form
4971A6008694j786495j132893r04165q82652q09540j313495j19692m02518j036114
4962G621130n1962l55832r275j76500j13431k44841q4202j49383O07109K30714
4952G273527J379362L68837N80469l55322l1861q45722m00187n24722n55051o53199
4942F236131j4245o44586k43122j06055q2477j23223J60480j5526j8041N392j30782
4931E023946k86685K48198N2993j75668j13265j72668J63776K81486m26964J1384
4921D606533J65398j79704K02345O1242J4522R1212N6280k17465L14895l63829
4911D751429R0280r6102O51949k69795K36827J47673K04556n80057M20435k42616
4901E314579J77481N5774J6210m09832K37036O305J73071l81935J75578K78353
$$ plain form
4891 5642620 5270028 5435832 5894984 5598087 5967910 5894410 6147252 5807693 6235442 6112122
4881 6112122 6237313 6368462 6909924 6568922 7001109 7088025 7058838 7178992 7035756 7517740
4871 7517740 7412004 7639300 7776482 7441039 7786973 7697014 7717868 7893110 8075878 8304042
4861 8304042 8772594 9004667 9296536 9771960 9628385 10343066 10770788 10967756 11571025 11575017
4851 11575017 12216316 13180267 13504937 14112464 14284802 15171972 15663976 16095338 16802142
4842 16802142 17575447 18179360 18809575 19241172 19473707 20487360 21646750 22080660 23128131
4833 23128131 23851472 24695259 25305093 26574817 26767240 27952226 28334033 29228777 30267047
4824 30267047 30899620 32356196 33021620 34262885 34902780 35989901 36815181 37893914 39182234
$$ packed form
4891E642620l72592J65804M59152k96897L69823p3500K52842l39559M27749j23320
4881F112122J25191J31149N41462l41002M32187Q6916k9187J20154j43236M81984
4871G517740j05736K27296J37182l35443L45934q9959K0854J75242J82768K28164
4861H304042M68552K32073K91869M75424j43575P14681M27722J96968O03269L992
4851A1575017O41299R63951L24670O07527J72338Q87170M92004M31362P06804
4842A6802142P73305O03913O30215M31597K32535J013653J159390M33910J047471
4833B3128131P23341Q43787O09834J269724J92423J184986L81807Q94744J038270
4824C0267047O32573J456576O65424J241265O39895J087121Q25280J078733J288320
$$ plain form
4815 39182234 40192421 41871186 43060040 44872796 46159089 47828425 49275410 49774647
4807 49774647 51135642 52069896 52857762 53220507 53599180 53865183 54214069 54903360 55442153
4798 55442153 56365888 56496669 57284481 58518928 59130564 60678415 62191907 63614866 66064803
4789 66064803 68637235 71864250 75331943 78191755 81087381 83516596 85144370 86596434
4781 86596434 86645728 87239555 86742648 86241807 85703721 84571531 84172302 83722024 82504532
4772 82504532 82551525 82488865 81817274 81350646 81224573 80984745 81209509 80933711 81116719 81510812
4762 81510812 82546453 81967892 82396487 81872163 81373969 79704687 77192980 74534648 71367559
4753 71367559 68700602 65286630 62707704 59907737 57464740 55242251 53531176 52304698
$$ packed form
4815C9182234J010187J678765J188854J812756J286293J669336J446985M99237
4807D9774647J360995R34254P87866L62745L78673K66003L48886O89291N38793
4798E5442153R23735J30781P87812J234447O11636J547851J513492J422959K449937
4789F6064803K572432L227015L467693K859812K895626K429215J627774J452064
4781H6596434M9294N93827m96907n00841n38086j132190l99229m50278j217492
4772H2504532M6993o2660o71591m66628j26073k39828K24764k75798J83008L94093
4762H1510812J035641n78561M28595n24324m98194j669282k511707k658332l167089
4753G1367559k666957l413972k578926k799967k442997k222489j711075j226478
$$ plain form
4745 52304698 50642105 49265590 48352960 48011004 46874532 46116442 45600813 45018583 44493645
4736 44493645 44097965 43335619 42616401 41934471 41284301 39940021 38857980 38111588 36840575
4727 36840575 35946082 35171073 34368057 33462309 32587434 31512750 31231997 30377341 29233026
4718 29233026 29108349 28472225 28215017 27328009 27031518 26664756 26748617 26086233 26060632 25588957
4708 25588957 25305758 24924641 24579832 24683564 23652730 23400677 23253452 22684258 22271947
4699 22271947 22468985 22202413 21745929 21504055 21398739 21529108 21569218 21049296 21263915 21044743
4689 21044743 20758259 20471386 20265909 20608040 20667563 20574743 20552987 20638572 21267652 21692560
4679 21692560 22329334 23310117 24138739 25786228 27011604 28036440 29153108 30015486 30403448
$$ packed form
4745E2304698j662593j376515r12630l41956j136472p58090n15629n82230n24938
4736D4493645l95680p62346p19218o81930o50170j344280j082041p46392j271013
4727C6840575q94493p75009q03016r05748q74875j074684k80753q54656j144315
4718B9233026j24677o36124k57208q87008k96491l66762Q3861o62384k5601m71675
4708B5588957k83199l81117l44809J03732j030834k52053j47225n69194m12311
4699B2271947J97038k66572m56484k41874j05316J30369M0110n19922K14619k19172
4689B1044743k86484k86873k05477L42131N9523r2820k1756Q5585O29080M24908
4679B1692560O36774R80783Q28622J647489J225376J024836J116668Q62378L87962
$$ plain form
4670 30403448 31960216 32694522 33657122 34919896 36257402 38060258 40314923 43082684
4662 43082684 45750604 49295154 53343858 59269985 66803953 78957278 94217901 111704494
4654 111704494 127369609 136377851 137938806 132853548 123881802 113762653 103221569 92574565
4646 92574565 83176070 74525118 67680753 62785176 58929898 56980116 55185515 53619701
4638 53619701 52704854 51825106 51714756 51595811 53604866 54481520 57105616 61292210 67371256
4629 67371256 77609523 90656050 106776209 121397360 130022142 131227391 125666157 116030558
4621 116030558 105256594 93758044 82265067 70819540 61604254 53395155 47778131
4614 47778131 42518761 38851541 35921343 32769114 30058010 27692422 26268948 24542515
$$ packed form
4670C0403448J556768P34306R62600J262774J337506J802856K254665K767761
4662D3082684K667920L544550M048704N926127P533968J2153325J5260623J7486593
4654A11704494J5665115R008242J560955n085258q971746j0119149j0541084j0647004
4646I2574565r398495q650952o844365m895577l855278j949782j794601j565814
4638E3619701r14847q79748j10350j18945K009055Q76654K624096M186594O079046
4629F7371256J0238267J3046527J6120159J4621151Q624782J205249n561234r635599
4621A16030558j0773964j1498550j1492977j1445527r215286q209099n617024
4614D7778131n259370l667220k930198l152229k711104k365588j423474j726433
$$ plain form
4606 24542515 22794075 21353656 20593766 19524738 18809275 18760347 18241786 18104567 18202359
4597 18202359 17367445 17424503 17070881 17059361 16537741 15979410 15432658 14760147 14387137 13808921
4587 13808921 13853871 12998304 13221196 12657491 12316371 12606053 12265991 12149342 11705942 11639512
4577 11639512 11730004 11390374 11527503 11751765 11313436 11693533 11973795 12072537 12872074 13117067
4567 13117067 13720810 13328742 13146500 12878418 12382674 11574645 11819224 11245973 10937508
4558 10937508 10766072 10611328 10217710 10281046 10030108 10363994 10164487 10097726 10019505 9756454
4548 9756454 10096192 9978669 9572603 10285590 10101553 10186927 10234194 10246319 11021034 11185386
4538 11185386 11289128 11544319 11680576 11691908 12408232 12735229 12905558 13295755 13456867 13908048
$$ packed form
4606B4542515j748440j440419p59890j069028p15463m8928n18561j37219R7792
4597A8202359q34914N7058l53622j1520n21620n58331n46752o72511l73010n78216
4587A3808921M4950q55567K22892n63705l41120K89682l40062j16649m43400o6430
4577A1639512R0492l39630J37129K24262m38329L80097K80262R8742P99537K44993
4567A3117067O03743l92068j82242k68082m95744q08029K44579n73251l08465
4558A0937508j71436j54744l93618O3336k50938L33886j99507o6761p8221k63051
4548I756454L39738j17523m06066P12987j84037Q5374M7267J2125P74715J64352
4538A1185386J03742K55191J36257J1332P16324L26997J70329L90197J61112M51181
$$ plain form
4528 13908048 13620558 13824678 13047585 12852374 13242883 13025329 12991777 12997455 13517659 13066691
4518 13066691 13029549 13130594 12792893 13311581 13088354 12522519 12874998 12600142 12992287 13002546
4508 13002546 13524666 13820434 14004535 15087340 15961354 16851631 17757801 18396145 19211689
4499 19211689 19709480 19915651 20874391 21576865 21929690 22311872 22312659 22154378 21628161 21321808
4489 21321808 20395468 19639712 18900529 18200776 17656376 17226489 16640748 17014954 16977342 17137272
4479 17137272 17269451 17836940 18384387 18979238 19805887 21254049 22199918 22848567 23331639
4470 23331639 23682045 24522176 24355947 24856746 26169467 26306138 26346750 26817096 26687899
4461 26687899 27250278 27515015 27467343 27552918 28162271 28943568 29643142 30353599 31837544 32517808
$$ packed form
4528A3908048k87490K04120p77093j95211L90509k17554l3552N678N20204m50968
4518A3066691l7142J01045l37701N18688k23227n65835L52479k74856L92145J0259
4508A3002546N22120K95768J84101J082805Q74014Q90277R06170O38344Q15544
4499A9211689M97791K06171R58740P02474L52825L82182P87j58281n26217l06353
4489B1321808r26340p55756p39183o99753n44400m29887n85741L74206l7612J59930
4479A7137272J32179N67489N47447N94851Q26649J448162R45869O48649M83072
4470B3331639L50406Q40131j66229N00799J312721J36671M0612M70346j29197
4461B6687899N62379K64737m7672Q5575O09353P81297O99574P10457J483945O80264
$$ plain form
4451 32517808 34513598 36349725 38889210 41296111 44319428 46067756 48877407 52671820
4443 52671820 58671328 65710812 71738011 74374366 74393327 73112608 72447240 71993156 71215872
4434 71215872 70951698 70948900 72517841 75266459 80102925 89108838 104936557 132043564
4426 132043564 172693424 240765242 315021003 360807306 362988110 348550138 333200540
4419 333200540 311107766 282514625 244513978 208318316 173937232 147029866 128797807
4412 128797807 118311430 111109829 106626403 105205574 107520652 115291374 132121555 163605079
4404 163605079 209702965 280384406 345857102 373489927 359015509 335330379 306831774
4397 306831774 275347502 239694789 201055346 167226304 136604965 114949209 100535894
$$ packed form
4451C2517808J995790J836127K539485K406901L023317J748328K809651L794413
4443E2671820N999508P039484O027199K636355J8961j280719o65368m54084p77284
4434G1215872k64174k798J568941K748618M836466R005913J5827719K7107007
4426A32043564M0649860O8071818P4255761M5786303K180804j4437972j5349598
4419C33200540k2092774k8593141l8000647l6195662l4381084k6907366j8232059
4412A28797807j0486377p201601m483426j420829K315078P770722J6830181L1483524
4404A63605079M6097886P0681441O5472696K7632825j4474418k3685130k8498605
4397C06831774l1484272l5652713l8639443l3829042l0621339k1655756j4413315
$$ plain form
4390 100535894 91641655 86470992 83515635 82633555 84853934 87021455 88587512 89588779
4382 89588779 89295932 87000945 83378836 77668936 72239772 67139476 62462506 59841928
4374 59841928 59698055 61617054 65435713 67868907 68554090 67286982 65880081 65122725 65908432
4365 65908432 68978833 73365105 75904652 76211285 73652053 70985864 68209674 65987970
4357 65987970 63736663 62342496 61882356 63265751 66572014 73190694 84189708 100538947
4349 100538947 122074688 153488262 188490055 210244383 213410024 203523776 190103308
4342 190103308 175942007 160189706 141519551 123190707 106012127 92028926 82071553
4335 82071553 76052831 73501661 71567720 70542046 70298378 70963126 72324283 75530518
$$ packed form
4390A00535894q894239n170663k955357q82080K220379K167521J566057J001267
4382H9588779k92847k294987l622109n709900n429164n100296m676970k620578
4374E9841928j43873J918999L818659K433194O85183j267108j406901p57356P85707
4365F5908432L070401M386272K539547L06633k559232k666189k776190k221704
4357F5987970k251307j394167m60140J383395L306263O618680J0999014J6349239
4349A00538947K1535741L1413574L5001793K1754328L165641r886248j3420468
4342A90103308j4161301j5752301j8670155j8328844j7178580j3983201r957373
4335H2071553o018722k551170j933941j025674k43668O64748J361157L206235
$$ plain form
4327 75530518 81116734 88887809 100165821 114486674 133587848 159909355 198382422
4320 198382422 261914302 334631653 381818648 389521325 370010813 343482598 314456233
4313 314456233 281769494 242359253 203763121 165780909 135187354 113537251 98325908
4306 98325908 87696574 80308854 74082826 68940069 64539550 61080186 59116118 56847248
4298 56847248 56792885 57156773 59600897 64627854 75304753 92382767 121831735 155478153
4290 155478153 177539930 181181375 172955260 161617708 148998484 134368029 116158985
4283 116158985 98282843 80859064 66657399 56353973 48835697 43606901 40140354
4276 40140354 36312431 33497628 30831670 28603910 26546374 24937494 22924530 22051658
$$ packed form
4327G5530518N586216P771075J1278012J4320853J9101174K6321507L8473067
4320A98382422O3531880P2717351M7186995P702677j9510512k6528215k9026365
4313C14456233l2686739l9410241l8596132l7982212l0593555k1650103j5211343
4306I8325908j0629334p387720o226028n142757m400519l459364j964068k268870
4298E6847248n4363L63888K444124N026957J0676899J7078014K9448968L3646418
4290A55478153K2061777L641445q226115j1337552j2619224j4630455j8209044
4283A16158985j7876142j7423779j4201665j0303426p518276n228796l466547
4276D0140354l827923k814803k665958k227760k057536j608880k012964q72872
$$ plain form
4268 22051658 20749863 19657166 19161213 18087981 17580689 17049658 16883642 16000415 15769347
4259 15769347 15796312 15215710 15012946 14408893 14024974 14019277 13925511 13290964 12677631 12768781
4249 12768781 12046999 11408794 11320940 11277527 10903776 10919064 10224581 10205554 10026164 9682015
4239 9682015 9335746 9356434 9147607 8864379 8635136 8828241 8127639 7976813 7757112 8355318
4229 8355318 7866948 7391748 7434575 6863158 7176641 6953018 6844277 7123966 6924729 6966703
4219 6966703 6440534 6256387 6250741 6373048 5869491 5999176 5612802 5331558 5498027 5541717
4209 5541717 5263347 5227232 5392577 5488700 5026930 5344638 5197595 4869129 4823318 5120211
4199 5120211 4828724 4746851 4825799 4955449 4673934 4601772 4701014 4835215 4588011 4524426
$$ packed form
4268B2051658j301795j092697m95953j073232n07292n31031j66016q83227k31068
4259A5769347K6965n80602k02764o04053l83919n697r3766o34547o13333R1150
4249A2768781p21782o38205q7854m3413l73751J5288o94483j9027j79390l44149
4239I682015l46269K0688k08827k83228k29243J93105p00602j50826k19701N98206
4229H355318m88370m75200M2827n71417L13483k23623j08741K79689j99237M1974
4219F966703n26169j84147n646J22307n03557J29685l86374k81244J66469M3690
4209E541717k78370l6115J65345R6123m61770L17708j47043l28466m5811K96893
4199E120211k91487q1873P8948J29650k81515p2162R9242J34201k47204o3585
$$ plain form
4189 4524426 4142962 4538452 4170160 4208305 4177907 3947547 4128461 4293811 3815141 4083791
4179 4083791 3642161 3576339 3554052 3925296 3843900 3513274 3777449 4020888 4086243 4594202
4169 4594202 4676986 4901679 4964655 4490868 4977407 4492300 3963191 4017193 4148107 3549104
4159 3549104 3718631 3575684 3185793 3040513 3443761 3221517 3220934 3029747 3070777 3326985
4149 3326985 3573618 3785905 4211252 4467950 4582116 4130068 3752199 3424975 3335823 3449624
4139 3449624 3114449 2795833 2660919 2419816 2393740 2136909 2432435 2490078 2855898 2337676
4129 2337676 2280728 2667676 2235103 2317726 2803210 2452729 1931450 2605892 2187656 2365577
4119 2365577 1982331 2110182 1946745 2028327 2444139 2091527 2157002 2082120 1990235 1949779
$$ packed form
4189D524426l81464L95490l68292L8145l0398k30360J80914J65350m78670K68650
4179D083791m41630o5822k2287L71244q1396l30626K64175K43439O5355N07959
4169D594202Q2784K24693O2976m73787M86539m85107n29109N4002J30914n99003
4159C549104J69527j42947l89891j45280M03248k22244n83j91187M1030K56208
4149C326985K46633K12287M25347K56698J14166m52048l77869l27224q9152J13801
4139C449624l35175l18616j34914k41103k6076k56831K95526N7643L65820n18222
4129B337676n6948L86948m32573Q2623M85484l50481n21279O74442m18236J77921
4119B365577l83246J27851j63437Q1582M15812l52612O5475p4882r1885m0456
$$ plain form
4109 1949779 2224490 2112192 2513286 2491953 2120925 2504543 2366234 2309805 2189118 2535313
4099 2535313 2422085 2601927 2220135 2553085 3306265 3204364 3143444 3193061 2957448 2491168
4089 2491168 2652348 2349190 2620012 2196471 2361133 2653527 2483416 2556457 2508341 2255648
4079 2255648 2585865 2580990 2296472 2328488 2611206 2583173 2645225 2865330 2973730 2758627
4069 2758627 3401800 3935687 3843914 3844255 3907710 4225044 3860734 3514150 3445930 3424338 3061509
4058 3061509 3139808 3068164 2917627 3036714 2997835 3269913 3236074 3577484 3484267 3324838
4048 3324838 3492433 3924781 3596533 3585903 3424122 3462015 3952688 4263514 3891418 4089758
4038 4089758 4379404 4356530 4453137 4035820 4361566 4502331 4532605 4581766 4449836 4407951
$$ packed form
4109A949779K74711j12298M01094k1333l71028L83618j38309n6429j20687L46195
4099B535313j13228J79842l81792L32950P53180j01901o0920M9617k35613m66280
4089B491168J61180l03158K70822m23541J64662K92394j70111P3041m8116k52693
4079B255648L30217m875k84518L2016K82718k8033O2052K20105J08400k15103
4069B758627O43173N33887r1773L41O3455L17334l64310l46584o8220k1592l62829
4058C061509P8299p1644j50537J19087l8879K72078l3839L41410r3217j59429
4048C324838J67595M32348l28248j0630j61781L7893M90673L10826l72096J98340
4038D089758K89646k2874R6607m17317L25746J40765L0274M9161j31930m1885
$$ plain form
4028 4407951 4414057 4341779 4861999 4914792 5569173 5258948 5555804 5584365 5721302 5852536
4018 5852536 5700352 5301139 4886998 4781069 4626149 4182956 4083699 4192547 3845158 3919926
4008 3919926 3983304 3957602 3997254 4778774 4567336 4560355 4897199 4460694 4707201 4977263
3998 4977263 4716563 5177897 5222073 4875744 5311933 5030352 4722846 4364333 4123068 4202426
3988 4202426 3843394 3693319 3645887 3590809 3197523 3545677 3752632 3530864 3213424 3273965
3978 3273965 3145153 3194371 3594939 3441364 3198983 2930176 3340514 2817757 2950140 2935003
3968 2935003 2632828 2501286 2600243 2416750 1803635 1809937 1985225 2022845 1951443 1784684
3958 1784684 1847218 1490108 1513553 1429727 1756397 1442027 1328247 1389098 1484384 1453319 1372364
$$ packed form
4028D407951O106p2278N20220N2793O54381l10225K96856K8561J36937J31234
4018E852536j52184l99213m14141j05929j54920m43193r9257J08848l47389P4768
4008C919926O3378k5702L9652P81520k11438o981L36844m36505K46507K70062
3998D977263k60700M61334M4176l46329M36189k81581l07506l58513k41265P9358
3988D202426l59032j50075m7432n5078l93286L48154K06955k21768l17440O0541
3978C273965j28812M9218M00568j53575k42381k68807M10338n22757J32383j5137
3968B935003l02175j31542R8957j83493o13115O302J75288L7620p1402j66759
3958A784684O2534l57110K3445q3826L26670l14370j13780O0851R5286l1065q0955
$$ plain form
3947 1372364 1415191 1353458 1167327 1506732 1572499 1203500 1283252 1243623 921449 1352918
3937 1352918 1349977 828527 1004451 1154455 1131220 1331245 928959 1090761 1432572 1179676
3927 1179676 1489139 861154 1301514 846481 908916 1176488 1070188 1191949 902980 862582
3917 862582 1002787 425260 1062418 575833 765580 526960 678676 770456 811008 881917
3907 881917 456930 895682 779043 815239 726712 969122 865086 575661 1013602 867664
3897 867664 716414 625883 861490 482464 767602 533607 665139 495885 661423 578790
3887 578790 694651 180916 486983 446672 527479 434966 512354 673268 765924 429406 784018
3876 784018 144892 583746 529710 479059 939838 535040 242905 -10138 207069 817455
$$ packed form
3947A372364M2827o1733j86131L39405O5767l68999P9752l9629l22174M31469
3937A352918k941n21450J75924J50004k3235K00025m02286J61802L41811k52896
3927A179676L09463o27985M40360m55033O2435K67572j06300J21761k88969m0398
3917H62582J40205n77527O37158m86585J89747k38620J51716R1780M0552P0909
3907H81917m24987M38752j16639L6196q8527K42410j04036k89425M37941j45938
3897H67664j51250r0531K35607l79026K85138k33995J31532j69254J65538q2633
3887E78790J15861n13735L06067m0311Q0807r2513P7388J60914R2656l36518L54612
3876G84018o39126M38854n4036n0651M60779m04798k92135k53043K17207O10386
$$ plain form
3866 817455 300783 195524 520957 40541 241426 403709 318063 412379 729269 389730
3856 389730 383172 822270 652283 238913 24262 619533 221349 278277 241836 179796 376124
3845 376124 195408 180900 82166 424346 148445 41306 -180660 273516 -130532 -52769
3835 -52769 354064 77804 20313 473303 -19420 -64889 -72225 -97106 276530 106888 -34270
3824 -34270 -62838 317776 182946 -383454 92667 64378 231049 213501 234830 425671 53517
3813 53517 4529 255810 -23872 118559 315339 224222 275591 76288 324797 517990
3803 517990 264166 8962 153344 109640 257942 -106910 -87116 468146 540493 160229
3793 160229 -104683 -57031 132165 449575 67600 -60859 -60765 27508 -355290 -1443 -287463
$$ packed form
3866H17455n16672j05259L25433m80416K00885J62283q5646R4316L16890l39539
3856C89730o558M39098j69987m13370k14651N95271l98184N6928l6441o2040J96328
3845C76124j80716j4508r8734L42180k75901j07139k21966M54176m04048P7763
3835e2769M06833k76260n7491M52990m92723m5469p336k4881L73636j69642j41158
3824c4270k8568L80614j34830n66400M76121k8289J66671j7548K1329J90841l72154
3813E3517m8988K51281k79682J42431J96780r1117N1369j99303K48509J93193
3803E17990k53824k55204J44382m3704J48302l64852J9794N55262P2347l80264
3793A60229k64912M7652J89196L17410l81975j28459R4Q8273l82798L53847k86020
$$ plain form
3782 -287463 76678 280957 -113236 107952 543453 -74607 65857 499504 -157792 111241
3772 111241 338320 35692 -71049 -32012 176098 181706 234977 217104 -94498 -161145 358945
3761 358945 -127339 87831 455674 224820 -28758 -94598 -79231 -5932 177277 27079
3751 27079 8134 103329 -23946 14462 168414 676582 246594 98566 -127566 175213
3741 175213 212424 420074 79380 159367 119376 328224 -143122 235573 127087 192274
3731 192274 147624 260872 242050 264854 153058 219734 192657 71700 168438 206495 241280
3720 241280 309332 -111202 224527 55621 -146564 -26063 -106203 269945 -12798 204760
3710 204760 81915 43125 159967 54768 -56646 510885 -7691 92377 -50367 163149
$$ packed form
3782b87463L64141K04279l94193K21188M35501o18060J40464M33647o57296K69033
3772A11241K27079l02628j06741L9037K08110N608N3271j7873l11602o6647N20090
3761C58945m86284K15170L67843k30854k53578o5840J5367P3299J83209j50198
3751B7079j8945R5195j27275L8408J53952N08168m29988j48028k26132L02779
3741A75213L7211K07650l40694P9987l9991K08848m71346L78695j08486O5187
3731A92274m4650J13248j8822K2804j11796O6676k7077j20957R6738L8057L4785
3720B41280O8052m20534L35729j68906k02185J20501q0140L76148k82743K17558
3710B04760j22845l8790J16842j05199j11414N67531n18576J00068j42744K13516
$$ plain form
3700 163149 49488 469003 156961 86651 307090 97599 13584 504825 -114524 59807
3690 59807 -16244 194860 54210 168255 81033 232268 -295525 -446267 241731 -179476
3680 -179476 40978 67817 -98137 268679 206105 109234 215999 -262239 122359 -74947
3670 -74947 115375 28282 465701 117804 195942 -361668 78597 87541 103834 269849 171822
3659 171822 233870 124586 -36613 -1144 100531 255008 102015 -161059 11841 -269918
3649 -269918 123564 33385 105822 -29662 202336 -18205 252524 -101603 -264642 195619
3639 195619 128875 266960 356491 33455 10055 -100222 69128 16173 268449 -142990
3629 -142990 -66224 187864 31637 23813 53008 -45870 -142168 339557 197411 -61210 493085
$$ packed form
3700A63149j13661M19515l12042p0310K20439k09491q4015M91241o19349J74331
3690E9807p6051K11104j40650J14045q7222J51235n27793j50742O87998m21207
3680a79476K20454K6839j65954L66816o2574r6871J06765m78238L84598j97306
3670g4947J90322q7093M37419l47897P8138n57610M40265Q944J6293J66015r8027
3659A71822O2048j09284j61199L5469J01675J54477j52993k63074J72900k81759
3649b69918L93482r0179P2437j35484K31998k20541K70729l54127j63039M60261
3639A95619o6744J38085Q9531l23036k3400j10277J69350n2955K52276m11439
3629a42990P6766K54088j56227p824K9195r8878r6298M81725j42146k58621N54295
$$ plain form
3618 493085 70614 -61680 -196907 215286 167382 286549 171126 106682 475465 235399
3608 235399 253955 -204164 -36821 -19820 143248 141999 -4956 -58608 618797 -149989 -12957
3597 -12957 117662 173268 41230 10881 -157748 203948 157097 290984 134505 -26377
3587 -26377 88958 113607 27482 316554 -29906 420388 96864 -177620 7293 59521
3577 59521 -59625 93276 105240 238093 13432 125571 -331403 91700 128781 45148
3567 45148 -264010 233277 -105991 198851 43821 -173475 58464 649609 383497 624475
3557 624475 470108 749282 230521 195911 489164 786609 393810 270058 384247 499810
3547 499810 -185554 -69809 234387 93206 227078 101782 -18963 143173 307779 5524
$$ packed form
3618D93085m22471j32294j35227M12193m7904J19167j15423o4444L68783k40066
3608B35399J8556m58119J67343J7001J63068j249j46955n3652O77405p68786J37032
3597a2957J30619N5606j32038l0349j68629L61696m6851J33887j56479j60882
3587b6377J15335K4649q6125K89072l46460M50294l23524k74484J84913N2228
3577E9521j19146J52901J1964J32853k24661J12139m56974M23103L7081q3633
3567D5148l09158M97287l39268L04842j55030k17296K31939N91145k66112K40978
3557F24475j54367K79174n18761l4610K93253K97445l92799j23752J14189J15563
3547D99810o85364J15745L04196j41181J33872j25296j20745J62136J64606l02255
$$ plain form
3537 5524 207826 -50570 163513 -87361 213421 214211 -313290 -199218 173108 -226711 -22209
3526 -22209 16326 -23650 -22390 26530 134268 190873 144601 253041 128042 159934 22831
3515 22831 115164 -15834 394866 146148 48287 18850 -156595 80770 173055 241397 162292
3504 162292 -65003 278129 57855 41462 61530 471202 -189215 366514 -100757 -64984
3494 -64984 1965 385603 169177 510264 274859 23268 268484 -155554 -219269 -29814
3484 -29814 29975 508245 48562 240214 486192 743000 68914 182061 72596 -409612
3474 -409612 166072 -5090 85072 -105846 189720 219179 204862 330601 215259 552486
3464 552486 568373 467693 27891 -124849 292373 357385 245753 364406 500041 882177
$$ packed form
3537E524K02302k58396K14083k50874L00782P90n27501J14072L72326l99819K04502
3526b2209L8535l9976J260M8920J07738N6605m6272J08440j24999L1892j37103
3515B2831R2333j30998M10700k48718r7861k9437j75445K37365R2285O8342p9105
3504A62292k27295L43132k20274j6393K0068M09672o60417N55729m67271L5773
3494f4984O6949L83638k16426L41087k35405k51591K45216m24038o3715J89455
3484b9814N9789M78270m59683J91652K45978K56808o74086J13147j09465m82208
3474d09612N75684j71162R0162j90918K95566K9459j4317J25739j15342L37227
3464E52486J5887j00680m39802j52740M17222O5012j11632J18653J35635L82136
$$ plain form
3454 882177 328973 262065 384429 414193 419300 315441 615312 325807 537952 284260
3444 284260 206910 43598 410150 322591 142728 611224 411967 258683 532444 591962
3434 591962 416180 297528 311277 480063 478485 491262 547948 787430 636231 378811 781063
3423 781063 467380 536946 684103 571316 323748 514599 603963 746531 671530 874792
3413 874792 786268 549782 1076653 682945 930507 786586 606484 829252 921147 412939
3403 412939 719202 1182650 1111506 1488912 1312554 1348820 1599693 1804713 2146877 2174407
3393 2174407 2225414 2669685 2645046 3052418 2998032 3240825 4042740 4563852 5554174 7880037
3383 7880037 12018822 16123605 19193842 20782635 20537172 18809511 17795831 15746780
$$ packed form
3454H82177n53204o6908J22364K9764N107j03859K99871k89505K12145k53692
3444B84260p7350j63312L66552q7559j79863M68496j99257j53284K73761N9518
3434E91962j75782j18652J3749J68786j578J2777N6686K39482j51199k57420M02252
3423G81063l13683O9566J47157j12787k47568J90851Q9364J42568p5001K03262
3413H74792q8524k36486N26871l93708K47562j43921j80102K22768R1895n08208
3403D12939L06263M63448p1144L77406j76358L6266K50873K05020L42164K7530
3393B174407N1007M44271k4639M07372n4386K42793Q01915N21112R90322K325863
3383G880037M138785M104783L070237J588793k45463j727661j013680k049051
$$ plain form
3375 15746780 13796376 11379080 9274972 6977733 5611565 4534601 4090929 3953717
3367 3953717 3674046 3516526 3382020 2856158 3041837 2858431 2341861 3044930 2497465 2294680
3357 2294680 2696804 2638223 2748356 2493245 2768846 2514733 2650254 2873130 2679451 2450037
3347 2450037 2878379 2876690 3124555 3137160 3587324 4120953 4425497 4834800 5731127 6608999
3337 6608999 7547178 7945941 8164618 8946375 9726125 10310390 11419063 13409301 16714727
3328 16714727 23267728 33728404 53613244 74886361 85154158 84902892 74812804 65801466
3320 65801466 57809667 48272440 38761525 30298396 22967425 17325723 13616196 12292232
3312 12292232 11624015 10409499 9310730 8266160 7253514 6690598 5922966 5214501 4394627
$$ packed form
3375A5746780j950404k417296k104108k297239j366168j076964m43672j37212
3367C953717k79671j57520j34506n25862J85679j83406n16570P03069n47465k02785
3357B294680M02124n8581J10133k55111K75601k54113J35521K22876j93679k29414
3347B450037M28342j689K47865J2605M50164N33629L04544M09303Q96327Q77872
3337F608999R38179L98763K18677P81757P79750N84265J108673J990238L305426
3328A6714727O553001J0460676J9884840K1273117J0267797k51266j0090088r011338
3320F5801466p991799r537227r510915q463129p330971n641702l709527j323964
3312A2292232o68217j214516j098769j044570j012646n62916p67632p08465q19874
$$ plain form
3303 4394627 4278633 3739053 3149231 3352322 3041840 2723642 2846693 2897086 2402363 2304349
3293 2304349 2580752 2351102 2688089 2282673 2540071 2138610 2085318 2068490 1779031 1850406
3283 1850406 1822697 1707905 1615978 1742330 1676708 1795240 1857262 1422794 1586622 1212988
3273 1212988 1221423 1272531 1402573 1322974 1456033 994294 686823 1296277 868543 1128611
3263 1128611 1280472 1188525 1220001 932843 707543 912432 789403 762204 1100188 697654
3253 697654 656341 732381 875489 790262 812635 732180 688229 1001368 438749 1033722 493434
3242 493434 431504 273403 414707 53567 335312 668721 424640 304399 1078026 450065
3232 450065 240956 321653 798144 417829 309740 467575 488709 68956 241622 389236
$$ packed form
3303D394627j15994n39580n89822K03091l10482l18198J23051N0393m94723r8014
3293B304349K76403k29650L36987m05416K57398m01461n3292j6828k89459P1375
3283A850406k7709j14792r1927J26352o5622J18532O2022m34468J63828l73634
3273A212988Q435N1108J30042p9599J33059m61739l07471O09454m27734K60068
3263A128611J51861r1947L1476k87158k25300K04889j23029k7199L37984m02534
3253F97654m1313P6040J43108q5227K2373q0455m3951L13139n62619N94973n40288
3242D93434o1930j58101J41304l61140K81745L33409k44081j20241P73627o27961
3232D50065k09109Q0697M76491l80315j08089J57835K1134m19753J72666J47614
$$ plain form
3222 389236 418826 342390 240085 304192 284687 415712 371807 281821 74936 479636 622324
3211 622324 370028 457178 345353 348199 299653 304128 643819 219017 192106 258947 344275
3200 344275 588244 82479 627662 -79471 346040 213144 226760 -149267 57199 -472
3190 -472 232022 277100 184971 417852 -170052 322059 365833 303175 246027 469874 -216300
3179 -216300 142348 -75562 245335 -102524 -203849 138010 341108 79131 -56350 175210
3169 175210 -203156 134496 -61741 -196637 38214 78278 168922 120585 -70594 244574
3159 244574 -496606 69383 322278 244004 254748 -75095 145930 108911 171468 35822
3149 35822 110989 382463 38916 306756 98283 135763 97356 -348828 90307 -253964
$$ packed form
3222C89236K9590p6436j02305O4107j9505J31025m3905q9986k06885M04700J42688
3211F22324k52296Q7150j11825K846m8546M475L39691m24802k6911O6841Q5328
3200C44275K43969n05765N45183p07133M25511j32896J3616l76027K06466n7671
3190d72K32494M5078r2129K32881n87904M92111M3774o2658n7148K23847o86174
3179b16300L58648k17910L20897l47859j01325L41859K03098k61977j35481K31560
3169A75210l78366L37652j96237j34896K34851M0064R0644m8337j91179L15168
3159B44574p41180N65989K52895p8274J0744l29843K21025l7019O2557j35646
3149C5822P5167K71474l43547K67840k08473L7480l8407m46184M39135l44271
$$ plain form
3139 -253964 -105529 -199973 -105674 -234898 303 -307328 -185044 151443 -34093 112256
3129 112256 249987 88673 -380083 -87447 18738 -192895 70846 -328383 -236222 35936
3119 35936 -290612 -42720 63676 127791 138775 123990 181161 118449 13514 -209769 -124808
3108 -124808 6460 115044 -172085 17191 -115781 -88020 50827 -592580 -264658 -176105
3098 -176105 -268341 13141 -173892 91193 295753 23862 -223673 306862 314500 285100
3088 285100 164549 415683 174788 -42275 381569 152558 36810 -160213 170617 428095
3078 428095 204828 -127209 57571 160936 229315 77341 31741 -154407 -100650 -114935
3068 -114935 -356635 167190 28779 -233685 -219199 -66843 -23001 210386 -68835 84340
$$ packed form
3139b53964J48435r4444R4299j29224K35201l07631J22284L36487j85536J46349
3129A12256J37731j61314m68756K92636J06185k11633K63741l99229R2161K72158
3119C5936l26548K47892J06396O4115J0984j4785N7171o2712j04935k23283Q4961
3108a24808J31268J08584k87129J89276j32972K7761J38847o43407L27922Q8553
3098a76105r2236K81482j87033K65085K04560k71891k47535N30535P638k9400
3088B85100j20551K51134k40895k17063M23844k29011j15748j97023L30830K57478
3078D28095k23267l32037J84780J03365O8379j51974m5600j86148N3757j4285
3068a14935k41700N23825j38411k62464J4486J52356M3842K33387k79221J53175
$$ plain form
3058 84340 -37217 -49341 -47930 -89444 -396683 88797 -46704 21669 -34254 -411586 234203
3047 234203 309233 -295654 2553 -323378 -19177 130257 234652 87522 -323544 288031
3037 288031 44816 -429549 -192389 -236437 -169934 -112508 -222435 -12700 72240 -186577
3027 -186577 -137577 60840 -76473 70481 -433376 107212 -234187 -182824 -176570 241327
3017 241327 -206323 47545 -13280 14927 -341029 160779 -168017 379384 -46752 -347507
3007 -347507 -235788 -165100 -135858 62693 291081 -47196 -9021 41616 -393613 -110479
2997 -110479 107226 -248981 -98243 -168064 -243204 -103920 -420235 -134060 -438847 -31975
2987 -31975 338049 -26846 -253704 -404725 83557 328813 -236371 -95908 -101063 -226745
$$ packed form
3058H4340j21557j2124J411m1514l07239M85480j35501O8373n5923l77332O45789
3047B34203P5030o04887K98207l25931L04201J49434J04395j47130m11066O11575
3037B88031k43215m74365K37160m4048O6503N7426j09927K09735Q4940k58817
3027a86577M9000J98417j37313J46954n03857N40588l41399N1363O254M17897
3017B41327m47650K53868o0825K8207l55956N01808l28796N47401m26136l00755
3007c47507J11719P0688K9242J98551K28388l38277L8175N0637m35229K83134
2997a10479K17705l56207J50738o9821p5140J39284l16315K86175l04787M06872
2987c1975L70024l64895k26858j51021M88282K45256n65184J40463n155j25682
$$ plain form
2977 -226745 -309517 185015 36469 -110669 -232444 -153967 -463312 -171828 228802 -94555
2967 -94555 -161976 -165819 516055 -510885 219456 258280 -255330 -33408 -259362 -30125
2957 -30125 -70753 -171370 -137041 -407500 41669 247802 -173843 47819 -169932 522770
2947 522770 280084 -215273 -294079 -619545 -113345 -280494 188611 61559 31571 -278863
2937 -278863 -114322 -154343 -101650 -56187 225922 -105987 -371751 -38374 -20148 -242577
2927 -242577 -190229 -334577 -287615 46998 101991 159346 -131688 -87844 -112590 14859 69962
2916 69962 -146948 -226266 44177 -313102 -138666 -192865 16975 -377649 258412 108300
2906 108300 44659 51388 477931 -13179 157433 -129020 -231330 -21011 16352 -223253
$$ packed form
2977b26745q2772M94532j48546j47138j21775P8477l09345K91484M00630l23357
2967i4555o7421l843O81874j026940P30341L8824n13610K21922k25954K29237
2957c0125m0628j00617L4329k70459M49169K06133m21645K21662k17751O92702
2947E22770k42686m95357p8806l25466N06200j67149M69105j27052k9988l10434
2937b78863J64541m0021N2693M5463K82109l31909k65764L33377J8226k22429
2927b42577N2348j44348M6962L34613N4993N7355k91034M3844k4746J27449N5103
2916F9962k16910p9318K70443l57279J74436n4199K09840l94624O36061j50112
2906A08300o3641O729M26543m91110J70612k86453j02310K10319L7363k39605
$$ plain form
2896 -223253 51505 -187796 -84392 -531073 -470984 -183672 453582 -49213 -311973 -204118
2886 -204118 -265122 102003 -329533 -125871 -235774 -268287 -552933 -15461 -2267 5923 -250034
2875 -250034 -79832 66402 -256510 316661 101790 -200469 -408440 -118697 72678 227544
2865 227544 -70985 -38926 -167914 -12568 -225756 -130758 -143520 -154530 -156682 366898 -349646
2854 -349646 -13213 34863 -321147 -177046 -62639 -269900 -460597 -197705 1167 -296214
2844 -296214 59473 -112414 -202369 -108556 63951 143539 5658 95806 -121447 -237153
2834 -237153 -755573 170671 -176918 -302333 118139 116285 -236585 -55290 -26081 -363306
2824 -363306 78385 86637 -74240 167940 -77482 -316019 -144340 -192089 -127157 -126714 -299394
$$ packed form
2896b23253K74758k39301J03404m46681O0089K87312O37254n02795k62760J07855
2886b04118o1004L67125m31536K03662j09903l2513k84646N37472J3194Q190k55957
2875b50034J70202J46234l22912N73171k14871l02259k07971K89743J91375J54866
2865B27544k98529L2059j28988J55346k13188R4998j2762j1010k152N23580p16544
2854c49646L36433M8076l56010J44101J14407k07261j90697K62892J98872k97381
2844b96214L55687j71887q9955R3813J72507P9588j37881R0148k17253j15706
2834b37153n18420R26244l47589j25415M20472j854l52870J81295K9209l37225
2824c63306M41691Q252j60877K42180k45422k38537J71679m7749O4932M43j72680
$$ plain form
2813 -299394 -215778 109876 -15985 191485 111444 118475 255579 -100616 -294738 -80181
2803 -80181 -74502 -291804 83858 14724 -257540 -194390 -140625 157830 87418 -167030 56555
2792 56555 -94521 -94565 -190116 257530 -205614 -133304 -164325 -178107 510628 -96610 -398190
2781 -398190 -257756 -113884 -504558 -96610 -66597 -127100 167843 29133 -157765 30554
2771 30554 -18470 -151776 -50137 -87411 -323809 -196373 -238096 -256431 46765 -263486 -327574
2760 -327574 -393876 -217032 -145116 -141629 -258204 -173019 -108065 -101161 -631455 -33562 -335554
2749 -335554 -59660 108796 -333045 -233149 -379516 -91740 273666 27936 -104275 -125611
2739 -125611 -374003 -80323 -100347 -368221 998 -172723 -50593 133554 -188559 182311
$$ packed form
2813b99394Q3616L25654j25861K07470q0041P031J37104l56195j94122K14557
2803h0181N679k17302L75662o9134k72264O3150N3765K98455p0412k54448K23585
2792E6555j51076m4r5551M47646m63144P2310l1021j3782O88735o07238l01580
2781c98190J40434J43872l90674M07948L0013o0503K94943j38710j86898J88319
2771C0554m9024j33306J01639l7274k36398J27436m1723j8335L03196l10251o4088
2760c27574o6302J76844P1916L487j16575Q5185O4954O904n30294N97893l01992
2749c35554K75894J68456m41841R9896j46367K87776L65406k45730j32211k1336
2739a25611k48392K93680k0024k67874L69219j73721J22130J84147l22113L70870
$$ plain form
2729 182311 58519 33924 -75539 -229394 -243830 -233287 -112558 -253345 -218007 74038
2719 74038 -54701 -243441 -154557 336243 -48839 -158213 -221087 -314144 -377299 144122 -160328
2708 -160328 -285617 -292361 161367 8852 365804 -164922 -188423 -268858 -72044 -328674
2698 -328674 -44996 -9322 63350 -70100 -102795 -101061 50128 -58614 -270242 59142 -384681
2687 -384681 -317865 -208742 -261211 -175088 -319820 -177341 -255583 -150707 -368485 -486319
2677 -486319 -52028 -435704 -171228 -538032 -464456 118512 -656296 -168071 10255 160263
2667 160263 -102411 43729 -111664 48910 -77334 223813 1655 -326743 -489899 -435277
2657 -435277 -367962 68629 -246144 -245298 -393097 -266188 -368185 -112253 -327332 -99508
$$ packed form
2729A82311j23792k4595j09463j53855j4436J0543J20729j40787L5338K92045
2719G4038j28739j88740Q8884M90800l85082j09374o2874r3057o3155N21421l04450
2708a60328j25289o744M53728j52515L56952n30726k3501q0435J96814k56630
2698c28674K83678L5674P2672j33450l2695J734J51189j08742k11628L29384m43823
2687c84681O6816J09123n2469Q6123j44732J42479p8242J04876k17778j17834
2677d86319M34291l83676K64476l66804P3576N82968p74808M88225J78326J50008
2667A60263k62674J46140j55393J60574j26244L01147k22158l28398j63156N4622
2657d35277O7315M36591l14773Q46j47799J26909j01997K55932k15079K27824
$$ plain form
2647 -99508 -232155 -317141 -670174 -319895 70866 -166689 -303881 -111689 8530 -78464
2637 -78464 -53130 357540 -158965 -70102 -168886 131384 -218695 142689 -153507 -67850 -11297
2626 -11297 42499 -167952 -359492 37593 -90243 -263807 -288314 219628 -389248 -181154
2616 -181154 -123080 78244 -283672 -330608 -47959 -68903 -205630 -383249 -305923 43046
2606 43046 -55477 -361488 -208317 -79287 -337396 -338962 -238106 -168261 -363498 -286973 -160237
2595 -160237 -200768 -145836 -366562 -311547 -386773 -205228 8274 -233916 45641 -28156 19767
2584 19767 65344 115418 -272196 -79442 -40757 -271554 -101126 -588083 -120745 -77663 -127452
2573 -127452 -254677 22833 -636011 -314806 -221764 7055 -200416 -102798 -189133 -65829
$$ packed form
2647i9508j32647q4986l53033L50279L90761k37555j37192J92192J20219q6994
2637g8464K5334M10670n16505Q8863r8784L00270l50079L61384k96196Q5657N6553
2626a1297N3796k10451j91540L97085j27836j73564k4507N07942o08876K08094
2616a81154N8074K01324l61916m6936K82649k0944j36727j77619P7326L48969
2606D3046r8523l06011J53171J29030k58109j566J00856O9845j95237P6525J26736
2595a60237m0531N4932k20726N5015p5226J81545K13502k42190K79557p3797M7923
2584A9767M5577N0074l87614J92754L8685k30797J70428m86957M67338M3082m9789
2573a27452j27225K77510o58844L21205R3042K28819k07471R7618q6335J23304
$$ plain form
2563 -65829 228255 -103448 -344688 109386 96889 -174967 18189 -253770 254556 -20657
2553 -20657 -321528 -317099 -85405 78329 -309543 -11432 -554781 -454341 38463 144674
2543 144674 -117521 -3987 306969 -583637 -196579 175282 -267166 -291428 -332355 -301047
2533 -301047 -70571 -75115 -258110 -214930 -340816 -181215 -110365 -339463 -169591 -80718 269513
2522 269513 15097 -20612 63759 -35515 70497 -56236 -203474 -447871 -20081 -450167
2512 -450167 -310697 -451763 -240334 -245250 -231445 72853 -16664 40729 202144 151680 -390052
2501 -390052 -37756 -243870 8601 -473225 -26909 28978 -188953 -258324 -479604 -281192
2491 -281192 -340980 -127820 252310 -343046 -237275 -203341 -464945 -71270 -209869 25338
$$ packed form
2563f5829K94084l31703k41240M54074j2497k71856J93156k71959N08326k75213
2553b0657l00871M429K31694J63734l87872K98111n43349J00440M92804J06211
2543A44674k62195J13534L10956q90606L87058L71861m42448k4262m0927L1308
2533c01047K30476m544j82995M3180j25886J59601P0850k29098J69872Q8873L50231
2522B69513k54416l5709Q4371r9274J06012j26733j47238k44397M27790m30086
2512d50167J39470j41066K11429m916J3805L04298q9517N7393J61415n0464n41732
2501c90052L52296k06114K52471m81826M46316N5887k17931o9371k21280J98412
2491b81192n9788K13160L80130n95356J05771L3934k61604L93675j38599K35207
$$ plain form
2481 25338 -9283 -297864 -162585 -574442 -409091 -295920 249983 -164913 88578 -226112
2471 -226112 -360920 122889 -16910 -65526 -572643 -227706 -160437 1310 217534 104337
2461 104337 49112 74786 154720 -188370 -411276 -326793 -42668 -22239 210269 98960 -308940
2450 -308940 43454 -318698 -33242 81910 -388102 -191668 43289 5931 -66978 53468
2440 53468 -422937 -706708 -35662 -267480 -522661 -165343 -59322 -140133 -222644 -567822
2430 -567822 -60164 -142667 -66790 -384315 -329895 -85311 -212466 -291154 -93412 -504897
2420 -504897 -112353 5485 168681 39975 -76690 -337448 -23389 -321135 -80089 -332255
2410 -332255 -361096 -235865 -215350 -81596 -347672 -489313 25473 11926 -266760 -508177
$$ packed form
2481B5338l4621k88581J35279m11857J65351J13171N45903m14896K53491l14690
2471b26112j34808M83809j39799m8616n07117L44937O7269J61747K16224j13197
2461A04337n5225K5674P9934l43090k22906Q4483K84125K0429K32508j11309m07900
2450c08940L52394l62152K85456J15152m70012J96434K34957l7358p2909J20446
2440E3468m76405k83771O71046k31818k55181L57318J06021q0811q2511l45178
2430e67822N07658q2503P5877l17525N4420K44584j27155p8688J97742m11485
2420e04897L92544J17838J63196j28706j16665k60758L14059k97746K41046k52166
2410c32255k8841J25231K0515J33754k66076j41641N14786j3547k78686k41417
$$ plain form
2400 -508177 -364482 -252613 -98179 -65715 -291743 -108475 -103864 -216757 -224109 -413641 -149858
2389 -149858 -360572 -407620 -180133 -88894 -29774 -396882 38998 -257422 -386251 -83761
2379 -83761 89123 12304 -427265 -35824 -173288 65038 -324958 -195729 -295001 175036
2369 175036 36321 -168499 -392449 -239494 -537676 -68066 -506192 -150226 -91011 72993
2359 72993 -214601 227528 -190340 -129873 -140675 260760 116124 -6898 233783 -117022
2349 -117022 -109387 218208 -213136 -227775 -163883 -1694 183752 -365293 -63686 -161950 -36900
2338 -36900 -3863 -90362 -184854 -240077 -3469 -324270 15164 -160789 -135436 -132236 -125486
2327 -125486 -183808 -353753 -204445 -321199 -76313 -238786 277143 -89372 -490088 115962
$$ packed form
2400e08177J43695J11869J54434L2464k26028J83268M611j12893p352j89532K63783
2389a49858k10714m7048K27487R1239N9120l67108M35880k96420j28829L02490
2379h3761J72884p6819m39569L91441j37464K38326l89996J29229r9272M70037
2369A75036j38715k04820k23950J52955k98182M69610m38126L55966N9215J64004
2359G2993k87594M42129m17868O0467j0802M01435j44636j23022K40681l50805
2349a17022P635L27595m31344j4639O3892J62189J85446n49045L01607r8264J25050
2338c6900L3037q6499r4492n5223K36608l20801L39434j75953K5353L200O750
2327a25486n8322j69945J49308j16754K44886j62473N15929l66515m00716O06050
$$ plain form
2317 115962 -23962 -22541 42516 -89753 -25740 86060 -277554 124704 -1590 9503 -84281
2306 -84281 -130029 -425592 175458 -24370 -429320 -299217 223251 -16569 -213688 -220865
2296 -220865 -296406 -590888 17601 -152465 -217895 -446824 -139965 51387 -163681 -354237
2286 -354237 181375 -302393 -57052 -446556 -526673 -417590 114755 -47357 -80453 86034
2276 86034 -125250 -128332 -408678 -306616 -349325 -159909 -110652 -56423 47600 128159 -326340
2265 -326340 9841 -424653 -225670 -212943 -283581 55817 -240726 -463189 56643 -409897
2255 -409897 -132410 -162688 -274902 -455827 -452996 -446769 -198485 94187 -260538 -582372 -245157
2244 -245157 -243836 -161246 150868 4970 -192865 -213878 -166381 -114749 49194 -82826 -317824
$$ packed form
2317A15962j39924J421O5057j32269O4013J11800l63614M02258j26294J1093r3784
2306h4281m5748k95563O01050j99828m04950J30103N22468k39820j97119p177
2296b20865p5541k94482O08489j70066o5430k28929L06859J91352k15068j90556
2286c54237N35612m83768K45341l89504q0117J09083N32345j62112l3096J66487
2276H6034k11284l082k80346J02062m2709J89416M9257N4229J04023Q0559m54499
2265c26340L36181m34494J98983J2727p0638L39398k96543k22463N19832m66540
2255d09897K77487l0278j12214j80925K831O227K48284K92672l54725l21834L37215
2244b45157J321Q2590L12114j45898j97835k1013M7497N1632J63943j32020k34998
$$ plain form
2233 -317824 -222814 65335 -432058 -245902 -136761 -208325 -320436 -21078 -54699 -531677
2223 -531677 -349618 -460266 -122400 -76550 68551 -234097 -462687 -207655 -475579 -204306
2213 -204306 -286296 -326268 -35047 -261293 -67292 -105406 -428402 -472391 -230482 58888
2203 58888 -424583 -361966 -503328 147525 -260817 -205490 -97618 -158477 -767638 -333180
2193 -333180 -325438 98775 -267875 -411197 -109284 -119912 -140880 16367 -490579 -306712
2183 -306712 -59536 27872 101399 -304695 -291855 -78542 58191 -279572 -247292 -446783
2173 -446783 -481635 -64443 154680 -311972 -318170 -238734 -446911 -131769 17955 -196041
2163 -196041 -312874 122844 -234657 -54278 -36169 -67533 -559975 154110 -146918 -77352
$$ packed form
2233c17824R5010K88149m97393J86156J09141p1564j12111K99358l3621m76978
2223e31677J82059j10648L37866M5850J45101l02648k28590K55032k67924K71273
2213b04306q1990l9972K91221k26246J94001l8114l22996m3989K41909K89370
2203E8888m83471O2617j41362O50853m08342N5327J07872o0859o09161M34458
2193c33180P742M24213l66650j43322L01913j0628k0968J57247n06946J83867
2183c06712K47176Q7408P3527m06094J2840K13313J36733l37763L2280j99491
2173d46783l4852M17192K19123m66652o198P9436k08177L15142J49724k13996
2163a96041j16833M35718l57501J80379J8109l1364m92442P14085l01028O9566
$$ plain form
2153 -77352 -247964 -207620 -119071 48646 106935 -138040 58174 -379569 -363261 -456340 -649734
2142 -649734 -34333 -330870 -402602 -139966 -128433 -78762 -232130 -330379 52086 -234344
2132 -234344 -239231 -165982 -213353 15327 -346818 -425470 -194385 -452906 -62753 -130964 -281742
2121 -281742 -217553 -129005 -377227 -232566 -209303 51850 -366343 30139 -208182 -121527
2111 -121527 -183059 -476473 -59863 -31065 -211997 -111510 -31472 -460481 -224464 -430738
2101 -430738 -153493 -376319 -95196 -63147 136928 191111 -216735 -321177 -411616 -34390
2091 -34390 -86732 -364875 -218673 -217658 -50732 188071 -9820 -105100 -59107 -162 -19870
2080 -19870 336529 -292483 -254091 -79284 -299121 -425380 83163 166137 -120541 -407265
$$ packed form
2153g7352j70612M0344Q8549J67717N8289k44975J96214m37743J6308r3079j93394
2142f49734O15401k96537p1732K62636J1533M9671j53368r8249L82465k86430
2132b34344m887P3249m7371K28680l62145p8652K31085k58521L90153o8211j50778
2121b81742O4189Q8548k48222J44661K3263K61153m18193L96482k38321Q6655
2111a21527o1532k93414M16610K8798j80932J00487Q0038m29009K36017k06274
2101d30738K77245k22826K81123L2049K00075N4183m07846j04442r0439L77226
2091c4390n2342k78143J46202J015J66926K38803j97891r5280M5993N8945j9708
2080a9870L56399o29012L8392J74807k19837j26259N08543Q2974k86678k86724
$$ plain form
2070 -407265 95067 -897 -31530 -41737 -149953 -84376 -465435 -271405 -152456 1656
2060 1656 -362105 151450 -41461 -295663 -321134 -376358 -111063 -184933 -46897 -430529 -476660
2049 -476660 -53783 -15030 13889 -4141 -98933 -272711 98366 113017 -67772 -15422 -341625
2038 -341625 -361788 -324683 -42522 53880 -136510 -308457 -260121 -261780 -293243 -156111 -120954
2027 -120954 -271169 -223346 169220 -383830 -189661 63601 -272417 -43149 -83404 -245996
2017 -245996 213019 6079 -136676 -52153 -177013 -90422 -256077 -91215 -217711 71854
2007 71854 123780 119182 -372922 -144038 -419900 -173913 -206250 -135927 -358960 -133213 -461142
1996 -461142 113591 -293663 -615020 41011 -65842 -346032 -253627 -251136 -305995 -107248
$$ packed form
2070d07265N02332r5964l0633j0207j08216O5577l81059J94030J18949J54112
2060A656l63761N13555j92911k54202k5471n5224K65295p3870J38036l83632m6131
2049d76660M22877L8753K8919j8030r4792j73778L71077J4651j80789N2350l26203
2038c41625k0163L7105K82161R6402j90390j71947M8336j659l1463J37132L5157
2027a20954j50215M7823L92566n53050J94169K53262l36018K29268m0255j62592
2017b45996M59015k06940j42755Q4523j24860Q6591j65655J64862j26496K89565
2007G1854N1926m598m92104K28884k75862K45987l2337P0323k23033K25747l27929
1996d61142N74733m07254l21357O56031j06853k80190R2405K491n4859J98747
$$ plain form
1986 -107248 -345174 211377 -190908 -294128 131418 -356829 -37126 -98854 -72068 -184606
1976 -184606 -132599 -61138 -288812 1317 -472319 -289535 -154249 -267601 -250947 -38627
1966 -38627 -113010 72475 -494455 -458647 -84617 -338085 -137151 -149696 2739 -71737 -316587
1955 -316587 21402 -120111 -127696 33803 35571 -143962 -282437 -244112 -208106 -421739 -141709
1944 -141709 136560 -218770 -139367 -266460 -314047 -43602 139191 -217524 -103577 -250527
1934 -250527 -376313 -181416 -168083 -194617 -95852 -336232 78847 -126665 9401 134567
1924 134567 -114176 -17856 -49852 -451613 -142639 -273455 -151374 151152 -205180 -210377
1914 -210377 -479109 96789 -167426 18539 -172337 -332900 -141544 -345668 78066 -156969
$$ packed form
1986a07248k37926N56551m02285j03220M25546m88247L19703o1728K6786j12538
1976a84606N2007P1461k27674K90129m73636J82784J35286j13352J6654K12320
1966c8627p4383J85485n66930L5808L74030k53468K00934j2545J52435p4476k44850
1955c16587L37989j41513p585J61499J768j79533j38475L8325L6006k13633K80030
1944a41709K78269l55330P9403j27093m7587K70445J82793l56715J13947j46950
1934b50527j25786J94897J3333k6534R8765k40380M15079k05512J36066J25166
1924A34567k48743R6320l1996m01761L08974j30816J22081L02526l56332n197
1914b10377k68732N75898k64215J85965j90876j60563J91356k04124M23734k35035
$$ plain form
1904 -156969 -100035 -201415 -247997 -402679 -17076 -250065 -173564 -81352 -549348 54590
1894 54590 -306924 -40994 -117184 -150168 -406834 -227652 -34915 205200 77597 -232060
1884 -232060 -289909 153777 -162372 -261795 -193400 35122 -256077 -258985 -534477 -258185 -422349
1873 -422349 -135984 -370240 -343859 -60604 -72506 -173931 -4737 -246819 -236417 -183320
1863 -183320 -390986 -634735 -392817 25805 -469807 -184804 -49095 -419210 69716 -31525
1853 -31525 -378622 -358815 -91305 -104167 205170 -127798 -260394 -396384 -242637 -219974
1843 -219974 -198673 -328884 -214647 61121 -127057 -378824 -331524 -474991 -197475 120197
1833 120197 -280443 130758 -246197 -37621 -475262 -51510 165028 102159 -160877 -179460
$$ packed form
1904a56969N6934j01380m6582j54682L85603k32989P6501R2212m67996O03938
1894E4590l61514K65930p6190l2984k56666J79182J92737K40115j27603l09657
1884b32060n7849M43686l16149r9423O8395K28522k91199k908k75492K76292j64164
1873d22349K86365k34256K6381K83255j1902j01425J69194k42082J0402N3097
1863a83320k07666k43749K41918M18622m95612K85003J35709l70115M88926j01241
1853c1525l47097J9807K67510j2862L09337l32968j32596j35990J53747K2663
1843b19974K1301j30211J14237K75768j88178k51767M7300j43467K77516L17672
1833A20197m00640M11201l76955K08576m37641M23752K16538o2869k63036j8583
$$ plain form
1823 -179460 4744 -298385 -383646 -488360 -142785 -104858 -272340 -132973 -207845 -265551
1813 -265551 -193881 -270149 -616522 -411240 -200195 -149406 -341273 31425 -537321 149787
1803 149787 -114035 -189208 -65203 -213632 -213126 -180303 -152648 -93181 -453424 -99920 -304344
1792 -304344 -352006 -194992 29257 -224035 -52349 -307765 -523881 -547295 -281849 -351215
1782 -351215 -325533 -240668 -273834 -345833 -172003 167564 -120599 114793 -235340 -840004
1772 -840004 -228070 -36457 -74686 -352233 -527146 -240168 -52304 -305455 -189352 -110453
1762 -110453 -249479 -102066 -169696 -128569 -480184 -182441 -480487 251948 -235584 -59997
1752 -59997 -285355 -305616 -168207 -285748 -169902 -58163 -248006 -458208 -266297 -123976
$$ packed form
1823a79460J84204l03129q5261j04714L45575L7927j67482J39367p4872n7706
1813b65551P1670p6268l46373K05282K11045N0789j91867L72698n68746O87108
1803A49787k63822p5173J24005j48429N06L2823K7655N9467l60243L53504k04424
1792c04344m7662J57014K24249k53292J71686k55416k16116k3414K65446o9366
1782c51215K5682Q4865l3166p1999J73830L39567k88163K35392l50133o04664
1772h40004O11934J91613l8229k77547j74913K86978J87864k53151J16103P8899
1762a10453j39026J47413o7630M1127l51615K97743k98046P32435m87532J75587
1752e9997k25358k0261J37409j17541J15846J11739j89843k10202J91911J42321
$$ plain form
1742 -123976 -113137 -130448 -234569 -61295 -266952 -185923 -140211 -112601 -2051 -138311 -171613
1731 -171613 -241292 -25083 -187915 -448721 -216412 -330622 -150431 139415 -289848 -211535
1721 -211535 -111628 -375824 -421704 -187973 -278712 -572834 -109820 -541559 -105922 -312364
1711 -312364 -110444 -277457 -7011 -65651 -158961 67177 116424 -371974 -283781 -430529
1701 -430529 -38867 -75202 369063 -70933 244524 -199137 -184546 -241513 -319669 -139871
1691 -139871 -247635 -165341 -72669 208480 -194196 -347711 90299 9206 -212212 -267747
1681 -267747 -301014 11568 -113540 -368051 -85144 -37221 -237483 -113474 -433719 346537
1671 346537 -240022 -185386 -355200 61061 -199764 -224176 -220094 -332155 -413613 -263004 -340780
$$ packed form
1742a23976J0839j7311j04121J73274k05657Q1029M5712K7610J10550j36260l3302
1731a71613o9679K16209j62832k60806K32309j14210J80191K89846m29263P8313
1721b11535R9907k64196m5880K33731r0739k94122M63014m31739M35637k06442
1711c12364K01920j67013K70446n8640r3310K26138M9247m88398Q8193j46748
1701d30529L91662l6335M44265m39996L15457m43661J4591n6967p8156J79798
1691a39871j07764Q2294R2672K81149m02676j53515M38010q1093k21418n5535
1681b67747l3267L12582j25108k54511K82907M7923k00262J24009l20245P80256
1671C46537n86559N4636j69814M16261k60825k4412M082j12061q1458J50609p7776
$$ plain form
1660 -340780 -155218 162859 -137683 -452697 -66858 -296093 179209 -306630 -672028 -151325
1650 -151325 -128676 -427782 -291001 -93336 -565042 -321406 -215928 -477319 2041 -341824
1640 -341824 -384900 -135013 -33414 -55660 -138156 133953 -483276 -133554 -146930 35273
1630 35273 -230363 -449508 -210502 -64381 -138253 61999 -195734 -136239 -125622 264015
1620 264015 140284 -390321 -318406 -292784 -191974 -185509 -357281 -476566 -182996 -91953 -341678
1609 -341678 -477862 24094 -558602 -135556 -197006 -172857 -299481 -144419 214440 127500
1599 127500 45602 -282742 -227213 -218701 -161143 -250367 239319 -251185 -170527 -112296 -109655
1588 -109655 -376544 -109972 -225857 -251318 -50030 -296038 245730 -10786 -102255 -356528
$$ packed form
1660c40780J85562L18077l00542l15014L85839k29235M75302m85839l65398N20703
1650a51325K2649k99106J36781J97665m71706K43636J05478k61391M79360l43865
1640c41824m3076K49887J01599k2246q2496K72109o17229L49722j3376J82203
1630C5273k65636k19145K39006J46121p3872K00252k57733N9495J0617L89637
1620B64015j23731n30605P1915K5622J00810O465j71772j19285K93570R1043k49725
1609c41678j36184N01956n82696M23046o1450K4149j26624J55062L58859q6940
1599A27500q1898l28344N5529Q512N7558q9224M89686m90504Q0658N8231K641
1588a09655k66889K66572j15885k5461K01288k46008N41768k56516r1469k54273
$$ plain form
1578 -356528 -581328 -66284 185001 -52732 249194 -330798 -303711 -296839 -80816 -152903
1568 -152903 -432579 -302684 245645 -415683 -176031 -265873 -75542 -27131 -389426 -149742
1558 -149742 -465439 -53159 -34642 -146491 -466526 -96788 -119856 -67181 -286855 -231879
1548 -231879 -568484 -382115 -144454 -329548 -558417 -158312 -34395 -121552 364948 230372
1538 230372 -393413 33804 -270095 -231296 -293475 -240007 -216526 -430743 -270460 -24032
1528 -24032 -145505 -438503 101943 -372473 -4089 -633007 -261872 -249830 -171425 -304268
1518 -304268 -386669 -260540 -388394 150796 -353546 133950 -223331 -173762 -378676 -345508
1508 -345508 -294783 38360 -240006 -461564 -374688 -272781 -235294 -34486 -362762 -64653
$$ packed form
1578c56528k24800N15044K51285k37733L01926n79992K7087O872K16023p2087
1568a52903k79676J29895N48329o61328K39652q9842J90331M8411l62295K39684
1558a49742l15697M12280J8517j11849l20035L69738k3068N2675k19674N4976
1548b31879l36605J86369K37661j85094k28869M00105J23917q7157M86500j34576
1538B30372o23785M27217l03899L8799o2179N3468K3481k14217J60283K46428
1528b4032j21473k92998N40446m74416L68384o28918L71135J2042P8405j32843
1518c04268q2401J26129j27854N39190n04342M87496l57281M9569k04914L3168
1508c45508N0725L33143k78366k21558Q6876J01907L7487K00808l28276K98109
$$ plain form
1498 -64653 -475391 -113155 -185420 -217066 189320 -375844 -453741 -306644 199055 15107
1488 15107 -195126 -27446 -412114 -338677 163511 -338555 -512990 -251139 -644148 -292008
$$ packed form
1498f4653m10738L62236p2265l1646M06386n65164p7897J47097N05699j83948
1488A5107k10233J67680l84668P3437N02188n02066j74435K61851l93009L52140
$$ [...]
##END NTUPLES=NMR SPECTRUM
##END=
