##TITLE=abcd
##JCAMPDX= 6.0         $$ Bruker NMR JCAMP-DX V2.0
##DATA TYPE= NMR SPECTRUM
##DATA CLASS= NTUPLES
##ORIGIN= UXNMR, Bruker Analytische Messtechnik GmbH
##OWNER= root
$$ XWIN-NMR		Version 3.5
$$ Tue Aug 25 17:24:15 2026 Russian Standard Time (UT+4h)  servis@DPX200
##.OBSERVE FREQUENCY= 200.131235884673
##.OBSERVE NUCLEUS= ^1H
##.ACQUISITION MODE= SIMULTANEOUS
##.ACQUISITION SCHEME= undefined
##.AVERAGES= 32
##.DIGITISER RES= 18
##SPECTROMETER/DATA SYSTEM= spect
##.PULSE SEQUENCE= zg
##.SOLVENT NAME= CDCl3
##.SHIFT REFERENCE= (INTERNAL, CDCl3, 0, 16.4885)
##AUDIT TRAIL= $$ (NUMBER, WHEN, WHO, WHERE, WHAT)
$$ ##TITLE= Audit trail, XWIN-NMR		Version 3.5
$$ ##JCAMPDX= 5.01
$$ ##ORIGIN= Bruker BioSpin GmbH
$$ ##OWNER= servis
$$ F:\spectra/data/av/nmr/H1/1/pdata/1/auditp.txt
$$ ##AUDIT TRAIL=  $$ (NUMBER, WHEN, WHO, WHERE, WHAT)
(   1,<2026-08-25 17:23:19.21 +0400>,<servis>,<DPX200>,
      <created by zg, POWCHK disabled, PULCHK disabled
       configuration hash MD5:
       00 E9 B6 7A A2 85 ED C7 34 08 36 98 17 FE 4E 26
       data hash MD5: 32K
       8B 2A D9 A9 86 64 EA 73 1B 87 C6 1E 24 E1 FB EC>)
(   2,<2026-08-25 17:23:46.92 +0400>,<servis>,<DPX200>,
      <Start of raw data processing
       efp BC_mod = 2 LB = 0.05 FT_mod = 6 PKNL = 1 PHC0 = -415.9518 PHC1 = 3.101563 SI = 16K 
       data hash MD5: 16K
       C1 52 CD 04 9C C2 99 BF 75 A7 0D 11 5A 43 8D 89>)
$$ ##END=
$$ 
$$ hash MD5
$$ DD 3C 20 C5 79 C6 B8 9A 99 69 11 39 48 3D 3A 85
##$RELAX= 
##$RELAX= 
##$RELAX= 
##$RELAX= 
##$RELAX= 
##$RELAX= 
##$RELAX= 
##$RELAX= 
$$ Bruker specific parameters
$$ --------------------------
##$DU= <F:\spectra>
##$EXPNO= 1
##$NAME= <H1>
##$PROCNO= 1
##$TYPE= <nmr>
##$USER= <av>
##$AMP= (0..31)
100 100 100 100 100 100 100 100 100 100 100 100 100 100 100 100 100 100 
100 100 100 100 100 100 100 100 100 100 100 100 100 100 
##$AQSEQ= 0
##$AQ_mod= 1
##$AUNM= <au_zg>
##$AUTOPOS= <>
##$BF1= 200.13
##$BF2= 200.13
##$BF3= 200.13
##$BF4= 200.13
##$BF5= 500.13
##$BF6= 500.13
##$BF7= 500.13
##$BF8= 500.13
##$BYTORDA= 1
##$CFDGTYP= 0
##$CFRGTYP= 5
##$CHEMSTR= <none>
##$CNST= (0..31)
1 1 145 1 1 1 1 1 1 1 1 1 1 1 1 1 1 1 1 1 1 1 1 1 1 1 1 1 1 1 1 1 
##$CPDPRG= <>
##$CPDPRG1= <>
##$CPDPRG2= <>
##$CPDPRG3= <>
##$CPDPRG4= <mlev>
##$CPDPRG5= <mlev>
##$CPDPRG6= <mlev>
##$CPDPRG7= <mlev>
##$CPDPRG8= <mlev>
##$CPDPRGB= <>
##$CPDPRGT= <>
##$D= (0..31)
0 2 0 0 0 0 0 0 0 0.06 0 0 0 0 0 0 0.0002 0 0 0 0 0 0 0 0 0 0 0 0 0 0 
0 
##$DATE= 1787664198
##$DBL= (0..7)
120 120 120 120 120 120 120 120 
##$DBP= (0..7)
150 150 150 150 150 150 150 150 
##$DBP07= 0
##$DBPNAM0= <>
##$DBPNAM1= <>
##$DBPNAM2= <>
##$DBPNAM3= <>
##$DBPNAM4= <>
##$DBPNAM5= <>
##$DBPNAM6= <>
##$DBPNAM7= <>
##$DBPOAL= (0..7)
0.5 0.5 0.5 0.5 0.5 0.5 0.5 0.5 
##$DBPOFFS= (0..7)
0 0 0 0 0 0 0 0 
##$DE= 6
##$DECBNUC= <off>
##$DECIM= 32
##$DECNUC= <off>
##$DECSTAT= 4
##$DIGMOD= 1
##$DIGTYP= 9
##$DL= (0..7)
0 120 120 120 120 120 120 120 
##$DP= (0..7)
150 150 150 150 150 150 150 150 
##$DP07= 0
##$DPNAME0= <>
$$ [...]
##$SUBNAM4= <"">
##$SUBNAM5= <"">
##$SUBNAM6= <"">
##$SUBNAM7= <"">
##$SUBNAM8= <"">
##$SUBNAM9= <"">
##$SW= 20.6817932712277
##$SWIBOX= (0..15)
0 0 3 0 0 0 0 0 0 0 0 0 0 0 0 0 
##$SW_h= 4139.07284768212
##$TD= 32768
##$TD0= 1
##$TE= 0
##$TE2= 300
##$TE3= 300
##$TEG= 300
##$TL= (0..7)
0 120 120 120 120 120 120 120 
##$TP= (0..7)
150 150 150 150 150 150 150 150 
##$TP07= 0
##$TPNAME0= <>
##$TPNAME1= <>
##$TPNAME2= <>
##$TPNAME3= <>
##$TPNAME4= <>
##$TPNAME5= <>
##$TPNAME6= <>
##$TPNAME7= <>
##$TPOAL= (0..7)
0.5 0.5 0.5 0.5 0.5 0.5 0.5 0.5 
##$TPOFFS= (0..7)
0 0 0 0 0 0 0 0 
##$TUNHIN= 0
##$TUNHOUT= 0
##$TUNXOUT= 0
##$USERA1= <user>
##$USERA2= <user>
##$USERA3= <user>
##$USERA4= <user>
##$USERA5= <user>
##$V9= 5
##$VALIST= <valist>
##$VCLIST= <CCCCCCCCCCCCCCC>
##$VD= 0
##$VDLIST= <DDDDDDDDDDDDDDD>
##$VPLIST= <PPPPPPPPPPPPPPP>
##$VTLIST= <TTTTTTTTTTTTTTT>
##$WBST= 1024
##$WBSW= 30
##$XGAIN= (0..3)
0 0 0 0 
##$XL= 0
##$YL= 0
##$YMAX_a= 208539
##$YMIN_a= -139603
##$ZGOPTNS= <>
##$ZL1= 120
##$ZL2= 120
##$ZL3= 120
##$ZL4= 120
##$ABSF1= 0
##$ABSF2= 0
##$ABSG= 0
##$ABSL= 0
##$ALPHA= 0
##$AQORDER= 0
##$ASSFAC= 0
##$ASSFACI= 0
##$ASSFACX= 0
##$ASSWID= 0
##$AUNMP= <proc_1d>
##$AZFE= 0.1
##$AZFW= 0.1
##$BCFW= 0
##$BC_mod= 2
##$BYTORDP= 0
##$COROFFS= 0
##$CY= 18.4799938201904
##$DATMOD= 1
##$DC= 0
##$DFILT= <>
##$DTYPP= 0
##$F1P= 9.9274215381318
##$F2P= -0.165520771350173
##$FCOR= 1
##$FTSIZE= 16384
##$FT_mod= 6
##$GAMMA= 0
##$GB= 0
##$INTBC= 1
##$INTSCL= 4.127829e-11
##$ISEN= 128
##$LB= 0.05
##$LEV0= 0
##$LPBIN= 0
##$MAXI= 10000
##$MC2= 0
##$MEAN= 0
##$ME_mod= 0
##$MI= 50
##$NCOEF= 0
##$NC_proc= -7
##$NLEV= 6
##$NOISF1= 3.799351
##$NOISF2= 2.8
##$NSP= 0
##$NTH_PI= 0
##$NZP= 0
##$OFFSET= 16.48848
##$PC= 4
##$PHC0= -415.9518
##$PHC1= 3.101563
##$PH_mod= 1
##$PKNL= yes
##$PPARMOD= 0
##$PSCAL= 4
##$PSIGN= 0
##$REVERSE= no
##$SF= 200.130005582386
##$SI= 16384
##$SIGF1= 3
##$SIGF2= 2
##$SINO= 400
##$SIOLD= 16384
##$SREGLST= <1H.CDCl3>
##$SSB= 0
##$STSI= 16384
##$STSR= 0
##$SW_p= 4139.07284768211
##$SYMM= 0
##$S_DEV= 0
##$TDeff= 32768
##$TDoff= 0
##$TI= <>
##$TILT= no
##$TM1= 0
##$TM2= 0
##$TOPLEV= 0
##$USERP1= <user>
##$USERP2= <user>
##$USERP3= <user>
##$USERP4= <user>
##$USERP5= <user>
##$WDW= 1
##$XDIM= 16384
##$YMAX_p= 427294517
##$YMIN_p= -918765
$$ End of Bruker specific parameters
$$ ---------------------------------
##NTUPLES= NMR SPECTRUM
##VAR_NAME=  FREQUENCY,     SPECTRUM/REAL,   SPECTRUM/IMAG
##SYMBOL=    X,             R,               I
##VAR_TYPE=  INDEPENDENT,   DEPENDENT,       DEPENDENT
##VAR_FORM=  AFFN,          ASDF,            ASDF
##VAR_DIM=   16384,         16384,           16384
##UNITS=     HZ,            ARBITRARY UNITS, ARBITRARY UNITS
##FACTOR=    0.252644378177508, 1,           1
##FIRST=     3299.83951724647, 0,            0
##LAST=      -839.233330435636, 0,           0
##MIN=       -839.233330435636, -918765,     0
##MAX=       3299.83951724647, 427294517,    0
$$ Real data points
##PAGE= N=1
##DATA TABLE= (X++(R..R)), XYDATA
$$ [...]
12428A624824l68615K5699j23516M81956J40627k35584R5141o5728J09322M38200
12418B122326l38380k19490L94085O7635K22629J94412q6664j38748L60083k66442
12408B311446O68810l87805N20070K7863k25422J70041j19157M39370q3111K70254
12398C592359K57813J12439K30530K44804J88130J79823K01810j74891R60707
12389E793524R777J0199L46849R1177L51899J84442J54766K69449K70606n10149
12379F972539P97014j75647M04800j78810J30307j26231R7437p3614p3830j9083
12369G754882n06559m64522o2651K75799l30761j81053o8933m72918r9123m10791
12359E433370J91036m97684l96867R4010k41140l79624k97240m0559L68971l98187
$$ plain form
12428 1624824 1256209 1281908 1158392 1640348 1780975 1545391 1640532 1574804 1684126 2122326
12418 2122326 1783946 1564456 1958541 2026176 2248805 2443217 2356553 2217805 2577888 2311446
12408 2311446 2980256 2592451 3112521 3140384 2914962 3085003 2965846 3405216 3322105 3592359
12398 3592359 3850172 3962611 4193141 4437945 4626075 4805898 5007708 4832817 5793524
12389 5793524 5803301 5813500 6160349 6251526 6603425 6787867 6942633 7212082 7482688 6972539
12379 6972539 7769553 7593906 7998706 7819896 7950203 7823972 7921409 7847795 7773965 7754882
12369 7754882 7248323 6783801 6721150 6996949 6666188 6485135 6416202 5943284 5844161 5433370
12359 5433370 5624406 5126722 4729855 4823865 4582725 4203101 3905861 3865302 4234273 3836086
12349C836086l4370k80980J03015k5487l92585k29807j4356k31180L6455q2260
12339B684531p6329k43641L92938o92953J12331K11565j40184k76939M8937k01661
12329A818595J88548O2923k6409l55795k6392L35820j72496p8032k67443j03945
12319A375374K581K64652m56036M21185O7022o2554n24280L3363P9637j21089
12309A079855o5865r2212o227L4235l01218K47031j01400N24523l52483N4894
12299A021133k14572m00693L22229J74263p9209R0899m59855M35442K1064n25869
12289C84832j55264M34398k36974M0948K30167m26924N33107k65643P8510k69
12279F16888l7768j71818J12969r1766k61810K56869K42157k01747m4783p057
$$ plain form
12349 3836086 3801716 3520736 3623751 3598264 3205679 2975872 2961516 2730336 2766791 2684531
12339 2684531 2608202 2364561 2757499 2064546 2176877 2388442 2248258 1971319 2020256 1818595
12329 1818595 2007143 2070066 2043657 1687862 1661470 1997290 1824794 1746762 1479319 1375374
12319 1375374 1377955 1642607 1186571 1607756 1674778 1612224 1087944 1121307 1200944 1079855
12309 1079855 1013990 921778 915551 949786 648568 895599 794199 1318722 966239 1021133
12299 1021133 806561 405868 728097 902360 823151 914050 454195 889637 910701 384832
12289 384832 229568 663966 426992 467940 698107 271183 804290 538647 617157 616888
12279 616888 579120 407302 520271 428505 166695 423564 665721 463974 419191 412134
12269D12134n4791j65627K23625J22687k63276L28787k16279p3610l83334N69289
12259D99605k76785P9280k22692K45409J57399K39066n21859L01778K00948l38331
12249C63818J68617j37270L34403k79949j48824K83871l18939J21486n9019l013
12239C25181N2860O6576j83808J31627j71772K55794P2613l02889K68053m76443
12229C7792L97215n71935L00356O09806p28215L57577n8648j86310J95411o1912
12219B91137j80770J37927k08246M9350K39848k54556L29377n26681L29606J2510
12209B19502k46760l66305N09968j48004k13060L32205j9698L20789m66414J28082
12199E0305q0633M69386l72036K01019l2756l06374J95298k44005K75946J76310
$$ plain form
12269 412134 357343 191716 415341 538028 274752 603539 387260 313650 -69684 499605
12259 499605 222820 302100 79408 324817 482216 721282 199423 501201 702149 363818
12249 363818 532435 395165 729568 449619 300795 584666 265727 387213 328194 325181
12239 325181 378041 444617 260809 392436 220664 476458 549071 246182 514235 37792
12229 37792 435007 -136928 163428 773234 45019 402596 343948 157638 353049 291137
12219 291137 110367 248294 40048 89398 329246 74690 404067 -122614 206992 219502
12209 219502 -27258 -393563 116405 -31599 -244659 87546 67848 388637 -77777 50305
12199 50305 -30328 439058 67022 268041 235285 -71089 124209 -119796 156150 332460
12189C32460l7472k96449l69819L20821J66871n4820p3341J01602K799J92814
12179B85466O7892k47339n7996n4877K15793K1438j35167M7168M02822n02466
12169D2734k01626J08329K16724k50944L93795Q0970j42380p2182J82920j45360
12159B12980m96011K9098O65113l62598M78228k75089M8353k8639k38491K6489
12149E9433K4736r1301L26131n27867J29932M97323o03326J42240O6892K63947
12139B88140J4479k72165r9744K17839j54630K58204j16429m71049N77539n57067
12129c14883O04394p1725m30834R5740j53213K36398K59784N3517l87108r5625
12119b03555K32495l12372J61159k9837N17700l90226j06853L76164Q882k77920
$$ plain form
12189 332460 294988 -1461 -371280 -50459 116412 61592 -11749 89853 92652 285466
12179 285466 353358 106019 48023 -6854 208939 230377 95210 142378 545200 42734
12169 42734 -158892 -50563 166161 -84783 309012 389982 247602 175420 358340 212980
12159 212980 -283031 -253933 411180 48582 526810 251721 300074 271435 32944 59433
12149 59433 84169 -7132 318999 -208868 -78936 418387 -184939 -42699 24193 288140
12139 288140 302619 30454 -69290 148549 -6081 252123 135694 -335355 242184 -314883
12129 -314883 289511 217786 -213048 -117308 -270521 -34123 225661 279178 -107930 -203555
12119 -203555 28940 -283432 -122273 -152110 365590 -24636 -131489 244675 253557 -24363
12109b4363J8606L58721l46550J20437n05900M59650J06508m42261M64905j72143
12099C7610j9748j60037N1953K96862j91492L02976j15239k96816P903J50212
12089F4184k08100L14789k38992P6195n1635j39409K13052J98055n8003Q9841
12079B59977k45867j75291M15159n8030q0672j99791K22987m09415N1692J50439
12069f8812k6212K8676j71872J47309P3251J33949r2224k32492N61504k73596
12059G9481J72196M0464n56095M94720n01071L23605m90259K78003K87370J83637
12049C12051J23475k20346m80051K04614N7856K63379m31409K74205j83636j45140
12039b25002J85014J8507J03397j76332k3757j23412K02053k01902M20736J02214
$$ plain form
12109 -24363 -5757 352964 6414 126851 -379049 80601 187109 -255152 209753 37610
12099 37610 17862 -142175 -90222 206640 15148 318124 202885 -93931 -86028 64184
12089 64184 -143916 170873 -68119 8076 -43559 -182968 30084 228139 170136 259977
12079 259977 14110 -161181 253978 195948 115276 -84515 138472 -270943 -219251 -68812
12069 -68812 -95024 -66348 -238220 -90911 -17660 116289 24065 -208427 353077 79481
12059 79481 251677 292141 -263954 230766 -270305 53300 -436959 -158956 128414 312051
12049 312051 435526 215180 -264871 -60257 -2401 260978 -170431 103774 -79862 -225002
12039 -225002 -39988 -21481 81916 -94416 -118173 -241585 -39532 -241434 179302 281516
12029B81516l38636J60280n80098N56026N5374o84494M69456Q2861k68978M8475
12019b18218k05529P53784k97804j56970j58561L12432Q7000k09689K62527r2880
12009G6092K64953m61851j61947K30149J76657m82419J22559J21769N3835j3380
11999g3583J80655n0202j71078Q5474J27857l20548L0490L93918l49349K9036
11989a17330j75375K78479j33904Q4543J72110j23055r4342l46476N71460p152
11979A08958P3902n45715R3859J54986L42467n19044M83157P593R1794m31539
11969a39582J54000j0048J2110o5099K51229m15986N42260J72j03434R6861j85514
11958A36969K66768k88293K0214K2030J33254l39099J40029p2913j4159k5606
$$ plain form
12029 281516 -57120 103160 -476938 79088 134462 -550032 -80576 2285 -266693 -218218
12019 -218218 -423747 330037 32233 -124737 -283298 29134 116134 -93555 168972 76092
12009 76092 341045 -120806 -282753 -52604 124053 -358366 -235807 -114038 -60203 -73583
11999 -73583 107072 56870 -114208 -28734 99123 -221425 -190935 202983 -146366 -117330
11989 -117330 -292705 -14226 -148130 -63587 108523 -14532 -108874 -455350 116110 108958
11979 108958 182860 -362855 -268996 -114010 228457 -290587 192570 200163 291957 -139582
11969 -139582 14418 4370 16480 -48619 202610 -213376 328884 329056 225622 322483 136969
11958 136969 403737 115444 135658 157688 290942 -48157 91872 18959 4800 -20806
11948b0806K17472L577j92391m7587l63l9846K00737l13208P24233l77548l12254
11937a57984J37128j84260J9042L645J41599l60754K12771M24172n38264L81580
11927G8675K96647p36438K02023j46018K5362K98265l54494L23183n44406N50616
11917f585j27060K0479P5915j82601K73956j17721j05750M76947j39339n0779
11907A17462j45521L36680l77264N7660k96120K13571l1666J78913K96395l84656
11897c4546K01745j76074k71064L90665k60183L75873j94264n00252K50870K64669
11887D7439l40195J83716K69520J17839o66935J5753K91457n3074P8934l5477
11877i1023J3240R6849J5424j58835k3802N8770J03019J37923l26809k08609K54826
$$ plain form
11948 -20806 196666 200243 7852 -39735 -40098 -79944 120793 -192415 531818 154270 -157984
11937 -157984 -20856 -205116 -186074 -182429 -40830 -401584 -188813 235359 -302905 78675
11927 78675 375322 -361116 -159093 -305111 -279749 18516 -335978 -12795 -557201 -6585
11917 -6585 -133645 -113166 -37251 -219852 54104 -63617 -169367 307580 168241 117462
11907 117462 -28059 308621 -68643 -10983 -307103 -93532 -125198 53715 350110 -34546
11897 -34546 167199 -8875 -279939 110726 -149457 226416 32152 -468100 -217230 47439
11887 47439 -292756 -109040 160480 278319 -388616 -372863 -81406 -134480 -55546 -91023
11877 -91023 -77783 19066 34490 -124345 -148147 -89377 13642 151565 -175244 -383853 -129027
11866a29027N52788n96308J02255R3577j27138n4134j62426J26764L60437n88366
11856d21578L47231n7597K97713k87972k37366L73210j37812L7832j25352K09436
11846b255k5285j32828J87554J98740p9880m9111j44488P3847m5654m0334K32323
11835A72629j76841j18027L23343m07738K83639K55647k00544m4997j64602N18495
11825D41004k22234k11827j87488j0734j14826K36863j50989J25373K24358j65312
11815c5812Q513N2249J23792j4641J28893m58285K02996r8938J2968K95366l27364
11804a10263J75318l6664j25158R6329K02799Q4267k6101m55724r7916K95694
11794B581k124P8211j72866K93140l13180j03709J05268J23023j53872L20216
$$ plain form
11866 -129027 423761 -172547 -70292 23285 -103853 -157987 -320413 -193649 166788 -421578
11856 -421578 -74347 -131944 165769 -122203 -359569 13641 -124171 -86339 -211691 -2255
11846 -2255 -27540 -160368 27186 225926 146046 96935 -47553 26294 -19360 -59694 172629
11835 172629 -4212 -122239 201104 -206634 77005 332652 132108 87111 -77491 441004
11825 441004 218770 6943 -180545 -191279 -306105 -69242 -220231 -94858 129500 -35812
11815 -35812 -27299 24950 148742 134101 262994 -195291 7705 -91233 -78265 217101 -110263
11804 -110263 65055 28391 -96767 -438 202361 286628 260527 -195197 -293113 2581
11794 2581 457 78668 -94198 198942 -114238 -217947 -112679 10344 -143528 176688
11784A76688k52967M5372J18847l8631j89698K72350k93071N38637m57444j27537
11774b07454q4025O99921k05960Q1424k59236Q4250l67162J76584j25650L08451
11764A01143K60920k29846l89942K33539P2714O5820j24783K70358m5287k47041
11754c2405K69904j01796J61646o6063m48162K32767j37555j87205K76742m8044
11744h0171j35161j84431L19288k91710M73715l51289L57237k03274N22933k82932
11734A44205l03595J04482k0045l29722P04723l96505K60060j53415q7243k61293
11724c38348M48690l04151L11222J79907m30265K04998o7855o3021j07386J94482
11714B8273k67822L11704O7200j096l60924K1604K53984j21349L42266m33707
$$ plain form
11784 176688 -76279 -30907 87940 49309 -140389 131961 -161110 377527 -79917 -207454
11774 -207454 -291479 408442 202482 283906 24670 108920 -258242 -81658 -207308 101143
11764 101143 362063 132217 -257725 -24186 48528 114348 -10435 259923 214636 -32405
11754 -32405 237499 135703 297349 231286 -216876 15891 -121664 -308869 -32127 -80171
11744 -80171 -215332 -399763 -80475 -372185 101530 -249759 107478 -95796 427137 144205
11734 144205 -159390 -54908 -74953 -404675 300048 -96457 163603 10188 -77055 -338348
11724 -338348 110342 -193809 117413 297320 -132945 72053 4198 -58823 -166209 28273
11714 28273 -239549 72155 139355 138259 -222665 -201061 52923 -68426 273840 -159867
11704a59867k33391L31679P6773P1980l60909K75832K19533k03438r118K21219
11694B30293J04409k73905J31171r9900j97242L33814j52921k50797L02883J6839
11684A44644q9781l05153K2509M46686l88131R5794J98989k33537m211J1331J55355
11673E4495P9038k24162R9798k04105K52839J34762l74900Q0263N71975q0802
11663C89201R181m12192j68284K66669O810K53601N1968n5451p47378N22917K88382
11652D05424k63332L71608l94830N68406o06912m25092K37861M51160k64035j53229
11642g2971J14796P9046J53641j569l04798J02348l1289j08738N4030k3652R7943
11631E8787L83028n50903M90826k94582J11163j42942N0326J99898k98635J94064
$$ plain form
11704 -159867 -393258 -61579 15194 87174 -273735 2097 221630 18192 9074 230293
11694 230293 334702 60797 191968 92068 -105174 228640 75719 -175078 127805 144644
11684 144644 54863 -250290 -227781 218905 -169226 -73432 125557 -107980 -112191 -100860 54495
11673 54495 133533 -90629 9169 -194936 57903 192665 -182235 -101972 470003 389201
11663 389201 398382 -13810 -182094 84575 91385 344986 396954 341503 -405875 117042 405424
11652 405424 142092 513700 118870 687276 80364 -344728 -106867 344293 80258 -72971
11642 -72971 41825 120871 274512 272943 -31855 70493 39204 -69534 -15504 -39156 58787
11631 58787 441815 -109088 381738 87156 198319 55377 105703 305601 6966 201030
11621B01030m67277J50965L84777M92723q13722j1617N09611o94046j09702J61297
11611a95961L87468l62464N54515m37247j30632K97627j1466l8308l20119L60658
11601A04071p3213K53903o14410O37689l85197k77712K12320J09947j6574J87471
11591A38295k53473n3513O3104K60425n3315j22558k32510L56354K22952l30334
11581d573j16884j61043L19105k95636M64962o8992N8970k59992J5438P9942K37940
11570B69237N2449k78784p803L31287j92966j83845K3315j52171K55851k34290
11560a17720l6138K47327J09146j45762J16360l42495M95055j72941K754j42018
11550A3568J34744l7049k62484M11200J85989k09173M0318m9061R3459m46256
$$ plain form
11621 201030 -266247 -115282 269495 762218 -51504 -63121 446490 -247556 -357258 -195961
11611 -195961 191507 -170957 383558 -53689 -184321 113306 101840 63532 -256587 104071
11601 104071 30858 284761 -329649 308040 -77157 -354869 -142549 -32602 -49176 138295
11591 138295 -115178 -168691 -105587 154838 101523 -21035 -253545 102809 325761 -4573
11581 -4573 -121457 -282500 36605 -259031 205931 136939 195909 -64083 -48645 31297 269237
11570 269237 321686 42902 35099 366386 173420 -10425 12890 -139281 116570 -117720
11560 -117720 -153858 93469 202615 56853 173213 -169282 325773 152832 155586 13568
11550 13568 148312 111263 -151221 259979 445968 236795 277113 228052 321511 -124745
11540a24745K15141K27821j89856k28258J36740O7430K24836J41433j88626O8397
11530C50313K09539l69181K38156J27620L7304N7555J04252l6905L29713m5541
11520A002825l58131j33780j38590L54007l78215J26614k6073L11852m18963N17326
11510H58872p33728M72800k11764J83197K2754K49248M35245l36382L63938o8090
11500A236090M22930J4723P47092R5805k39235R7524L1149K1069m88474k78603
11490A660070l0757R2864k82405k34723N7463q2740O8958l50720J01671k28930
11480G70751j34574L15050m06537M53272j41006K24200J60878k4306K56645O87898
11470B162271o2141K65543J71520j73777J38925o07056L07837l12530p3462k30704
$$ plain form
11540 -124745 90396 318217 128361 -99897 36843 104273 329109 470542 281916 350313
11530 350313 559852 190671 428827 556447 593751 651306 755558 718653 1048366 1002825
11520 1002825 644694 510914 372324 726331 348116 474730 448657 760509 341546 858872
11510 858872 125144 597944 386180 569377 592131 841379 1276624 940242 1304180 1236090
11500 1236090 1659020 1673743 2420835 2516640 2277405 2374929 2406078 2427147 1938673 1660070
11490 1660070 1629313 1722177 1439772 1205049 1262512 1179772 1248730 898010 999681 770751
11480 770751 636177 951227 544690 997962 856956 1081156 1242034 1217728 1474373 2162271
11470 2162271 2100130 2365673 2537193 2363416 2502341 1895285 2203122 1890592 1817130 1586426
11460A586426k44263l07673J364M36115p68160p2292J58778l27872K48182K88675
11450I99280o45360L90984P5422o696j24913k47132N26145L3724k10514O2149
11440H53089L92776k27641k3462o7501k62179J660j16158J55262R5035k89292
11430E11589l33871J8869M1546k65291J68049L27567j30581k26364L95091k31677
11420B74927j63643K01058J54203o4866j52348k30743M0908j5384k76893L01798
11410F9017k47811K55273J19402L82643l10194l7735L83901m68970j07720L2193
11400F9999K37718k74785M44377j79969l17736K25113m7992r050K65838q0173
11390C33340N1860l27996p4464J08783j12744J83886k88249K55989M670R4019
$$ plain form
11460 1586426 1342163 1034490 1035854 1471969 703809 631517 790295 462423 710605 999280
11450 999280 353920 744904 820326 813630 688717 441585 967730 1001454 790940 853089
11440 853089 1245865 1018224 994762 927261 665082 666742 550584 705846 800881 511589
11430 511589 177718 196587 238133 -27158 140891 468458 337877 111513 506604 274927
11420 274927 111284 312342 466545 401679 249331 18588 59496 44112 -232781 69017
11410 69017 -178794 76479 195881 578524 268330 230595 614496 145526 37806 69999
11400 69999 307717 32932 477309 297340 -20396 204717 156725 147675 413513 333340
11390 333340 385200 57204 -17260 91523 -21221 162665 -125584 130405 135075 229094
11380B29094j96333K99890l54277R6715J69970M9870l54928J92083j10486q2984
11370f1386L67177l57024K88318K3423l29694N9301m22582O51843l38674K51164
11360A31866J05434j12517J9251N934m8818j20559J46722m63796M31714k55050
11350a59819M98659j04732m14860K74833q3577j29329K76085n412m7424O2630
11340A67054L54707m36427j16401K15486l98502N75711o1575j05201n85739O5047
11330c25840O13164o3594o2750j96908K2496L06564j42793J07930k14350J10109
11320A54028K08718m38013K6211O3140J48854k065j48559j45949j41588R21680
11310F46457m00788j10542L66048n0937K4576m71425K73700j74278L1526k98844
$$ plain form
11380 229094 32761 332651 -21626 75089 245059 294929 -59999 132084 21598 -61386
11370 -61386 305791 -51233 237085 260508 -69186 -9885 -432467 219376 -119298 131866
11360 131866 237300 124783 144034 149968 101150 -19409 127313 -336483 95231 -159819
11350 -159819 338840 234108 -180752 94081 10504 -118825 157260 151848 104424 167054
11340 167054 521761 85334 -31067 184419 -214083 361628 300053 194852 -390887 -325840
11330 -325840 287324 223730 160980 -35928 -13432 293132 150339 258269 43919 154028
11320 154028 362746 -75267 -49056 14084 162938 160873 12314 -133635 -275223 646457
11310 646457 245669 135127 501175 450238 474814 3389 277089 102811 134337 -164507
11300a64507M08491l4918K82176m70415L703r892N6085R5359j34328k71560R85480
11289G45674n67734j38906P5716M48879l1816m13683p2646J83028r2909j30391
11279E212J61289L2715K45675l53223J20130j9001K41502k09856j57665j47679
11269h0901J20486M76486k59841J73464J11877K03832k67610L5179m7412m9513
11259D16047J4931m05881J62346l0182r1561K23490J4542k46461L0536n1836K59109
11248B95080k17581L09409j68864j08517L56042k18810M1569J11271P4907j75469
11238B99037l3398N2103K16671j85651k0824l6267N8007J6879q7586K56917m08427
11227A27461O3662j40474J90026j1390P9340k7914K509R2531j25208J88078m15947
$$ plain form
11300 -164507 243984 209066 491242 20827 24530 14638 70723 166082 31754 -239806 745674
11289 745674 177940 39034 114750 563629 531813 118130 45484 228512 135603 5212
11279 5212 166501 199216 444891 91668 211798 192797 434299 224443 66778 -80901
11269 -80901 39585 516071 256230 429694 541571 745403 477793 512972 465560 416047
11259 416047 430978 25097 187443 157261 65700 289190 303732 57271 87807 35971 295080
11248 295080 77499 386908 218044 109527 465569 246759 288328 399599 474506 299037
11238 299037 265639 317742 534413 348762 327938 291671 349678 366557 278971 535888 127461
11227 127461 191123 50649 240675 229285 308625 280711 283220 375751 250543 438621 22674
11216B2674K30193j4463k08119K57873k56975J95045R8776l69041J24238o9202
11206A0999r2315K74892J87402o38876Q14706n35248L09644l4745m62036L58277
11196A92700Q1764K88451m15747l4727M7976L14278n02205J37256J19094r9036
11186A29804L65816j47999j12307j79386M33738m65277M04860n26485L80632j22176
11176A61220n0391J07601k91140O6501J38484J31186k9623R8562l41083M72420
11166D63737m52030K86966J16607n8395k8260m6561J45837k81326j76058K23245
11156A93762Q4355l794J92701n60229K60454L01932m32655L69678l32547k33624
11146a59967L80926l91442J37802R8205l67349L95032J24686l328m58716P05445
$$ plain form
11216 22674 252867 238404 30285 288158 31183 226228 325004 -44037 80201 10999
11206 10999 -81316 193576 380978 -257898 556808 21560 331204 296459 -165577 192700
11196 192700 274464 562915 147168 112441 160417 474695 -27510 109746 228840 129804
11186 129804 495620 347621 235314 55928 489666 24389 429249 -97236 283396 161220
11176 161220 110829 218430 -72710 -6209 132275 263461 233838 332400 -8683 463737
11166 463737 11707 298673 415280 356885 328625 282064 427901 146575 -29483 193762
11156 193762 278117 274323 467024 -93205 167249 469181 36526 406204 73657 -159967
11146 -159967 220959 -170483 -32681 65524 -301825 93207 217893 214565 -244151 461294
11136D61294m74048P2213J62027L04808m84302J99960J36980j85339K95639k25187
11126B64045j15700J3685j38014Q4900n0981k51803J75940j69942j4708N55354
11116C52776o21392K65171m6110j25519K94567J18469r6544n54528L84623J92687
11106A64200j70425L22312m16239k04780N41560k27264K39226n64896K45301J15927
11096D4922n8951L13857k21669k90478M56965k6045r8628J62187k52264K45522
11086B75418P9923k15703L18960l85865K77987k38578o1652O5396K58058L9929
11076D13873j02738j24901J71581l39669J39960M2436L79341n60390k96545L8843
11066b38209K29258L21982k00040j38293O2006J89511L12540n81329J10123j71482
$$ plain form
11136 461294 -12754 59459 221486 526294 41992 241952 378932 193593 489232 264045
11126 264045 148345 162030 24016 108916 57935 -193868 -17928 -187870 -202578 352776
11116 352776 -268616 -3445 -49555 -175074 119493 237962 141418 -413110 -28487 164200
11106 164200 -6225 316087 -100152 -304932 236628 9364 248590 -316306 -71005 44922
11096 44922 -14029 299828 78159 -212319 244646 218601 119973 282160 29896 275418
11086 275418 355341 139638 458598 72733 350720 112142 50490 115886 373944 413873
11076 413873 311135 186234 357815 18146 158106 200542 579883 19493 -277052 -238209
11066 -238209 -8951 313031 112991 -25302 36704 226215 538755 -42574 67549 -103933
11056a03933K12701L55746k6286k78406L87790n1846l75758O6491J4568Q2110
11046B83177k75958J03110K37059L07543m20027o6147K39653L3723M6608l79261
11036A09480M04586j34278m75660O68258n78611L42314k19076J1357j3099P7348
11026A92619j4636J12291J6206K9340o12414L00090m6422K42356k79187O30552
11016E70795k21409J93762j05853j56193p387M6604l27859K85789j39335J32285
11006B71199j58479J3144L46412m41755L4388K22726l20777J39763n7876Q3478
10996A32223k85813j0972K81296O5472k18382r3180j08607K78009R8571j70417
10986c1800J80311q6145K53900k11329K09972N66196p52510L65595J3783J51659
$$ plain form
11056 -103933 108768 464514 438228 159822 547612 495766 120008 186499 201067 283177
11046 283177 7219 110329 347388 654931 234904 168757 408410 442133 488741 109480
11036 109480 514066 379788 -95872 572386 -6225 336089 117013 128370 115271 192619
11026 192619 177983 290274 306480 335820 -276594 23496 -22926 219430 -59757 570795
11016 570795 349386 543148 437295 281102 273715 320319 -7540 278249 138914 271199
11006 271199 112720 125864 472276 30521 64909 287635 -33142 106621 48745 132223
10996 132223 -153590 -164562 116734 182206 -36176 -129356 -237963 40046 138617 -31800
10986 -31800 148511 62366 316266 104937 314909 881105 128595 494190 507973 659632
10976F59632j6590P2378l49172j85374M85612k3158J50247m4026n68101j9272
10966A62176r6952Q6164k5697J56940Q9552m913l48068O22823R8523L18804K19010
10955A278362J22994j98916j1542K27899o61921l370J63924j31192j79459j25110
10945D81669p2491k70601K73084k30657J23563j8785K29699K06235j83800L39880
10935H77796M91734J90165n36678K68217k6009l06883j11160j48364K195L0989
10925G32002o01039Q9879J97197K34806l31014K2177L65718l50713J38416m8731
10915D48698J18899K410l45143M96255q3274l04463L00391N8859n20355P2919
10905B45196P5633K16892n49336L96287M5364j17086k29647L10919n67610P25262
$$ plain form
10976 659632 643042 715420 366248 180874 666486 643328 793575 749549 181448 162176
10966 162176 65224 151388 125691 282631 372183 367270 19202 642025 740548 1059352 1278362
10955 1278362 1401356 1202440 1190898 1418797 756876 753506 917430 786238 606779 481669
10945 481669 409178 138577 411661 181004 304567 285782 515481 721716 537916 877796
10935 877796 1369530 1559695 1023017 1291234 1265225 958342 847182 698818 701013 732002
10925 732002 130963 220842 418039 652845 321831 344008 709726 359013 497429 448698
10915 448698 567597 570007 224864 721119 637845 333382 633773 692632 172277 245196
10905 245196 320829 537721 -11615 384672 430036 312950 83303 394222 -173388 551874
10895E51874o00238N01652l62861J51167J6264J73333m13925M75279j99983J367
10885B93929J78972J70435k95028m10810k315J93479k47672J2597J32586L96926
10875D23099p21066M09097Q1131j74106M13302j68191j41454K7007J5171n11945
10865c47955K24491j00340M8910K60761J03474J24749l95337K00950J63642j05612
10855A77733j14178K18558k76258K62216o6834J20231L3805q9656j15397k69048
10845a18828N1941K42431K16602m99801K11335J82143k44733K67932j29716l8393
10835A40913j25738J97902j66803N9493K88588k35774k60805J36468L15879k04497
10825A45626K48118o5122Q2796j07752k2004j21325n120l556o5705K63797m55677
$$ plain form
10895 551874 -48364 453288 90427 241594 257858 431191 17266 492545 292562 293929
10885 293929 472901 643336 348308 -62502 -64817 128662 -119010 -106413 26173 423099
10875 423099 -297967 111130 192261 18155 431457 263266 121812 148819 163990 -347955
10865 -347955 -123464 -223804 -174894 85867 189341 314090 -81247 119703 283345 177733
10855 177733 63555 282113 5855 268071 201237 321468 355273 265617 150220 -118828
10845 -118828 -66887 175544 392146 -107655 103680 285823 41090 309022 179306 140913
10835 140913 15175 213077 46274 105767 394355 158581 -102224 34244 350123 145626
10825 145626 393744 328622 411418 303666 281662 160337 155217 151661 85956 349753 -105924
10814a05924L35097j78681J30888l14751J32412L88631n85882L30188l35758N70902
10804C67122k09086K35033m58092O05268m77106n4158j55534O7643R8290j84067
10794a64687L71703Q3301k7115k19445L80315j24789j49489O9799P5360J05480
10784D00433k47896M3704J19283l85879Q3233K20626l69887J07802K63743J72418
10774D07580m72522L27834O6865j66446Q6794J04879n07681K43527Q2014n6313
10764A16531L67824k63061P1747m72922K63673m5715J61201J9847J17437m48181
10754a11619K22595N5249K05392m30242J65254j93990o8075L3884L55127P4174
10744C07749q1163n9406k3173n7498K4981o8845L72173k80911N9128O7443m48075
$$ plain form
10814 -105924 229173 50492 181380 -133371 -959 387672 -198210 131978 -203780 367122
10804 367122 158036 393069 -65023 540245 63139 8981 -146553 -78910 19380 -164687
10794 -164687 207016 290317 263202 43757 424072 299283 149794 219593 294953 400433
10784 400433 152537 196241 315524 -70355 12878 233504 -136383 -28581 235162 407580
10774 407580 -64942 262892 329757 163311 250105 354984 -152697 90830 172844 116531
10764 116531 484355 221294 293041 -179881 83792 38077 199278 219125 336562 -111619
10754 -111619 110976 166225 371617 -58625 106629 -87361 -155436 -121552 233575 307749
10744 307749 226586 167180 144007 86509 111490 42645 414818 133907 193035 260478 -187597
10733a87597M86522n12157M25776j13125J53546m00074K20595n0272L74728k87373
10723A10569j13959L59900m34069L82032j92599j79788O68929l79090K41621n66289
10713a02743N12869j97644K19396r2512o6479L24375o18396M1537L44738j94461
10703A70680J90749k04285N7912r4430o1641j09007M48066j27257l0703r33j31712
10692A07439l78785M53105j47491J25875J07608j66295L66034J38809p32693j68463
10682b94857O84535k14683O9514k95563Q0401N0214j79178K04606K16346p5306
10672B46029k38678j54126J32982J25005L029K45033j24005j93358K34621k07203
10662F9329P3528K38094Q1427J11624j33914k05225l93445L24712P1404k46762
$$ plain form
10733 -187597 298925 -213232 212544 99419 252965 -147109 73486 23214 397942 110569
10723 110569 -3390 356510 -77559 304473 111874 -67914 601015 221925 463546 -102743
10713 -102743 410126 212482 431878 339366 272887 597262 -21134 20403 365141 170680
10703 170680 361429 157144 215056 120626 58985 -50022 398044 270787 240084 239151 107439
10692 107439 -271346 181759 34268 160143 267751 101456 467490 606299 -126394 -294857
10682 -294857 389678 174995 244509 -51054 29347 79561 -99617 104989 321335 246029
10672 246029 7351 -146775 -13793 111212 114241 359274 235269 41911 276532 69329
10662 69329 142857 380951 462378 574002 440088 234863 -158582 166130 237534 -9228
10652i228L21717Q1753L580j6061J38700l17111p0990L8170J24010k18102o0845
10641A5593L01902O5817j18970J83053j79973M49553k74333k46817M46876j1776
10631F30925Q7554K32736r8633m71155P55128m05731k36902k5745K58792m61606
10621B65363L9619K27877k04479L85535k50180n9231o5594J18032j24764L27483
10611F59661l43083J56396l05283K57391m71184O15810j6079j1067J30174O6353
10601G39089J47949O1136p8747l7049j64375L41344m18655k68011j03830L37481
10591E56332m76081L61026M17988m82695K79334m28004M47865l00212J57573k43107
10581B90019M4793j98120M37492O467l69846M88254l46839M946J04605N96994
$$ plain form
10652 -9228 312489 394242 397822 381761 520461 203350 132360 170530 294540 76438 15593
10641 15593 317495 383312 264342 447395 267422 716975 442642 195825 642701 630925
10631 630925 718479 951215 852582 381427 1136555 730824 493922 468177 726969 265363
10621 265363 304982 532859 328380 713915 463735 404504 338910 456942 332178 659661
10611 659661 316578 472974 167691 425082 -46102 569708 553629 542562 672736 739089
10601 739089 887038 948174 869427 832378 668003 1009347 590692 322681 218851 556332
10591 556332 80251 441277 859265 376570 655904 227900 675765 375553 533126 290019
10581 290019 334812 136692 574184 580651 210805 699059 352220 357166 461771 1058765
10571A058765m36375k19280J16825j14911K8956M9790j74925J7224J32072L19278
10561G77419n80588J68874o8776J99344j96509L58617k66940J28768q0472J49725
10551E89462O5600o3840q3441m3568r2633J53444M7510n6043j95548j911l9315
10540B79717m014P8501k39533L47559m7866j08242L94999k77132J67272m77341
10530A13920L53918j11561j35427L47549j63771m0055R0972j54503K35812K4624
10520E61478r2511j35792o3813P353l36258O77705m1296m52630M25249P9415m3781
10509E85119J03115l98448M39717l16490M14864n99684L77615J04806n37683K43635
10499D16566L15458J71376q29276O97979l04463J02447l01120J22622K17437K39930
$$ plain form
10571 1058765 622390 403110 519935 405024 433980 483770 308845 326069 458141 777419
10561 777419 196831 365705 296929 496273 299764 658381 391441 520209 439737 589462
10551 589462 655062 591222 507781 464213 371580 525024 572534 516491 320943 319032 279717
10540 279717 275703 354204 114671 462230 414364 306122 701121 423989 591261 113920
10530 113920 467838 356277 220850 568399 404628 364573 455545 301042 536854 561478
10520 561478 468967 333175 269362 276715 -59543 618162 576866 124236 549485 628900 585119
10509 585119 688234 289786 729503 413013 827877 228193 605808 710614 172931 416566
10499 416566 732024 903400 74124 772103 467640 570087 268967 391589 609026 848956
10489H48956k12235m0309J5823J86658o2664J22488l64917N92849l62720J58061
10479H81990k66497o9102K14787l11789J04236K27025j32917J09873k00334J62847
10469G20119r4623L41522j86222l01325M2061J34319K14149k33355J3300L60128
10459A010073p45389J020756k81803j11566K13588l85864K06570n9469k37887
10450F29009L86994n10669K05424l03243L65017k09392L35752M7885M7361J44247
10440A138385J1655l60158J56778K751j89542m2253O29937n87423K79918K18619
10430A258667n39007P99389m22004M35585k66300m59570K1189J02085R6747P7368
10420A104149k06071k51189j18353N99265l77808k39598M64490k54425m4360K47348
$$ plain form
10489 848956 636721 596412 612235 798893 736229 858717 493800 1086649 723929 881990
10479 881990 615493 546391 761178 449389 553625 780650 647733 757606 557272 720119
10469 720119 625496 967018 780796 479471 521532 655851 870000 636645 649945 1010073
10459 1010073 264684 1285440 1003637 892071 1105659 719795 926365 866896 629009
10450 629009 1016003 505334 710758 407515 772532 563140 898892 946777 994138 1138385
10440 1138385 1150040 789882 946660 949411 759869 717616 1347553 760130 1040048 1258667
10430 1258667 719660 1519049 1097045 1532630 1266330 806760 827949 930034 1026781 1104149
10420 1104149 898078 646889 528536 1127801 749993 510395 974885 720460 676100 923448
10410I23448j41930j6077j69590K62715K98454n2435k86907M88502N7089k19184
10400A144085K82707l74752J03851K58959l60542l07809J91615r6406k92795L3753
10390E82666o0559N26360j83177j87300J18160M30655l03625l17100k01829M45349
10380H49600j27694R9424N9262R5876K02363j29702K65780Q8299J61662n38114
10370A026756M3981j67647k01929K06607Q1335o2902q5356k5471j68620K58488
10360I05242J27049m85990P6036k11382J86979l37031K54507N24224l46936K13644
10350I06342j7876Q657j32703j7920Q0352K56045j41863k68062R0226J12459L8441
10339I14098J87018n40736M04748L4379k03203q8361r474N9713K49947k67193
$$ plain form
10410 923448 781518 765441 595851 858566 1157020 1104585 817678 1306180 1363269 1144085
10400 1144085 1426792 1052040 1155891 1414850 1054308 746499 938114 841708 548913 582666
10390 582666 522107 1048467 865290 677990 796150 1226805 923180 606080 404251 849600
10380 849600 721906 821330 880592 976468 1178831 1049129 1314909 1403208 1564870 1026756
10370 1026756 1070737 903090 701161 907768 989103 926201 840845 815374 646754 905242
10360 905242 1032291 546301 622337 410955 597934 260903 515410 1039634 692698 906342
10350 906342 888466 897123 764420 746500 826852 1082897 941034 672972 763198 875657 914098
10339 914098 1101116 560380 965128 999507 796304 707943 698469 758182 1008129 740936
10329G40936J60446j88273k05911m4990J39299L20460k17378J04270M1991Q3424
10319I34274l75859K30962m11356N38056J29281j68634L370l59990N97918j41631
10309I76391m65615M58647n98669K86318j04989k52639L31825O4157J93755j2846
10299H76335l64584o4841o5318J97660M4278o6468R892j33942O65421l62524N0016
10288G85925m15094O77388k93992q6723J34747k76794R70602n83272k31870Q6454
10278G67371J97131O4858l49905M26037m8637n9318j12796N5953K93056l39631
10268H94119o3375J01666K02859k89403N00354r6339k72217k71599M17595k23357
10258I00303k04955K93051j73820O5873j97467J54080K0818J26438J44777J36998
$$ plain form
10329 740936 901382 713109 507198 462208 601507 921967 704589 808859 850850 934274
10319 934274 558415 789377 378021 916077 1045358 876724 880094 520104 1118022 976391
10309 976391 510776 969423 370754 657072 552083 299444 631269 695426 889181 876335
10299 876335 511751 446910 381592 579252 623530 557062 566954 433012 1098433 735909 785925
10288 785925 370831 1048219 754227 667504 802251 525457 1496059 912787 680917 767371
10278 767371 964502 1029360 679455 1105492 1056855 997537 884741 940694 1233750 894119
10268 894119 830744 932410 1135269 845866 1346220 1249881 977664 706065 1123660 900303
10258 900303 695348 988399 814579 880452 682985 837065 857883 984321 1129098 1266096
10248A266096j07534J30232l21063L42235m90029O42074k58776l79453K50577
10239A074359j22855M17832j16858l45307M73823K5119k83952l43117O42604k99543
10229A122105j27028M84288k80006K21089J56691k14706P1560M6059Q1280l48459
10219A212873O71983P7672l34024J6998Q9709J81337J85525k32177o7885J88557
10209A990568Q3866L82313k40641K5493K23318l2202J09870J60366l4694j12668
10199B555589J55607K0500k18403k5609M61104p8414N41252n37002K00689r9879
10189B975434O43926l78324K77407O9993P73651j62351J65299L16309N2461j80418
10179D553387M24645M92694l41878K7503j34128J86593k62044Q0832l45438j90285
$$ plain form
10248 1266096 1158562 1288794 967731 1309966 819937 1462011 1203235 823782 1074359
10239 1074359 951504 1369336 1252478 907171 1380994 1406113 1122161 779044 1421648 1122105
10229 1122105 995077 1479365 1199359 1420448 1577139 1362433 1433993 1480052 1561332 1212873
10219 1212873 1884856 1962528 1628504 1645502 1735211 1916548 2102073 1869896 1802011 1990568
10209 1990568 2074434 2456747 2216106 2241599 2464917 2432715 2542585 2702951 2668257 2555589
10199 2555589 2711196 2731696 2513293 2487684 2948788 2870374 3411626 2874624 3075313 2975434
10189 2975434 3619360 3241036 3518443 3588436 4362087 4199736 4365035 4681344 4733805 4553387
10179 4553387 4978032 5470726 5128848 5156351 5022223 5208816 4946772 5027604 4682166 4491881
10169D491881J54184J32858n4564j18767l42450L87394J87817j67998j55454o4602
10159D450299N96104m54467K24150K51400M49666J73175j29452K1736L3778p7994
10149E538395l47574O87517k81585l76093J61563l91846l19218K76024j22148
10140D825035l19929j50929m13916r5294L63163m27011p0907k95352J13818O7392
10130C596070K0238j53767J31559j67981J72202K82195m972m00084k8596k73803
10120C173061L13081l17587K03127R6641k70666j19124O39741q9227o44912Q3314
10110C067449j30372k45858o9332m03152K33866j10882j07267L62521m13826k54536
10100A928611n7235j42050K644L22739J01877m34201L75334j43709j36838J20468
$$ plain form
10169 4491881 4646065 4778923 4724359 4605592 4263142 4650536 4838353 4670355 4514901 4450299
10159 4450299 5046403 4591936 4816086 5067486 5517152 5690327 5560875 5582611 5616389 5538395
10149 5538395 5190821 5878338 5596753 5220660 5382223 4990377 4671159 4947183 4825035
10140 4825035 4505106 4354177 3940261 3844967 4208130 3781119 3710212 3414860 3528678 3596070
10130 3596070 3616308 3462541 3594100 3426119 3598321 3880516 3875544 3475460 3446864 3173061
10120 3173061 3486142 3168555 3371682 3468323 3197657 3078533 3718274 3629047 2984135 3067449
10110 3067449 2937077 2691219 2621887 2218735 2452601 2341719 2234452 2596973 2183147 1928611
10100 1928611 1871376 1729326 1731970 2054709 2156586 1722385 2097719 1954010 1817172 1937640
10090A937640k90822O14616R2745k06209L78306k08736R4318j36031k4584j54059
10080B097184Q8707j94163m72482J45949M33431k11335K16474l30537K1536P0759
10070A865523J27195j57245J38074Q233l59933R6836J6600O0975m38137N73999
10060A932120J83749l57113l55948P71263o89284L11021K3212R4525k31023j18744
10050A563778l26742K73100J94227k02432K14350l9986o2032o558M81623p59620
10040A329708L67665R159j57040M01225k47969K79226k75915O5164q7471m8362
10030A635390L5577p2338M10669J15275l30585j73119O2425N3568O6243l81341
10020A421764N5567M1844M0465M02923j18750M33744j72697j47678M70080j83924
$$ plain form
10090 1937640 1646818 2261434 2354179 2147970 2526276 2317540 2411858 2275827 2251243 2097184
10080 2097184 2185891 1991728 1519246 1665195 2098626 1887291 2103765 1773228 1794764 1865523
10070 1865523 1992718 1835473 1973547 1981780 1621847 1718683 1735283 1796258 1358121 1932120
10060 1932120 2115869 1758756 1402808 2174071 1484787 1795808 1819020 1913545 1682522 1563778
10050 1563778 1237036 1510136 1704363 1501931 1716281 1676295 1614263 1607705 2089328 1329708
10040 1329708 1697373 1706532 1549492 1950717 1702748 1981974 1706059 1771223 1683752 1635390
10030 1635390 1670967 1598629 2009298 2124573 1793988 1620869 1683294 1736862 1803105 1421764
10020 1421764 1477331 1519175 1559640 1962563 1843813 2277557 2104860 1957182 2427262 2243338
10010B243338O7072K32631l13608j3310M03735p5966j16370k12504L39676m64965
10000B089729k12901P7740k1877R5237j48471L44364m57046J72779L30927o19404
9990A651077J79997l5774R50349o13890L10854J39935N80P5753k15109Q75088
9980C318860R6154p1481J38872k29133K89142k26701q415k94491q6396P9954J69632
9969C175997J37686m89221L81911k92441k74085L28455k89989j44711j0365o5382
9959B457855N59202n16998k28425N76302r3424J91666Q4064r9076J91879Q3207
9949C206252L63782n05260M00038K5598L24791l53237O68413p2570J15713q5563
9939D087957L19792j68999j05160j10925J72898m28973l25281l23836J46546l49995
$$ plain form
10010 2243338 2310410 2543041 2229433 2216123 2619858 2543892 2427522 2215018 2554694 2089729
10000 2089729 1876828 1954568 1932691 2027928 1879457 2223821 1766775 1939554 2270481 1651077
9990 1651077 1831074 1795300 2745649 2131759 2442613 2582548 2583128 2658881 2443772 3318860
9980 3318860 3415014 3343533 3482405 3253272 3542414 3315713 3307298 3012807 2926411 3006365 3175997
9969 3175997 3313683 2824462 3206373 2913932 2639847 2968302 2678313 2533602 2523237 2457855
9959 2457855 3017057 2500059 2271634 2847936 2754512 2946178 3030242 2931166 3123045 3206252
9949 3206252 3570034 3064774 3464812 3490410 3815201 3461964 4130377 4057807 4173520 4087957
9939 4087957 4407749 4238750 4133590 4022665 4195563 3766590 3441309 3117473 3264019 2914024
9929B914024K8683k33908K81251r7571M1677j06941L24046k99087O6361K29449
9919C147984L35197m30163n7080O64152k89106k0121K35796J19346K36433k8738
9909C913700N953j91289m1559m49607K34494k93760L7515j92317L58342l12994
9899C068478P8707L0667n1067M23287J11543J03387J38296K06360J84248m43012
9889C850894l5583o4100j2594m73131j16315k00265L39672L43364r2126N5373
9879C595189m41804M04924j91425k92208m284L828K40564j15737l9185L92280
9869C552142l5492o6029N43242Q5389J76241J07113k09108l4204L31627l89508
9859D061413j54559k84336K26481K52818j76193J46037j01554P9116p7126j89502
$$ plain form
9929 2914024 2942707 2708799 2990050 2892479 2934156 2827215 3151261 2852174 2918535 3147984
9919 3147984 3483181 3053018 2995938 3660090 3370984 3350863 3586659 3706005 3942438 3913700
9909 3913700 3919653 3728364 3686805 3237198 3471692 3177932 3215447 3023130 3381472 3068478
9899 3068478 3147185 3177852 3126785 3550072 3661615 3765002 3903298 4109658 4293906 3850894
9889 3850894 3815311 3751211 3738617 3265486 3149171 2948906 3288578 3631942 3539816 3595189
9879 3595189 3153385 3558309 3366884 3074676 3070392 3074220 3314784 3199047 3159862 3552142
9869 3552142 3516650 3450621 3993863 4079252 4255493 4362606 4153498 4119294 4450921 4061413
9859 4061413 3906854 3622518 3848999 4101817 3925624 4071661 3970107 4049223 3972097 3782595
9849C782595J86197l2845l34884n1085J9814J84610j06509M94727j64661k52454
9839C725505K39079M36218k25579j10352o5100J19679K34054j80505k37951k54014
9829C681034M01184J00492J90113N0151r103l40626k13206M93636n46826N7083
9819C863932O00898o76186j30927L93595M6449J076m83853L71193L80020k99932
9809D066265O5373q522j80788N01730l36238K14085K81853o6475n81836M64373
9799D419820r3999n5864L53431p9250m06430J17012O13593m88060p6347K09658
9789D513564k16214J78984J21864O9204K67505o20581K08138M86765m70884J20360
9779D658705Q3952J47498L84970L7982K71731L75421k684L41619p04719P87J55850
$$ plain form
9849 3782595 3968792 3935947 3601063 3549978 3569792 3754402 3647893 4142620 3977959 3725505
9839 3725505 3964584 4400802 4175223 4064871 3999771 4119450 4353504 4172999 3935048 3681034
9829 3681034 4082218 4182710 4372823 4422974 4413871 4073245 3860039 4353675 3806849 3863932
9819 3863932 4464830 3788644 3657717 4051312 4097761 4098837 3614984 3986177 4366197 4066265
9809 4066265 4131638 4123116 3942328 4444058 4107820 4321905 4603758 4537283 3955447 4419820
9799 4419820 4325821 4269957 4623388 4544138 4137708 4254720 4868313 4380253 4303906 4513564
9789 4513564 4297350 4476334 4598198 4667402 4934907 4314326 4522464 5009229 4538345 4658705
9779 4658705 4742657 4890155 5275125 5313107 5584838 5960259 5957575 6299194 5594475 5595262 5751112
9768E751112J27797m17020j26615n4363j3138N04570j38193P5768J59748m71842
9758E397824L27866J26239q5159M1496L09408J39669K40789j18620M39457J43268
9748F962237K48708q4801L58402k3134K90721L4514k49629j70305L44226l84813
9738G326126m1855l97805N17956j54021l8702n0907J52037k61710M08774j07147
9728G352746k71256K01157P3912M99214q9384n0844K75904J95414M46653n0854
9718H582662Q3282j16459J21279O8080j46216j31939K18564j45201L6961O3757
9708H634770L51889m45242K71404K56825K78056M1246j40033j19258O9283J7814
9698I216754P7957p9400k37871L21614j03982M7570J76039j34068L86106r4248
$$ plain form
9768 5751112 5878909 5461889 5335274 5280911 5267773 5772343 5634150 5709918 5869666 5397824
9758 5397824 5725690 5851929 5766770 5808266 6117674 6257343 6498132 6379512 6818969 6962237
9748 6962237 7210945 7126144 7484546 7461412 7752133 7786647 7537018 7366713 7710939 7326126
9738 7326126 7284271 6886466 7404422 7250401 7211699 7160792 7312829 7051119 7459893 7352746
9728 7352746 7081490 7282647 7356559 7855773 7766389 7715545 7991449 8186863 8633516 8582662
9718 8582662 8665944 8549485 8670764 8738844 8592628 8460689 8679253 8534052 8571013 8634770
9708 8634770 8986659 8541417 8812821 9069646 9347702 9388948 9248915 9129657 9198940 9216754
9698 9216754 9294711 9215311 8977440 9299054 9195072 9242642 9418681 9284613 9670719 9576471
9688I576471N4046k31877J74391L13155J64923M85529Q1725M33059R3102l66405
9678A0778119Q0951K1738M31207k30113l3194N05176m88694k69779O22198j27476
9668A1290133M874N7087N13189J81608k21730P1739L81841R401O3744R0750K26242
9657A2668878K19263k07853k08933J18737L98564J95040N49362j78242j60596
9648A3394220L66456L71755K56780J7751J29859M19721p384o9486J13828O24383
9638A5617883l46873L22916N46113K90588J73259J25495k1030K82734k3593K64163
9628A7231655K46824j92132Q62089M12618p0004K84603P4305P49753K35134L13787
9618B0148632P83784l2739N20378N88367R07609J81266L15776J42111Q42859J67887
$$ plain form
9688 9576471 9630517 9398640 9573031 9886186 10051109 10536638 10618363 11051422 11144524 10778119
9678 10778119 10859070 10880808 11312015 11081902 11048708 11553884 11065190 10795411 11417609 11290133
9668 11290133 11295007 11352094 11865283 12046891 11825161 11896900 12278741 12288142 12351886 12442636 12668878
9657 12668878 12888141 12680288 12471355 12590092 12988656 13183696 13733058 13554816 13394220
9648 13394220 13760676 14132431 14389211 14406962 14536821 14956542 14949158 14879672 14993500 15617883
9638 15617883 15271010 15593926 16140039 16430627 16603886 16729381 16708351 16991085 16967492 17231655
9628 17231655 17478479 17286347 18148436 18561054 18491050 18775653 18849958 19599711 19834845 20148632
9618 20148632 20932416 20899677 21420055 22008422 22916031 23097297 23413073 23555184 24398043 24565930
9608B4565930j03890R96147L11827J86608P74907L03637Q1513J49317O27077L75056
9598B8268129O98951N17540M32405M0870J69322J11771O33728K49095M25155L55351
9588C1902317Q30223R06385O90063Q05747N61661J291681R36275J038642Q04563
9579C9767557M09950M05937O66977p5860M45313j53883K98416M30863K20783P19368
9569D3135421M05297K16569J451043N27806M58808N0645Q97781K42729O23112
9560D8009211M97870Q48800K10693J091978J091206J054499J083843R53988J253956
9551E6096044J068712P01878J115628N43535R30867J141948L61388O46301J038950
9542F3645251J013351J539538J177589J320858J243743J594202J219824J174710
$$ plain form
9608 24565930 24462040 25458187 25770014 25956622 26731529 27035166 27116679 27265996 27893073 28268129
9598 28268129 28967080 29484620 29917025 29957895 30127217 30238988 30872716 31121811 31546966 31902317
9588 31902317 32732540 33638925 34328988 35134735 35696396 36988077 37924352 38962994 39767557
9579 39767557 40177507 40583444 41250421 41174561 41619874 41465991 41764407 42195270 42416053 43135421
9569 43135421 43540718 43757287 45208330 45736136 46194944 46245589 47143370 47386099 48009211
9560 48009211 48507081 49355881 49566574 50658552 51749758 52804257 53888100 54842088 56096044
9551 56096044 57164756 57866634 58982262 59525797 60456664 61598612 61960000 62606301 63645251
9542 63645251 64658602 66198140 67375729 68696587 69940330 71534532 72754356 73929066
9534G3929066J776526J240138J406889J305189K269793J528301J730176K113372
9526H7299450J869700J984826K179120K654556K290637K364704K518797K354304
9518A05516094K630769K508068L363687K813404L137138L272083L473656L516075
9510A30230974L961834L926323M275151L990264L862620N019851M508139M879246
9502A64654402M942946N615559N707597N478517O414793O358476O902063O836333
9494B12910686P134958P551994P536331Q088699Q310886P873036R207357R155442
9486B77769389R554609Q967026R394721R832058R603430R662573R431851R451714
9478C53667371R588633Q630803Q668324Q462511P542759O766257O302438N621825
$$ plain form
9534 73929066 75705592 76945730 78352619 79657808 81927601 83455902 85186078 87299450
9526 87299450 89169150 91153976 93333096 95987652 98278289 100642993 103161790 105516094
9518 105516094 108146863 110654931 114018618 116832022 119969160 123241243 126714899 130230974
9510 130230974 134192808 138119131 142394282 146384546 150247166 155267017 159775156 164654402
9502 164654402 169597348 175212907 180920504 186399021 192813814 199172290 206074353 212910686
9494 212910686 220045644 227597638 235133969 243222668 251533554 259406590 268613947 277769389
9486 277769389 287323998 296291024 305685745 315517803 325121233 334783806 344215657 353667371
9478 353667371 363256004 371886807 380555131 389017642 396560401 403326658 409629096 415250921
9470D15250921M899866L508909J946791J688030j66536j070245k226529l304888
9462D20526319m100370n125670n261513o981549p396965p486938p761659q244375
9454C68167280q837690q650057q597543r051633q644386q466422q367771q629062
9446B98922716p691436p719051p134229p108707o923579o306000o110044n782955
9438B44146715o787767o043238n509710o467797o556163n956523o582623n656655
9430A94586239o034542n354401n819174n368698n012934m196653m499893m344732
9422A53955212l774419l066847l273662l264775l223222k726486k679696k643364
9414A29302741k354676j992076k368115j854289j763770k164769k250623j613284
$$ plain form
9470 415250921 420150787 423659696 425606487 427294517 427127981 426057736 423831207 420526319
9462 420526319 416425949 411300279 406038766 399057217 391660252 384173314 376411655 368167280
9454 368167280 359329590 350679533 342081990 333030357 324385971 315919549 307551778 298922716
9446 298922716 291231280 283512229 276378000 269269293 262345714 256039714 249929670 244146715
9438 244146715 237358948 231315710 225806000 219338203 212782040 206825517 200242894 194586239
9430 194586239 188551697 183197296 177378122 172009424 166996490 162799837 158299944 153955212
9422 153955212 150180793 147113946 143840284 140575509 137352287 134625801 131946105 129302741
9414 129302741 126948065 124955989 122587874 120733585 118969815 116805046 114554423 112941139
9406A12941139j898138k046004k236272k122594k757964j573177k096249k897048
9398I5313693j774793k310626j729557j916295j416060k417896j159381j498420
9390H1090665j687966j187962j988502j195633k045759j269174j203374j625640
9382F8886655r18909j450644j328657j300190j344641j207728p73417j017901
9374E9544568j066702j367799j428835N0813j505990r60600q98192m16819r77184
9365E0973260m75503q18637n81118p42004o34490p28502j97063l72459q25351
9356D5598133k93418p86527j021571j42194q53091o58934l63418j086523l10680
9347D0081777j067776r86514j64368q62286m91613m20948m63829r91271k3457
$$ plain form
9406 112941139 111043001 108996997 106760725 104638131 101880167 100306990 98210741 95313693
9398 95313693 93538900 91228274 89498717 87582422 86166362 83748466 82589085 81090665
9390 81090665 79402699 78214737 76226235 75030602 72984843 71715669 70512295 68886655
9382 68886655 67967746 66517102 65188445 63888255 62543614 61335886 60562469 59544568
9374 59544568 58477866 57110067 55681232 55732045 54226055 53265455 52367263 51950444 50973260
9365 50973260 50497757 49679120 49098002 48355998 47721508 46993006 46795943 46423484 45598133
9356 45598133 45304715 44518188 43496617 43354423 42501332 41842398 41478980 40392457 40081777
9347 40081777 39014001 38027487 37863119 37000833 36509220 36088272 35624443 34633172 34609715
9338C4609715n06901o34639o09028n78282l03536m56882m56191k38176n40245
9329C0285835j05829o49069j48870o60978o2336p14907m23764j86280m96747M2087
9319B6879142q80798j45244m3689l34143o73102j94337l25844m23819l166l9400
9309B3815600m55895k34039K14410j45907n10570K14844k82360m80330M17117
9300B2552870o0598o24647L16031p8122m1230m1278k9411J07149o33008M70219
9290B1937975N6430K05420k07916Q7747k11126R4542M03202m9699P28309o04860
9280B2440024M77548j18244J44004O45149K81828j16629L35956M58846K42365
9271B4790847P93788J09073R92005N93933J070555P18292P47835O28450K50315
$$ plain form
9338 34609715 34102814 33468175 32859147 32280865 31977329 31520447 31064256 30826080 30285835
9329 30285835 30180006 29530937 29382067 28721089 28658753 27943846 27520082 27333802 26837055 26879142
9319 26879142 25998344 25853100 25809411 25475268 24802166 24607829 24281985 23858166 23855000 23815600
9309 23815600 23359705 23125666 23340076 23194169 22683599 22898443 22616083 22135753 22552870
9300 22552870 22492272 21867625 22183656 22105534 22064304 22023026 21993615 22100764 21467756 21937975
9290 21937975 21994405 22199825 21991909 22079656 21868530 21963072 22366274 22316575 23044884 22440024
9280 22440024 22917572 22799328 22943332 23588481 23870309 23753680 24089636 24548482 24790847
9271 24790847 25584635 25693708 26685713 27279646 28350201 29068493 29816328 30444778 30695093
9262C0695093L54706K85778k36018n65710o2078m99817o04074r14837q24287n82217
9252B7046539q09238n67035k82336l04266l56601k02946J44119o7327M30374M59575
9242B5490858o6728L75791R74567M75455O05866J56852J66158K76285N6369o54006
9232B7857467q3389r08087j014574q82836j111076j346215r52590j049735j049763
9223A9459202p21582p98202o96386k05384o99252j80060m43217n46062j74903
9214A4994154k892J53344K4236L28998o0600L03898J36497R38542l77431Q45826
9204A7284572j16428k86649j44532k52021o41962q93352p0981q39476n37739k67113
9194A3234319q48925l46199m41215l26260o73108L5908j59159m24260L0824m17943
$$ plain form
9262 30695093 31049799 31335577 31099559 30533849 30471771 29971954 29367880 28453043 27628756 27046539
9252 27046539 26237301 25670266 25387930 25083664 24727063 24524117 24668236 24600909 25031283 25490858
9242 25490858 25424130 25799921 26774488 27249943 27855809 28012661 28178819 28455104 28511473 27857467
9232 27857467 27774078 26865991 25851417 24968581 23857505 22511290 21558700 20508965 19459202
9223 19459202 18737620 17939418 17243032 17037648 16338396 16158336 15715119 15169057 14994154
9214 14994154 14991262 15144606 15168842 15497840 15437240 15741138 15877635 16816177 16438746 17284572
9204 17284572 17168144 16881495 16736963 16484942 15842980 14949628 14878647 14039171 13501432 13234319
9194 13234319 12385394 12039195 11597980 11271720 10598612 10634520 10475361 10051101 10081925 9663982
9184I663982j42517l92325N4467N2603k62775k34131p6625J24782n82684O6804
9174H271581O3707k73239j69462M33264j23265o1024l95637k69979j29596N26510
9164G872860m02910l31551K60290k40915n4740n18583M70025j41119p61067N81697
9154F733987K56990k47674j37678k76058O80674n40793j83994j47897J56912J81948
9144F476417q1420n69915J66902K53885m28591j96828M90919K17407n09103K1821
9134E841494L88756j86990l20604K60109l51933j76593N44643k65048J27217k21926
9124E639125L88960m89739M58521l88034j61837K64508K0544m5833j21209r7717
9114E467289M24388l0543j03556o4873O3496L76701l11603J14483m26379M98506
$$ plain form
9184 9663982 9521465 9129140 9183607 9236210 8973435 8739304 8662679 8787461 8204777 8271581
9174 8271581 8335288 8062049 7892587 8325851 8202586 8141562 7745925 7475946 7346350 7872860
9164 7872860 7469950 7138399 7398689 7157774 7103034 6584451 7054476 6913357 6152290 6733987
9154 6733987 6990977 6743303 6605625 6329567 7010241 6469448 6285454 6137557 6294469 6476417
9144 6476417 6394997 5825082 5991984 6245869 5817278 5620450 6111369 6328776 5819673 5841494
9134 5841494 6230250 6043260 5722656 5982765 5630832 5454239 5998882 5733834 5861051 5639125
9124 5639125 6028085 5538346 5996867 5608833 5446996 5711504 5732048 5686215 5565006 5467289
9114 5467289 5891677 5861134 5757578 5692705 5756201 6132902 5821299 5935782 5509403 6007909
9104F007909j93214N24572j38841n93789K24055K50722j38234M26929K68836M50299
9094G089244l25190K41573L57119J78438L97717M83333J186729J256701J477688
9085A2343352J939492J555415J450498R21093N24915O90825N12251J603572J163460
9076B2704873J662642R03438O46921J57061J99981J097088K153310J211098J378936
9067C2115348N14418q13512p98801n05782n86953k54345k58535n16741j147394
9058B7747703j396130j630078j380806j331404p84527q41164j213334j043511
9050A8126749j296500j219387j173528j018776r61454l40021m49228n88381j90079
9041A0889395j99553k16433K0567L23550j118840J57972J03565L99955n74215
$$ plain form
9104 6007909 5814695 6339267 6200426 5606637 5830692 6081414 5943180 6370109 6638945 7089244
9094 7089244 6764054 7005627 7362746 7541184 7938901 8422234 9608963 10865664 12343352
9085 12343352 14282844 15838259 17288757 18209850 18734765 19425590 19937841 21541413 22704873
9076 22704873 24367515 25270953 25917874 26074935 26274916 27372004 29525314 30736412 32115348
9067 32115348 32629766 31816254 31017453 30511671 29924718 29670373 29411838 28895097 27747703
9058 27747703 26351573 24721495 23340689 22009285 21224758 20383594 19170260 18126749
9050 18126749 16830249 15610862 14437334 13418558 12457104 12117083 11667855 11079474 10889395
9041 10889395 10689842 10473409 10493976 10817526 9698686 9856658 9960223 10360178 9785963
9032I785963J06547l72866n8630J4481m22380J34616l13738l41732l38725L27077
9022H520613l34848j38643l1055j00732m32868L39776l05781J7632J16920l57159
9012G293855j0037K02577m53046K13983L2105m09224k4312l05626l63949J57481
9002F333807M5551N1383m67140O5468j77139j03472K34543n32781J58401J99770
8992E808391l57990L38982k8153j28973N971J64871m53585P26998r6573R2239
8982F072178k25852K19351M71482o8304N3829N29111K39611J72237L33685J12588
8972G909916K97954J41903j14844O42917K28380K4894M63367p8603M84907l17883
8962I682908Q3358M22684M46044M963l1751M35165j28798O64629L480N24475Q03485
$$ plain form
9032 9785963 9892510 9519644 9461014 9475495 9053115 9187731 8873993 8532261 8193536 8520613
9022 8520613 8185765 8047122 8016067 7915335 7482467 7822243 7516462 7534094 7651014 7293855
9012 7293855 7283818 7486395 7033349 7247332 7279437 6870213 6845901 6540275 6176326 6333807
9002 6333807 6379358 6430741 5963601 6029069 5851930 5748458 5983001 5450220 5608621 5808391
8992 5808391 5450401 5789383 5761230 5632257 5638228 5803099 5349514 6076512 5979939 6072178
8982 6072178 5846326 6065677 6537159 6468855 6522684 7051795 7291406 7463643 7797328 7909916
8972 7909916 8207870 8349773 8234929 8877846 9106226 9131120 9594487 9515884 10000791 9682908
8962 9682908 9766266 10188950 10634994 10639957 10608206 11043371 10914573 11579202 11582682 12107157 12910642
8951A2910642l37952M64811K49052j80460O03342N88519r63639J26927k06137
8942A3255105k92841o57548j12416q21861j23793p03193k65333Q9817p22527o5302
8932I580108k25395l02117n6390n8120Q938m8040o2410j87492k48248j722j87853
8921H211259k38782j51578j12879o83735k84777Q5632o46640j80027m6084m69231
8911E483158p8700m92244J63389m91206k56578K09765O3527n60551N4177j08355
8901C986382k74641K71002r60256L68023L40948l07553M0961K0568m5114o5071
8891C375249N3421l25102J68750k75679M02580n14721M62595l25007n8614L11832
8881C275304l80876k9995O6406j82052M74066J51138m39210J01099R9576l05886
$$ plain form
8951 12910642 12572690 13037501 13286553 13106093 13709435 14297954 13334315 13461242 13255105
8942 13255105 12962264 12304716 12192300 11370439 11246646 10543453 10278120 10367937 9645410 9580108
8932 9580108 9354713 9052596 8996206 8938086 8947024 8898984 8836574 8649082 8400834 8399112 8211259
8921 8211259 7972477 7820899 7708020 7024285 6739508 6825140 6178500 5998473 5952389 5483158
8911 5483158 5404458 4912214 5075603 4584397 4327819 4537584 4601111 4040560 4094737 3986382
8901 3986382 3711741 3982743 3022487 3390510 3731458 3423905 3464866 3485434 3440320 3375249
8891 3375249 3428670 3103568 3272318 2996639 3399219 2884498 3347093 3022086 2963472 3275304
8881 3275304 2894428 2864433 2930839 2748787 3222853 3373991 2934781 3035880 3135456 2829570
8871B829570J79917n0615J72967k50036l79934K64671K43496j48074R9238l12341
8861B648859M79566j96768k35896L19685K12677l12597K15956l7866L04365m63286
8851B934695M21580j24909k83634L49395K96225l10059K30583N0252J93276O5087
8841C822491j67959J2724L76873K15888k26110J78661j24576N80283j32142M76743
8831E012876r7885M20082n3092K92308K04975O5125J67492l51194M77444m6O9772
8820F207857l60588j18525M515j0606J40204j25121K54166Q9071K84361N44848
8810F910182M24083L32565M42390m53491M48986m3631K54863K44465J29257Q05781
8800I495450P3273L23597N56000J31584J66853N06118M20887j31480l04094j347
$$ plain form
8871 2829570 3009487 2958872 3131839 2881803 2501869 2766540 3010036 2861962 2961200 2648859
8861 2648859 3128425 2931657 2695761 3015446 3228123 2915526 3131482 3093616 3397981 2934695
8851 2934695 3356275 3231366 2947732 3297127 3593352 3283293 3513876 3564128 3757404 3822491
8841 3822491 3654532 3667256 4044129 4260017 4033907 4212568 4087992 4668275 4536133 5012876
8831 5012876 4914991 5335073 5281981 5574289 5779264 5844389 6011881 5660687 6138131 6138085 6207857
8820 6207857 5847269 5728744 5733259 5722653 5862857 5737736 5991902 6080973 6365334 6910182
8810 6910182 7334265 7666830 8109220 7655729 8104715 8061084 8315947 8560412 8689669 9495450
8800 9495450 9568723 9892320 10448320 10579904 10746757 11252875 11673762 11542282 11238188 11236841
8790A1236841k02464n31607l68190m02434M02388j292428K89906K92627O9314
8781I493953K64072M01385J39186M28438K877L56481k15N82050M32461j26006
8771A1974682l1162O97454p3865J86872O08122M887M09954J47464K01619o05736
8761A3520291k02396j92962o72229n15582m91224P36778n9479L33764J316316
8752A3773277M98124N19393m07358j39088n36012j110171l59594o20976j037274
8743A0580321M0824k88516j61373K48440J39238K48907k5503Q44032J626549J406013
8733A4658932P67054M30573J73130j458150j060632j404520j628150p53091q44679
8724H880467j178881p13556m38930L84725n05840m18350L4336k59233k10674j46483
$$ plain form
8790 11236841 11034377 10502770 10134580 9732146 10134534 8842106 9132012 9424639 9493953
8781 9493953 9758025 10159410 10298596 10727034 10729911 11086392 11086177 11668227 12100688 11974682
8771 11974682 11943520 12640974 12567109 12753981 13362103 13366990 13776944 13924408 14126027 13520291
8761 13520291 13317895 13124933 12452704 11937122 11445898 12182676 12123197 12456961 13773277
8752 13773277 14271401 14790794 14383436 14244348 13708336 12598165 12238571 11617595 10580321
8743 10580321 10621145 10332629 10171256 10419696 10558934 10807841 10782338 11626370 13252919 14658932
8733 14658932 15425986 15856559 16029689 14571539 13510907 12106387 10478237 9725146 8880467
8724 8880467 7701586 6988030 6549100 6933825 6427985 6009635 6043971 5784738 5574064 5427581
8714E427581k89420j08490j70109j62898o275M90298m05876J72447n90638L26255
8704D682875m58308K76821l95639n8581Q2715o7974j69707k54633l08220n1466
8694C277883J20028k05206o12291J79436Q6783k50485Q311L8249J14187J48460
8684B905355o05183J44200J12564l92225K14152j14192K9534k18897L9464k4151
8674B090621K40724n9681J88436j92515K58485n52010L26922J2725l09114N09160
8664B513753j49694l49308j44858J60868J01408k90402q3738N5412o4L29740p4484
8653B068633l07420K09285J34730l09462J43571j49552k38389M57659K26499j07129
8643B128425j63318J12560N6113p47873K47040K07697m4741K70252p5216J13902
$$ plain form
8714 5427581 5138161 5029671 4859562 4696664 4690389 5180687 4774811 4947258 4356620 4682875
8704 4682875 4224567 4501388 4105749 4047168 4129883 4061909 3892202 3637569 3329349 3277883
8694 3277883 3397911 3192705 2580414 2759850 2846633 2596148 2604459 2642708 2756895 2905355
8684 2905355 2300172 2444372 2556936 2164711 2378863 2264671 2294205 2075308 2114772 2090621
8674 2090621 2331345 2271664 2460100 2267585 2526070 1974060 2300982 2313707 2004593 2513753
8664 2513753 2364059 2014751 1869893 2030761 2132169 1841767 1758029 1813441 1813377 2143117 2068633
8653 2068633 1761213 1970498 2105228 1795766 1939337 1789785 1551396 2009055 2235554 2128425
8643 2128425 1965107 2077667 2133780 1385907 1632947 1840644 1795903 2066155 1990939 2104841
8633B104841j50099K5135J09927j29681o3201M76501k84420K28811l22299L26159
8623B321674j37974k423l52476m4121J16676L08068m77264R32790n36580k3268
8613B105102L6520N79846n22675N81715k25691K16413j6110K57208k72979L37910
8603C077259J10934L48149R45078J495423J364564R73473M02666r3707r21328
8594G702511r81798m64402r62147n63789r70764J03459p04936M23649j9804k12930
8584C349049l08802j50240P817J49766l08500o9926J64900k16796K83109m67023
8574B433354J42452J32963O3768K7140K59024o1298n705j6686n1718n2910K83652
8563C154036l25096N22884n48148M01606J12798j67650M09119k58305p7007N58614
$$ plain form
8633 2104841 1954742 1979877 2089804 1960123 1896922 2373423 2089003 2317814 1995515 2321674
8623 2321674 2183700 2181277 1828801 1784680 1901356 2209424 1732160 2664950 2128370 2105102
8613 2105102 2141622 2721468 2198793 2780508 2554817 2771230 2755120 3012328 2739349 3077259
8603 3077259 3188193 3536342 4481420 5976843 7341407 8314880 8717546 8623839 7702511
8594 7702511 6720713 6256311 5294164 4730375 3759611 3863070 3158134 3581783 3561979 3349049
8584 3349049 3040247 2890007 2897824 3047590 2739090 2669164 2834064 2617268 2900377 2433354
8574 2433354 2575806 2708769 2772537 2799677 3058701 2997403 2991698 2975012 2923294 2870384 3154036
8563 3154036 2828940 3351824 2803676 3205282 3318080 3150430 3559549 3301244 3224237 3782851
8553C782851q3908K8817j38345K34542M33450k58762J38830L6054K75227J37145
8543D585901N94799j12245L13856O6010K94989K98275J396596k503217K83150
8534E218114K90318K62029J04731L20954r4704M80059N61685m05905N08922K07681
8524G453884K26478O2129L17971J17396M55596N87104l6097L77346k493O67569
8514A0226883M08165L52868N44871M01446N30716L88911P05952M72812N98178
8505A4630802M43727N40159L43702J14491N49553L46660P83845O1701J069938
8496A8884578R23385M73333J291331M44684R36962J127112K60954L88883J4018
8487B4745240O39009K81653L36890N8374O90009O42059N21362M00473O43445l32591
$$ plain form
8553 3782851 3698943 3727760 3589415 3823957 4257407 3998645 4137475 4173529 4448756 4585901
8543 4585901 5180700 5068455 5382311 5448321 5743310 6041585 7438181 4934964 5218114
8534 5218114 5508432 5770461 5875192 6196146 6101442 6581501 7143186 6737281 7246203 7453884
8524 7453884 7680362 7742491 8060462 8177858 8633454 9220558 9184461 9561807 9559314 10226883
8514 10226883 10635048 10987916 11532787 11934233 12464949 12853860 13559812 14032624 14630802
8505 14630802 15074529 15614688 15958390 16072881 16622434 16969094 17752939 17814640 18884578
8496 18884578 19807963 20281296 21572627 22017311 22954273 24081385 24342339 24731222 24745240
8487 24745240 25384249 25665902 26002792 26061166 26751175 27393234 27914596 28315069 28958514 28625923
8477B8625923K71605n92802R8823m34196o82185l51186r68142M9488m09189R6189
8467B5704328o78577k67254m56699q57502p72114o69883j152541o47200j010565
8458A9191993p05774k21663q26189l17533o77628m07591n7427l07544o19593p62219
8448A4288832n04790o83327Q7038q97218l21999n27658n04766j69127l02560o35237
8438I829188p8941o14936j35501k52500j81243l14787j90946l33104k08582j41818
8428G376830j27642J5256n34793N38141m85373j15764O6845m72449m7582j43473
8418F069996M25217o26989l65015J37501J19311n02887J76113l05901j73677k64496
8408D689173K06378j77178k02463K35933k96862k47357p1332N02054O713l75937
$$ plain form
8477 28625923 28897528 28304726 28403549 27969353 27287168 26935982 25967840 26017328 25608139 25704328
8467 25704328 25025751 24758497 24301798 23444296 22672182 22002299 20849758 20202558 19191993
8458 19191993 18486219 18264556 17438367 17120834 16443206 16035615 15978188 15670644 15051051 14288832
8448 14288832 13784042 13100715 13187753 12290535 11968536 11440878 10936112 10766985 10464425 9829188
8438 9829188 9750247 9135311 8999810 8747310 8566067 8251280 8060334 7727230 7518648 7376830
8428 7376830 7249188 7264444 6729651 7267792 6782419 6666655 6733500 6261051 6213469 6069996
8418 6069996 6495213 5868224 5503209 5640710 5760021 5257134 5433247 5127346 4953669 4689173
8408 4689173 4895551 4718373 4515910 4751843 4454981 4207624 4136292 4638346 4645059 4269122
8398D269122L40301j93146k1595m09355K96029o9576M4681J09541p06378N52348
8388D211972k59355k21850p9143J49409m3193l47493M68244J60769J06799k04547
8378C941612N47008m08118J05341K6043m57237K13699J24872n6372N59395L39428
8368D935671n01133Q6842J42247K55540l95065J89102k15847L97269l39605j37364
8358D417657O86119J55983L9531M12796j10694P53243M03575Q00949J258698J243948
8348A0061805Q65205J085164R66776O679k60582j71384q49304k02455j354618
8339A0147286q30200m82369n04809l06253l69951k59219K30531n56493r1409P3749
8329G050863J45968l812J04705k34696R33879N40822L47407Q47161J567403J388030
$$ plain form
8398 4269122 4609423 4416277 4394682 3985327 4281356 4211780 4256461 4366002 3659624 4211972
8388 4211972 3952617 3730767 3651624 3801033 3757840 3410347 3878591 4039360 4146159 3941612
8378 3941612 4488620 4080502 4185843 4211886 3754649 3968348 4093220 4036848 4596243 4935671
8368 4935671 4434538 4521380 4663627 4919167 4524102 4713204 4497357 4894626 4555021 4417657
8358 4417657 5103776 5259759 5299290 5712086 5601392 6354635 6758210 7559159 8817857 10061805
8348 10061805 10927010 12012174 12978950 12985629 12725047 12553663 11704359 11501904 10147286
8339 10147286 9317086 8834717 8329908 8023655 7653704 7394485 7625016 7068523 6977114 7050863
8329 7050863 7196831 7193019 7297724 7063028 7996907 8537729 8885136 9732297 11299700 12687730
8319A2687730J312075K96351P32983p0375k77470p18316j13547r10984k23265
8310A2715182q4157K44910J97235L21360N66894K44912k20383K26079K17536n14605
8300A3914963J27005P60709O3803K41045Q90318L06813J625220J284967R44205
8291B0159048J566720O40156J6355K81587m74739l82307j003965k18146r42446
8282A9642263n2797j48369n48044o03582J66676l24670n15514m98398p9945P7174
8272A7114794o33566J61048J43800M71989J01580Q85926P16280J163635O57791
8263B0783277K61794J37095j055674o21457j096040r30413j290894j764546m95900
8254A3927242j632532n20543j222971n52932m36673j014897k92314k19411j10113
$$ plain form
8319 12687730 13999805 14296156 15029139 14958764 14681294 13962978 13849431 12938447 12715182
8310 12715182 12631025 12875935 13073170 13394530 13961424 14206336 13985953 14212032 14429568 13914963
8300 13914963 14041968 14802677 14866480 15107525 15997843 16304656 17929876 19214843 20159048
8291 20159048 21725768 22365924 22382279 22663866 22189127 21806820 20802855 20584709 19642263
8282 19642263 19589466 19441097 18893053 18289471 18456147 18131477 17615963 17117565 17037620 17114794
8272 17114794 16481228 16642276 16786076 17258065 17359645 18245571 18961851 20125486 20783277
8263 20783277 21045071 21182166 20126492 19505035 18408995 17478582 16187688 14423142 13927242
8254 13927242 12294710 11774167 10551196 9998264 9561591 8546694 8254380 8034969 7924856
8245G924856l86289p90440p3434o09151J18152N2279m09787l95244P0m4344j24924
8234E261744L741o22409K9580J42638m17952J49583J803J47349k01212j15965
8224D378900m80080J12179J61571J33173l67143J41006R0619K28966m54514K45579
8214D190256l62984l00622j52470O3299k33285K82635j51659m18992J90255q2355
8204C024078j95193N19704L54055J7098o73896K61383O6100j21407o80067M61748
8194C033603J97043m46989L914069l554592N64683l02616j42946L18770P5238
8185C656263l40005q8072k22562K36544j72763n42589K79174n8514K90320l80754
8175B657042L34846m05131J46722N79024m55086K47083m12910o5401K30132q3607
$$ plain form
8245 7924856 7538567 6748127 6674693 6065542 6183694 6235973 5826186 5430942 5431012 5386668 5261744
8234 5261744 5265485 4643076 4672656 4815294 4397342 4546925 4548728 4696077 4494865 4378900
8224 4378900 3898820 4010999 4172570 4305743 3938600 4079606 4170225 4399191 3944677 4190256
8214 4190256 3827272 3526650 3374180 3437479 3204194 3486829 3335170 2916178 3106433 3024078
8204 3024078 2828885 3348589 3702644 3719742 3045846 3307229 3373329 3251922 2571855 3033603
8194 3033603 3230646 2783657 6697726 3143134 3707817 3405201 3262255 3581025 3656263
8185 3656263 3316258 3228186 3005624 3242168 3069405 2526816 2805990 2747476 3037796 2657042
8175 2657042 2991888 2586757 2733479 3312503 2857417 3104500 2691590 2626189 2856321 2772714
8165B772714Q6395K32586j95730n6589j73846j46507j7397J52137j6273L91795
8155C029285o08655K10940M24023l09132L3816q3049l21165K13573L11925l16660
8145B584901J07454l24978L70567j96856l82478L10048l5218l44642N73761p67256
8135A895303L78606k7733J46647q76l64554J28151J77229R4412n4168j72650L89600
8124B589967j30948J69869L97501l38576L03805L39377n04896K58125o1947p7823
8114B944454J42829q2401j93622l51054N61613k24010j57866k36746K95960l89261
8104B309896O3112J90522p3167o6280M34631k58567L52999p1395L63224J23761
8094C368736N21238N9900K0165M36890k04088k91028l43656q1421j00396j61304
$$ plain form
8165 2772714 2859109 3091695 2895965 2839376 2665530 2519023 2501626 2653763 2637490 3029285
8155 3029285 2420630 2631570 3055593 2746461 2780277 2697228 2376063 2589636 2901561 2584901
8145 2584901 2692355 2367377 2737944 2541088 2158610 2468658 2433440 2088798 2662559 1895303
8135 1895303 2273909 2246176 2392823 2391947 2027393 2155544 2332773 2427185 2373017 2200367 2589967
8124 2589967 2459019 2628888 3026389 2687813 2991618 3330995 2826099 3084224 3022277 2944454
8114 2944454 3087283 3004882 2811260 2460206 3021819 2797809 2639943 2403197 2699157 2309896
8104 2309896 2373008 2563530 2490363 2424083 2858714 2600147 2953146 2881751 3244975 3368736
8094 3368736 3889974 3949874 3970039 4406929 4202841 3911813 3568157 3486736 3386340 3225036
8084C225036q6395k68854K54687J82333k77438O0216r284L37831K4286L0549O7293
8073C540260L87812J25290L97122L71169P89541J075184J105040O51366L64404
8064H807188O3645m53124n83764j019707m54345m29480j46489p23195m49072N40932
8054E152589k66539l3426n79580O61232J03207M38859J51445J369519J009233
8045H006539P51306O07520Q2901p86314k52144k49807q17267n48484m9p74923
8035F019278O907j68715j91780K27289n47060L96249j2392j21174J3433K54260
8025E876295K57407p3948k87246O27961J66805O82759m57277R1814P67067K33318
8015G884955L48635P15304k7948M97080J302103N36274J379800J682397R45811
$$ plain form
8084 3225036 3138641 2869787 3124474 3306807 3029369 3089585 3080301 3418132 3442418 3472967 3540260
8073 3540260 3928072 4053362 4450484 4821653 5611194 6686378 7791418 8442784 8807188
8064 8807188 8870833 8417709 7833945 6814238 6359893 5930413 5783924 5060729 4611657 5152589
8054 5152589 4886050 4852624 4273044 4934276 5037483 5476342 5627787 6997306 8006539
8045 8006539 8757845 9365365 9448266 8661952 8409808 8160001 7342734 6794250 6794201 6019278
8035 6019278 6026185 5857470 5665690 5892979 5345919 5742168 5729776 5608602 5622035 5876295
8025 5876295 6133702 6059754 5772508 6400469 6567274 7250033 6792756 6884570 7651637 7884955
8015 7884955 8233590 8948894 8920946 9418026 10720129 11256403 12636203 14318600 15264411
8006A5264411J497663J024500Q16673J141909J871906R79224J698429N83189p12150
7997B4165754j788135k128971k582652k612867j755510j839583j021042q80736
7989I556258j375988l59860n01038k34027j21937K66569j05187L79386O27872
7980H132048R85142O36409k74982k86527l74166j409363k08102l68449j247455
7971E584555j64760q03194n76900K3576J09373n36114M52054l72420l92119K74345
7961C598396M7091J50163J35945M86495n48016N01363K96976N84111r0899N43191
7951E704816L12236k33488o34261k28135m73290j85244m21899l70078o26721K59370
7941C103306K15237n27684l31172L1181K1746L39256m88026l37087K53264K74115
$$ plain form
8006 15264411 16762074 17786574 18603247 19745156 21617062 22596286 24294715 24877904 24165754
7997 24165754 22377619 20248648 17665996 15053129 13297619 11458036 10436994 9556258
7989 9556258 8180270 7820410 7319372 7085345 6963408 7229977 7124790 7504176 8132048
7980 8132048 9117190 9753599 9478617 9192090 8817924 7408561 7200459 6832010 5584555
7971 5584555 5419795 4616601 4039701 4063277 4172650 3636536 4088590 3716170 3324051 3598396
7961 3598396 3645487 3795650 3931595 4418090 3870074 4371437 4668413 5252524 5161625 5704816
7951 5704816 6017052 5783564 5149303 4921168 4447878 4262634 3840735 3470657 2843936 3103306
7941 3103306 3318543 2790859 2459687 2490868 2512614 2851870 2363844 2026757 2280021 2554136
7931B554136j26813J29569k81621q3986J49390Q9187n2021L3358j44254j6673
7921B250272l31158j77893m4072K96712m70303j83687p3904J29927M04697k52132
7911A548459j72756J72366j04173l56456O41520o38966l1997K5475N51055l56766
7901A277761J46999l12050k4704Q1766P1401J87331r5970j76941k18065K9356
7891I66884K39304k30723k08517O3664M04351l7085j65826M7481k60778L01005
7881A119760l97579N3022K41158m7284Q3145k85310L23032p28263M85410M85497
7871A332588n13646j96445K64541j0782j59359Q3799o1298L74274j34353j00652
7861H78667l49530K19063O1053J41059k86360j39456j2918L46891j33290k19018
$$ plain form
7931 2554136 2427323 2556892 2275271 2191285 2340675 2429862 2377841 2411199 2266945 2250272
7921 2250272 1919114 1741221 1697149 1993861 1523558 1339871 1265967 1395894 1800591 1548459
7911 1548459 1375703 1548069 1443896 1087440 1728960 1089994 1057997 1083472 1634527 1277761
7901 1277761 1424760 1112710 1088006 1169772 1241173 1428504 1332534 1155593 937528 966884
7891 966884 1206188 975465 766948 830612 1234963 1197878 1032052 1079533 818755 1119760
7881 1119760 722181 775203 1016361 969077 1052222 766912 1089944 361681 847091 1332588
7871 1332588 818942 622497 887038 876256 716897 800696 739398 1113672 979319 878667
7861 878667 529137 748200 809253 950312 663952 524496 511578 858469 725179 506161
7851E06161K02046P2543q94419P00002Q85587j94034k00984m73206P0348M72795
7841A146839n54134P3371L7648j43871J33639O9958j93356K71157j41277n163
7831F94811L69105m34138J01452j95131J31325j68075N29210K5732l52960k02210
7821D99121L06448l39417N72064o32669L67997k14782J57330o3091R7032J17734
7811H67767L00940n47788R8867k05804M73505p59817N03350l0289L0607l98685
7801C32653M35223k91401K36771J49688j33334k66737K30424J39542m83588L89409
7791G38650J17857n32820j6093L41403J35080K24347l29452o4053J26454J27486
7781H68859k94463n2520J75210K83489p9138k64635j65316o3212L77816Q2427
$$ plain form
7851 506161 708207 780750 -113669 586333 1471920 1277886 1076902 603696 674044 1146839
7841 1146839 592705 666076 703724 559853 693492 763450 570094 841251 699974 694811
7831 694811 1063916 629778 731230 536099 667424 499349 1028559 1054291 701331 499121
7821 499121 805569 466152 1038216 405547 773544 558762 716092 653001 750033 867767
7811 867767 1168707 620919 719786 513982 987487 227670 731020 700731 731338 332653
7801 332653 767876 476475 713246 862934 729600 462863 693287 832829 349241 738650
7791 738650 856507 323687 307594 648997 784077 1008424 678972 614919 741373 868859
7781 868859 574396 521876 697086 980575 901437 636802 471486 408274 786090 868517
7771H68517o72332O61831n66665M95007Q2684q0047m96933L31377N14238n57470
7761E80207O70326o89092L41792O0279k26470l486P0067k09861j13478K78528
7751G58812r3455J18067J76122N8130m31473N52149k17380j00884j16402J58106
7741H61792J76036o6089J58438r038K8997J40353j56675J21495j41435J40820
7731A254694o3204j60636J30440m3894j07786q5603K43934k78630N67869k41079
7721A216105o1122L57903l0311m16503K88555j75502Q9352j8181N32065l83104
7711A399257O50021j13821J90261L4267N7045k98387k39591p857k32179O9513
7701A508529J42902m01586J81485o7968L7015k77797j2810j95835L81958j97962
$$ plain form
7771 868517 196185 858016 291351 786358 869042 788995 292062 623439 1137677 580207
7761 580207 1250533 561441 903233 963512 737042 733556 803623 593762 480284 758812
7751 758812 665357 783424 959546 1017676 586203 1138352 920972 820088 703686 861792
7741 861792 1037828 971739 1130177 1121139 1150136 1290489 1133814 1255309 1113874 1254694
7731 1254694 1191490 1030854 1161294 1117400 1009614 924011 1167945 889315 1457184 1216105
7721 1216105 1154983 1512886 1482575 1066072 1354627 1179125 1268477 1250296 1782361 1399257
7711 1399257 2049278 1935457 2125718 2159985 2217030 1918643 1679052 1671195 1439016 1508529
7701 1508529 1651431 1249845 1431330 1363362 1400377 1122580 1109770 913935 1295893 1097931
7691A097931K68839l74563K62268L14785N8775q9841J33322m28769k5975L55610
7681A572382O4531j66797q6027P5698J32777l95854J33775l77239J81967o7318
7671A067895k0982j01214M6075J15719k87780J35133k4328R5787l28465K42451
7661I40291O8894k64484j87402L13643r1637r9109J06675J80070m88738K28977
7651G07180k95790K88083J68889k71564n375J861p1540m7518J51943M3317n15719
7640A53767M0441q494J73814K01461q6172M16446l35995P5392K5802k0702j43606
7629D92154l74863O43506n25924K06488k54331M88207o7780l42217L71896l92162
7619B44974J78791j96386J30129j01297k14167Q7145L01204k95489K35450P1813
$$ plain form
7691 1097931 1366770 992207 1254475 1569260 1628035 1538194 1671516 1242747 1216772 1572382
7681 1572382 1636913 1470116 1384089 1459787 1592564 1196710 1330485 953246 1135213 1067895
7671 1067895 1046913 945699 991774 1107493 819713 954846 930518 1026305 697840 940291
7661 940291 1009185 744701 557299 870942 779305 680196 786871 966941 478203 707180
7651 707180 411390 699473 868362 596798 591423 593284 521744 474226 626169 669486 153767
7640 153767 194208 185714 359528 560989 474817 891263 555268 630660 656462 635760 492154
7629 492154 117291 760797 234873 441361 187030 675237 607457 265240 637136 244974
7619 244974 423765 227379 357508 256211 42044 129189 430393 134904 370354 442167
7609D42167q4385K91952L0024k3071q8499j96745L6312m63445O08387j37364j94683
7598B20650R38327j000474L21932R4714k87853n480j46631L0741K65276J13954
7588E45156m36162J98827J47121J5206n40896M35293K39867j09969j60424K0720
7578C54739j03095q0973r6377M19220r6554k22163K30374q7604O5474l48469R5872
7567A30444J8802j62600j8763J28729M63988j06319m37147R5140j02273Q5247
7557I5248L6359J89301j05718O5757j02101K32402m32038J80930K06146k12986
7547A53300K07215k79730j26809K69421p7536L11852N2093K4982j97453j65576
7537A71759J91504r2025j5236J40273j98532n8493N89363k88200k55266R5873
$$ plain form
7609 442167 357782 649734 679758 656687 568188 371443 407755 -55690 552697 415333 220650
7598 220650 1158977 158503 480435 575149 287296 281816 135185 165926 431202 545156
7588 545156 108994 307821 454942 470148 -70748 364545 604412 494443 334019 354739
7578 354739 251644 170671 74294 493514 396960 174797 405171 317567 383041 34572 130444
7567 130444 149246 -13354 -32117 96612 560600 454281 17134 112274 10001 95248
7557 95248 131607 320908 215190 280947 178846 411248 -20790 160140 366286 153300
7547 153300 360515 80785 -46024 223397 145861 457713 509806 534788 337335 171759
7537 171759 363263 271238 256002 396275 197743 139250 728613 440413 185147 281020
7527B81020j99676L28860k27045P1813k52906K19706k63693M58141J35786k97748
7517B54258k7763N0339O7433k42650L80197j76732J63710j81364m3492O8754n7245
7506B55445k519j29763K41857l16580k48N76257r07180N53350L91234p38670M30432
7495C53615m28788M82371l15475j67487K42874K55891j72900p7700K5948j18095
7485H0254Q5481J36173j03880R1662j70534m7246K61175O0198k5112k46250J6150
7474A38071k24033L14951J95090k72628J56092k41290J67010J28468Q5103j5223
7464D31611M8357k24810l54895O42938K111l22447J38998n7388l98282K45472
7454A51665K23426j20414O0906J56092n29552K7720J43323L6512L08560m02627
$$ plain form
7527 281020 81344 410204 183159 254972 2066 221772 -41921 416220 552006 254258
7517 254258 226495 276834 344267 101617 481814 305082 468792 287428 243936 312690 255445
7506 255445 252926 123163 365020 48440 48192 624449 -282731 270619 661853 -76817 353615
7495 353615 -75173 407198 91723 -75764 167110 423001 250101 172401 198349 80254
7485 80254 165735 301908 198028 289690 119156 71910 333085 393283 368171 121921 138071
7474 138071 -85962 228989 424079 151451 307543 66253 233263 361731 446834 431611
7464 431611 479968 255158 -99737 543201 545312 222865 361863 304475 -93807 151665
7454 151665 375091 254677 315583 471675 -57877 -30157 113166 149678 458238 55611
7444E5611O95295p08054L96254n63028O1687K87630L64800m53998M91091O5819
7434F93107p22562o2883P36907n76972K80117j38428l4646l38639M85584M1082
7424C62667k67613J04863n1385N00166m46736p1834j7996K21807M3523k20081
7414A57381l3613L4073P5732k68809J14760L07664l12356r4453M6449j57854N832
7403a25194M11069L01942n25863L3534J67995J97319K04981o58098L22481k4266
7393C05900l25845J07007o4841k46311P22673m27844L66819j65933J46566j00103
7383C18088j04009k5032k89677K33896L0043K64694J48508k78242K2471j04797
7373B15943m0659j451m32187N44706j14400N3813k79749j40615O78321j70274
$$ plain form
7444 55611 750906 42852 439106 -123922 -62235 225395 590195 136197 627288 693107
7434 693107 -29455 -92338 644569 67597 347714 209286 174640 -163999 321585 362667
7424 362667 95054 199917 148532 648698 201962 130128 112132 333939 377462 157381
7414 157381 123768 157841 233573 -35236 79524 387188 74832 -19621 26828 -131026 -125194
7403 -125194 285875 587817 61954 95488 263483 460802 665783 7685 330166 305900
7393 305900 -19945 87062 22221 -224090 498583 70739 437558 271625 418191 318088
7383 318088 214079 189047 -100630 133266 163309 428003 576511 298269 320740 215943
7373 215943 175284 173833 -258354 286352 171952 225765 -53984 -194599 483722 313448
7363C13448l2719j47629J98237k6698O5312O2156m16578j90539N42650m17408
7353d9768L50612k6359J06127Q6598m44713M58710m15955O549R3151P268J4161
7342A86381j13108J15295N0713m27229L82359l73539J69470L60058n3343k70083
7332B6974J72168K28599m69754N52398j73767q2319O3625l5002k96197K05385
7322A92110J02938j07023j23551J49120j2985K08185K7186o16745K95609J18266
7312B33110J47531l68946L66776J3944j24192n7394N2063j31436J84291J59581
7302D75328p957k79357l45575M34226l29499J01024K34259l65982L48366J87345
7292D52178L13958r20194M2360Q2696L21206M6771m26161L62116K98007p20268
$$ plain form
7363 313448 280729 133100 331337 304639 369951 432107 15529 -175010 367640 -49768
7353 -49768 300844 274485 380612 467210 22497 481207 65252 71801 164952 172220 186381
7342 186381 73273 188568 239281 -187948 194411 -179128 -9658 350400 297057 26974
7332 26974 199142 427741 -42013 510385 336618 254299 317924 282922 -13275 192110
7322 192110 295048 188025 64474 213594 200609 408794 435980 -180765 114844 233110
7312 233110 380641 11695 378471 392415 268223 210829 262892 131456 315747 475328
7302 475328 467371 188014 -157561 276665 -52834 48190 282449 -83533 264833 452178
7292 452178 766136 -154058 -111698 -29002 292204 338975 -87186 274930 572937 -147331
7282a47331J17877L93964k49383J77254o5245j84373K37474n9009l3806K88160
7272D75582m04682Q4740K9406k79950J09172N80077r8194j92650M7860l50750
7262F11p8641L50371l74077M00067j52279Q3352m5229J88926k93680k06626K12173
7251H4968q756K86916K93813l27930J41342L12623R4092k39805K45961n88868
7241B94356j5154J09085R6994j12350j50731j04422k4180J75456j36104O7916
7231B00866J36184k03699R9365J98767K8333k87531J42533P8554k62584K18465
7221C49253k74842J22799K04891k13831l36570N43829o6094p2588N30177l40487
7211D46537k67073L01800J48092l5988l48147Q901J87695j74741l12952L09062
$$ plain form
7282 -147331 -29454 364510 115127 292381 227136 42763 280237 221228 187422 475582
7272 475582 70900 155640 185046 -94904 14268 594345 496151 303501 351361 611
7262 611 -78030 272341 -101736 298331 146052 229404 184175 373101 79421 -127205 84968
7251 84968 76212 363128 656941 329011 470353 782976 877068 637263 883224 294356
7241 294356 279202 388287 485281 372931 222200 117778 93598 269054 132950 200866
7231 200866 337050 133351 232716 431483 459816 172285 314818 393372 130788 349253
7221 349253 74411 197210 402101 188270 -148300 395529 329435 256847 787024 446537
7211 446537 179464 481264 629356 593368 245221 254122 441817 267076 -45876 263186
7201B63186J07726J98275j61100l0426k53232M1939Q9835l1295Q6170j57368j4510
7190A39200m0622j96889J75328J48084L73355l30156L25946r78480Q93506k77847
7180B31425K08223k52689K85634k68148j23725Q4996J32894o3727l37354P37034
7170F34563l04842J06342j30792j99752N54221k76870l46360L88030j95570j90061
7160C8909j7778L38704K75948j00794j7134j58559j5690k19634J70506O67373
7150I61851o62072K03892l26741P7665J27572K65105q0941j70863K5863M4121
7140D65452J84480l89559j22966J80000K67163k37369K87391J01331j5527j94481
7130E25915n1650j36745N12844m630k49499J36425J17238l54128n17282R58254
$$ plain form
7201 263186 370912 569187 408087 377661 124429 166368 256203 224908 311078 153710 139200
7190 139200 98578 -98311 77017 225101 598456 268300 594246 -384234 509272 231425
7180 231425 439648 186959 472593 204445 80720 165716 298610 234883 -102471 634563
7170 634563 329721 436063 305271 105519 659740 382870 36510 424540 228970 38909
7160 38909 21131 359835 635783 534989 517855 359296 343606 123972 294478 961851
7150 961851 299779 503671 176930 254595 382167 647272 566331 395468 421331 465452
7140 465452 649932 260373 137407 317407 584570 347201 634592 735923 720396 525915
7130 525915 474265 337520 850364 845734 596235 732660 849898 495770 -21512 936742
7120I36742l98487k5588k14161N17987N958j25116n08028R10131l80059r5323
7110F24056J69561k51038q0036K19909j29181K71902K06393n67572J41256K26083
7100H31333j71585q9871K9080O4610k4938P2071r2193K63650J90694r1905p1875
7089I09071j68214O09286j09031l75960K54136J0206k74032M58541K1636j32647
7079A202992K12662l61553K03527K25967l43804L18436n92581L36954K51091k7633
7069A426058J91271j59167J76429J53667M9280k53878p1714R490K65618O4831
7059A851885j23789R3104j578m12641O28428j60746o54L1619L97150R092r776
7048B302094o17094O28778J6759o5688J47304L7128L42386M6317j65155P3495
$$ plain form
7120 936742 538255 512667 298506 816493 822451 697335 189307 1099438 719379 624056
7110 624056 793617 542579 462543 682452 553271 825173 1031566 463994 605250 831333
7100 831333 659748 569877 598957 663567 638629 710700 618507 882157 1072851 980946 909071
7089 909071 740857 1350143 1241112 865152 1119288 1129494 855462 1314003 1335639 1202992
7079 1202992 1415654 1054101 1257628 1483595 1139791 1458227 865646 1202600 1453691 1426058
7069 1426058 1617329 1458162 1634591 1788258 1837538 1583660 1511946 1521436 1787054 1851885
7059 1851885 1728096 1821200 1819622 1406981 2035409 1874663 1874009 1905628 2302778 2311870 2302094
7048 2302094 1685000 2313778 2330537 2264849 2412153 2449281 2791667 2837984 2672829 2746324
7038B746324K28787q8756N33122n35559N98882k81152O33568O68322k81894P26953
7028D948597J048527J155156P11901J86528R11970Q62854P20961P49757J194587
7019A2490838J874303K924515M746031J1334114K0198105K3445648J8785905R063227
7011A04862686Q34848p845726j1561507j4781326j3029624j1378492r754329p426872
7003B9919658o060052l088797j963589j360563r97439j801410j315526j357839
6995A1974443j404389p78266j130877l26612q63574n07706m14775j92791k33408
6986F122045j58933p63655n36821R4522M067o6843p30594M42798m27697o9535
6976C909354k54713J71536l42624J03154r1306j6557j60673L5461n8594k13088
$$ plain form
7038 2746324 2975111 2886355 3419477 2883918 3482800 3201648 3835216 4503538 4221644 4948597
7028 4948597 5997124 7152280 7864181 8050709 8962679 9825533 10546494 11296251 12490838
7019 12490838 14365141 17289656 22035687 33369801 53567906 77013554 95799459 104862686
7011 104862686 105697534 97851808 86290301 71508975 58479351 47100859 37346530 29919658
7003 29919658 23859606 20770809 18807220 17446657 16449218 14647808 13332282 11974443
6995 11974443 10570054 9791788 8660911 8334299 7470725 6963019 6548244 6355453 6122045
6986 6122045 5963112 5199457 4662636 4757158 4761225 4694382 3963788 4406586 3978889 3909354
6976 3909354 3654641 3826177 3483553 3586707 3495401 3478844 3318171 3353632 3295038 3081950
6966C081950p2607p2163k38296k19460j2432R1528k53770j5792J13238m50847
6956A951349J85680N32990o92533p2677J84698m38668Q8068J54238j86507m3543
6946A663095m46531L53880L2226L16010q38877M98027j19333P1254m94158K16033
6936A251626j00730Q5730J01525J02958j70922l67322Q6216K00064J4448K81726
6926A485319m11170O8057l47459J37381Q9528l70085K79749J08248O5546l2829
6916A072285K23404m92536k18794J52394N2314J08639R121k22594J94158j37051
6906G41340k52564J86930L18488o3732j1879Q7265o2401n87136N33466P3700l67417
6895E96060j0070K72679m21437K61404J10496j59270J63877m66959J64764N3663
$$ plain form
6966 3081950 3009343 2937180 2698884 2479424 2466992 2558520 2304750 2288958 2402196 1951349
6956 1951349 2137029 2670019 1977486 1904809 2089507 1650839 1738907 1893145 1706638 1663095
6946 1663095 1216564 1570444 1602670 1918680 1079803 1577830 1458497 1529751 1035593 1251626
6936 1251626 1150896 1236626 1338151 1441109 1270187 902865 989081 1189145 1203593 1485319
6926 1485319 1074149 1142206 794747 932128 1021656 651571 931320 1039568 1105114 1072285
6916 1072285 1295689 803153 584359 736753 789067 897706 906827 684233 878391 741340
6906 741340 488776 675706 994194 930462 918583 1005848 943447 356311 889777 963477 596060
6895 596060 585990 858669 437232 698636 809132 649862 813739 346780 511544 565207
6885E65207J14477k1806q2513J5184P2345n15464L5071J19844L11003k64162K2223
6874C71409J66608j5874q9920r2915R7040L25214l40883L72021j49730j71857
6864D71113L1651J33739o91172K54354L69511k65800J06069n5035r4034K4453
6854B84849K5371L74043n84279K06478k3821M5417k23544N08107l68529R3881
6844C37973j31506m2652L0225P4331Q3533j06923K24268P4033n67625L12453j34686
6833A53424O74772k94290j53903l92582N45263l04153K59232k75599L11110j40592
6823C82682j58437m37085O40920n8630k05093m16547O18616j60274l17301Q69302
6813G58153l16815k01122J16321l55270K71212J04288K1289k97871K53366Q0972
$$ plain form
6885 565207 679684 657878 575365 590549 662894 147430 182501 302345 613348 349186 371409
6874 371409 538017 522143 432223 339308 436348 761562 420679 792700 642970 471113
6864 471113 502764 636503 -54669 199685 569196 303396 409465 354430 260396 284849
6854 284849 310220 684263 99984 306462 282641 328058 104514 612621 244092 337973
6844 337973 206467 163815 194040 268371 351904 244981 469249 543282 -24343 288110 153424
6833 153424 828196 533906 380003 -12579 532684 228531 487763 212164 523274 382682
6823 382682 224245 -212840 428080 369450 164357 -252190 366426 206152 -111149 758153
6813 758153 441338 240216 356537 1267 272479 376767 398056 100185 353551 434523
6803D34523j98136K30610m04707K92149k30666K22006j74712k47440L68949l97392
6793a04816L00259j07294K15826K7364l23693L58817m81677J31149j57377n1470
6783a92912M81478p7667j45286L87049R6715J17604q982p4788J57424k27538J32033
6772F45130j36389j15629j8964o7702K92295J04402l31912Q3443l76529L7831
6762A15976n4834L2271R7115k16310K78726L1936j18129l348r4955J67527j38169
6751I7806K1890K50547j1502J55707o24789K56652J50476J27949j97448L8968
6741B66256p291k74585M63001j66326P5563l13605J9821J88364J87405l40841
6731I7762k73014M06336J43966m2969K5698l84432J71287K02464j63982K08914
$$ plain form
6803 434523 236387 466997 62290 354439 123773 345779 171067 -76373 292576 -104816
6793 -104816 195443 88149 303975 331339 7646 366463 -115214 15935 -141442 -192912
6783 -192912 288566 210899 65613 452662 549377 666981 657999 583211 740635 513097 645130
6772 645130 508741 393112 374148 306446 598741 703143 371231 454674 78145 115976
6762 115976 61142 93413 190528 -25782 252944 284880 166751 163403 68448 235975 97806
6751 97806 119696 370243 358741 514448 -110341 146311 296787 424736 227288 266256
6741 266256 258965 -15620 447381 281055 356618 43013 62834 251198 438603 97762
6731 97762 -175252 231084 375050 332081 357779 -26653 144634 347098 183116 392030
6721C92030n96319L55742l40481N91675l87406J77745m1399l826O9667K64921
6711D82349p88197L40931K47626J51404q7209N2136l80127R6306J15004n07444
6701b77221M85523j64535N05619j45233l80726K04544l80737j56625Q69638m1877
6691E18370m90621N05127j41948j20953k13619K33046k87769J41041k03120J42108
6681H1662J35385J09110k69342N2227J84068n5933l87063L15015j42994K43060
6671B65195m2385N9958l84210r739l8135J47789m897j8855M08905o52307N71970
6660C03289m21374J39178m11978N15478j78682J8058N859k30660P39716l61409
6650A17475L37323k62440r7770o8629L62323r5328J59006k11232l51231R2264
$$ plain form
6721 392030 -204289 151453 -189028 402647 15241 192986 151587 147761 217428 482349
6711 482349 -305848 35083 282709 434113 346904 399040 18913 115219 230223 -277221
6701 -277221 208302 43767 549386 404153 23427 227971 -152766 -309391 560247 518370
6691 518370 27749 532876 390928 269975 56356 289402 1633 142674 -60446 81662
6681 81662 217047 326157 56815 109042 293110 237177 -149886 165129 22135 265195
6671 265195 222810 282768 -101442 -111181 -149316 -1527 -6424 -25279 383626 -268681 303289
6660 303289 -118085 21093 -390885 124593 -54089 -36031 -30172 -260832 478884 117475
6650 117475 454798 192358 94588 25959 388282 292954 451960 240728 -110503 -18239
6640a8239j0286L3132M59414o05495M92021j05771j8045n34O8987m21255J81713
6629E5642m22463J88971K16272j06210K15148R3676j95745J26929j08384Q1203
6619A45039k39793N17725m23182J90383l91605K64046k14994J08109q3074R9384
6609b7962J99583l6339J7227j94170J78640J45596j50906k60922O43274l15166
6599A98855k07993L38807k76890J42907k75947K78843l09899J76353o219j53177
6589i4360K58864k3550j03644J29258M04220l90350o8736l5520J46395p65k13318
6578H494L19511l26962l3819N91962k39593Q4460j24409k94906K25565J20998
6568C31301j41733m15071N15836l51052K35924m47532K45937J44497J26772j46581
$$ plain form
6640 -18239 -28525 4607 464021 -141474 350547 244776 226731 226197 295184 -126071 55642
6629 55642 -366821 -177850 38422 -67788 147360 241036 45291 172220 63836 145039
6619 145039 -94754 422971 -211 190172 -201433 62613 -152381 -44272 -127346 -27962
6609 -27962 171621 135282 152509 -41661 136979 282575 131669 -129253 514021 198855
6599 198855 -9138 329669 52779 195686 -80261 198582 -111317 65036 58817 -94360
6589 -94360 164504 140954 37310 166568 570788 180438 111702 76182 222577 221812 8494
6578 8494 328005 1043 -32776 559186 319593 404053 279644 -15262 210303 331301
6568 331301 189568 -225503 290333 -60719 175205 -272327 -26390 118107 244879 98298
6558I8298K07175L01795n41846J64951j53511K76439k39897K81172m99690J90078
6548H4964k10325L63532k04166P3612N4320R3637l4785k3434o57659L21506L28739
6537A89941p5788j81098L63517K363k050N1660j91898M5537l71065L86076p1432
$$ plain form
6558 98298 305473 607268 65422 230373 76862 353301 113404 394576 -105114 84964
6548 84964 -125361 238171 34005 107617 161937 255574 220789 197355 -460304 -138798 189941
6537 189941 114153 -66945 296572 298935 296885 348545 156647 202184 -168881 217195 145763
$$ [...]
##END NTUPLES=NMR SPECTRUM
##END=
