##TITLE=abcd
##JCAMPDX= 6.0         $$ Bruker NMR JCAMP-DX V2.0
##DATA TYPE= NMR SPECTRUM
##DATA CLASS= NTUPLES
##ORIGIN= UXNMR, Bruker Analytische Messtechnik GmbH
##OWNER= root
$$ XWIN-NMR		Version 3.5
$$ Tue Jul 14 16:29:26 2026 Russian Standard Time (UT+4h)  servis@DPX200
##.OBSERVE FREQUENCY= 200.131235884673
##.OBSERVE NUCLEUS= ^1H
##.ACQUISITION MODE= SIMULTANEOUS
##.ACQUISITION SCHEME= undefined
##.AVERAGES= 32
##.DIGITISER RES= 18
##SPECTROMETER/DATA SYSTEM= spect
##.PULSE SEQUENCE= zg
##.SOLVENT NAME= CDCl3
##.SHIFT REFERENCE= (INTERNAL, CDCl3, 0, 16.4885)
##AUDIT TRAIL= $$ (NUMBER, WHEN, WHO, WHERE, WHAT)
$$ ##TITLE= Audit trail, XWIN-NMR		Version 3.5
$$ ##JCAMPDX= 5.01
$$ ##ORIGIN= Bruker BioSpin GmbH
$$ ##OWNER= servis
$$ F:\spectra/data/av/nmr/H1/1/pdata/1/auditp.txt
$$ ##AUDIT TRAIL=  $$ (NUMBER, WHEN, WHO, WHERE, WHAT)
(   1,<2026-07-14 16:23:22.59 +0400>,<servis>,<DPX200>,
      <created by zg, POWCHK disabled, PULCHK disabled
       configuration hash MD5:
       00 E9 B6 7A A2 85 ED C7 34 08 36 98 17 FE 4E 26
       data hash MD5: 32K
       E3 57 25 62 98 50 66 7A B3 70 35 31 1E 47 3D D7>)
(   2,<2026-07-14 16:28:53.35 +0400>,<servis>,<DPX200>,
      <Start of raw data processing
       efp BC_mod = 2 LB = 0.05 FT_mod = 6 PKNL = 1 PHC0 = -415.39 PHC1 = 3.101563 SI = 16K 
       data hash MD5: 16K
       DC C2 95 9E CE F8 F2 CF C9 CB 49 9F B6 62 B3 53>)
$$ ##END=
$$ 
$$ hash MD5
$$ EB 18 79 F3 D7 52 50 A0 2F 4F 8D 77 9A 59 CD 4C
##$RELAX= 
##$RELAX= 
##$RELAX= 
##$RELAX= 
##$RELAX= 
##$RELAX= 
##$RELAX= 
##$RELAX= 
$$ Bruker specific parameters
$$ --------------------------
##$DU= <F:\spectra>
##$EXPNO= 1
##$NAME= <H1>
##$PROCNO= 1
##$TYPE= <nmr>
##$USER= <av>
##$AMP= (0..31)
100 100 100 100 100 100 100 100 100 100 100 100 100 100 100 100 100 100 
100 100 100 100 100 100 100 100 100 100 100 100 100 100 
##$AQSEQ= 0
##$AQ_mod= 1
##$AUNM= <au_zg>
##$AUTOPOS= <>
##$BF1= 200.13
##$BF2= 200.13
##$BF3= 200.13
##$BF4= 200.13
##$BF5= 500.13
##$BF6= 500.13
##$BF7= 500.13
##$BF8= 500.13
##$BYTORDA= 1
##$CFDGTYP= 0
##$CFRGTYP= 5
##$CHEMSTR= <none>
##$CNST= (0..31)
1 1 145 1 1 1 1 1 1 1 1 1 1 1 1 1 1 1 1 1 1 1 1 1 1 1 1 1 1 1 1 1 
##$CPDPRG= <>
##$CPDPRG1= <>
##$CPDPRG2= <>
##$CPDPRG3= <>
##$CPDPRG4= <mlev>
##$CPDPRG5= <mlev>
##$CPDPRG6= <mlev>
##$CPDPRG7= <mlev>
##$CPDPRG8= <mlev>
##$CPDPRGB= <>
##$CPDPRGT= <>
##$D= (0..31)
0 2 0 0 0 0 0 0 0 0.06 0 0 0 0 0 0 0.0002 0 0 0 0 0 0 0 0 0 0 0 0 0 0 
0 
##$DATE= 1784031802
##$DBL= (0..7)
120 120 120 120 120 120 120 120 
##$DBP= (0..7)
150 150 150 150 150 150 150 150 
##$DBP07= 0
##$DBPNAM0= <>
##$DBPNAM1= <>
##$DBPNAM2= <>
##$DBPNAM3= <>
##$DBPNAM4= <>
##$DBPNAM5= <>
##$DBPNAM6= <>
##$DBPNAM7= <>
##$DBPOAL= (0..7)
0.5 0.5 0.5 0.5 0.5 0.5 0.5 0.5 
##$DBPOFFS= (0..7)
0 0 0 0 0 0 0 0 
##$DE= 6
##$DECBNUC= <off>
##$DECIM= 32
##$DECNUC= <off>
##$DECSTAT= 4
##$DIGMOD= 1
##$DIGTYP= 9
##$DL= (0..7)
0 120 120 120 120 120 120 120 
##$DP= (0..7)
150 150 150 150 150 150 150 150 
##$DP07= 0
##$DPNAME0= <>
$$ [...]
##$SUBNAM4= <"">
##$SUBNAM5= <"">
##$SUBNAM6= <"">
##$SUBNAM7= <"">
##$SUBNAM8= <"">
##$SUBNAM9= <"">
##$SW= 20.6817932712277
##$SWIBOX= (0..15)
0 0 3 0 0 0 0 0 0 0 0 0 0 0 0 0 
##$SW_h= 4139.07284768212
##$TD= 32768
##$TD0= 1
##$TE= 0
##$TE2= 300
##$TE3= 300
##$TEG= 300
##$TL= (0..7)
0 120 120 120 120 120 120 120 
##$TP= (0..7)
150 150 150 150 150 150 150 150 
##$TP07= 0
##$TPNAME0= <>
##$TPNAME1= <>
##$TPNAME2= <>
##$TPNAME3= <>
##$TPNAME4= <>
##$TPNAME5= <>
##$TPNAME6= <>
##$TPNAME7= <>
##$TPOAL= (0..7)
0.5 0.5 0.5 0.5 0.5 0.5 0.5 0.5 
##$TPOFFS= (0..7)
0 0 0 0 0 0 0 0 
##$TUNHIN= 0
##$TUNHOUT= 0
##$TUNXOUT= 0
##$USERA1= <user>
##$USERA2= <user>
##$USERA3= <user>
##$USERA4= <user>
##$USERA5= <user>
##$V9= 5
##$VALIST= <valist>
##$VCLIST= <CCCCCCCCCCCCCCC>
##$VD= 0
##$VDLIST= <DDDDDDDDDDDDDDD>
##$VPLIST= <PPPPPPPPPPPPPPP>
##$VTLIST= <TTTTTTTTTTTTTTT>
##$WBST= 1024
##$WBSW= 30
##$XGAIN= (0..3)
0 0 0 0 
##$XL= 0
##$YL= 0
##$YMAX_a= 249350
##$YMIN_a= -465517
##$ZGOPTNS= <>
##$ZL1= 120
##$ZL2= 120
##$ZL3= 120
##$ZL4= 120
##$ABSF1= 0
##$ABSF2= 0
##$ABSG= 0
##$ABSL= 0
##$ALPHA= 0
##$AQORDER= 0
##$ASSFAC= 0
##$ASSFACI= 0
##$ASSFACX= 0
##$ASSWID= 0
##$AUNMP= <proc_1d>
##$AZFE= 0.1
##$AZFW= 0.1
##$BCFW= 0
##$BC_mod= 2
##$BYTORDP= 0
##$COROFFS= 0
##$CY= 18.4799938201904
##$DATMOD= 1
##$DC= 0
##$DFILT= <>
##$DTYPP= 0
##$F1P= 9.9274215381318
##$F2P= -0.165520771350173
##$FCOR= 1
##$FTSIZE= 16384
##$FT_mod= 6
##$GAMMA= 0
##$GB= 0
##$INTBC= 1
##$INTSCL= 4.127829e-11
##$ISEN= 128
##$LB= 0.05
##$LEV0= 0
##$LPBIN= 0
##$MAXI= 10000
##$MC2= 0
##$MEAN= 0
##$ME_mod= 0
##$MI= 50
##$NCOEF= 0
##$NC_proc= -7
##$NLEV= 6
##$NOISF1= 3.799351
##$NOISF2= 2.8
##$NSP= 0
##$NTH_PI= 0
##$NZP= 0
##$OFFSET= 16.48848
##$PC= 4
##$PHC0= -415.39
##$PHC1= 3.101563
##$PH_mod= 1
##$PKNL= yes
##$PPARMOD= 0
##$PSCAL= 4
##$PSIGN= 0
##$REVERSE= no
##$SF= 200.130005582386
##$SI= 16384
##$SIGF1= 3
##$SIGF2= 2
##$SINO= 400
##$SIOLD= 16384
##$SREGLST= <1H.CDCl3>
##$SSB= 0
##$STSI= 16384
##$STSR= 0
##$SW_p= 4139.07284768211
##$SYMM= 0
##$S_DEV= 0
##$TDeff= 32768
##$TDoff= 0
##$TI= <>
##$TILT= no
##$TM1= 0
##$TM2= 0
##$TOPLEV= 0
##$USERP1= <user>
##$USERP2= <user>
##$USERP3= <user>
##$USERP4= <user>
##$USERP5= <user>
##$WDW= 1
##$XDIM= 16384
##$YMAX_p= 404869386
##$YMIN_p= -1574113
$$ End of Bruker specific parameters
$$ ---------------------------------
##NTUPLES= NMR SPECTRUM
##VAR_NAME=  FREQUENCY,     SPECTRUM/REAL,   SPECTRUM/IMAG
##SYMBOL=    X,             R,               I
##VAR_TYPE=  INDEPENDENT,   DEPENDENT,       DEPENDENT
##VAR_FORM=  AFFN,          ASDF,            ASDF
##VAR_DIM=   16384,         16384,           16384
##UNITS=     HZ,            ARBITRARY UNITS, ARBITRARY UNITS
##FACTOR=    0.252644378177508, 1,           1
##FIRST=     3299.83951724647, 0,            0
##LAST=      -839.233330435636, 0,           0
##MIN=       -839.233330435636, -1574113,    0
##MAX=       3299.83951724647, 404869386,    0
$$ Real data points
##PAGE= N=1
##DATA TABLE= (X++(R..R)), XYDATA
$$ [...]
12089b70693R57550j121189J065345n85630l14146N8515O03924O05L75414k85104
12079D84591j15667q2460J78729p0816k233j20977P3240R1480k56803K50533n54412
12068a24795L65343k30283o5138L11577L1062k77007N44192k79638l71088l15080
12058d10855Q68241o04412L56343L3070k64887K15310J44923o4287K55023q79716
12048c51247J312828p21367R74o3942L20388J53073q03566P24914o05879j51603
12038a85427K61036L03076J05498l63942L10821j98791k32738O00169m96046p737
12028I5919k16385O32572l32692l06775J75639L10435j36085l12320P46306j29892
12018E26722k36824K19530M5106l79174J20339L63303p05823K690M36103o4481
$$ plain form
12089 -270693 686857 -434332 631013 45383 -268763 -210248 393676 394281 769695 484591
12079 484591 368924 286464 465193 394377 392144 271167 344407 435887 179084 429617 -124795
12068 -124795 240548 10265 -54873 256704 287766 10759 554951 275313 -95775 -410855
12058 -410855 457386 -147026 209317 242387 -22500 192810 337733 273446 528469 -351247
12048 -351247 961581 240214 241188 177246 497634 650707 -152859 572055 -33824 -185427
12038 -185427 75609 378685 484183 120241 431062 232271 -467 599702 103656 95919
12028 95919 -120466 512106 179414 -127361 48278 358713 222628 -89692 656614 526722
12018 526722 289898 509428 554534 175360 295699 659002 -46821 -44131 391972 327491
12008C27491L96225r25277N17268L08110l11002q7251K95881R4757o0148n7911
11998D98143l79511J58343J56643L43916r47216N58502m53867Q42782n52195j88130
11988C7410J23187j53046J32303k8054m63527R67447p72275K49838J40645m28583
11978a94655J20618l1971P78499q96963R05687p68018Q94373j394634J217955
11969F30891q93224Q24450k35614n23392M87464J3802l08440O37788l92915j5527
11959B25283N57826k14168K61313m71973O57764l66093o83335O40364m60400J92927
11949C39508k47819L02120k55558j62059P53301l39045o20633M63078M681L34842
11939E72416p91559M53188M81570j103561R95803m84056o5979M06591k67278k35238
$$ plain form
12008 327491 723716 -201561 315707 623817 312815 225564 521445 616202 556054 498143
11998 498143 118632 276975 433618 777534 -169682 388820 -65047 777735 225540 37410
11988 37410 160597 7551 139854 111800 -351727 615720 -156555 93283 233928 -194655
11978 -194655 -74037 -106008 672491 -224472 681215 -86803 807570 -587064 630891
11969 630891 -262333 562117 326503 -196889 290575 304377 -4063 633725 240810 225283
11959 225283 783109 568941 830254 358281 1016045 649952 -33383 606981 146581 339508
11949 339508 91689 393809 138251 -23808 729493 390448 -230185 232893 237574 572416
11939 572416 -219143 234045 715615 -387946 607857 123801 57822 464413 197135 -38103
11929c8103N23575m68171N74191q34707J24884R13342q59863J52151N72212j55900
11919E03611l64848m70990Q89778k31289m03689Q72210k87860J77500q23420Q44568
11909G05571k60686p29927K33635K86946k38498M04709J22306l71891M91660m59355
11899A84470K87968P2600K16521o68435M17410M69182n62712k55475k91480N3013
11889g6938M6563K51607K85640j21796o46261K61821J46166J98851q0853m69859
11879b05059L85561K35131m54175M31026q41538P90942l60764p02194R61825j25629
11869A15126Q33246j523254O39495k93799R9721m07431O89416L93527l42384j49915
11859E3748Q59696p00369J032446n02329k16288J3748k52355N89355n87618Q1301
$$ plain form
11929 -38103 485472 17301 591492 -243215 -118331 795011 -64852 87299 659511 503611
11919 503611 138763 -332227 557551 326262 -77427 794783 506923 684423 -138997 705571
11909 705571 444885 -285042 -51407 235539 -2959 401750 524056 152165 643825 184470
11899 184470 472438 545038 761559 93124 510534 979716 417004 161529 -129951 -76938
11889 -76938 -30375 221232 506872 385076 -261185 636 146802 345653 264800 -205059
11879 -205059 180502 415633 -38542 392484 -449054 341888 -18876 -721070 240755 115126
11869 115126 948372 -574882 64613 -229186 -129465 -536896 152520 546047 203663 53748
11859 53748 913444 213075 1245521 743192 526904 540652 288297 877652 290034 371335
11849C71335m84285K65081o19666P39452k11281J83858l7751J59833o60720m4852
11839c38996J111524O722n07578R1546Q5414j79378l97553J0099L635N5888k73738
11828c32415K73650k17697J28893L84442l70789M44006j65414L81736j99715K36677
11818E63374j93964l18074R5361o91851K32554R7965J77362k36737l6147j35074
11808d45231O07001K40973q3379n04677Q75033m90413N64664m42601j69227L68617
11798E20760j169152Q24910j843m04272O12502j51985P3408J16514k84686P9354
11788B15510o80233J48099N2173P12786K34202k94314N6171Q4964l18840j66426
11778D4092N06678l58564J38700m35779j33423K71771l68715M06487n63786M94889
$$ plain form
11849 371335 -112950 152131 -467535 271917 60636 244494 206743 366576 -294144 -338996
11839 -338996 772528 779250 271672 363218 448632 269254 -128299 -118200 -114565 -58677 -332415
11828 -332415 -58765 -276462 -147569 236873 -133916 310090 144676 526412 326697 563374
11818 563374 369410 51336 146697 -545154 -312600 -214635 -37273 -274010 -310157 -445231
11808 -445231 161770 402743 319364 -185313 689720 199307 763971 321370 152143 520760
11798 520760 -648392 176518 174675 -229597 382905 230920 304328 420842 136156 215510
11788 215510 -464723 -316624 -264451 448335 682537 388223 444394 529358 210518 44092
11778 44092 550770 192206 330906 -104873 -238296 33475 -335240 71247 -492539 2350
11768B350J1891J35565J61831k13958k45504O05863j44990P2695j63844N47324
11758G69223o23947O058O51705j576093J609359o31988o10220J224590l23504
11749D95183j70835k47073k34505P70959m61485m60862K10180M11713M59303o25112
11739A47466L76190l51076Q1756o60096N28736J52068M2862n24503N58377m58521
11729a06741m52313N61642l15555P67594n08268J175N07022m1093K81596k119
11719F92940p68366M68591m62675J8301J95109j7361M63741n91220j84039N7780
11709a27199j9375K50639M12058l92728N49628l61019N95081p68626L01155R9704
11699E39318q32537N25830P6733q8195r2024k10859K06408l99200J72507N40290
$$ plain form
11768 2350 14241 149806 311637 97679 -147825 458038 313048 385743 221899 769223
11758 769223 145276 151334 803039 -773054 836305 204317 -405903 818687 495183
11749 495183 324348 77275 -157230 613729 152244 -308618 -98438 313275 772578 147466
11739 147466 523656 172580 254336 -405760 122976 275044 317906 -206597 351780 -106741
11729 -106741 -559054 2588 -312967 454627 -53641 -52466 454556 413463 695059 692940
11719 692940 -75426 393165 -69510 -51209 143900 126539 590280 -940 -184979 -127199
11709 -127199 -146574 104065 516123 123395 673023 312004 907085 138459 439614 539318
11699 539318 -293219 232611 309344 221149 129125 -81734 124674 -274526 -102019 438271
11689D38271k16493N43978J43880o2034p29641R9867L59568M7666o2736m1411
11679E20915l04855m71973L35609m40493N57438j88851j6013R73096j080459P77734
11669F62148n03788l81536P86132p57139N16391l28945n8052j01141l17003J053671
11659E70738p94412J21454O04609m79984K15267J49666L310l69188J622K17884
11649B40966J38781J30612n50129O39319j43342o59493j44868O15767k74672N07987
11639E00928J67117l42617L32659p8306p4157n80693j1146N37656l65375P2408
11629A58474L32610k27082k62060j8378L20328j73576j89351J19546O79682j044068
11619c03875M10224J59968o62489M24313K92519P33877j382830R33030N0197l86919
$$ plain form
11689 438271 221778 765756 909636 847602 117961 217828 577396 625062 562326 520915
11679 520915 216060 -255913 79696 -360797 196641 7790 -8223 964873 -115586 662148
11669 662148 158360 -223176 562956 -194183 322208 -6737 -64789 -165930 -482933 570738
11659 570738 -223674 -102220 502389 22405 237672 387338 390648 21460 23082 240966
11649 240966 379747 510359 -39770 599549 456207 -203286 -348154 267613 -7059 500928
11639 500928 668045 325428 658087 579781 505624 -75069 -86215 451441 86066 158474
11629 158474 491084 264002 1942 -16436 303892 130316 -59035 60511 740193 -303875
11619 -303875 106349 266317 -396172 28141 320660 1054537 -328293 604737 654934 268015
11609B68015k34979J86432M31243n15261K96549j19182l22564n3827J93355l22581
11599a92800K13797j30917M81615J00664p59292N37318j32206k78847J24698J011615
11589I75645o78867p6710p2488m23371O12100J83400j59443J4029r5450k56277
11579B2568K17214j85721J08625N9555L80750m90007r9127o4658K25714o4241
11569A10672k859J6725K72850l60104K38973l47119M14652J17076n74188K64413
11559A51091K36331m49040K69165O50028r60174O79872m16683l85720Q37302n81579
11549C0593N13269o77534J73301j72120Q3357N90352K64803j49386k5592m64177
11539A66866M82397o62489l9028N14080n10061O50594m13697l0719o4952L86294
$$ plain form
11609 268015 33036 219468 650711 135450 431999 312817 -9747 -63574 129781 -192800
11599 -192800 20997 -109920 371695 472359 -286933 250385 118179 -160668 -35970 975645
11589 975645 296778 220068 147580 -275791 336309 519709 360266 374295 278845 22568
11579 22568 239782 54061 162686 222241 602991 112984 13857 -50801 174913 110672
11569 110672 107813 124538 397388 37284 276257 -70862 343790 460866 -113322 151091
11559 151091 387422 -61618 207547 857575 -102599 577273 160590 -225130 612172 30593
11549 30593 543862 -133672 39629 -132491 -49134 541218 806021 656635 631043 166866
11539 166866 649263 -13226 -52254 461826 -48235 602359 188662 157943 92991 479285
11529D79285k73733j92278J4494Q52432q79232J26964J00192r80138Q63617m04505
11519b92902N33305l89419J98134M13360k68492O7198q9188j94654M86069n65929
11509a02518O99257J58153r84468M30378k16331O45975n22381m5374K7445J47519
11499B37655j26790M27332l32840J30524K14037m44436o3376M66019j4618l2676
11489D60831m37220J66701j612L51638r29881O83276K39418l55583j86282j55658
11479a64372J99512N7284J73522K47200l4482k09410k17341p6485M81285m13359
11469D3354j93564N08460m13779k61267K27922L81939l70105M21352n65044M59586
11459B38854L23649P0016m64901J29603K51308k56700l66835J64603k19042R9287
$$ plain form
11529 479285 205552 13274 27768 880200 968 127932 228124 -752014 111603 -292902
11519 -292902 240403 -149016 49118 462478 193986 261184 171996 -22658 463411 -102518
11509 -102518 596739 754892 -229576 200802 -15529 630446 108065 62691 90136 237655
11499 237655 110865 538197 205357 335881 549918 105482 42106 508125 493507 460831
11489 460831 23611 190312 188700 540338 -389543 293733 533151 177568 -8714 -164372
11479 -164372 35140 92424 265946 513146 478664 269254 51913 -24572 456713 43354
11469 43354 -150210 358250 -55529 -316796 -88874 293065 -77040 344312 -220732 238854
11459 238854 562503 632519 167618 297221 548529 291829 -75006 89597 -129445 -30158
11449c0158m70647P10794q1247r2847M95537l17040N87668K79354k79114J44545
11439I46845m32634n12314N37612o68103Q3435Q4350l57288N24138m05274J15199
11429h4034J00588j0867k35716L25175M39749L22147J27089k81940p79396K18028
11419A40823J42465k62742L73937p38466P35393K00660l35586K31795l94703j47832
11409e4256N94988k85221N2748J076824j311379L39886k61685j13012L22777p70254
11399d08584P99399k05768l16496Q4269L06211N2945j45236N22345n54397R4954
11389B29642R48886r22986N66651o26505K71489j37646o6101N76228p31448k74148
11379a65938L26486J97373l77214J98649r4600k65843M85644k06047M70584j56312
$$ plain form
11449 -30158 -500805 209989 128742 35895 531432 214392 802060 1081414 802300 946845
11439 946845 514211 1897 539509 -128594 -45159 39191 -318097 206041 -199233 -84034
11429 -84034 16554 5687 -230029 95146 534895 857042 984131 702191 -77205 140823
11419 140823 283288 20546 394483 -343983 391410 592070 256484 488279 93576 -54256
11409 -54256 540732 255511 308259 1385083 73704 413590 151905 38893 361670 -408584
11399 -408584 390815 185047 -131449 -47180 259031 311976 166740 689085 134688 229642
11389 229642 1178528 255542 822193 195688 467177 329531 263430 839658 108210 -165938
11379 -165938 160548 357921 -19293 179356 84756 -181087 304557 98510 569094 412782
11369D12782j41651N55869k12982l92149p7116L57853q53613R08822m01610L85035
11359E41240m37123J33996L32091m81080j94947P04458J09262q01265K49150k83117
11349a27335K96231J3669q0527n0842n30003N84707O95803q70359J08402N16011
11339E55757j28706j31555J15669K96002j75788j53890m97996Q6686q672j06967
11329a49460J78767K66096k59573Q91631r33600j17286K17121J29885M11732k50509
11319C84804K23700L78005j034098K07465k07680k0276K82073L66938L91273r09570
11309F2634P64942j46706k78402j08295q949N12748p42754L36248m36850L32530
11299B87146n34921o9050J8790K62608k62833P96032m22602Q38813o93499N15889
$$ plain form
11369 412782 271131 827000 614018 221869 144753 502606 -351007 557815 156205 541240
11359 541240 104117 238113 570204 89124 -105823 598635 707897 -93368 155782 -127335
11349 -127335 168896 182565 102038 51196 -478807 105900 801703 -68656 39746 555757
11339 555757 427051 295496 411165 707167 531379 377489 -120507 -33821 -42493 -149460
11329 -149460 29307 295403 35830 927461 -6139 -123425 93696 223581 635313 384804
11319 384804 608504 986509 -47589 159876 -47804 -68080 213993 580931 972204 62634
11309 62634 827576 680870 402468 294173 285224 797972 55218 391466 -45384 287146
11299 287146 -247775 -316825 -298035 -35427 -298260 497772 75170 913983 220484 736373
11289G36373m22302l46687L59920M86861m17577j06143N8137l11583M22641o50125
11279a90485J84039P41332m5821j53888n046j97040P2839j39537K56194L3131
11269E55718o05042N24988L2028j35484m58668M86246k39858K42109K11920n059
11259F08898m31027M15118J12365q18375k9012K19406K36537m68584M72870m53899
11249a35703N21140j077993L26776N36775j80405L85695l29981J5717N00485L02667
11239H65173p33877k46606O95919q8679R9786m36962M36428K63852q50882L70861
11229C75013J12425n44824L13632j50960K42578o20448L39173K35047k52943P22491
11219G71184m81089P90758p79608K97654k49871j5366J47434l44262m5200L31953
$$ plain form
11289 736373 314071 -32616 327304 814165 396588 290445 348582 36999 459640 -190485
11279 -190485 -6446 734886 689065 535177 530131 333091 405930 266393 522587 555718
11269 555718 -49324 475664 507692 372208 -86460 399786 159928 402037 613957 608898
11259 608898 177871 592989 705354 -113021 -142033 77373 313910 -154674 318196 -135703
11249 -135703 385437 -692556 -365780 170995 -9410 376285 46304 62021 562506 865173
11239 865173 131296 -115310 580609 491930 591716 154754 591182 855034 4152 375013
11229 375013 487438 -57386 256246 105286 347864 -272584 66589 301636 48693 771184
11219 771184 290095 1080853 301245 598899 349028 333662 481096 136834 91634 423587
11209D23587j20876l41241l6659J82664J86153Q305k76338J91107j96369M46308
11199D66641r9456O1281l57283K3208L81876m77249J94229M76225k24552j15870
11189C29050j63125M33304n85941P62223p84300K06146p5892K44055l70981K84397
11179B78936M666L23113j97016N4827K04055M5251p70814J58311K11420K79429
11169E92178k80837m8823P29214j001605P90281m71692l27027M57272L49949j64060
11159F24850m16502m0713L37988o0760m83660j49148L19858j67320N31731l19794
11149A76530k21245R6176q546K10508J9782M27762l65955K76054k96263P03584
11139A018387o57713n0955L17677n54803K17107l80555L03867q7190k80950j99896
$$ plain form
11209 423587 302711 -38530 -75189 107475 293628 301933 25595 216702 20333 466641
11199 466641 367185 428466 71183 94391 476267 -982 193247 669472 444920 329050
11189 329050 165925 599229 13288 775511 -8789 197357 121465 365520 -5461 278936
11179 278936 283602 606715 409699 464526 668581 713832 -56982 101329 312749 592178
11169 592178 311341 262518 991732 -9873 780408 308716 -18311 438961 788910 624850
11159 624850 208348 167635 505623 444863 -38797 -187945 131913 -35407 496324 176530
11149 176530 -44715 51461 42915 253423 273205 700967 335012 611066 314803 1018387
11139 1018387 360674 309719 627396 72593 289700 -90855 213012 125822 -155128 -355024
11129c55024O16470j74766J91867M0355k69771J07137j19971L6851K68339O49846
11119I91333j122025O08983m13288O49731p15289M33367J39478n11190K83123
11110C44223L70554n62084M30720k70223n40094N69567o92372M02397m60697J196391
11100G88382o954L69962p51401R45594o80962n81438M06885M7507L50592p54056
11090A34111M1883J55496j68851k84730P30698j15468n87597Q87850j11547m07945
11080B73900O43025p30865j9614R3581J07309K54169j46047J58370K0514m9133
11070F05209n45004L07513k0446J50628J54803j33874n1261K53240J31586q27676
11060B4718M65798Q6960n35638Q7421l81877J16790M16908m22223j89374M52623
$$ plain form
11129 -355024 261446 86680 278547 318902 49131 156268 36297 73148 341487 991333
11119 991333 -130692 478291 65003 714734 -555 432812 572290 61100 344223
11110 344223 714777 152693 583413 313190 -226904 342663 -349709 52688 -408009 788382
11100 788382 781428 1151390 399989 1345583 664621 83183 490068 537575 888167 134111
11090 134111 175994 331490 162639 -122091 608607 493139 -94458 793392 681845 273900
11080 273900 916925 186060 166446 260027 367336 621505 475458 633828 654342 605209
11070 605209 60205 367718 347272 497900 652703 518829 467568 720808 852394 24718
11060 24718 490516 577476 41838 129259 -252618 -135828 281080 -141143 -330517 122106
11050A22106J29816P8017K08000j32798O78914q99894J44939M36953q10844N73997
11040E29206J26423j36392O43870j011949M33610o1630l48703q0845K79984k16570
11030A57004k87165N37220m01190J114701j031225R7089M34609j95849K15785
11021F40979L2736o12417O60480j77387q53813M44502J98J01330J4933L16965
11011E68506m10649J54697n67433R34292l94792J15464J83450K66624l92929Q9235
11001E46465j87585O178o35452P43149m12003M09444N6379l1340j13100k72906
10991A09229q3192L37149J20535r5907o3104N3825m48717M10907L0625r9842j79552
10980I1956J48799o67877J056715J46627m54164k89459l30599P82795k75323K19901
$$ plain form
11050 122106 251922 329939 537939 405141 1084055 184161 329100 766053 -44791 529206
11040 529206 655629 519237 1163107 151158 584768 523138 174435 93590 373574 157004
11030 157004 -130161 407059 5869 1120570 89345 186434 621043 425194 640979
11021 640979 673715 61298 721778 544391 -309422 135080 135278 236608 251541 568506
11011 568506 157857 312554 -254879 679413 284621 400085 583535 850159 457230 546465
11001 546465 358880 365058 -270394 472755 60752 470196 526575 495235 382135 109229
10991 109229 26037 363186 483721 387814 324710 378535 -70182 340725 371350 271508 91956
10980 91956 240755 -427122 629593 776220 322056 32597 -298002 484793 209470 429371
10970D29371L02442l20868n5488p0368N16641n84948K76252n4380P42579p67436
10960D13797O18237l50503K17984r90093O04462j42769M5937l3784k695o3219
10950C17354N40290l32473j49044M41547k8166K5025m70303J13560j86448M1573
10940C12915l44904K73196j34919J66734k09076J40509K86851n03481K6728M78812
10930D93365N8719k17170O22242n52755L32308j21418n79788M25476P30191j330591
10920a39421R5322P02269m32362J55557k67593N56388p00738N09314M08110j38867
10910G47979p76334Q47323j50845j30000n99172K4760K49252L19226l49975O99339
10900H81553k54951l03491J05624L8152K6320L5608K64648r41988J114869m83185
$$ plain form
10970 429371 731813 410945 355457 285089 801730 216782 493034 438654 1181233 413797
10960 413797 1032034 681531 899515 -90578 513884 371115 417052 383268 380573 317354
10950 317354 857644 525171 376127 817674 789508 814533 344230 457790 271342 312915
10940 312915 -31989 241207 106288 273022 63946 204455 491306 -12175 14553 493365
10930 493365 552084 334914 957156 404401 736709 615291 35503 460979 1191170 -139421
10920 -139421 -44099 658170 225808 381365 113772 670160 -30578 478736 886846 747979
10910 747979 -28355 818968 668123 538123 -61049 -36289 212963 532189 182214 881553
10900 881553 626602 323111 428735 466887 493207 528815 793463 -148525 966344 483159
10890D83159l12237J28573K01978j39070J55984j60405K04616l78570n5084R8492
10880B27436m3313N13532p39784P12989M6189k63170Q6268N6082m65232P48197
10870H79194p82126L47419j94550k9058j37408J52544M39539r9004J13330j83457
10860E06423k71972J78164N11355n01750J43217p1570Q5770j91663j67557j94952
10850B5465N19196J28105J52517k22281L40064k57338n19962K04648N3049l9079
10840C84384j82034N6079N8152J84412n90976k8902K62097j15026o50862O68198
10830D5522O80575k64465o17265R52314R7859r8863j51462j8525M02507k84051
10820G44146m34812l66039M56266l71361J6793J24011Q8684J93617L29828o95588
$$ plain form
10890 483159 170922 299495 501473 362403 518387 357982 562598 184028 128944 227436
10880 227436 184123 697655 -42129 670860 717049 453879 540147 596229 130997 879194
10870 879194 97068 444487 249937 220879 83471 236015 675554 576550 689880 506423
10860 506423 234451 412615 923970 422220 565437 493867 579637 387974 220417 25465
10850 25465 544661 672766 825283 603002 943066 685728 165766 370414 423463 384384
10840 384384 202350 258429 316581 500993 -89983 -118885 143212 28186 -622676 45522
10830 45522 726097 461632 -155633 796681 894540 795677 644215 625690 1028197 744146
10820 744146 309334 -56705 399561 28200 44993 169004 257688 451305 781133 85545
10810H5545O88817k29372j45378J86293O57775j98559q55762L40587N1439o34049
10800e2664K13254O13011r58485L19131P97641n89050J22687k33574J97513L12355
10790G41819l07038N63749o16071j08107L11691j70285j94322j37441M29333L71518
10780H84846r38395L41877J71157L0011j8312j15241r8560l9605J17126k8127
10770C06777L73344N7548k07788o13527R10399r32542l0189M14998J57564O9078
10760E05662j2643m03961M18632L26512n77084l9084L29870j81929M62731o26637
10750B02069K20806p5954K45045m00383L16141K13100k24316J024J16448o5959
10740E48021m8471j78737L54033n38494J15849K40517m45071M69126n0171l45095
$$ plain form
10810 85545 774362 544990 399612 585905 1243680 1045121 189359 529946 581385 -52664
10800 -52664 160590 773601 -184884 134247 931888 342838 465525 231951 429464 741819
10790 741819 434781 998530 382459 274352 586043 415758 221436 83995 513328 884846
10780 884846 -53549 288328 459485 489496 471184 355943 257383 217778 334904 306777
10770 306777 680121 737669 529881 -83646 826753 -105789 -135978 279020 436584 505662
10760 505662 493019 89058 507690 834202 257118 218034 547904 365975 828706 202069
10750 202069 422875 346921 591966 191583 507724 720824 496508 497532 613980 548021
10740 548021 499550 320813 674846 136352 252201 492718 47647 516773 466602 121507
10730A21507Q63618q83040J79399N53342k76726l10623R72469r15276K36165n5742
10720D85093j2604m9359q7451M81364m22755o1260K66483k3736o27240M38163
10710C86698N01138l02247j91307K62901J24617n9450l55191L4572K90622m22811
10700B69542J78915j19844k60411N02769k10620k60287k378L92907l88589L86847
10690D88851j33776M92215n23108j9112k08581Q3189K80665l95838L28270k4035
10680C68740r687M09062m55897j69366R79165p14175n4144j116O77512l39956
10670F90138k65635J40543O18612o90442J20185K81562L15527l75679l23989M96685
10660A007507k60747j62748r15963J358615j23261k88027j16091l35522N31690
$$ plain form
10730 121507 985125 102085 281484 834826 558100 247477 1219946 304670 540835 485093
10720 485093 472489 423130 335679 817043 394288 333028 599511 575775 -51465 386698
10710 386698 887836 585589 394282 657183 781800 722350 367159 401731 692353 269542
10700 269542 448457 328613 68202 570971 360351 100064 97686 490593 102004 488851
10690 488851 355075 847290 324182 305070 96489 179678 460343 64505 392775 368740
10680 368740 359053 768115 312218 142852 1122017 407842 353698 352582 1030094 690138
10670 690138 424503 565046 1183658 493216 613401 894963 1210490 834811 510822 1007507
10660 1007507 746760 584012 -331951 1026664 903403 615376 499285 163763 695453
10651F95453m46063r9724Q51784l77531j60022j19549N95522m60532k44822L04790
10641E39306l7852m2248k50701M20322j38280M03870q42098m1817Q36788k86717
10631E60573k83785L64063K33921k83768l20203k48592O63405l57923K58237n95289
10621i361O90939J11221q09299N34179P4684j03982j6190j4734L0339J25743j06303
10610E07236J02847Q3613J49398r82705L83937J59631J91278j84635K00080m87205
10600A23475M93847j5544J68765m69505N26472l39207l89531L96210j52249K68351
10590F11084j28278j98494j45757Q93280m31780K39481n17250O48755l45042J86628
10580H12627m81655l5345J27809N7512k12144M64885q5095l31542M6197M62585
$$ plain form
10651 695453 249390 149666 1001450 623919 463897 344348 939870 479338 234516 539306
10641 539306 501454 459206 208505 628827 490547 894417 52319 10502 847290 560573
10631 560573 276788 640851 874772 591004 270801 22209 685614 327691 585928 -9361
10621 -9361 681578 792799 -16500 517679 592363 488381 472191 457457 487796 613539 507236
10610 507236 610083 693696 843094 -139611 244326 403957 595235 410600 610680 123475
10600 123475 617322 601778 770543 301038 827510 488303 98772 494982 342733 611084
10590 611084 482806 284312 138555 1031835 600055 839536 322286 971041 625999 812627
10580 812627 330972 295627 423436 480948 268804 733689 648594 317052 363249 825834
10570H25834L38551r98591P04679l08784K38879n21689L23296m74026P10825n42442
10560B96532L98334k49719m68750O78299k95625N80710m96220M40553r2049o74118
10550A17947O02157n53707N78760J70460j080956Q09600r1201q2426j56731l2027
10540B81876k20328M86951m74363O53869K2956m39641M25306l48030P11225n43856
10530E55965K31660j12888l33256K77734n00325J21014Q2004J81220k85471O0377
10520B78034M99736j43545k80607K97481r1663N4774N03490j84806k11304m36849
10510B84741R12831o27262j91391M00325K19651o13544Q1595o5986L60231m37809
10500C23382m44645R89968k08335L24396p53471Q09155k36647l89536M19616o66450
$$ plain form
10570 825834 1164385 165794 870473 561689 800568 278879 602175 128149 838974 296532
10560 296532 694866 445147 -23603 654696 359071 939781 443561 884114 792065 117947
10550 117947 720104 166397 745157 915617 -165339 644261 553060 470634 313903 281876
10540 281876 61548 548499 74136 728005 750961 311320 736626 388596 1099821 555965
10530 555965 787625 674737 341481 619215 118890 239904 321908 503128 217657 278034
10520 278034 777770 634225 353618 651099 559436 614210 1117700 932894 721590 284741
10510 284741 1197572 570310 378919 779244 998895 385351 466946 400960 761191 323382
10500 323382 -121263 868705 660370 984766 231295 1040450 803803 414267 833883 167433
10490A67433J14735J08114K13666q964k57711N69038o67253K52501J0928L06239
10480H08726j87952N39676m82020k67065r9439o0629K4515J76539l40877j3227
10470I8247P17478p13140O56530l77855n13783Q94658N6161j84115K92402l51801
10460E74782m93911M11411n23173O69944K88480m84549L61821l19756J72895M2743
10450G00687k7837k00408K78104j98457L73543m69379J31801N9694o72027M23195
10440C98916j37654N32593N1871q19288P55995l05775K571l2513K59966K38154
10430I44836l03023N0908p9630M66999o03425j61869k09863L2600K29460K18176
10420E85169J18821r0009m14429J05875O92878m20949P05588k28877k43394R5954
$$ plain form
10490 167433 282168 390282 603948 594984 337273 906311 239058 491559 502487 808726
10480 808726 620774 1160450 678430 411365 311926 251297 275812 452351 111474 98247
10470 98247 815725 102585 759115 381260 -132523 762135 818296 634181 926583 574782
10460 574782 80871 492282 -30891 639053 927533 442984 804805 485049 657944 700687
10450 700687 672850 472442 750546 552089 925632 456253 588054 647748 -24279 398916
10440 398916 261262 793855 845726 26438 782433 476658 479229 446716 706682 944836
10430 944836 641813 692721 613091 1080090 476665 314796 104933 137533 366993 585169
10420 585169 703990 613981 199552 305427 998305 577356 1282944 1054067 810673 906627
10410I06627o45562L28416R20067j109502L31753k91084P09598k23636n20513
10401D06164k10061J78247L91094q47807N61694O2437N963n16855N36735k90842
10391B76769m8767k89508L58044J54016l69454P09586k76209j01988N45244p25131
10381B32602O29946m40022J94410k44L30631k29586m3580N0614K83542r38274
10371G0039O83614k33878L92786p9537o81559N19006l88580L24480Q6645j07562
10361E85454M20208j91434m84206L66250j45124L32853o99075N90832k0250O20288
10351A375796p00902J09786M40313p84763L668K79819m51384O60703j54840n95595
10341A82601K27599k11260J42926l84183O20198m59670J012839o60277K75572
$$ plain form
10410 906627 261065 589481 1509548 400046 731799 440715 1150313 926677 406164
10401 406164 196103 374350 765444 -82363 479331 541768 547731 30876 567611 276769
10391 276769 228002 -61506 296538 450554 81100 790686 514477 412489 957733 232602
10381 232602 862548 422526 616936 616692 947323 717737 674157 724771 1008313 70039
10371 70039 753653 519775 912561 833024 151465 670471 281891 606371 693016 585454
10361 585454 1005662 814228 330022 696272 551148 884001 184926 775758 755508 1375796
10351 1375796 674894 784680 1224993 440230 443898 723717 272333 933036 778196 182601
10341 182601 410200 198940 341866 -42317 577881 118211 1131050 470773 746345
10332G46345j66177J4946K15547R0020R20149j258828K39817k01886L23773l82569
10322E41137n89073L83496N30527l62184n08170R88697l0087m7718l27755M30115
10312A008985o4473n31715M63616k22177m7878L28424n68267N08231m62622N02088
10302I14212m08250L53876K34106n84911K58733M05335R09l80742n8191q2266
10292F52811J6041l46239K27986O01933o99190m80814k8681P49855n9461m04560
10282B29681M45611m91635j396Q14925n43548L26206k57287J60180m6838j34769
10272E01130J74720l39741L03573l60327j43510P38046l57605j46640Q32892n81559
10262F20979M16707n46112K16928L80376j83584k09664L42043O32067r34219J63344
$$ plain form
10332 746345 580168 595114 810661 900681 1820830 562002 801819 599933 923706 541137
10322 541137 -47936 335560 866087 503903 -4267 984430 954343 906625 578870 1008985
10312 1008985 944512 412797 876413 654236 606358 934782 366515 874746 412124 914212
10302 914212 505962 859838 1093944 509033 767766 1173101 1174010 793268 735077 652811
10292 652811 668852 322613 550599 1152532 453342 -27472 -56153 693702 634241 229681
10282 229681 675292 183657 182261 997186 453638 779844 522557 682737 635899 501130
10272 501130 675850 336109 639682 279355 135845 873891 516286 369646 1202538 620979
10262 620979 1037686 491574 708502 1088878 905294 695630 1037673 1669740 735521 898865
10252H98865o08526N67320J30475p15679K26103P13268p58064O85393j035251
10243A03904O11527m93147J41980L32386K83798k94978R0541q3166p2371L1352
10233F51826p349R246N2482k1514l85295K86666M9975N89533o59494k02924P37778
10222A100930m05935N7890k68065K4332m58574j9297L00169m64059K21903R82930
10212A072224j87875m12678n8977N91537p14206R7650O19434k91411p2760o37771
10202E167N97487K5449J56563l58608l55492P14006J21958j21969j9546M53685
10192A218700M9495o40757m52720R98874q09412K54236k1520L03924O5364n36201
10182D29983l4056J25907m42505R19250m88469K68298k60094L58875n61742L80237
$$ plain form
10252 898865 290339 857659 988134 272455 498558 1211826 453762 1139155 103904
10243 103904 715431 222284 364264 696650 980448 685470 776011 692845 620474 651826
10233 651826 644477 653723 706205 684691 299396 586062 636037 1225570 566076 363152 1100930
10222 1100930 694995 752885 484820 509152 50578 31281 331450 -132609 89294 1072224
10212 1072224 884349 471671 412694 1004231 290025 387675 1007109 715698 642938 5167
10202 5167 602654 628103 784666 426058 70566 784572 906530 784561 765015 1218700
10192 1218700 1268195 627438 174718 1173592 364180 618416 596896 900820 966184 429983
10182 429983 395927 521834 79329 998579 510110 778408 518314 877189 315447 695684
10172F95684J25363p46273J046495o97467n8358j81979P64193m20524l92062M79388
10162F14460m1886J67494o74156N82310j41868l01302O20868n69511L67690M81332
10152A105431m45812K40534p07019R84215l01337l32855L37934j95266k14955
10143D70870j91818j66250L16103P28203o29170j26485N90244K3711k80818M04638
10133A139228j77610J04809N5210K59932k52073m00116J86236n69002K74009l77586
10123B43037P11264o93441P6776O23222l65659m9654n8376L28783k26958P8733
10113F67727L48731o62570r3148N7648m3171l58087k00207J103200m66029m68282
10103a14188J014490j81256j1045K51040Q4805Q3813p16544J069441l53594k81305
$$ plain form
10172 695684 821047 74774 1121269 423802 365444 183465 947658 527134 135072 614460
10162 614460 572574 740068 65912 648222 506354 205052 825920 256409 624099 1105431
10152 1105431 659619 900153 193134 1177349 876012 543157 881091 685825 470870
10143 470870 279052 112802 428905 1157108 527938 401453 991697 1015408 734590 1139228
10133 1139228 961618 1066427 1121637 1381569 1129496 729380 915616 346614 620623 243037
10123 243037 954301 260860 337636 960858 595199 545545 487169 815952 588994 667727
10113 667727 1016458 353888 260740 318388 275217 -82870 -283077 820123 354094 -114188
10103 -114188 900302 719046 708001 959041 1043846 1127659 411115 1480556 1126962 845657
10093H45657L20345k25023l74708n63011J129296j56852m94280O76549m62545
10084F95428J70324n16403J78693M63936l31562l916R3785J82106m80937K54282
10074G05736k54660l74648J436707o52555l55662N38714J1432k33759r46052O78094
10064E53347L38574l85864P76713j78745N3850r33171M36562m49571L30423N53454
10054A095572k61235J21444O3038j54020m35962m33157O27956J08408j24662N00586
10044A107968n33528L18340o25186N29984n47521L45753L54442O40712r31279
10035F59685P91493j08090l00673l72055p134J62735l44668P68859l09731p53707
10025A86714j2637J49678J14813M05994m5337M50903j4401j03711m67663N78846
$$ plain form
10093 845657 1166002 940979 566271 3260 1132556 975704 481424 1157973 695428
10084 695428 865752 349349 528042 991978 660416 656500 750285 932391 451454 705736
10074 705736 451076 76428 1513135 860580 504918 1043632 1055064 821305 -124747 553347
10064 553347 891921 506057 1282770 1104025 1157875 224704 661266 211695 542118 1095572
10054 1095572 834337 955781 1018819 864799 428837 -4320 623636 732044 607382 1107968
10044 1107968 574440 892780 267594 797578 250057 595810 950252 1590964 659685
10035 659685 1451178 1343088 1042415 670360 663226 825961 481293 1250152 940421 186714
10025 186714 174077 323755 438568 844562 799225 1250128 1235727 1132016 664353 1243199
10015A243199l19412O82073m80429K8529k5638K99949K71248j107750R05619j122501
10005C74887M59088m2829K37461j10963m78628R25824n49968n00854J154464m4512
9995A423970m55225k98770M71949R955q88072K58226M30289n10428N51970J80927
9985A174791q4329m88913R16304l34828n74846N14311m5701n20768L11186J84354
9975A051561k53608l64551L21403P6449p90580Q65496L72924k83721o99898P99712
9965A095187l78930L07499o08743J161929o23915j56124L65487n61440L41834
9956I42784L13430q7999q96978O79299J66450n41828m04998R41461m30894R4075
9946G74802n06328R08793j06043o38089P32417l74117L39630m29795k6677N49782
$$ plain form
10015 1243199 923787 1605860 1125431 1153960 1128322 1428271 1699519 591769 1497388 374887
10005 374887 833975 791146 1028607 917644 439016 1364840 814872 314018 1468482 1423970
9995 1423970 968745 669975 1141924 1151879 263807 522033 952322 441894 993864 1174791
9985 1174791 1090462 601549 1517853 1183025 608179 1122490 1076789 556021 867207 1051561
9975 1051561 797953 433402 754805 831254 40674 906170 1279094 995373 295475 1095187
9965 1095187 716257 1023756 415013 1576942 953027 796903 1162390 600950 942784
9956 942784 1256214 1168215 271237 950536 1116986 575158 170160 1111621 680727 774802
9946 774802 268474 1177267 1071224 433135 1165552 791435 1131065 701270 674593 1224375
9936A224375K56134p97314p6305M19466J43924o05295M77030l45095k08400K57671
9926G46191q84151P26242m6528J37969L99129P2005o7424L35197m46310j53500
9916H18820l01746J202404o47623L0793j85919K00245L945q54916J277294m29127
9906A114170j75047L14396J51760J21743l59056m89952R20105o03529R7188L17033
9896A408811k23318j6378N68602m96743n84411Q83947l3431k028J24528N76458
9886B206037j0729m60291n18480R51843j161340K03804M95778L24798l82380J14619
9876A763659l15773q7195J16919K36485J53641P1482P5948L44309k4991k81470
9866B053014j29016M47077j4332L43552P3106k73945L2955N8304M63067p09883
$$ plain form
9936 1224375 1480509 683195 606890 1026356 1170280 564985 1042015 696920 488520 746191
9926 746191 -137960 588282 541754 679723 1078852 1150857 1083433 1418630 972320 818820
9916 818820 517074 1719478 1071855 1102648 916729 1116974 1120919 266003 1543297 1114170
9906 1114170 939123 1253519 1405279 1527022 1167966 678014 1598119 994590 1091778 1408811
9896 1408811 1185493 1169115 1737717 1240974 656563 1540510 1507079 1505051 1629579 2206037
9886 2206037 2195308 1735017 1216537 2168380 1007040 1210844 1706622 2031420 1649040 1763659
9876 1763659 1447886 1360691 1477610 1714095 1867736 1939218 2015166 2359475 2334484 2053014
9866 2053014 1923998 2371075 2356743 2700295 2773401 2499456 2532411 2590715 3053782 2343899
9856B343899K52253L05246J06336n50242J04955j16800j76003o36025l32311O46764
9846A948072k61966J01554l05557R90284k29451q59997O27263L90895j75445O98030
9836B923682k56553J00811l20793K0093k09609K95251r4612q01975R74798k69687
9826B361406n61313J34486k03572k80725j13887K36975K12037K95941n91860L41899
9816A831387p81836M35253m58822j88738M7989J97600k56431J2218N15341l79751
9806I74210o57883P75855L42788m15268m62687O66364M90817r25729L20256k82971
9796H25752P36295r41507M69136k14677N85042n32948l18127N22389l99422K27063
9786I58996J64345m9491L70577K35395m62148J56097j69582j37378J7514j28968
$$ plain form
9856 2343899 2596152 2901398 3007734 2457492 2562447 2445647 2269644 1633619 1301308 1948072
9846 1948072 1686106 1787660 1482103 2472387 2242936 1382939 2010202 2401097 2225652 2923682
9836 2923682 2667129 2767940 2447147 2467240 2257631 2552882 2458270 1656295 2631093 2361406
9826 2361406 1800093 1934579 1731007 1450282 1336395 1573370 1785407 2081348 1489488 1831387
9816 1831387 1049551 1484804 1025982 837244 885233 1082833 826402 838620 1353961 974210
9806 974210 316327 1092182 1434970 1019702 557015 1223379 1714196 788467 1108723 825752
9796 825752 1562047 620540 1089676 874999 1460041 927093 608966 1131355 731933 958996
9786 958996 1123341 1073850 1444427 1679822 1217674 1373771 1204189 1066811 1084325 955357
9776I55357J90751K67091m94423O7430M42384n32113J91434L49382O147j262391
9766A81049J039236J17547m05689M0328m1081P77194q28404n4887P34827l31475
9756A228645l22514j13651K79344N38664o16744L27720k19797Q2646K8471m13246
9746G99538j57880R37476m56592K68723l06161N29850m30663R8014K78510l48033
9736A212782J48914p23280O76150j63254k59466o0395P1374K92859k2617m36201
9726G36866P62758L4067m13112M73048m10751N31790q26179j67324K95844r8588
9716I18419K71092o61198M11037j46940j39216M51763m56818L59083k8827j51526
9706H26869N15630j23424j11658n30819P77984p8622k97662k33813K8654K84974
$$ plain form
9776 955357 1146108 1413199 918776 986206 1428590 896477 1087911 1437293 1443440 181049
9766 181049 1220285 1337832 932143 972471 931390 1708584 880180 825293 1560120 1228645
9756 1228645 906131 792480 1071824 1610488 993744 1321464 1101667 1184313 1212784 799538
9746 799538 641658 1579134 1122542 1391265 1085104 1614954 1184291 1282305 1560815 1212782
9736 1212782 1361696 638416 1314566 1151312 891846 831451 902825 1195684 1173067 736866
9726 736866 1499624 1533691 1120579 1593627 1182876 1714666 888487 721163 1017007 918419
9716 918419 1189511 528313 939350 792410 653194 1104957 648139 1007222 978395 826869
9706 826869 1342499 1219075 1107417 576598 1354582 1275960 978298 744485 773139 1058113
9696A058113j90102N32449l92414K39953J32332o12643R2935N57363n25165l37344
9686E55477Q20833o05038L5196j09499M06641M2080j1593L9526j29418J10122
9676A154327k31299l7551n01347O83755K54825l17199O92071k96083n96495M32835
9666A237839j54399j3282N9541J4182M84595m58395k72102O31072l76164j95299
9656I57588P71196j76484K1745l8031m3055P32472k29345j68312N89581L5156
9646B452511l82058Q98546r23196j61176q7116o5977k08944L13349p43917L20843
9636A412865J67375M8490l08459j4439L45528j04469P12152j061107P74773L8169
9626B010878l13155J87033J49315J12146k8799N92519n4603R8366p16362N84825
$$ plain form
9696 1058113 868011 1400460 1008046 1247999 1380331 767688 860623 1417986 892821 555477
9686 555477 1376310 771272 806468 696969 1103610 1145690 1134097 1173623 1044205 1154327
9676 1154327 923028 885477 384130 1067885 1322710 1005511 1697582 1401499 805004 1237839
9666 1237839 1083440 1070158 1129699 1143881 1628476 1170081 897979 1529051 1152887 957588
9656 957588 1728784 1552300 1574045 1536014 1492959 2225431 1996086 1827774 2417355 2452511
9646 2452511 2070453 2968999 2045803 1884627 1797511 1731534 1522590 1835939 1092022 1412865
9636 1412865 1580240 1628730 1320271 1305832 1651360 1546891 2259043 1197936 1972709 2010878
9626 2010878 1697723 1884756 2034071 2146217 2117418 2709937 2655334 2753700 2037338 2622163
9616B622163m48334m0885O5192M55688n96047J99060l1401k44199l46762n77274
9606A057201L23096J84458j12617K74691j37670n78981N27617n69762j88390O40297
9596A419940J19041Q4616m72623O44795j05398m34654k64867J53032L26529n9752
9586A410659l90541O55796o01144L55759l98504j46082L13729L78693O6459J81620
9576A826444n86702K81605p0513m01531N02072j38129O09999m42530k7240j49346
9566A404129L20498o52818K83065j18333K18130L3229K19108l39337R6090J13723
9556A577484o47275R37251n22543M06389j73369k3366n38279K07050p9997O0317
9546A203662M11778n2201O05656j260555J292810o96050O8328r6161O34027j41865
$$ plain form
9616 2622163 2173829 2132944 2198136 2653824 2057777 2256837 2225436 1981237 1634475 1057201
9606 1057201 1380297 1564755 1452138 1726829 1589159 1010178 1537795 968033 779643 1419940
9596 1419940 1538981 1623597 1150974 1795769 1690371 1255717 990850 1143882 1470411 1410659
9586 1410659 1020118 1675914 1074770 1430529 1032025 885943 1199672 1578365 1644824 1826444
9576 1826444 1239742 1521347 1450834 1049303 1551375 1413246 2023245 1580715 1553475 1404129
9566 1404129 1724627 1071809 1354874 1236541 1454671 1487900 1707008 1367671 1463761 1577484
9556 1577484 930209 1867460 1344917 1751306 1577937 1554571 1016292 1223342 1143345 1203662
9546 1203662 1615440 1563239 2168895 908340 2201150 1505100 1573428 1477267 2111294 1969429
9536A969429J17153k11093J97083m93289J10083J00559k44190K56098M17945M0032
9526B259810r6716o52755J83611J15490l05650P76927p61830K46430J77449L04141
9516B246907o64299Q8845J44870K27316J71933k0344J50323l77136j35249L97427
9506B230593j37783K43242k46232L18995J89810N58661l64196J071288m49917
9497C414461k50541N17957m38174P6616J15981n15965n22149N6073j81127J85883
9487B459015K80154M1929K29869l48378q4572L57328j14746K2894K65945O6987
9477C176425j64236K64545J03561n70440O8290N21467j29205M33222K70451K21090
9467D195170r89900L3930L0851m59074j51419N74358k41711j92709M76847m203
$$ plain form
9536 1969429 2086582 1875489 2072572 1579283 1689366 1789925 1545735 1801833 2219778 2259810
9526 2259810 2163094 1510339 1693950 1809440 1503790 2280717 1518887 1765317 1942766 2246907
9516 2246907 1582608 1671453 1816323 2043639 2215572 2195228 2345551 1968415 1833166 2230593
9506 2230593 2092810 2336052 2089820 2408815 2598625 3157286 2793090 3864378 3414461
9497 3414461 3163920 3681877 3243703 3320319 3436300 2920335 2398186 2454259 2273132 2459015
9487 2459015 2739169 2781098 3010967 2662589 2578017 2935345 2820599 2843493 3109438 3176425
9477 3176425 3012189 3276734 3380295 2809855 2878145 3399612 3270407 3703629 3974080 4195170
9467 4195170 3205270 3239200 3270051 2810977 2659558 3233916 2992205 2799496 3276343 3272140
9457C272140j011774J073912k67112M6289l8155j05041L51429n9720n64944M98503
9447C195527J27745k4092M99945j5820n58726R21091l06084J01203O6696J64682
9437D172167J06735l57459J007798q47525n49053o12184O06337J85170k14523
9428C497463p8035m2979L41111k97896j37790k74774L30199p37339Q45125n99475
9418B845610N37557k59312L0783k50853N85253j04986m62042N61867J75760l31160
9408C328477j0089M47910p65590J09153l67683J32790J02419K64681l82805m2350
9398B816913m15508K24934m6952K03872k17839L47273L13004m70027r4507J96624
9388B857787J73617k43339O23295l48931M89870n01192J50057l10868j1155O79118
$$ plain form
9457 3272140 2260366 3334278 3067166 3113455 3075300 2970259 3321688 3261968 2697024 3195527
9447 3195527 3323272 3299180 3799125 3783305 3224579 4145670 3839586 3940789 4007485 4172167
9437 4172167 4278902 3921443 4929241 4081716 3532663 2920479 3526816 3711986 3497463
9428 3497463 3419428 3376449 3717560 3419664 3281874 3007100 3337299 2599960 3445085 2845610
9418 2845610 3383167 3123855 3154638 2903785 3489038 3384052 2922010 3483877 3659637 3328477
9408 3328477 3318388 3766298 3000708 3109861 2742178 2874968 2977387 3242068 2859263 2816913
9398 2816913 2401405 2626339 2579387 2783259 2565420 2912693 3225697 2755670 2661163 2857787
9388 2857787 3031404 2788065 3411360 3062429 3552299 3051107 3201164 2890296 2879141 3558259
9378C558259k93249Q6887O62557j037427P40487j00628k75346M630O01188k65031
9368C682327k530K1852q05402R33157j60458q26931J203921p62018M21181j5592
9358C689507l10074O82936J23141p1298m8784R23301j17n82475L38060l89041
9348D355156O76106n60169o00030J426253o72603R35488J06278m22520O35937
9339E879896l65923O47388k53047n6512L42829R931k99627K74262O7393j32496
9329F114094r77294J397752k06190k70603R7532L75448k68344K05773J08611k3433
9319F553346M98259N34785k55189l59310Q39443l75497k11665p7648J049039k1490
9309H174073l90437Q43857O98355j075108k26036O79172p9957j39122P3662J072967
$$ plain form
9378 3558259 3265010 3351897 4014454 2977027 3717514 3616886 3341540 3346170 3947358 3682327
9368 3682327 3679797 3701649 2896247 3829404 3668946 2842015 4045936 3283918 3705099 3689507
9358 3689507 3379433 4062369 4185510 4114212 4065428 4988729 4988612 4406137 4744197 4355156
9348 4355156 5031262 4471093 3871063 5297316 4624713 5560201 5666479 5243959 5879896
9339 5879896 5513973 6161361 5908314 5851802 6194631 6204562 5904935 6179197 6246590 6114094
9329 6114094 5136800 6534552 6328362 6057759 6155291 6530739 6262395 6468168 6576779 6553346
9319 6553346 7051605 7586390 7331201 6971891 7811334 7435837 7224172 7146524 8195563 8174073
9309 8174073 7783636 8627493 9325848 8250740 8024704 8703876 8623919 8484797 8558459 9631426
9299I631426j091703J56888j43872l29392M34106P8587j60726K52091O88480O02908
9289A0118793p8378K00272O56808o75392M55988K2209K74815j29044r4622J064357
9279A1815806j035919O87206j81758R21156M6911o86544J074390j96660L68339
9270A2812927L53553J17114K22450o67177O64185m53363N11885k89772L58332
9261A3630134K85551K34926O35208L51923k20850P09752K47285Q79998l43057
9252A6410870K43252Q16662j57721O59907j74860k82472R35238k23040K70967
9243A8498803Q73777M26092Q48241J34976O04631P17017L20679Q55195Q07539
9234B4086950O35051J484217J266864J134382J894234R19090J772874P30347K076645
$$ plain form
9299 9631426 8539723 8696611 8552739 8223347 8657453 8736040 8575314 8827405 9515885 10118793
9289 10118793 10040415 10240687 10897495 10222103 10678091 10700300 10975115 10846071 10751449 11815806
9279 11815806 10779887 11467093 11285335 12206491 12253402 11566858 12641248 12444588 12812927
9270 12812927 13166480 13283594 13506044 12838867 13503052 13049689 13561574 13271802 13630134
9261 13630134 13915685 14150611 14785819 15137742 14916892 15626644 15873929 16753927 16410870
9252 16410870 16654122 17470784 17313063 17972970 17798110 17515638 18450876 18227836 18498803
9243 18498803 19372580 19798672 20646913 20781889 21386520 22103537 22424216 23279411 24086950
9234 24086950 24722001 26206218 27473082 28607464 30501698 31420788 33193662 33924009 36000654
9225C6000654J783881J798033J818236N62264J076012o13315O1959P26717n99457
9216D2614984O98183L86067j68359O66523K50870J497677J184412J251731K523952
9207E0906040K341777L875200L399997M271172L727150M746350M527425N084742
9199H2879853M633079L575961K092644J929869K176827M310554L653087M117622
9191A09369496M285441K960377L378143M082664N593968M377611L041191R97522
9183A38086413n12978k435927k142898J353883K648593L074702M182117O901034
9175A51154939R993124J7684322K4918961L3746675L9207676L7210439K6777784
9168C40693920J4334796M551104n15308Q28281Q649012J2583574J3354731R371668
$$ plain form
9225 36000654 37784535 39582568 41400804 41963068 43039080 42425765 42487724 43214441 42614984
9216 42614984 43313167 43699234 43530875 44197398 44448268 45945945 47130357 48382088 50906040
9207 50906040 53247817 57123017 60523014 64794186 68521336 73267686 77795111 82879853
9199 82879853 87512932 91088893 93181537 95111406 97288233 101598787 105251874 109369496
9191 109369496 113654937 116615314 119993457 124076121 129670089 134047700 137088891 138086413
9183 138086413 137573435 135137508 132994610 134348493 136997086 140071788 144253905 151154939
9175 151154939 161148063 178832385 203751346 237498021 276705697 313916136 340693920
9168 340693920 355028716 359579820 359064512 359892793 368541805 381125379 394480110 403851778
9160D03851778J017608o556705j4641871j9255195k4999545k9241160l0794109
9153B79380801k9417253k4963490j9514664j3800607p125379r49124M268893P868208
9145A95747385R308055J0007035O891568L466952k5469p07443j830540k444359
9137B20413184o9649J09552J92978O23334O08278q67322q33252l55191j902617
9128B17919295l399030n285137q763346j2316361j3674857j4000951j3601049
9121A46878564j1796236j0672827r031885o821640o399339m759259m906960m581002
9113H7909416k850248l754741k215103k069933j297816j493980p23754o35960
9105G2867881q44693p84198p38049p11788k142592j868467o21186j142315l36020
$$ plain form
9160 403851778 404869386 398312681 383670810 364415615 339416070 310174910 279380801
9153 279380801 249963548 225000058 205485394 191684787 184559408 183610284 187879177 195747385
9145 195747385 205055440 215062475 221954043 225420995 225395526 224688083 222857543 220413184
9137 220413184 220343535 220453087 220646065 221269399 221877677 221010355 220177103 219821912 217919295
9128 217919295 214520265 209235128 200471782 188155421 174480564 160479613 146878564
9121 146878564 135082328 124409501 115377616 108555976 102156637 97397378 92490418 87909416
9113 87909416 85059168 81304427 79089324 77019391 75721575 74227595 73503841 72867881
9105 72867881 72023188 71238990 70500941 69789153 67646561 65778094 65156908 64014593 63678573
9096F3678573m39368j45341J554176N97104P61617L255914N288450J1894731K8154974
9087A14600830L2320331L0327408P887549k589744k6069205k6546036j7932403
9080A11998730k0488686j5089470j2341897q845795o620829l534916k301931k133029
9072D0642177j675620j443166p33924q71846q30247l56235q66666j125394n43106
9063C2195973n27603q35215m99426J25233m51005l18355j079999j343840o35467
9054B6630296r68916j268725r38280l3754j476002k36487o06484r25034K8132
9045B0204746p79181k80044K27297r44782l22854r5404p36046m70483m4477n45432
9035A6213340p7929l04721r22159l08586m52117j33870R5584m93231J57024l98391
$$ plain form
9096 63678573 63239205 63093864 64648040 65245144 66006761 69262675 74551125 86445856 114600830
9087 114600830 146921161 177248569 185136118 182546374 156477169 129931133 111998730
9080 111998730 91510044 76420574 64078677 55232882 48612053 45077137 42775206 40642177
9072 40642177 38966557 37523391 36789467 35917621 35087374 34731139 33864473 32739079 32195973
9063 32195973 31668370 30833155 30333729 30458962 30007957 29689602 28609603 27265763 26630296
9054 26630296 25661380 24392655 23454375 23420621 21944619 21708132 21101648 20176614 20204746
9045 20204746 19425565 19145521 19372818 18428036 18105182 18009778 17273732 16803249 16758772 16213340
9035 16213340 16135411 15830690 14908531 14599945 14147828 14013958 14109542 13616311 13773335 13374944
9025A3374944k45173N60873q45244N5219l12516n66584N01232p21910J66160j20587
9015A1846414k85720n51303n04674N78722r62982l2973N30010l71965k93314j38977
9005I813238K254n34881j32535J76110p1745M68543q20749k42389l86962K38928
8995H509812o1492j0608j93174J46527K19994o52437O8523j94416l28291o3559
8985G440879L7205j01182q5890L66088m65221p75n42511K01835J65032k64387
8975F751073N22387k63727m23299M5177m37361K84731q6477L03612j24882M24670
8965F995904r74192j97710K20476l01154M0310O93139n70638k81447O70495n79569
8955E715614k07605m26920N84848k94229R8138m88578O59254q99545l45424p76276
$$ plain form
9025 13374944 13129771 13690644 12845400 12900619 12588103 12021519 12522751 11800841 11967001 11846414
9015 11846414 11560694 11009391 10504717 11083439 10120457 10087484 10617494 10245529 9952215 9813238
9005 9813238 9815492 9280611 9148076 9324186 9252441 9720984 8900235 8657846 8270884 8509812
8995 8509812 8448320 8437712 8244538 8391065 8611059 7958622 8027145 7832729 7504438 7440879
8985 7440879 7478084 7376902 7291012 7657100 7191879 7191104 6648593 6850428 7015460 6751073
8975 6751073 7273460 7009733 6586434 6631611 6194250 6478981 6392504 6696116 6571234 6995904
8965 6995904 6021712 5824002 6044478 5743324 5783634 6476773 5906135 5624688 6295183 5715614
8955 5715614 5508009 5081089 5665937 5371708 5469846 4981268 5640522 4740977 4395553 3619277
8945C619277J283165l97392K72652K06389m38510L01515o26617l06452l25687
8936C588340r6997K61171p6312o31186R31084m89431k2227q35890P46186n60148
8926B814590Q23269l46994K89078M43194q98069k62988j81939j38518J47827M75449
8916C164899q71378Q20592o18889j60935j95589j37955O07144k64823K86257n1382
8906B577941L4788j74892j28620l516L8507j7247M49021k60445m66853L53621
8896B402305N42376j002830M34739l55218M1292J75912L90517m34527j81260P0580
8886B083886l75350N11296J9707J71794m14369M50156L87030p19802j66823O46581
8876B594106m42230J04334O56217j59528L06644o30481q9987J09588l69048K65761
$$ plain form
8945 3619277 4902442 4505050 4777702 4984091 4545581 4847096 4220479 3914027 3588340
8936 3588340 3491343 3752514 3676202 3045016 3976100 3486669 3464442 2628552 3374738 2814590
8926 2814590 3637859 3290865 3579943 4023137 3125068 2862080 2680141 2541623 2689450 3164899
8916 3164899 2293521 3114113 2495224 2334289 2138700 2000745 2607889 2343066 2629323 2577941
8906 2577941 2612729 2437837 2309217 2305701 2344208 2326961 2775982 2515537 2048684 2402305
8896 2402305 2944681 1941851 2376590 2021372 2062664 2238576 2629093 2194566 2013306 2083886
8886 2083886 1708536 2219832 2239539 2411333 1996964 2447120 2834150 2114348 1947525 2594106
8876 2594106 2151876 2256210 2912427 2752899 3059543 2429062 2339075 2448663 2079615 2345376
8866B345376J87920j46255L23622Q1087k92664N7441M317K14872k38641K74804
8856B811879L38893l03003j68401K77022m53915L58932k57685l09140J0246N57529
8846B862357N7393n37226k07605M42034K02960m39237J23865m75364L96947m74535
8836A951589P60871l79543o43260O91603k45092l23618m712P08852k92047L19063
8826B543706Q0678L4615m7503J99195n11038N90850k50669l47525N4429j25936
8816B220802N12269k18827m25698k70586L99883l15856q1492J67914N59012k71120
8806B276301n52964K94850l26508j27640L29977K3700o39304N10105l97148L34148
8796A725517j21920M228m6845L90096j76604J93003o05019N50951K30775q1555
$$ plain form
8866 2345376 2533296 2387041 2710663 2791750 2499086 2556527 2560844 2775716 2537075 2811879
8856 2811879 3150772 2847769 2679368 2956390 2502475 2861407 2603722 2294582 2304828 2862357
8846 2862357 2919750 2382524 2174919 2616953 2819913 2380676 2504541 2029177 2426124 1951589
8836 1951589 2712460 2332917 1689657 2381260 2136168 1812550 1807838 2516690 2224643 2543706
8826 2543706 2624384 2658999 2611496 2810691 2299653 2890503 2639834 2292309 2346738 2220802
8816 2220802 2733071 2514244 2088546 1817960 2217843 1901987 1820495 1988409 2547421 2276301
8806 2276301 1723337 2018187 1691679 1564039 1894016 1917716 1278412 1788517 1391369 1725517
8796 1725517 1603597 1607825 1560980 1951076 1774472 1967475 1362456 1913407 2144182 2062627
8786B062627m02739J13133Q9535p97887L76912k53828P66087q21789K02823L05458
8776A640332K56526m49708K02326m81780K75224k39048Q55634k60852k79504N31506
8766B050656p2493o80201k21734P2887l8325L18599m21362L87342k46399M97454
8756A646424n86420k00179O70859J97412j36191k85751N72452n68836k2869n84863
8746G02038N09166J4091J15490m73028L03730K81499k85481M76259o45905k45200
8736G52659L72554P86330o55964M93282o41873L29372N7926k41081n53871R65129
8726A664463J50887r76400M17493K00313k38281L6906j20712j3243K59114j45844
8716A234696L36701l47051K92804o30064k01827N64956P2687N9504N2334j99331
$$ plain form
8786 2062627 1659888 1773021 1862556 1064669 1441581 1187753 1953840 1132051 1334874 1640332
8776 1640332 1896858 1447150 1649476 1167696 1442920 1203872 2059506 1798654 1519150 2050656
8766 2050656 1978163 1297962 1076228 1149115 1110790 1429389 1008027 1395369 1148970 1646424
8756 1646424 1060004 859825 1530684 1728096 1591905 1306154 1878606 1309770 1286901 702038
8746 702038 1211204 1225295 1340785 867757 1171487 1452986 1167505 1643764 997859 752659
8736 752659 1125213 1911543 1255579 1748861 1106988 1436360 1494286 1253205 699334 1664463
8726 1664463 1815350 838950 1256443 1456756 1218475 1255381 1134669 1121426 1380540 1234696
8716 1234696 1571397 1224346 1517150 887086 685259 1250215 1322902 1382406 1434740 1235409
8706A235409Q5540J89155o69968O17583n08645N66170k71638N79242l91028o62817
8696G69003N16313j61121l05532K3504O42454n65720N33166k10823Q7745n64108
8686G64881Q48078m68611R7046q8967j04762O55679k45098l58034J26617M3727
8676A270556o1741Q4627k3881K35521J01518N08185j246335J785135k5863j137431
8666A490291l1018k29508q9893M45656n21506J40963q3267J59315j70483r7816
8656A012734P57881l41498k01230q3907R345J17542l67379L29108k93472k29764
8646G09360L39696j37918k69471K11410M63146j99025N6257n8907J80520k75884
8636A019184q869j22302K33562j11041K74416l12049p0922O3310L9603j43425
$$ plain form
8706 1235409 1320949 1510104 840136 1457719 949074 1515244 1243606 1822848 1431820 769003
8696 769003 1285316 1124195 818663 842167 1484621 918901 1452067 1241244 1328989 764881
8686 764881 1612959 1144348 1241394 1152427 1047665 1703344 1458246 1100212 1226829 1270556
8676 1270556 1208815 1293442 1269561 1505082 1606600 2114785 868450 2653585 2627722 1490291
8666 1490291 1459273 1229765 1139872 1585528 1064022 1204985 1121718 1281033 1110550 1012734
8656 1012734 1770615 1429117 1227887 1143980 1153325 1270867 903488 1232596 939124 709360
8646 709360 1049056 911138 641667 853077 1316223 1117198 1173455 1114548 1295068 1019184
8636 1019184 1010315 888013 1121575 1010534 1284950 972901 901979 965289 1004892 861467
8626H61467K92027K30783l3672K4190J30252p36735N69752n68305Q26700k38697
8616A357762k65181m05017J28889j30798k04666K79940J51900J43029r8419M01474
8606A358913J9978K27437l28312K9065J51313m5562l09960J67910L69133n14480
8596A125435J63414k98079k76803L99143m34997J10013J76670J8006r5726O5452
8586I52528R3299j74275j03775O64342j35639o10631N97530m06090J8655m1720
8576H54224p9062m3714N60298o30255N77238L40781m30979m6223k28271j9279
8566H54758N44261l31230k39094l1685L58108m12372j36147O56113n05320J28907
8556H86299k49037N16046k69297L36619j5672n5482j94347N93713n67316J13051
$$ plain form
8626 861467 1153494 1384277 1350605 1374795 1505047 768312 1338064 769759 1596459 1357762
8616 1357762 1092581 687564 816453 685655 480989 760929 912829 1055858 957439 1358913
8606 1358913 1378891 1606328 1278016 1307081 1458394 1412832 1102872 1270782 1639915 1125435
8596 1125435 1288849 990770 713967 1113110 678113 788126 964796 982802 887076 952528
8586 952528 1045827 871552 767777 1432119 1296480 685849 1283379 877289 895944 854224
8576 854224 775162 731448 1291746 661491 1238729 1579510 1148531 1102308 874037 854758
8566 854758 1399019 1067789 828695 797010 1155118 742746 606599 1262712 757392 886299
8556 886299 637262 1153308 884011 1220630 1204958 1149476 955129 1548842 981526 1094577
8546A094577m55159L71818P9148r23283O71241j87088N08874K78628k664130L068404
8536A843030o66638l24315K13168O8875Q5978K6103o8264m76855M99176q00514
8526C99744P02090j23724J94438l6601M4901l42830L09968l45303n45581O51112
8516I08214k8966K31611k94469J43250k88278N26219n11567j76655M09893L26861
8506A246113J97967o79072L74191j88594K70987p8578J64701k10763l29136J22607
8496H90423j58810J7094L81911m26520L26847M93456O4044m00006j38917J73404
8486A222926L27828p92234L18497K34830k48276j37129j20157j72431P5011m1648
8476F67217N67306L9095m28726O53588l74956N59054r84194M68158K11541l13038
$$ plain form
8546 1094577 639418 1011236 1090384 167101 838342 651254 1160128 1438756 -1225374 1843030
8536 1843030 1176392 852077 1065245 1134120 1220098 1246201 1177937 701082 1200258 399744
8526 399744 1101834 978110 1172548 1135947 1180848 838018 1147986 802683 257102 908214
8516 908214 879248 1110859 816390 959640 671362 1197581 686014 509359 919252 1246113
8506 1246113 1444080 765008 1139199 950605 1221592 1143014 1307715 1096952 767816 890423
8496 890423 731613 748707 1130618 704098 1030945 1524401 1588445 1188439 1049522 1222926
8486 1222926 1550754 758520 1077017 1311847 1063571 926442 806285 633854 708865 667217
8476 667217 1234523 1273618 844892 1498480 1123524 1682578 698384 1166542 1378083 1065045
8466A065045K97864m52328R3875n78002j39515L33128J75223j59161N72518j40946
8456A067701J08041l94847N00005r1894k10071M57808m00941K46126J9357k37492
8446A063793j39696R6163O15876q63736J20003O62021n41660M56775n01292K97054
8436A265301k42568m86915O13460M55690r03179N00246O7286n83520L80879L07625
8426A374305k63901L15818j77885m43340M50658l38438Q41479p76839O7695K27599
8416A277151l13700K39815m28829Q34958q13084K56975k96204N20736n41727m8491
8406F87600R71647n87897l6803j7584j41221N39771k73612J95116p66601m3715
8396E26701L37045p38489P92916M79852q45016R2536L06182m6022O25398o45889
$$ plain form
8466 1065045 1362909 910581 1004456 426454 286939 620067 795290 636129 1208647 1067701
8456 1067701 1175742 780895 1280900 1189006 978935 1436743 1035802 1281928 1301285 1063793
8446 1063793 924097 1020260 1636136 772400 892403 1554424 1012764 1469539 968247 1265301
8436 1265301 1022733 535818 1149278 1604968 701789 1202035 1269321 685801 1066680 1374305
8426 1374305 1110404 1426222 1248337 804997 1255655 917217 1758696 981857 1049552 1277151
8416 1277151 963451 1203266 774437 1609395 796311 1053286 757082 1277818 736091 687600
8406 687600 1659247 1071350 1034547 1016963 875742 1415513 1141901 1337017 570416 526701
8396 526701 863746 125257 918173 1398025 553009 645545 951727 905705 1531103 885214
8386H85214K86938J21772l33229L7564J39552k42160O63272n64857o22180R30649
8376A302535o06516K89359K4101O49887n4015q74082m1901P01557q4372p95862
8366E10691R30015o06825L91278n11200J81059l71132L14033p15440P44419o6248
8356H00650K50747L60581m13594N06027m2420l60284M54324n10231N47298l6548
8346A556550o52717J12795m06033M57824k12683L15048J56473j04116m74795N10989
8336A259335N5494q99161O39907R7113L83731K02468o06518K53372n27016P76412
8326A635137j147600O63870P21873o47955R1028n03726O86315j87732j109903
8317B01307J205632j21533O9264k34153N1952j25860j3711K11091m47668P38562
$$ plain form
8386 885214 1172152 1293924 960695 998259 1137811 895651 1558923 994066 371886 1302535
8376 1302535 696019 985378 1009479 1659366 1605351 731269 689368 1390925 1306553 510691
8366 510691 1440706 833881 1225159 713959 895018 523886 837919 122479 866898 800650
8356 800650 1051397 1411978 998384 1504411 1461991 1101707 1556031 1045800 1593098 1556550
8346 1556550 903833 1016628 610595 1068419 855736 1170784 1327257 1223141 748346 1259335
8336 1259335 1314829 415668 1055575 1152688 1536419 1738887 1132369 1385741 858725 1635137
8326 1635137 487537 1151407 1873280 1225325 1316353 812627 1498942 1311210 201307
8317 201307 1406939 1285406 1354670 1120517 1172469 1046609 1032898 1243989 796321 1534883
8307A534883k00651k66739j9681M99696o30139L68089o76952N14188k0326L4239
8297A136607L92619n9737J15269r50782K73217J51033L32912l11343K02796J09890
8287A392481o99922M00733j31616k45122L45440O8090r844L8098P5684k15726
8277A018296L77095o7921j11332J24343q702K77978P0889m03638o2786q7277m07003
8266G19942O87122o91737O83617k8967l1292k39230q5863L94209m86389O58332
8256A579744k02606L27453n422j81563k78767j65150L4117K61285K2137K7253
8246A418481o4422m67113O77869r62419J142802o43961K20877L61864k6378K10741
8236A868341o48793N88724j34244l98834M10482K04960l12599M83299l4665n20969
$$ plain form
8307 1534883 1334232 1067493 1047812 1547508 917369 1285458 608506 1122694 1102368 1136607
8297 1136607 1529226 1469489 1584758 633976 907193 1058226 1391138 1079795 1282591 1392481
8287 1392481 692559 1093292 961676 716554 1061994 1130084 1120240 1158338 1234022 1018296
8277 1018296 1395391 1327470 1216138 1340481 1331779 1609757 1680646 1277008 1214222 1126945 719942
8266 719942 1407064 715327 1398944 1369977 1338685 1099455 1013592 1407801 921412 1579744
8256 1579744 1377138 1704591 1699169 1517606 1238839 1073689 1107806 1369091 1391228 1418481
8246 1418481 1354059 886946 1564815 602396 1745198 1101237 1322114 1683978 1657600 1868341
8236 1868341 1219548 1808272 1674028 1275194 1685676 1890636 1578037 2061336 2026671 1505702
8226A505702O07120n05952P10406j30334l69726L17227K05702n78498L48135Q3231
8216B193013n51376M58695o05511J034671k22313j77479P19905o62264N22230
8207B709571O15126n9294j030541O45517K04697n27412j12586k74977N57816j001793
8197A726124O38266L9408l01134J003183j79009L59879L07428j014370P79452
8188C359227m82486K53461J74008p19868K40535j76023K46879n37034P74115n50010
8178B582804N17633K43253l3867L19815n2304m57177L36270k03816o89556N53219
8168C116274j089018Q52602k82359L94094J2376Q4901n4111J22832L86286o21158
8158B922719M45359J78528o02833M45575l7325k33055k72420k66276Q08J02666
$$ plain form
8226 1505702 2112822 1606870 2317276 2186942 1817216 2134443 2340145 1761647 2109782 2193013
8216 2193013 1641637 2100332 1494821 2529492 2307179 2129700 2849605 2187341 2709571
8207 2709571 3324697 3265403 2234862 2880379 3085076 2557664 2445078 2170101 2727917 1726124
8197 1726124 2364390 2403798 2102664 3105847 2926838 3286717 3594145 2579775 3359227
8188 3359227 2876741 3130202 3304210 2584342 2824877 2648854 2895733 2358699 3132814 2582804
8178 2582804 3100437 3343690 3309823 3629638 3577334 3120157 3456427 3252611 2563055 3116274
8168 3116274 2027256 2879858 2597499 2991593 3003969 3088870 3034759 3157591 3543877 2922719
8158 2922719 3368078 3546606 2943773 3389348 3352023 3118968 2846548 2580272 2581080 2683746
8148B683746L59171J8131l40932M48752q35606P80398m50645k52918K94036k15547
8138B488586K89035L02630o58897P30699p71980O98198J56910m27060O29276q83366
8128B554031J013300q72544J99820L53401l289L883O9289J127554m05257r2560
8118C947628R04988j57161L3826L27477q2028R2699l01156M97597n36270l03205
8108D424395N73265N12395o08226m70669N15416p12332M6570o35103P19694j125264
8098C240141K45717j62909M97297q02817K6121M80940m24568j90540K21991Q4704
8088C216077p61488J24010k25214K12295j206973R69530k84687p99394J069388
8079B313544k82143K96789j04234M40909P0273o59216L63502R14237j529768R28228
$$ plain form
8148 2683746 3042917 3061048 2720116 3168868 2333262 3113660 2663015 2410097 2704133 2488586
8138 2488586 2777621 3080251 2421354 3152053 2380073 3078271 3235181 2808121 3437397 2554031
8128 2554031 3567331 2694787 2894607 3248008 3244719 3248602 3317891 4445445 4040188 3947628
8118 3947628 4852616 4695455 4729281 5056758 4974730 5067429 4766273 5263870 4727600 4424395
8108 4424395 4997660 5510055 4901829 4431160 4946576 4234244 4280814 3645711 4365405 3240141
8098 3240141 3485858 3322949 3820246 3017429 3043550 3524490 3099922 2909382 3131373 3216077
8088 3216077 2454589 2578599 2353385 2565680 1358707 2328237 2043550 1244156 2313544
8079 2313544 2031401 2328190 2223956 2664865 2735138 2075922 2439424 3353661 1823893 2752121
8069B752121k96983N12033j102346M79668j6334J00351j22201k20837O99321k28952
8059B555841l86672J48692L4622n35657O44868p13198J099943n06258m30798L49385
8049B260768o3858n08601l67211K98956M58434Q8474p81532J310606p1929L94482
8039C018589n5973L32928J25812R5686r08775o086J2171m18000k00872p10213
8029A285267Q65768n69831J34489J73581L49425m18814n22850P97558L0502L6444
8019B161539m57196N00799N50149p16887O75350m8845L21077k27220k82159J101334
8009C577941r15843l5539P9773o00367N32469o87348J16352M20568l45852l17721
7999A824433P38019p30452L61748k92180j95461L53240L19351m05098O781l3810
$$ plain form
8069 2752121 2455138 2967171 1864825 2344493 2328159 2428510 2306309 2085472 2784793 2555841
8059 2555841 2169169 2317861 2352483 1816826 2461694 1748496 2848439 2342181 1911383 2260768
8049 2260768 2196910 1688309 1321098 1620054 2078488 2166962 1385430 2696036 2624107 3018589
8039 3018589 2962616 3295544 3421356 3517042 2608267 2602181 2614352 2196352 1995480 1285267
8029 1285267 2151035 1581204 1715693 1889274 2238699 1819885 1297035 2094593 2125095 2161539
8019 2161539 1704343 2205142 2755291 2038404 2713754 2664909 2985986 2758766 2476607 3577941
8009 3577941 2662098 2626559 2706332 2105965 2638434 1951086 2067438 2488006 2142154 1824433
7999 1824433 2562452 1832000 2193748 1901568 1706107 2059347 2378698 1973600 1980381 1946571
7989A946571l62865N44211p81583J098708m47809m01626N24056Q0092j98105J61378
7979B163028n46012L89593o689J43986J32610m09880N25378k16373k2122l19742
7969A833777N63735r78011L34288J91228p7982k41694l94940P91156l57811J95283
7959A859029J25983k2478m0363N44774o25056J93289k90265R2692j53246N2601
7949A736960K33515j99436j10365K44278M94426m07452J56160L71909O1406Q4288
7939B665689j002946J100859q46160J10594j10688J03218j54916j62428K53418
7930A956640l33146K73059N16003o69040N97916j26943J05132N57025l72578L84066
7920B888134n3866M1716j58867j3118n8500j66939m2447l46202K83647K83207
$$ plain form
7989 1946571 1583706 2127917 1346334 2445042 1997233 1595607 2119663 2199755 2001650 2163028
7979 2163028 1617016 2006609 1999920 2143906 2276516 1866636 2392014 2175641 2153519 1833777
7969 1833777 2397512 1419501 1753789 1945017 1867035 1625341 1230401 2021557 1663746 1859029
7959 1859029 1985012 1962534 1922171 2466945 1841889 2035178 1744913 1837605 1684359 1736960
7949 1736960 1970475 1771039 1660674 1904952 2399378 1991926 2148086 2519995 2581401 2665689
7939 2665689 1662743 2763602 1917442 2028036 1917348 2020566 1865650 1703222 1956640
7930 1956640 1623494 1896553 2412556 1743516 2341432 2214489 2319621 2876646 2504068 2888134
7920 2888134 2834268 2875984 2717117 2703999 2645499 2478560 2436113 2089911 2373558 2656765
7910B656765k25041l3852O03173m15149K5811j63776N66867K1890n89117M04877
7900B852448j97692L67960l19227j98753J013027J80936m13225j65269N19204
7891C639409N32548j075610O15471M4829P8606m72079k89120M50829o3327k0921
7881C440635O5237M62742l07837O4631j81061P67845K01867N1847j16259J018518
7871E468165m12193N08182N85819L41203j98603J161336q8475P09334J001171
7862I075939O42942J880541J037510K371242J331033J621695J149512L86044L36855
7853A9833313j186053L8489k308267o42097j337769l33095n33396j201626N43344
7844A2872843p92255j96929j22430O98981N52063N39517J152644J320776J452636
$$ plain form
7910 2656765 2431724 2397872 3001045 2585896 2611707 2447931 3014798 3036688 2447571 2852448
7900 2852448 2654756 3022716 2703489 2504736 3517763 3698699 3285474 3120205 3639409
7891 3639409 4171957 3096347 3711818 3756647 3835253 3363174 3074054 3524883 3461556 3440635
7881 3440635 3505872 3968614 3660777 3725408 3544347 4312192 4514059 4565906 4449647 5468165
7871 5468165 5055972 5564154 6149973 6491176 6292573 7453909 7365434 8074768 9075939
7862 9075939 9718881 11599422 12636932 15008174 16339207 17960902 19110414 19496458 19833313
7853 19833313 18647260 18685749 16377482 15735385 14397616 14064521 13531125 12329499 12872843
7844 12872843 12080588 11883659 11761229 12460210 13012273 13551790 14704434 16025210 17477846
7835A7477846J893818L861046L584170N249883O113336O382697N725216L536301
7827E3824313J358840j11154l641409m176255n554339m665088n186390l513353
7819B8335165l922986k223992j944971j878318q46565n84343j6962j1657j04114
7810A6801257Q52527J562767M21924K628827K694265L865461M830383O394252
7802D0051663O168907N554188L140998J350868j408997k884893n137249n620137
7794D1215348n049487n580538m320006m543089k441575k064376k030021j058700
7786A4127556q90681q98506l90333q67982K99105n32624M57018O22937P10103
7777A2636593J602346P77326J688244P74260K125732N94994j46009N11270r75085
$$ plain form
7835 17477846 19371664 23232710 26816880 32066763 38180099 44562796 50288012 53824313
7827 53824313 55183153 55071999 51430590 47254335 41699996 37034908 31848518 28335165
7819 28335165 24412179 22188187 20243216 18364898 17518333 16933990 16917028 16905371 16801257
7810 16801257 17653784 19216551 19638475 22267302 24961567 28827028 33657411 40051663
7802 40051663 46220570 51774758 54915756 56266624 54857627 51972734 46835485 41215348
7794 41215348 36165861 30585323 26265317 21722228 19280653 17216277 15186256 14127556
7786 14127556 13236875 12338369 11948036 11080054 11379159 10846535 11303553 11926490 12636593
7777 12636593 14238939 15016265 16704509 17478769 19604501 20199495 20053486 20564756 19589671
7768A9589671k374614j449044j759562j591159k385677p68279o08504j057681
7760G595151q05275l21786m64594j113843p2962p22951P65041n04202K53406n00269
7750D107716N2135l45785k36261k45228J84811P2484m98187P172O58363m89194
7740C268026p57628O35571J24015l29563K25669l4019J22918r63005k00668j49920
7730A941396K97590L84027l4009k23802M75983j64178n23375O49740n35071n5686
7720B212615K3449L71691l04320J66726p28024M06351L47942q76781Q38706k28344
7710B230011l98796K08685J00764n80760K39123R0970m38420O77632l4139j28890
7700A966180k49791j68443L13311n99745K46158J37778O07825n81418L36791K29370
$$ plain form
7768 19589671 17215057 15766013 14006451 12415292 10029615 9261336 8652832 7595151
7760 7595151 6789876 6468090 6003496 4889653 4816691 4093740 4858781 4354579 4607985 4107716
7750 4107716 4159851 3814066 3577805 3332577 3517388 3589872 3091685 3098857 3757220 3268026
7740 3268026 2510398 3145969 3269984 2940421 3166090 3132071 3254989 2291984 2091316 1941396
7730 1941396 2238986 2623013 2589004 2365202 2841185 2677007 2153632 2803372 2268301 2212615
7720 2212615 2236064 2607755 2303435 2470161 1742137 2148488 2496430 1619649 2458355 2230011
7710 2230011 1831215 2039900 2140664 1559904 1799027 1889997 1451577 2129209 2095070 1966180
7700 1966180 1716389 1547946 1861257 1261512 1507670 1645448 2253273 1671855 2008646 2238016
7690B238016k55629o5471k0985j20962O73476l15701j24711L07668o78890K64858
7680A901669p58579k97867R51758R0014o47035M68628K55769o72627j6211J061153
7670B336672o98035K10977j04728Q63630k09196p40665O30396q80800j15918J49253
7660A441586L29506K3306j87128j19008J56481r8067k21662M75267k15832L01806
7650A886255Q2303l80014P09820o21062m42440K30095p5590P19744n22604o4161
7640A522346N45063k70367l55972j42412J61357L75105j24323K05152j75197L72476
7630B113228o97960R6601J62883R477K34763r25619R85243n45455P8129M60468
7620A971758J7796n36274J85268P7662N33253l79613k12020K21804L64438j099034
$$ plain form
7690 2238016 1982387 1916916 1895931 1774969 2448445 2132744 2008033 2315701 1636811 1901669
7680 1901669 1143090 845223 1796981 1886995 1239960 1708588 1964357 1291730 1275519 2336672
7670 2336672 1638637 1849614 1744886 2608516 2399320 1658655 2289051 1408251 1292333 1441586
7660 1441586 1771092 1794398 1607270 1488262 1644743 1546676 1325014 1800281 1584449 1886255
7650 1886255 1968558 1588544 2298364 1677302 1234862 1464957 1389367 2109111 1586507 1522346
7640 1522346 2067409 1797042 1441070 1298658 1460015 1835120 1710797 1915949 1740752 2113228
7630 2113228 1415268 1511869 1674752 1684229 1918992 993373 1978616 1433161 1511290 1971758
7620 1971758 1989554 1453280 1638548 1716210 2249463 1869850 1657830 1879634 2244072 1145038
7610A145038M91492O56728p35012M47171n51256L18168k18551P7170k1017O8358
7600A678289M16779p11405l90757J85111O03481k47852l36714K9946Q46744j105683
7590I67939Q37407K28689J36338n06478n409O86050m61656m01600J4952N93744
7580B089976l22374j03654N68771l43104n75193O80600m21183R84717j021812
7571A536744j98982N98255m0643J78935j48892K76306m59616L19654k60601J51937
7561A953097r3491K59908K4757n85504J22641M72770n25855K58299k98143M26858
7551B015337n46974P67646l03410j5016j22029k99349P48498r46985J05742Q90837
7541B294297j272273Q23465m39340Q69790n08808m95375O99345l30124K95668
$$ plain form
7610 1145038 1636530 2293258 1558246 2005417 1454161 1772329 1553778 1630948 1609931 1678289
7600 1678289 2095068 1383663 992906 1178017 1781498 1533646 1196932 1226878 2073622 967939
7590 967939 1805346 2034035 2170373 1663895 1658486 2344536 1882880 1481280 1496232 2089976
7580 2089976 1767602 1663948 2232719 1889615 1314422 1995022 1573839 2558556 1536744
7571 1536744 1337762 1936017 1895374 2074309 1925417 2201723 1742107 2061761 1801160 1953097
7561 1953097 1859606 2119514 2144271 1558767 1681408 2154178 1628323 1886622 1588479 2015337
7551 2015337 1468363 2236009 1932599 1917583 1795554 1496205 2244703 1297718 1403460 2294297
7541 2294297 1022024 1845489 1406149 2275939 1767131 1271756 1971101 1640977 1936645
7532A936645J31993J10186L21931o80942J18943N29429j173185Q38077o98328
7523A434749K02963m89752O74016M45257o61924j80799O01490m90610J87800L56771
7513B079961l56012n3025K57476J84023m33732M33431p6424j85163R6951p7098
7503A870388K25919n00157N8815j2700N45279j196911Q91547k06701j46852L49984
7493A878611n64076K28832J73906n82083J215375r25358M63614M42708r29876
7484A401653Q36844j017267L33397m74724O82397m7496M72235n19729p5774Q36718
7474B428254l24723o8890L54199n6987k43357n78482N37385l5900p6380k5514
7464A909605l32153K20772l18599K48340J66734n32310K28056p2769Q6373j34835
$$ plain form
7532 1936645 2068638 2178824 2500755 1819813 1938756 2468185 1295000 2133077 1434749
7523 1434749 1637712 1147960 1821976 2267233 1605309 1424510 2026000 1535390 1723190 2079961
7513 2079961 1723949 1670924 1928400 2112423 1678691 2112122 2035698 1850535 1947486 1870388
7503 1870388 2096307 1596150 1654965 1642265 2187544 990633 1882180 1675479 1528627 1878611
7493 1878611 1314535 1543367 1717273 1135190 2350565 1425207 1888821 2331529 1401653
7484 1401653 2238497 1221230 1554627 1079903 1762300 1714804 2187039 1667310 1591536 2428254
7474 2428254 2103531 2034641 2388840 2331853 2088496 1510014 2047399 2011499 1935119 1909605
7464 1909605 1577452 1798224 1479625 1727965 1894699 1362389 1590445 1517676 1604049 1469214
7454A469214M81779K62834l80360j56721L67082L42495k22240M64017q16490k55775
7444A555835J07681L52222n57786l27368M28323k21937L15012k90947L85801K87035
7434B033871n23136q4719N12498N68674p65780J41659L0668j85347N34804o28100
7424A635092k254q4334L64621n38381J7356N89634j65869J53231j22882J28728
7414A974942m78874N95997j90269M69764l41635O4352k31025O57603r43095K61356
7404A839116q2789o2410j43167J73253k0097k14983L31196m76175M52122J32856
7394A928922J06013k25465j21613k5075k71154L18239L41602p76387N56834p66293
7384A065623N50212L35077p87594O04309j83556j53481L45624L5264N10562p83125
$$ plain form
7454 1469214 1950993 2213827 1833467 1676746 2043828 2386323 2164083 2628100 1811610 1555835
7444 1555835 1663516 2015738 1457952 1130584 1558907 1336970 1651982 1361035 1746836 2033871
7434 2033871 1510735 1426016 1938514 2507188 1741408 1883067 1913735 1728388 2263192 1635092
7424 1635092 1632838 1548504 1913125 1374744 1392100 1981734 1815865 1969096 1846214 1974942
7414 1974942 1496068 2092065 1901796 2371560 2029925 2094277 1863252 2520855 1577760 1839116
7404 1839116 1756327 1693917 1550750 1724003 1703906 1488923 1820119 1343944 1796066 1928922
7394 1928922 2034935 1809470 1687857 1662782 1391628 1709867 2051469 1275082 1831916 1065623
7384 1065623 1615835 1950912 1163318 1767627 1584071 1430590 1776214 1811478 2322040 1538915
7374A538915j27338P45921m01721M28104l21233q9554j19584N0371n26357J49369
7364A326893M53848l42236K31686L87542m4911j2713k79961j31709K97838j40375
7354A745902N53881j78668m75034L69106r2007j38951m8278o25426N57852l83036
7344A285341O51183K13819j1661k56014j34201m50448n6365P03237k10871j27213
7334A606807J74142O99356l88725o93438M81925M95354o99390o00784J132403
7325B207650m36185j80134L76692m44701O7120M01555m25634K59589j68239J58471
7315A816184j97899n14978N51017k20838J78237j27632L72341l10092Q4130N79706
7305B210176L90642q20302O03305l91549L89392m92489k24389K04051r6514l71327
$$ plain form
7374 1538915 1411577 2157498 1755777 2183881 1862648 1773094 1653510 1703881 1177524 1326893
7364 1326893 1780741 1438505 1670191 2057733 2012822 2000109 1720148 1588439 1886277 1745902
7354 1745902 2299783 2121115 1646081 2015187 1923180 1784229 1735951 1110525 1668377 1285341
7344 1285341 1936524 2150343 2138682 1882668 1748467 1298019 1241654 1944891 1734020 1606807
7334 1606807 1780949 2480305 2091580 1398142 1880067 2375421 1676031 1075247 2207650
7325 2207650 1771465 1591331 1968023 1523322 1590442 1991997 1566363 1825952 1657713 1816184
7315 1816184 1618285 1103307 1654324 1433486 1611723 1484091 1856432 1546340 1630470 2210176
7305 2210176 2600818 1780516 2383821 1992272 2381664 1889175 1664786 1868837 1772323 1400996
7295A400996J10554O373K70058M068L48366n83706n05455J105460p5764k71300
7285A809650K25140l34959M93229q39605N83811J44632j60654L2866k85799K28585
7275A896896p1956K02591L6017n95170M8246N53389j76081p7257J6099k21305
7265A611469n31454L51903k69172O28397O3824J03695N4165k09424M90647j5510
7255B278540l92191m80531J276510m31150k8913O0509j95136n7133m14824K19517
7245A835198m66892L73568J57902M89522j026330J162478n33657m3833P657m20680
7235A534933P99661o29506L66008J9763j84680K98924k27952j12626K67116J26230
7225B257871j75992r9697O66440j175947J84726m63630P09577j52493J02198Q49741
$$ plain form
7295 1400996 1511550 1517923 1787981 1792049 2140415 1556709 1051254 2156714 2080950 1809650
7285 1809650 2034790 1699831 2193060 1353455 1937266 2081898 1921244 1954110 1668311 1896896
7275 1896896 1824940 2027531 2063548 1468378 1516624 2070013 1893932 1816675 1832774 1611469
7265 1611469 1080015 1431918 1162746 1791143 1854967 1958662 2012827 1803403 2294050 2278540
7255 2278540 1886349 1405818 2682328 2251178 2222265 2282774 2087638 2030505 1615681 1835198
7245 1835198 1368306 1741874 1899776 2389298 1362968 2525446 1991789 1947956 1955613 1534933
7235 1534933 2334594 1705088 2071096 2090859 1906179 2205103 1977151 1864525 2131641 2257871
7225 2257871 2081879 1982182 2648622 1472675 1657401 1193771 1903348 1750855 1853053 2702794
7215B702794q30542l03512L80770J99129m50738J65992N44652j19977l19018k85129
7205A684421L08297j91324m30782J097548m49320M09541M2142n65927M5662K12512
7195B162770q3316m21790K84319k6658P30669j449853P71690K49018j14637k95204
7185A807008J42520M51225q4009k31469J98782n3722k87654j48784Q25713j054210
7175A565400J049296n17616k28932M56065l09189m9504n54957N15296L99346j72658
7165B152547m53441O92864P0889n10058J87055L9328n10353P23136l59443L72023
7155B404547p35908o3264M55702J20289l06L36589M13697j131368O53854k01619
7145B252213k08872K00867r228l69903P2595j21055M81468o02496N46248j98169
$$ plain form
7215 2702794 1872252 1568740 1949510 2148639 1697901 1863893 2408545 2288568 1969550 1684421
7205 1684421 1992718 1801394 1370612 2468160 2018840 2428381 2470523 1904596 1950258 2162770
7195 2162770 2079454 1657664 1941983 1915325 2645994 1196141 1967831 2216849 2102212 1807008
7185 1807008 1949528 2400753 2316744 2085275 2284057 2230335 1942681 1793897 2619610 1565400
7175 1565400 2614696 2097080 1868148 2324213 2015024 1965520 1410563 1925859 2325205 2152547
7165 2152547 1699106 2391970 2462859 1952801 2139856 2179184 1668831 2391967 2032524 2404547
7155 2404547 1668639 1605375 2061077 2181366 2181060 2517649 2931346 1799978 2453832 2252213
7145 2252213 2043341 2244208 2234980 1865077 1937672 1816617 2298085 1695589 2241837 2043668
7135B043668k42115N72105P3800l87012M34925p31445M70621k95744O25278j60129
7125B403952m72515Q18572n76591K89070m81598K27108n7120l38387o5003N26459
7115B273947r8226j53034k38975P7098K40115M03704l73470J50592K07013J01742
7105B590506n80899N3293K69638N2560m25042P53157J16682q54106o9654P65529
7095B671664r25673J042684n12623J37668J06686p70124P51878k97173J50730
7086B355717j82084j1688k39450L66709m1302l48171N07007k60666M6842k12528
7076A980386N22211O1305J90863l83578O14268o44330j35228K40857K65880l90324
7066B322310J73798n15323O50597m00448L00588k80308P33260m52910M50316m66073
$$ plain form
7135 2043668 1801553 2373658 2447458 2060446 2495371 1763926 2234547 1938803 2564081 2403952
7125 2403952 1931437 2750009 2173418 2462488 1980890 2207998 2150878 1812491 1747488 2273947
7115 2273947 2175721 2022687 1783712 1860810 2100925 2504629 2131159 2281751 2488764 2590506
7105 2590506 2009607 2062900 2332538 2385098 1960056 2713213 2829895 1975789 1906135 2671664
7095 2671664 1745991 2788675 2276052 2413720 2520406 1750282 2502160 2204987 2355717
7086 2355717 2173633 2161945 1922495 2289204 2247902 1899731 2406738 2146072 2192914 1980386
7076 1980386 2502597 2563902 2754765 2371187 2985455 2341125 2205897 2446754 2712634 2322310
7066 2322310 2496108 1980785 2631382 2230934 2531522 2251214 2984474 2531564 2981880 2515807
7056B515807J23496j12128J90363j98535k2066L70228j25981K86786K90645k31324
7046C087291K86415r02541J90209L17988m84673M79183q2264q0299k60563M98026
7036C048772l02907O98708o09725K42144M24773k50949J62022r3190j39856K10874
7026C390666Q54603m51192Q798M64088R3972O7712J03098P69513M68599q5096
7016E684761J96258M49467k95551r8227m56870k75544n45000k63616M68912J42244
7006E006834l37359O53877m10738N89579j49451P86151N51069L26735J131361
6997H148058R53556M67054m15421N20122q12304m43465m17590Q8622r52217k96499
6987F839916n47929n3200j72359J58515M17932r3709O83130J415795Q53277Q24945
$$ plain form
7056 2515807 2639303 2527175 2717538 2519003 2496937 2867165 2741184 3027970 3318615 3087291
7046 3087291 3373706 2471165 2661374 2979362 2494689 2973872 2891608 2811309 2550746 3048772
7036 3048772 2745865 3444573 2834848 3076992 3501765 3250816 3412838 3319648 3179792 3390666
7026 3390666 4245269 3794077 3802875 4266963 4360935 4428647 4531745 5301258 5769857 5684761
7016 5684761 5881019 6330486 6034935 5936708 5479838 5204294 4659294 4395678 4864590 5006834
7006 5006834 4669475 5323352 4912614 5502193 5352742 6138893 6689962 7016697 8148058
6997 8148058 9101614 9568668 9153247 9673369 8861065 8417600 8000010 8088632 7136415 6839916
6987 6839916 6291987 6238787 6066428 6224943 6642875 6549166 7232296 8648091 9501368 10326313
6977A0326313K554127L290291J271889R54278L69584j385591j914747k117037
6969A3349107j339746j678894j012525q64910m11488n40884P8177l44624j36930
6960G097283M70875n76078R11990J57429J032847R05863k57110J618816R92591
6951A2354506J485626L828413O220143P565327O429195K935020r15692k759817
6943C7142721n799202m737895l750585l959878l391715k018956j680964o85727
6935A1117799j306868j106848M29890M08442n04213K31299P49222n95294N46502
6926I969931J61571J613993J430727J637752K868838O333844O878609O739251
6918C7634516M072747p40790k108608o164408n117943m134919m154795l666363
$$ plain form
6977 10326313 12880440 16170731 17442620 18396898 18766482 17380891 15466144 13349107
6969 13349107 12009361 10330467 9317942 8453032 8041544 7500660 7578837 7234213 7097283
6960 7097283 7568158 6992080 7904070 8061499 9094346 10000209 9743099 11361915 12354506
6951 12354506 13840132 17668545 23888688 31454015 37883210 40818230 39902538 37142721
6943 37142721 31343519 26605624 22855039 18895161 15503446 13484490 11803526 11117799
6935 11117799 9810931 8704083 9133973 9542415 9038202 9269501 10018723 9423429 9969931
6926 9969931 10131502 11745495 13176222 14813974 17682812 24016656 30895265 37634516
6918 37634516 41707263 40966473 38857865 32693457 27575514 23440595 19285800 15619437
6910A5619437l129792j955561m81794j311938o67557K44473l60530j158500L63873
6901G162111L8718l06418L61311O4976R33138k84082N22564K46411J857897K254160
6891A2850786K221251J296670M31672j098283j727101j778684j284856j663559
6883I247896q87140j449692m41544m67448m56652O6699l68662l62210K01823M2951
6873E126021j95834N99643j46302l01441k2186k01898j27831n4967j37369n75328
6863C962508L48322j13837m58203K1951l04662r1859N14989K35019l43340J56756
6853C927644J64168k69941k72872J24851M55178m59471O96062p54239O12401k10802
6843D012979k00242L38310k84578p7374j6559k9835L48965l28032L45936k47909
$$ plain form
6910 15619437 12489645 10534084 10052290 8740352 8072795 8317268 7956738 6798238 7162111
6901 7162111 7200829 6894411 7255722 7320698 8253836 7969754 8492318 8738729 10596626 12850786
6891 12850786 15072037 16368707 16800379 15702096 13974995 12196311 10911455 9247896
6883 9247896 8360756 6911064 6469520 6002072 5545420 5612119 5243457 4881247 5083070 5126021
6873 5126021 4930187 5529830 5383528 5082087 5059901 4858003 4730172 4675205 4537836 3962508
6863 3962508 4310830 4196993 3738790 3760741 3456079 3364220 3879209 4114228 3770888 3927644
6853 3927644 4091812 3821871 3548999 3673850 4129028 3669557 4365619 3611380 4223781 4012979
6843 4012979 3812737 4151047 3866469 3789095 3772536 3742701 4091666 3763634 4109570 3861661
6833C861661n41546Q87755j021264J202038M67767n59155l0358k64909K04102
6824D206091J17847j26144R68200m4079k5923j83517N65967m12910k7691l7424
6814E000417M19423l05666m70571N34700k32526J37555l06281j58635j64308N89303
6804E043411k49092j50380j68833J067752p07838P07135L26195M51908o36729
6795E683529J60178j14472l02538J11567o37716K68195K62815k09501p25066Q78504
6785E375495q06245j20010j75612O69800l83645N96617o72864P89825o86026L68670
6775D956005k07815k06548M14660N66491J26902l49504J135617q30576l58271
6766E246961K43318M03073m22169l71146J6112J40753o8315j18314L19617n765
$$ plain form
6833 3861661 3320115 4207870 3186606 4388644 4856411 4297256 4266898 4001989 4206091
6824 4206091 4323938 4197794 5165994 5121915 5095992 4912475 5478442 5065532 5037841 5000417
6814 5000417 5419840 5114174 4643603 5178303 4945777 5083332 4777051 4618416 4454108 5043411
6804 5043411 4794319 4643939 4475106 5542858 4835020 5542155 5868350 6320258 5683529
6795 5683529 5843707 5729235 5426697 5538264 4900548 5168743 5431558 5222057 4496991 5375495
6785 5375495 4569250 4449240 4273628 4943428 4559783 5156400 4483536 5273361 4587335 4956005
6775 4956005 4748190 4541642 4956302 5522793 5649695 5300191 6435808 5605232 5246961
6766 5246961 5490279 5893352 5471183 5100037 5116149 5256902 5188587 5070273 5389890 5384125
6756E384125j95588n3996K68138q08879J79853l28846M20116k02906j01094j90345
6746D370578J132895m96651L5810K79329L15073P9308L3968k83829o7580M77277
6736E876178q48625P36355p60849M1530K93857N43170n36890J91422o8721m77529
6726D989898R02398M3439O88911N35811O75337N4035n30920n48636n6710k25680
6716F527883p01195k24370J06859n16387L8421j1207L94950m25444Q696j4509
6706E183697P7283L72828m79806J19565j88194M69806j29660M77511J120297O90428
6696G713755J461904J093696J811822Q56740Q39671j135444r25499n83295k068365
6687I064985q24933o86755r78093n76489k06031l08152J09435j89733K10357m06290
$$ plain form
6756 5384125 5188537 5134541 5402679 4593800 4773653 4444807 4864923 4662017 4560923 4370578
6746 4370578 5503473 5006822 5042632 5321961 5637034 5716342 5750310 5466481 5398901 5876178
6736 5876178 5027553 5763908 5003059 5044589 5338446 5881616 5344726 5536148 5467427 4989898
6726 4989898 5892296 5935735 6624646 7160457 7835794 7889829 7358909 6810273 6753563 6527883
6716 6527883 5826688 5602318 5709177 5192790 5231211 5220004 5614954 5189510 5198206 5183697
6706 5183697 5260980 5633808 5154002 5273567 5085373 5555179 5425519 5903030 7023327 7713755
6696 7713755 9175659 10269355 12081177 12937917 13777588 12642144 11716645 11133350 9064985
6687 9064985 8240052 7553297 6575204 5998715 5792684 5484532 5593967 5404234 5614591 5208301
6677E208301L99302l3474k01004L12291k85601L96891l23504J177536j10187J299092
6667G839643O33156K437286J447226K28381L3478r93201j561325j486848l94368
6658H183428o13185o60763q95090N68696p01569J2114j66050m43055k46203L64188
6648E402511k69455k18252M09333l23163l89311M9351O48525N85584j39670r1706
6638E663747K013225m87200J03510P22549l07937j017948P76224N39132M74035
6629H479337J57350j97130l37650p02659R214o32375k01473l22263n36540R4793
6619E810604k62558m7269n65118j98602R56083r93602N98742m14139m08727R62779
6609E438193o32364J178373K28044J99547P66947J601136J098523K800451J903762
$$ plain form
6677 5208301 5607603 5574129 5373125 5685416 5399815 5796706 5473202 6650738 6540551 7839643
6667 7839643 8472799 10910085 12357311 12585692 12619170 11625969 10064644 8577796 8183428
6658 8183428 7570243 6909480 6014390 6583086 5881517 5893631 5727581 5284526 5038323 5402511
6648 5402511 5133056 4914804 5324137 5000974 4611663 4661014 5309539 5895123 5755453 5663747
6638 5663747 7676972 7189772 7293282 8015831 7707894 6689946 7466170 8005302 8479337
6629 8479337 8636687 8439557 8101907 7399248 7408462 6776087 6574614 6252351 5715811 5810604
6619 5810604 5548046 5500777 4935659 4737057 5693140 4699538 5298280 4884141 4475414 5438193
6609 5438193 4805829 5984202 6212246 6411793 7178740 8779876 9878399 12678850 14582612
6600A4582612O77910L01911j496163j320307j987533p24671j219790j207741p77781
6591F828447L85745J61923j054122L0848K22383p43288K26623p2739Q20246n85540
6581F220526j2699O62038k45495N7539R67852Q78353J577478K911457K620456
6572A5637505R83435l04530m58890j821954j418597r56765q50347j676492l59062
6563H774303q11800o13220j72863O565k30106q85500J04451L16743o97032l90845
6553E400696O04703j61297m42901O23565K12334K14437R34966P55398Q60673Q44938
6543I847512O5320K52961k90189k72620o68670p55050q28435k28070r71193O63688
6533F815254o73142K4765L7138l26772L54587n65829R4372J28972K15138n75327
$$ plain form
6600 14582612 15260522 15562433 14066270 12745963 10758430 10033759 8813969 7606228 6828447
6591 6828447 7214192 7376115 6321993 6352841 6575224 5831936 6058559 5985820 6806066 6220526
6581 6220526 6207827 6869865 6624370 6681909 7649761 8528114 10105592 13017049 15637505
6572 15637505 16620940 16316410 15857520 14035566 12616969 11660204 10809857 9133365 8774303
6563 8774303 7962503 7349283 7176420 7182985 6952879 6067379 6171830 6488573 5791541 5400696
6553 5400696 6005399 5844102 5401201 6024766 6237100 6451537 7386503 8141901 9002574 9847512
6543 9847512 9912832 10165793 9875604 9602984 8934314 8179264 7350829 7122759 6151566 6815254
6533 6815254 6142112 6166877 6204015 5877243 6231830 5666001 5760373 5889345 6104483 5529156
6523E529156K39276r8219J84074j030003J56551n627N22365k27717q8613K85551
6513E466794j92442K98352l32865N51021k32505k85267m32614K71494P6413k61008
6503D927373k19187K82613L95988r7753k946J66912N20960j004101L62791N3137
6493E385787m25940k99760R50807j118052M93820l51322K84831k63982N15405
6484E171594j29091l35045L54639k46442J01030n90286P97290m13485j25161R17213
6474E502256N75480o35710j61560M51862k3035J56947n20650O03318m0257n55197
6464E353454k64344M78152M2148m67440M54036o4730L14710L7706j72001m22313
6454E289378J67868L16180k31347l64679P35643n95462Q32110q71763Q35363L60831
$$ plain form
6523 5529156 5768432 5670213 5854287 4824284 4980835 4975208 5497573 5269856 5181243 5466794
6513 5466794 5274352 5572704 5239839 5790860 5558355 5273088 4840474 5111968 5188381 4927373
6503 4927373 4708186 4990799 5386787 5289034 5286088 5453000 5973960 4969859 5332650 5385787
6493 5385787 4959847 4660087 5610894 4492842 4986662 4635340 4920171 4656189 5171594
6484 5171594 5042503 4707458 5062097 4815655 4916685 4326399 5123689 4710204 4585043 5502256
6474 5502256 6077736 5442026 5280466 5732328 5709293 5866240 5345590 5948908 5908651 5353454
6464 5353454 5089110 5567262 5609410 5141970 5596006 5531276 5845986 5883692 5711691 5289378
6454 5289378 5457246 5773426 5542079 5177400 5913043 5317581 6149691 5277928 6113291 6474122
6444F474122m48686j34241P55645q99935L10104K91263K5778k72069j013969J316916
6434F404928n97794m17129P60620J38372n6771p5138R62805l19775j19055M73283
6424G154346M2389k99193J06423K84570K0822j8397o8783j48037K31595K57952
6414G563687p74784J002173J6854O707k2294j58379J060204l61940q9850L24359
6404H566737j36957M34807q17697N74924k16702K55137J73246J92389J52457N48763
6394I727104k25472L67050K89616l91542L84483j45428J256638j014911N29559
6385A0777097p19763O79432L23851o50600O07204K44650l85654N73651k82945
6376A1166923J213276n17512J37343M83495L87472k63587l53403j19427L83000
$$ plain form
6444 6474122 6025436 5891195 6646840 5746905 6057009 6348272 6374050 6101981 5088012 6404928
6434 6404928 5807134 5390005 6150625 6288997 6232226 6157088 7119893 6800118 6681063 7154346
6424 7154346 7196735 6897542 7003965 7288535 7309357 7290960 7222177 7074140 7305735 7563687
6414 7563687 6788903 7791076 7807930 7814637 7792343 7633964 8694168 8332228 8242378 8566737
6404 8566737 8429780 8864587 8046890 8621814 8405112 8660249 8833495 9025884 9178341 9727104
6394 9727104 9501632 9868682 10158298 9766756 10151239 10005811 11262449 10247538 10777097
6385 10777097 10057334 10736766 11060617 10410017 11017221 11261871 10876217 11449868 11166923
6376 11166923 12380199 11862687 12000030 12483525 12870997 12607410 12254007 12134580 12517580
6367A2517580N68173j093065J377783K05804N25680j125781P57791L3656K44593
6358A4012214m87344P6765P68993l08750p017j30310R95078n89423R96346o24942
6348A4701610L85011O02141k58177o41750M26469p86135L61573m90788K65117
6339A4565071M54387o04099J05488P46180P6608o93384N42021k61623N05552m25183
6329A5011018k12930N29492o69317K67901m5986m36441Q52008K69002J9940m77462
6319A5107225Q24552l48651J19863J28346K2151Q80280j036698K16694M14926
6310A6328688J30061o59383M61383l03621O24277o08164J055193p30026P49311
6301A7047719M17926p77596R66109L75927O53475J325908P94035L210677J557120
$$ plain form
6367 12517580 13085753 11992688 13370471 13576275 14101955 12976174 13733965 13767621 14012214
6358 14012214 13524870 13601635 14370628 14061878 14054861 13924551 14919629 14330206 15326552 14701610
6348 14701610 15086621 15688762 15430585 14788835 15215304 14429169 14790742 14299954 14565071
6339 14565071 15019458 14415359 14520847 15267027 15343635 14650251 15192272 14930649 15436201 15011018
6329 15011018 14798088 15327580 14658263 14926164 14880178 14443737 15295745 15564747 15584687 15107225
6319 15107225 15931777 15583126 15702989 15831335 15853486 16733766 15697068 15913762 16328688
6310 16328688 16458749 15799366 16260749 15957128 16581405 15973241 17028434 16298408 17047719
6301 17047719 17465645 16688049 17654158 18030085 18683560 20009468 20803503 24014180 25571300
6292B5571300K215439K151509J26585m44614j600935j574582j861105j440780
$$ plain form
6292 25571300 27786739 29938248 30064833 29620219 28019284 26444702 24583597 23142817
$$ [...]
##END NTUPLES=NMR SPECTRUM
##END=
