##TITLE=abcd
##JCAMPDX= 6.0         $$ Bruker NMR JCAMP-DX V2.0
##DATA TYPE= NMR SPECTRUM
##DATA CLASS= NTUPLES
##ORIGIN= UXNMR, Bruker Analytische Messtechnik GmbH
##OWNER= root
$$ XWIN-NMR		Version 3.5
$$ Wed May 20 17:21:19 2026 Russian Standard Time (UT+4h)  servis@DPX200
##.OBSERVE FREQUENCY= 200.131235884673
##.OBSERVE NUCLEUS= ^1H
##.ACQUISITION MODE= SIMULTANEOUS
##.ACQUISITION SCHEME= undefined
##.AVERAGES= 32
##.DIGITISER RES= 18
##SPECTROMETER/DATA SYSTEM= spect
##.PULSE SEQUENCE= zg
##.SOLVENT NAME= CDCl3
##.SHIFT REFERENCE= (INTERNAL, CDCl3, 0, 16.4885)
##AUDIT TRAIL= $$ (NUMBER, WHEN, WHO, WHERE, WHAT)
$$ ##TITLE= Audit trail, XWIN-NMR		Version 3.5
$$ ##JCAMPDX= 5.01
$$ ##ORIGIN= Bruker BioSpin GmbH
$$ ##OWNER= servis
$$ F:\spectra/data/av/nmr/H1/1/pdata/1/auditp.txt
$$ ##AUDIT TRAIL=  $$ (NUMBER, WHEN, WHO, WHERE, WHAT)
(   1,<2026-05-20 17:18:31.93 +0400>,<servis>,<DPX200>,
      <created by zg, POWCHK disabled, PULCHK disabled
       configuration hash MD5:
       00 E9 B6 7A A2 85 ED C7 34 08 36 98 17 FE 4E 26
       data hash MD5: 32K
       70 62 63 FB E6 0C 9E F0 A0 DF 9F F5 32 A9 68 8B>)
(   2,<2026-05-20 17:20:21.89 +0400>,<servis>,<DPX200>,
      <Start of raw data processing
       efp BC_mod = 2 LB = 0.05 FT_mod = 6 PKNL = 1 PHC0 = -412.19 PHC1 = 3.101563 SI = 16K 
       data hash MD5: 16K
       A1 11 F4 92 94 99 72 B3 9A CA A0 F9 CD FA 4E 44>)
$$ ##END=
$$ 
$$ hash MD5
$$ 55 BB 94 48 A3 8B 25 25 DF CD 0E 83 E9 45 35 A5
##$RELAX= 
##$RELAX= 
##$RELAX= 
##$RELAX= 
##$RELAX= 
##$RELAX= 
##$RELAX= 
##$RELAX= 
$$ Bruker specific parameters
$$ --------------------------
##$DU= <F:\spectra>
##$EXPNO= 1
##$NAME= <H1>
##$PROCNO= 1
##$TYPE= <nmr>
##$USER= <av>
##$AMP= (0..31)
100 100 100 100 100 100 100 100 100 100 100 100 100 100 100 100 100 100 
100 100 100 100 100 100 100 100 100 100 100 100 100 100 
##$AQSEQ= 0
##$AQ_mod= 1
##$AUNM= <au_zg>
##$AUTOPOS= <>
##$BF1= 200.13
##$BF2= 200.13
##$BF3= 200.13
##$BF4= 200.13
##$BF5= 500.13
##$BF6= 500.13
##$BF7= 500.13
##$BF8= 500.13
##$BYTORDA= 1
##$CFDGTYP= 0
##$CFRGTYP= 5
##$CHEMSTR= <none>
##$CNST= (0..31)
1 1 145 1 1 1 1 1 1 1 1 1 1 1 1 1 1 1 1 1 1 1 1 1 1 1 1 1 1 1 1 1 
##$CPDPRG= <>
##$CPDPRG1= <>
##$CPDPRG2= <>
##$CPDPRG3= <>
##$CPDPRG4= <mlev>
##$CPDPRG5= <mlev>
##$CPDPRG6= <mlev>
##$CPDPRG7= <mlev>
##$CPDPRG8= <mlev>
##$CPDPRGB= <>
##$CPDPRGT= <>
##$D= (0..31)
0 2 0 0 0 0 0 0 0 0.06 0 0 0 0 0 0 0.0002 0 0 0 0 0 0 0 0 0 0 0 0 0 0 
0 
##$DATE= 1779283111
##$DBL= (0..7)
120 120 120 120 120 120 120 120 
##$DBP= (0..7)
150 150 150 150 150 150 150 150 
##$DBP07= 0
##$DBPNAM0= <>
##$DBPNAM1= <>
##$DBPNAM2= <>
##$DBPNAM3= <>
##$DBPNAM4= <>
##$DBPNAM5= <>
##$DBPNAM6= <>
##$DBPNAM7= <>
##$DBPOAL= (0..7)
0.5 0.5 0.5 0.5 0.5 0.5 0.5 0.5 
##$DBPOFFS= (0..7)
0 0 0 0 0 0 0 0 
##$DE= 6
##$DECBNUC= <off>
##$DECIM= 32
##$DECNUC= <off>
##$DECSTAT= 4
##$DIGMOD= 1
##$DIGTYP= 9
##$DL= (0..7)
0 120 120 120 120 120 120 120 
##$DP= (0..7)
150 150 150 150 150 150 150 150 
##$DP07= 0
##$DPNAME0= <>
$$ [...]
##$SUBNAM4= <"">
##$SUBNAM5= <"">
##$SUBNAM6= <"">
##$SUBNAM7= <"">
##$SUBNAM8= <"">
##$SUBNAM9= <"">
##$SW= 20.6817932712277
##$SWIBOX= (0..15)
0 0 3 0 0 0 0 0 0 0 0 0 0 0 0 0 
##$SW_h= 4139.07284768212
##$TD= 32768
##$TD0= 1
##$TE= 0
##$TE2= 300
##$TE3= 300
##$TEG= 300
##$TL= (0..7)
0 120 120 120 120 120 120 120 
##$TP= (0..7)
150 150 150 150 150 150 150 150 
##$TP07= 0
##$TPNAME0= <>
##$TPNAME1= <>
##$TPNAME2= <>
##$TPNAME3= <>
##$TPNAME4= <>
##$TPNAME5= <>
##$TPNAME6= <>
##$TPNAME7= <>
##$TPOAL= (0..7)
0.5 0.5 0.5 0.5 0.5 0.5 0.5 0.5 
##$TPOFFS= (0..7)
0 0 0 0 0 0 0 0 
##$TUNHIN= 0
##$TUNHOUT= 0
##$TUNXOUT= 0
##$USERA1= <user>
##$USERA2= <user>
##$USERA3= <user>
##$USERA4= <user>
##$USERA5= <user>
##$V9= 5
##$VALIST= <valist>
##$VCLIST= <CCCCCCCCCCCCCCC>
##$VD= 0
##$VDLIST= <DDDDDDDDDDDDDDD>
##$VPLIST= <PPPPPPPPPPPPPPP>
##$VTLIST= <TTTTTTTTTTTTTTT>
##$WBST= 1024
##$WBSW= 30
##$XGAIN= (0..3)
0 0 0 0 
##$XL= 0
##$YL= 0
##$YMAX_a= 652411
##$YMIN_a= -911868
##$ZGOPTNS= <>
##$ZL1= 120
##$ZL2= 120
##$ZL3= 120
##$ZL4= 120
##$ABSF1= 0
##$ABSF2= 0
##$ABSG= 0
##$ABSL= 0
##$ALPHA= 0
##$AQORDER= 0
##$ASSFAC= 0
##$ASSFACI= 0
##$ASSFACX= 0
##$ASSWID= 0
##$AUNMP= <proc_1d>
##$AZFE= 0.1
##$AZFW= 0.1
##$BCFW= 0
##$BC_mod= 2
##$BYTORDP= 0
##$COROFFS= 0
##$CY= 18.4799938201904
##$DATMOD= 1
##$DC= 0
##$DFILT= <>
##$DTYPP= 0
##$F1P= 9.9274215381318
##$F2P= -0.165520771350173
##$FCOR= 1
##$FTSIZE= 16384
##$FT_mod= 6
##$GAMMA= 0
##$GB= 0
##$INTBC= 1
##$INTSCL= 4.127829e-11
##$ISEN= 128
##$LB= 0.05
##$LEV0= 0
##$LPBIN= 0
##$MAXI= 10000
##$MC2= 0
##$MEAN= 0
##$ME_mod= 0
##$MI= 50
##$NCOEF= 0
##$NC_proc= -6
##$NLEV= 6
##$NOISF1= 3.799351
##$NOISF2= 2.8
##$NSP= 0
##$NTH_PI= 0
##$NZP= 0
##$OFFSET= 16.48848
##$PC= 4
##$PHC0= -412.19
##$PHC1= 3.101563
##$PH_mod= 1
##$PKNL= yes
##$PPARMOD= 0
##$PSCAL= 4
##$PSIGN= 0
##$REVERSE= no
##$SF= 200.130005582386
##$SI= 16384
##$SIGF1= 3
##$SIGF2= 2
##$SINO= 400
##$SIOLD= 16384
##$SREGLST= <1H.CDCl3>
##$SSB= 0
##$STSI= 16384
##$STSR= 0
##$SW_p= 4139.07284768211
##$SYMM= 0
##$S_DEV= 0
##$TDeff= 32768
##$TDoff= 0
##$TI= <>
##$TILT= no
##$TM1= 0
##$TM2= 0
##$TOPLEV= 0
##$USERP1= <user>
##$USERP2= <user>
##$USERP3= <user>
##$USERP4= <user>
##$USERP5= <user>
##$WDW= 1
##$XDIM= 16384
##$YMAX_p= 470645999
##$YMIN_p= -2359411
$$ End of Bruker specific parameters
$$ ---------------------------------
##NTUPLES= NMR SPECTRUM
##VAR_NAME=  FREQUENCY,     SPECTRUM/REAL,   SPECTRUM/IMAG
##SYMBOL=    X,             R,               I
##VAR_TYPE=  INDEPENDENT,   DEPENDENT,       DEPENDENT
##VAR_FORM=  AFFN,          ASDF,            ASDF
##VAR_DIM=   16384,         16384,           16384
##UNITS=     HZ,            ARBITRARY UNITS, ARBITRARY UNITS
##FACTOR=    0.252644378177508, 1,           1
##FIRST=     3299.83951724647, 0,            0
##LAST=      -839.233330435636, 0,           0
##MIN=       -839.233330435636, -2359411,    0
##MAX=       3299.83951724647, 470645999,    0
$$ Real data points
##PAGE= N=1
##DATA TABLE= (X++(R..R)), XYDATA
$$ [...]
9995 -110382 -178584 -549032 -50700 -215994 -3603 192909 301847 -339364 -442605 -649991
9985 -649991 -381901 -1074516 -112334 67197 1134112 79335 156443 464223 906271 468994
9975 468994 30788 249085 514388 190434 1035829 -394688 -297839 126559 -408718 -20806
9965 -20806 760486 422809 -249937 116580 -308122 -429514 579478 311856 -18008 220008
9955 220008 485446 178916 179721 -27639 655770 607638 -15285 -327156 396272 180473
9945 180473 159259 317866 22922 -376423 -434709 -209618 -426625 446970 313051 280939
9935 280939 -18424 -483075 -68866 485501 197238 115436 975264 -362282 608246 174818
9925 174818 743156 505115 138262 28466 945360 395000 941333 -40866 481917 -780143
9915 -780143 415416 326334 164264 -179291 670640 752143 499609 285586 602047 996562
9905 996562 -103530 1042843 585409 -117310 1347834 451347 324670 2270 262632
9896 262632 385839 1158714 991335 327134 615194 1171897 -160694 326926 406799 114493
9886 114493 -85144 739303 687089 666836 666608 1252875 722492 632324 862765 856905 983029
9875 983029 834013 655109 1505148 774888 1286476 1336975 1896371 1786874 2285780 1765672
9865 1765672 1758265 1000425 2030488 3068698 4027591 4414248 6207657 5162640 6948337
9856 6948337 6259129 6702218 5640569 4880154 5579292 5266052 3996871 4193200 4693424
9847 4693424 4211392 2740954 2777785 2765902 1608957 2782078 2030452 2221393 2751760
9838 2751760 2244185 2585762 3021701 2333022 2536261 2512982 3129680 3187167 3676161 4464235
9828 4464235 5548761 5796853 7664057 7210119 6626583 6161415 5537193 5581372 6351699
9819 6351699 6268460 5674113 4134682 3778496 2830881 3545998 2006284 1489003 1617511
9810 1617511 1543005 1712038 2952471 1390616 1735210 1099630 1467515 1604970 1157654
9801 1157654 938527 563188 1515157 1829036 513969 1392229 1631701 254667 1613466
9792 1613466 1494510 280639 617754 324808 380645 1125072 918622 629742 191878 274595
9782 274595 564779 1046622 742747 1079979 382694 729395 1380210 306442 537398 1620726
9772 1620726 1668106 1084839 1210047 1114206 999363 1191506 1223055 1460827 480354 954340
9762 954340 1116140 661391 1565327 711798 959692 1209817 571237 976436 859660 1076643
9752 1076643 1294272 638132 1000191 180022 1351078 1009486 1008360 465372 567096 884665
9742 884665 881704 692063 1004168 9720 1320623 736522 479810 837596 875468 98228
9732 98228 792563 856005 617726 740071 1159223 731356 892132 924648 959515 391106
9722 391106 1050723 1078208 330839 1433644 730253 493971 950035 928345 810160 1218063
9712 1218063 1196398 -47849 867219 1215720 795382 619605 277696 93920 1546243
9703 1546243 484597 1054103 745126 720670 705616 791057 1191398 964113 658492 490648
9693 490648 426525 427387 1102959 415334 1175962 661564 596562 12232 980434 820210 1369606
9682 1369606 248614 1218521 1064465 301731 1191015 341559 1072246 405942 626012
9673 626012 1083670 1185804 882022 1010324 57117 1438034 684806 210903 301727 634922
9663 634922 734294 983794 315396 573025 919626 178754 624010 381507 791524 1337848
9653 1337848 1446256 1935056 2003566 542195 1027293 396997 1191218 1407369 1048345 690577
9643 690577 308450 1658554 974251 550306 786532 295677 445018 -244176 -59162 658920
9633 658920 969022 228737 1098679 597175 1298750 580020 847490 1028092 874023 642390
9623 642390 1287828 1016814 1518249 1015587 1565899 1050780 48169 1138096 1265260
9614 1265260 1031423 1015175 1116449 1546317 1226785 736549 1456285 155668 61971 863931
9604 863931 503797 246599 668339 917661 1267751 413034 395784 104538 832791 621301
9594 621301 1106959 739171 959539 687959 959742 1707161 434229 564463 913694 729136
9584 729136 965863 1306091 593091 1149351 1438890 -139369 668430 1114522 994139 706392
9574 706392 1525644 648421 986664 1386241 960390 282639 448164 421919 1600802 899548
9564 899548 1118868 1054155 1744897 415925 1210588 631854 511495 1201130 1521618 440539
9554 440539 1132329 1097527 842963 983512 842982 39023 493431 386628 114618 1398347
9544 1398347 1470114 974556 798710 829826 698564 920975 1278883 928428 611759 801881
9534 801881 870255 510003 1545496 1260818 786012 705458 909365 1146171 626383 278787
9524 278787 1655651 1576292 1234398 312595 1411615 1053794 780291 869303 629187 1200007
9514 1200007 1385255 468785 919611 684620 932299 775853 682670 1411821 955173 847320
9504 847320 1243833 524066 1490300 937537 1521396 1785567 2189844 2740679 2490276 1584586
9494 1584586 2241056 2191708 1420929 921911 887359 1998581 880590 876660 1093661 1173691
9484 1173691 847406 478139 1119363 1666179 547568 1366403 -696374 463877 560772
9475 560772 1604529 1190680 1004097 779831 1084796 619518 1093682 763895 1710755 503367
9465 503367 718522 1443915 745375 1156841 1291931 1113637 2025905 2173162 1856237 1293770
9455 1293770 1743197 1730031 2096841 2447635 2162761 1080379 2589363 1444987 1503001
9446 1503001 1831329 1762721 1539119 1411280 889782 801695 917898 1581969 787386 595770
9436 595770 1143115 2308935 1703467 2049874 2850998 1883576 2282489 2121489 2660690 3428418
9426 3428418 3693357 4673258 5548369 5475549 5061993 3602210 2634407 3881290 2460699
9417 2460699 3709573 3108166 2265078 1798703 1448316 1931745 1732958 2208754 1700480
9408 1700480 2008990 1786503 2052376 1808342 2360935 1533592 2159461 2271293 2841875 2779190
9398 2779190 2957925 3887101 2806802 3250259 3685954 3724951 3467631 2804207 2471833 2592982
9388 2592982 1604026 2882878 2488103 1939281 1800374 1461414 1518344 1665442 1731428 1292241
9378 1292241 1100070 1497638 1720574 774264 1473609 773178 1467485 1163855 1212745 789212
9368 789212 1714878 675521 574648 1581888 1099955 1228815 602195 742914 977172
9359 977172 1979504 1598847 974190 1029042 1784076 918301 1427514 1753342 1162535 1295477
9349 1295477 1823471 646052 1619342 696728 1106360 1104668 480293 587192 2175143 1412533
9339 1412533 2065631 2036301 2123101 2380230 2576031 2946605 3603231 3978406 5061647 5730589
9329 5730589 5981327 6375693 6227056 5345121 3942823 4955909 3889607 3598823 4028524
9320 4028524 3850869 2924983 3423434 2621484 2005631 2201434 1837900 1470001 1633210 1971524
9310 1971524 2023949 2645745 3099828 3306978 3766580 4367286 4635550 5071763 4867844 6450588
9300 6450588 5811717 7082237 6855138 7482207 7999050 7061246 6909446 6598098 4655693
9291 4655693 5134677 3678774 3784263 3894208 3095192 3766604 3379222 2658382 2211817
9282 2211817 2296165 2552978 2915657 2870375 2521810 2635938 2905821 2890165 2443029 2648309
9272 2648309 3036580 3145913 3329110 4172827 3615774 4068191 4410614 3270292 3416644
9263 3416644 3033788 2420295 2388543 2327844 2316305 2618965 2157505 1482434 825584 1215772
9253 1215772 1585227 1263908 1490360 1179316 1802634 781140 831073 1438059 1554165 925216
9243 925216 1654195 1081034 527603 1367637 1304756 520591 2142834 1799014 1575614 1860925
9233 1860925 1513722 1103530 1368553 1724447 1262380 1327641 973793 423775 470348 1587778
9223 1587778 1058657 1809291 1741586 1017906 1688695 1564018 1190028 1508494 1309900 426471
9213 426471 1545176 1160046 1143497 1430895 1641899 1748792 1530394 1282689 758001 981790
9203 981790 1159067 1672237 1664446 1936808 1576169 1728516 1493439 1262416 1455557 1569491
9193 1569491 627943 1335791 1358780 1160830 1859152 1772658 1889209 1646636 1630656 1305749
9183 1305749 1484161 1528216 1581720 1510012 2231484 1210398 1583645 2060426 2541214 1678651
9173 1678651 2087057 1533254 2170192 2265017 2758872 1935057 1587939 2202500 2028615 2177249
9163 2177249 1792373 1098320 2184450 2532419 1525834 2222369 1787439 1417625 1594879
9154 1594879 1603047 1991635 1994331 2730079 3084692 2305993 2945714 2416594 3021892 2515830
9144 2515830 2230113 2727982 3036172 2769829 2788421 2508950 3012717 3183082 3496780 2797646
9134 2797646 2836071 3106187 3984868 2472962 3769326 2832980 3761915 2936679 3583030
9125 3583030 3576742 3459643 4152033 4456607 3962474 3878950 4332421 4177582 4732164 4215665
9115 4215665 4454640 4742560 6035148 5889437 5805089 6825061 5410087 6663525 7163491
9106 7163491 7244658 8403733 9055660 8977246 10928448 11184006 12225348 13025325 14757266
9097 14757266 15509022 15492626 17991516 20935036 23813188 29628202 36483201 53041055
9089 53041055 75312415 106453128 156327768 210155803 249095154 241383949 186871626
9082 186871626 141998217 108747497 84598761 63170006 48267406 37648500 30165652
9075 30165652 25126212 22555498 19092278 17315095 15320087 13875864 12457065 11998921
9067 11998921 10514305 11479451 10451188 10414133 9979607 9834845 9753697 9123548 8269538
9058 8269538 8188858 7276262 7848567 7478470 7584776 7493547 7649271 6050133 7576147 6509305
9048 6509305 6286969 6761874 6646154 6342825 5992756 4408581 6406450 5584678 5108308
9039 5108308 4961303 4876739 5117414 4354110 3842913 4586274 4261321 4349920 3672053 4191499
9029 4191499 3304757 3281361 3241632 4213365 3512834 4113291 3602968 3503377 2894313 3460205
9019 3460205 2976660 3956051 2885272 3960705 3599692 2905154 3548271 2473407 2748119
9010 2748119 2400793 2367247 2225159 2251674 2013527 3112354 2458136 2388541 2723511 2665005
9000 2665005 2423346 1702736 3020047 1784360 2036883 1655349 2279145 3131495 1714305
8991 1714305 2212485 2400901 1909383 1831557 1158932 1257158 2128281 2001987 2344979 2419151
8981 2419151 1157339 1610679 1152809 1761490 1673858 2293614 1658577 1834989 1782519 1927793
8971 1927793 1744090 1710730 2419386 1931526 1352220 2242605 1706992 1060243 1472154 1636113
8961 1636113 2117683 892010 1098024 1353980 1241677 1299264 1491630 1075013 1318452 1415011
8951 1415011 2119509 1254887 1844342 721053 1197343 1447232 2183693 1868788 1780542 893208
8941 893208 895616 1646445 989390 1651350 1470485 581589 1166746 319033 177740 711679
8931 711679 726897 1704453 1250500 752467 1039234 180984 655774 839253 794788 1453407
8921 1453407 868452 905160 837848 406406 837333 808934 1183916 734431 669042 396175
8911 396175 -201580 1196766 953719 476556 432302 463264 382130 1065874 672814 1099362
8901 1099362 696590 1054989 1313396 922788 1657355 504708 1080371 813061 103929
8892 103929 596756 15094 286267 230183 778812 303675 593555 557139 442668 919275
8882 919275 155346 726734 845403 -7543 102527 191943 391454 930345 656087 827979
8872 827979 583235 508737 249615 482945 1269947 157819 636532 250166 387656 805276
8862 805276 545023 654503 1500205 820232 48356 947571 360886 98453 775089 610310
8852 610310 411978 1049129 47601 578519 778109 1318708 1164267 240979 1663276
8843 1663276 575074 -36493 1081824 -33647 1084176 145822 218003 657921 1965488
8834 1965488 677409 654929 459759 644285 640115 446825 321727 376225 53790 261496
8824 261496 -13737 -28851 1170219 -429469 263137 253203 528808 536991 262957 548183
8814 548183 1253749 143189 83162 613588 371284 1021428 465444 -473516 -54473 -379771
8804 -379771 265022 -162657 477181 -260501 800016 46807 444430 465253 1203832 195717
8794 195717 151766 766143 409693 992706 700866 456998 162682 1133538 835181 44003
8784 44003 25661 477407 125022 -7134 -97822 -67010 -62244 56194 486213 292160 -299914
8773 -299914 491076 -458632 20123 412245 915698 709500 988562 255653 279737 344357
8763 344357 884016 592718 -399618 271217 -669258 -137820 230386 -441621 295251 406938
8753 406938 -136304 1391104 748931 35727 695190 919129 -330126 211252 16526
8744 16526 -33594 535151 440900 107830 541806 127422 -395857 50164 -340442 457250
8734 457250 588026 256202 -819320 648543 428652 362705 -505175 669053 315473
8725 315473 -96482 -519634 43072 261117 109558 -103212 895286 158356 -746221 -89251
8715 -89251 157670 14758 105615 -849906 799422 -605464 -636107 -544474 -1040441 -396341
8705 -396341 -356896 -91870 861727 598728 -170065 -287817 -478137 486487 427961 86098
8695 86098 -262015 450455 856492 994334 -55799 -1572 -31748 502671 116341 -503892
8685 -503892 298344 1095059 132068 898998 86023 18758 -372627 298112 -157318 25408
8675 25408 758155 1050832 545819 939576 772718 1650759 851330 1559245 1006702 652245
8665 652245 1067218 453478 712429 -77315 701119 243304 -255450 334605 -712158 33197
8655 33197 -224404 357419 320212 -441765 -115975 -672662 -746830 374844 -100314 337880
8645 337880 522308 -505999 26180 -627637 -589746 126941 -121917 759313 -206239 513253
8635 513253 733622 -425893 439167 -160877 511203 287551 -476926 -319123 112286 174319
8625 174319 -175068 135502 175451 -334600 -283979 -493727 -496130 -821750 248051 -417963
8615 -417963 1228817 -317053 -238661 -287646 469908 -117186 24635 780500 621190 391760
8605 391760 -398278 -560882 387961 -678565 -377960 826111 -741556 495087 -82351
8596 -82351 -614304 465679 143309 -168653 37197 -266014 792538 -409777 225842
8587 225842 180183 -374246 73246 -478910 -185240 135618 158254 493529 24487 512103
8577 512103 661227 445777 -366741 -504944 762181 168014 564949 116322 131283 -251125
8567 -251125 -460585 -436782 806800 -636072 -194 -460461 -134280 -585911 19012 -204209
8557 -204209 -205126 1196386 338596 -1336211 447209 -1049494 -129480 12497 302029 268855
8547 268855 -67587 -757163 -389738 -919790 61475 -228026 -943829 363949 193024 -7083
8537 -7083 159871 -447637 140589 -243103 297411 550045 177095 436654 497221 2203
8527 2203 467935 -30979 -47081 -265952 -441898 -542759 150137 -211075 -705559 145729
8517 145729 -203624 29396 -220860 -461216 -382227 520602 -6150 134316 -6295 -136708
8507 -136708 501130 -99229 404552 50525 180266 321063 -370636 304192 259196 236344
8497 236344 121697 115142 -507567 465088 -1077361 -326039 -145987 -692055 -563122 -243943
8487 -243943 -255314 -518798 -911106 266303 -471243 732499 -485863 81301 -441599
8478 -441599 333812 -425270 -352019 528213 338502 637181 481933 -317512 129225 -264976
8468 -264976 -779695 275928 -127774 354647 22879 -188329 566360 -772282 -360520
8459 -360520 -167862 -160841 -26340 520 153209 320529 95317 -361569 -424797 -40405
8449 -40405 250075 -192300 661142 -38920 394601 -572657 -653919 475929 305719 -118501
8439 -118501 223135 -185490 1466764 288612 -535713 339679 683512 1198455 518784
8430 518784 267078 617820 -271903 1745549 540637 548267 2000473 785031 1222355
8421 1222355 1343171 1172143 2744815 1361966 1819420 2180879 1907424 2395350 1666539
8412 1666539 2325169 2827361 2168988 2802918 3665510 3254138 2985145 3159839 2112608
8403 2112608 2248768 2384654 1506517 1746268 2305689 998581 2538617 1657037 1379376
8394 1379376 1167514 1749174 1035129 497339 609307 1604744 69179 355103 -108707
8385 -108707 451964 822322 -60224 448812 699781 437825 829827 208018 128494 -542274
8375 -542274 264225 510946 499042 442037 728114 83653 363645 -263463 66592 114183
8365 114183 94071 -47186 93831 -368475 -611351 -189397 1189547 -452143 59855 -372916
8355 -372916 -433367 -252907 238248 -541669 13756 416771 -441873 -538175 -126089 -930730
8345 -930730 -485919 -165293 -505492 169737 -705239 -848191 -682748 677467 -335940
8336 -335940 -334574 482640 -102035 -886006 629194 -371887 99193 243653 -406539 -208546
8326 -208546 101541 -703663 145065 -17436 36490 52570 451819 -602768 -44075 144113
8316 144113 -175717 -9236 163580 -312720 -286066 -764881 111251 -344093 640177 -643541
8306 -643541 474910 -1144283 -490377 -663523 69351 -129605 -86745 -1012956 -171379 270648
8296 270648 -675224 -639384 -736019 -468131 -522316 -382829 -956879 -932794 -206633 -633352
8286 -633352 -604717 -858598 -411410 -905331 -470268 -409660 211883 12440 -417236 -251565
8276 -251565 -800382 -404052 -90569 631835 -128644 -764604 207385 298785 6494 -137970
8266 -137970 313965 11584 -14760 -603441 218612 -1487488 -1142671 78547 -416412 -195514
8256 -195514 -359896 -596350 -707286 205670 -1007350 -810070 -610457 -68242 -93141 -876784
8246 -876784 -828711 -128006 -326532 -132795 -532904 -60377 124233 -425967 -355743 239837
8236 239837 -324262 -834024 -544541 -466473 -225026 186938 -24670 -278475 485200 -666297
8226 -666297 -506044 -213364 342125 -29056 -230903 -739456 -93134 -636837 -1314891 -880914
8216 -880914 -929572 -321479 -854675 -815249 -762269 -401937 -570556 -1307696 -942309 -499247
8206 -499247 -753884 -249431 -533314 -1091640 -408348 -880146 -1208556 -721703 -198557 -623275
8196 -623275 502326 -414265 -393812 -1883620 1051002 523333 118069 553588 330231
8187 330231 -1296478 -77642 -283464 -373781 350062 -672026 459261 -603403 -253103
8178 -253103 -323887 -42238 70223 -496595 -581820 312834 -237118 -149914 -119405 -826786
8168 -826786 -570700 -734199 -981605 -782713 -215715 -862232 -1172718 -652842 -857624 -257948
8158 -257948 -583802 115811 192368 -553312 -535924 -428411 -450523 -162595 -86980 -259062
8148 -259062 -625937 -399539 -997653 -984321 108792 -159449 287744 -620255 -985804 -15007
8138 -15007 -837566 -1078735 -725509 -199683 -1110896 92720 -1119292 -258518 -453953 -530380
8128 -530380 -347016 -91479 -424769 -73310 -534365 -390822 -1130507 -392689 -1020647 -701866
8118 -701866 139330 -934289 -1848170 -695002 -797890 -739937 -540917 -71709 -678428 -489207
8108 -489207 -493312 -603737 -21839 -4384 -376661 325974 -873359 -592879 -305573 -73149
8098 -73149 -1112618 -901573 -1026767 -966097 -18758 -217527 -207113 495189 -545163 -1171898
8088 -1171898 -820219 -799182 -1026585 -985342 -421020 -859026 -741642 -663506 -848065 -501869
8078 -501869 -868440 -1292949 -516019 -712817 -521738 -120053 559641 -657097 -362160 -1222252
8068 -1222252 -281235 -563637 -1224737 -885242 50555 -862492 -786832 -326534 -1031516 -294980
8058 -294980 -41191 -277628 -96128 481418 -256657 -238811 -349069 -265325 -725627 -410317
8048 -410317 1891 -474669 -1487567 -878482 -1553777 -342212 -466883 -157110 -1030544
8039 -1030544 -350621 -713732 -849278 -89101 -231670 -366815 -508830 -58033 -1433216
8030 -1433216 -778253 -280716 94535 -18079 -54886 260368 -70484 206889 -241114 -99920
8020 -99920 -153878 -286918 -932489 -182088 -398634 -207828 39782 -962999 26288 -606871
8010 -606871 -720185 -507511 -17080 41561 481936 326830 863694 -514179 -56715 490150
8000 490150 840900 999817 1044643 887266 1721558 1284002 682237 982402 895169 1281249
7990 1281249 970798 611080 816947 869255 444356 950534 1105753 1798219 1629572 298383
7980 298383 233128 1215562 540938 147696 400607 86899 637050 -184831 314573 -695668
7970 -695668 170776 -131265 -842063 377100 -634248 -285094 -865548 -779194 -313352 -90565
7960 -90565 -552164 37726 -238305 -229588 20963 215392 722090 812568 673980 1273813
7950 1273813 1160842 1139170 1088433 575012 875628 1738133 706517 1821942 1261954 785195
7940 785195 1288449 158314 676532 720300 1335256 1143601 1227128 1180211 1193159 630049
7930 630049 678552 408567 902388 419125 354803 48554 166101 95554 -373932 160168
7920 160168 327087 -654226 -399594 -168622 -245830 92557 445784 243625 -270362 181672
7910 181672 -31519 -580198 432723 -297472 445050 2117 -605957 -748286 334655
7901 334655 -1483118 -293397 -856346 -652381 -621082 -329620 -486380 -869123 -929278 -481713
7891 -481713 -580532 -1206712 -437626 -1344465 -869825 -17470 -987845 -321352 -667266 -317687
7881 -317687 -19456 -1028120 -207024 -191844 -715454 254549 71776 118441 336665 -619714
7871 -619714 66566 -723162 -280066 18215 134738 -37842 -478679 -410483 -235018 -453218
7861 -453218 -631519 -1329013 -1217897 -1002366 -584859 -423615 -2027443 -161306 -674302
7852 -674302 -678870 -508887 -1029170 -275150 -935572 -289808 -382229 40919 -583517 130659
7842 130659 -838719 -642753 -990429 -1430507 -268712 -455940 17430 -654296 -881454 -381180
7832 -381180 -825329 -776625 -732040 -356526 -430905 -655433 -823485 -936832 -605454 -728712
7822 -728712 -792419 -543711 -1105489 -584456 -445716 -642246 -702772 -525377 10329 -434578
7812 -434578 -525504 -1340973 -638140 -249968 -358397 -234121 853293 483365 -909783 -527492
7802 -527492 -711833 -545264 -776163 -486860 -217263 -358360 -855565 -375324 -823973 -231660
7792 -231660 -360928 -70824 -370426 -719614 73212 -129367 -384231 -64177 152038 -505824
7782 -505824 -668019 -840452 -193248 -591718 -297125 -530977 121223 180920 -427974 87595
7772 87595 209 551804 -26016 553600 323783 995745 880167 207339 875722 1467067
7762 1467067 1429629 1871752 1419186 1869062 2351999 1438380 2762157 2618482 2696665 2737868
7752 2737868 2474689 3406332 3347171 2491249 3748793 3422019 2807447 2825564 2504592 2597801
7742 2597801 3491590 2615171 2497195 3015545 1943753 2948983 1199415 1815918 1847386
7733 1847386 971500 877048 1213871 959273 1181014 252374 988835 745421 1015067 251575
7723 251575 185103 819447 773894 370209 514126 158522 370729 512709 370799 1264687
7713 1264687 1583756 825680 1614654 1880858 2558546 1813594 2290535 2230978 2975568 2570066
7703 2570066 3121044 2346177 2122290 3560256 3842348 2875399 2943285 3856940 3091273 2491835
7693 2491835 2878603 2629975 2795860 2650055 2292595 2339624 2190301 2049277 1443737 2355073
7683 2355073 2150498 1104465 1446908 1216051 440128 573750 1127304 860808 1114423
7674 1114423 475611 137031 202356 562218 -868542 -197034 -628396 245929 -521403 -135239
7664 -135239 -776471 196887 -258692 -228932 -502626 136231 -593470 -4836 -631209 -371637
7654 -371637 -96715 -694814 -1023449 -695864 -437379 135738 -959321 59127 -365073
7645 -365073 -573452 -898947 -908638 182811 -508866 -697803 -299480 -1122264 -179404 -642184
7635 -642184 26852 -158939 -317417 -236661 -923857 -472935 -2258 -55575 -634119 -818426
7625 -818426 -831422 -964686 -748872 -1579485 -607957 -661642 -305209 65081 -1014390 -846097
7615 -846097 -381711 -866700 -737804 -853028 -629090 120419 -1198919 306775 295983 -492665
7605 -492665 -700016 90525 -529858 -408532 -905539 159993 -1072079 -667026 -820500
7596 -820500 -165341 -786850 -501464 -877662 -881871 -715380 -565820 172584 285540 -58283
7586 -58283 -182269 -1242066 -208655 247114 -270701 32390 -896330 42759 -1441966
7577 -1441966 -887241 -505524 -793463 -702229 -1188089 -700889 -116402 -601027 -411912 184171
7567 184171 -840713 359228 -124036 -11378 -85453 431553 -20231 107164 567625 -316032
7557 -316032 125079 472888 -92560 71144 -43794 789878 -175569 279634 -809489 -682013
7547 -682013 38753 -299287 81935 521685 -9923 55949 276656 -381705 -420223 -236385
7537 -236385 -875351 83586 -928356 -587352 -913479 -546787 -1221504 -146323 -852829
7528 -852829 -431858 -469839 -589768 -1374328 -347098 70164 -637773 367523 857325 -178741
7518 -178741 498857 -633383 -63872 -395611 -792924 -514804 224646 31563 -521623 -1055588
7508 -1055588 -496205 -498846 -563561 23208 -492311 -66878 -547096 -477150 -392166 -696250
7498 -696250 -1198859 -555486 -391232 -1775997 -163620 -876482 -1027262 -633743 169662
7489 169662 -1108202 -217402 -1649727 -792651 -478067 -121151 -188067 -254075 -472378 -388657
7479 -388657 -974636 -820980 -116137 -135120 -169808 -554529 302610 -62235 205161 196175
7469 196175 -580227 -90665 -1185110 -1484373 -407706 -1597772 -870890 -509326 -922132
7460 -922132 -775183 -1589535 -776848 -301993 -143722 -897464 -614459 -750205 -613066 -1021256
7450 -1021256 -430334 -717146 -205381 -782198 -645020 -480153 66075 -117767 -614738 -13748
7440 -13748 308515 -435573 -690782 -945166 -695169 -597112 -307485 -343615 -607003 -876472
7430 -876472 -1380396 -907093 -169204 -858588 -2050036 -1486280 -857509 -98861 -476145 249033
7420 249033 -419024 -579514 -1320776 -27247 -230226 -449759 331301 -273247 -219454 -419519
7410 -419519 -73767 -101504 -444661 108965 -438295 166898 -499365 -1049392 -196384 397380
7400 397380 -750807 -62286 -591303 -456081 -356618 -275987 9738 -67864 223247 114696
7390 114696 -493337 1268604 20 -528184 331427 -500048 -615537 432892 -393306
7381 -393306 -525926 -286691 -892423 475923 -857884 -467417 -616178 -148168 -201037 -128291
7371 -128291 238268 702658 -540355 -784449 -271309 -804824 69483 -160043 80754 103376
7361 103376 415329 -324087 580485 -6533 53743 658411 -478280 -182206 158954 201861
7351 201861 568574 308503 -106010 95816 -444701 -778883 315213 -533801 -524650 -397287
7341 -397287 -525047 -186881 97100 -600109 -545497 -222217 -656432 -582068 -299511 -514495
7331 -514495 -324588 -780822 -683992 -1262621 -205702 -747294 -705081 -886984 -51075 -868544
7321 -868544 -305896 -70255 359298 366257 628618 -556576 203689 -295904 -720375 -761390
7311 -761390 -356832 -322987 -238656 -547001 -718082 -494099 -988218 -1058572 -1113209 -542260
7301 -542260 -1301772 -1114569 -829644 -394917 -1392013 -901022 -1213865 -261349 -593636 132284
7291 132284 139437 455105 -603749 -549792 -345925 -563501 -452045 -66356 -659631 326901
7281 326901 -110349 430981 -682909 -167208 -373897 -177509 -1297218 -869458 -549927
7272 -549927 -432797 -879810 -270460 -163374 254026 -424393 -509208 -77494 231804 -567789
7262 -567789 -73639 -187274 220993 -772787 30053 -37121 -334662 -263992 -407686 -146990
7252 -146990 1040707 815197 -435811 -244443 -628975 -308106 -32348 -459479 39700
7243 39700 329474 932027 50834 71103 27725 287767 171996 879792 914380 501573
7233 501573 -91582 501664 234112 770587 1349642 144121 1547071 748791 546375
7224 546375 1276614 764102 933912 898643 1598672 701400 721959 1284755 727273 828500
7214 828500 1196570 646369 903515 1267813 1365097 2114701 2206713 2548317 1437079 2726053
7204 2726053 1919365 2796220 3264120 3179201 3703973 3789055 3089296 4370470 4491189 4876511
7194 4876511 5432686 6137677 7442217 7576103 7411332 8526949 8798388 9803363 10851012
7185 10851012 11392571 11919930 12210203 13279930 14309484 13898951 14697826 15627687 15979941
7176 15979941 15831980 16684108 17011858 17570578 17410628 18002436 18706712 19762591 19177512
7167 19177512 19189954 19151627 19885861 19870547 19937394 20170920 19815426 20525569 19854237 20516072
7157 20516072 20980245 20391229 20811206 20550269 21217762 20660189 21099313 20624805 20541085 20620170
7147 20620170 20730425 20607689 21424603 21085387 20754419 20252275 21135308 21113763 20732105 19659283
7137 19659283 20376711 20349001 20939876 20463336 21360329 21181594 20755232 20115942 21253024
7128 21253024 21156628 21109603 21069720 21277758 21741340 22062428 22042430 22100304 21583014 21643686
7118 21643686 22033242 22257963 22449863 21841402 21893813 22639643 21791716 22371282 22386875 21293335
7108 21293335 21148142 21742001 21811380 20940645 21250952 20372841 21360473 21391466 20580870 20427892
7098 20427892 21156815 20469350 20467503 19122263 19211294 18985246 18159468 16629132 16081915 16195706
7088 16195706 16004049 13812853 13904297 13255087 13052837 11909640 10637909 10516377 10348511
7079 10348511 9198329 8513208 7738652 7101254 6438148 6367220 6494874 6073352 6006333 5251519
7069 5251519 4845050 4362271 4062115 2641031 3619931 3482166 4146145 3742365 3704493 3158253
7059 3158253 3235953 2637906 2947857 2366099 2644309 2644729 2447311 2354248 2651750 2492997
7049 2492997 2816737 2042975 1730108 3047607 2334779 2235811 2345588 1876803 2209540 1175018
7039 1175018 1976443 1116486 1336478 1587262 2212714 1245664 1686990 1500027 1744919 2086855
7029 2086855 1540525 1380715 1665990 1950210 1656072 1972310 1522776 930409 1518746 1394982
7019 1394982 1204153 2194408 1784924 1017931 1438006 619667 1489871 1673104 1836823 864284
7009 864284 905549 974300 595562 776967 1624886 1001176 1011440 1133014 596932 1550971
6999 1550971 1086706 1069514 869248 1633963 1460799 1461634 1866552 1699525 1945465 1659010
6989 1659010 777211 1817328 1324542 1981998 1853685 2194785 2050686 1746800 2087229
6980 2087229 2516450 1685829 2880003 2202078 2374861 2951058 3176387 3860918 3520416
6971 3520416 3468210 4699711 4904395 5645704 7495881 9730995 12402800 13943037 16264356
6962 16264356 16526201 14811079 12799936 10945419 8501547 7387327 6390124 6379015 5848721
6953 5848721 5509066 4919398 4779099 5150944 5071645 5761849 5376156 6212046 7254244 7226873
6943 7226873 8928053 9713782 12359536 14905407 19233479 24708828 32046376 40683112
6935 40683112 47347715 49000599 44520238 36364871 29819148 25334464 19412725 17135760
6927 17135760 13325966 11728283 11175435 10011134 9556755 8524044 7327783 8212013 7952682
6918 7952682 7871362 8271908 8571633 10084348 11013484 12618879 15813710 20005150 24557988
6909 24557988 31954062 40720359 48440577 50510897 47032357 38920273 32315034 25648493
6901 25648493 20269274 16931256 14588949 12572223 10767001 9722573 8969048 8095863
6893 8095863 7540732 6901620 7203925 6869409 5799397 5859059 5671259 6881963 7159783
6884 7159783 8776735 9341223 10909689 13346499 15471836 18121284 19474091 17784802
6876 17784802 15475533 12698460 11631935 10183214 7796784 7407204 5374036 5702526
6868 5702526 5185401 4791101 4164010 3738619 3605537 3655921 3473732 3678851 3722522 3879127
6858 3879127 2239557 2264252 2524914 2677821 2085635 2974284 2562284 3080398 2325873 2824283
6848 2824283 3374946 2323559 2778578 1563860 2112164 2033303 1805643 2055806 1938671
6839 1938671 833590 2284346 986791 1628866 1876111 1895423 1603754 1167878 1123055
6830 1123055 1573303 1844698 2257595 2336862 1339585 1383040 1044834 1634973 1028700 1489718
6820 1489718 1523413 1031004 853243 371040 768035 1431984 1317189 1976389 1106539 832870
6810 832870 179643 321607 732683 1933726 1071346 600368 1055993 744744 356129 625767
6800 625767 1407377 730803 639838 1436722 128103 694366 711320 347908 635313 1246611
6790 1246611 830879 -145271 -141942 -359482 849820 1554787 617744 641409 620929 117235
6780 117235 208823 -437226 108887 1213347 1844896 -196779 -214294 -216332 -30236 927449
6770 927449 -212822 689353 1166583 -66941 -230470 130195 360490 194819 -374600
6761 -374600 490300 6913 697908 -106701 -177661 -120268 951098 314359 -310222 497257
6751 497257 328767 76397 1182966 187212 165436 130915 -430895 730469 215494 264803
6741 264803 471539 -12099 692079 824195 233194 789959 -98454 321220 36810 -713273
6731 -713273 432675 861741 705980 937187 959466 329323 783253 -232002 637429 345839
6721 345839 759001 1712321 488924 917812 1294783 293892 196092 395585 1150005 84402
6711 84402 895894 1558175 1137690 914492 942538 912429 557581 524960 903554 283613
6701 283613 1126849 1505324 698580 1272734 1599742 2540337 2226170 2252266 3072697 2751492
6691 2751492 3529495 3229209 2900703 2386849 1648258 1705677 1583630 1059312 1429900 1486447
6681 1486447 1013695 355459 1295861 809797 1296312 1725806 1263079 1793931 2018648 2076567
6671 2076567 1884926 2414072 3786811 3766531 4739954 5255188 8070248 8960370 10224793
6662 10224793 8818448 6981754 4831830 5091931 3316762 3864398 3839658 2502445 2647284
6653 2647284 2692735 2204496 2646649 2674926 2114384 2935616 3306348 2594286 3018044 3424524
6643 3424524 3196727 3522015 4022484 5458825 5844096 7712410 10240333 10888966 11105537
6634 11105537 10675789 8863066 8310890 7658883 6905580 7570841 6560632 7177770 8016837
6625 8016837 8748261 10208793 13403553 16389351 21795359 27039549 31103825 31173330 26590751
6616 26590751 23111805 18219316 15168004 13190921 10961608 10751281 10191934 10251129 11356887
6607 11356887 11251997 10738509 10239471 10045785 9833251 10399261 10822643 10466974 12883106
6598 12883106 14027880 16823093 22151738 29240625 41165871 54939301 71488035 86370447
6590 86370447 89128963 79426189 64421502 51119332 39608584 31831633 26360015 21357230
6582 21357230 17909562 16271378 14603589 12633557 13226039 12300260 11270909 11038829 12359988
6573 12359988 11859784 12971882 13120629 15142542 18337014 22746118 30009242 39067409
6565 39067409 53037896 69753134 85243645 92123057 85935219 70935106 56276381
6558 56276381 44330478 36002239 28944466 22065056 18135875 15579495 13763953 12317623
6550 12317623 11271159 10430283 9640962 8635585 8239866 8472931 8594614 8383519 9834702
6541 9834702 9463727 10551450 13233472 15792327 19242086 25866528 30643299 35097915
6533 35097915 32410661 28098037 23213338 19166874 14737395 12198154 10349736 8109214
6525 8109214 7785201 6371653 6547833 5849446 5807242 4904139 4733019 3807335 4608030 3859384
6515 3859384 3514960 3406884 3505024 2515188 2727442 2376517 2432119 2705732 3067392 3230204
6505 3230204 2810919 2604362 2125070 2112197 2474162 2558277 2515681 2380674 2677186 2216041
6495 2216041 2237389 2115178 2094776 1465498 2425785 2394623 2340395 970625 1431596 1968785
6485 1968785 2234384 1381738 1777922 1096789 1564639 1046133 1709485 949170 1481581 1378817
6475 1378817 1159201 1102266 1604425 1110176 919891 492881 887570 1056301 601690 460994
6465 460994 1569785 276916 542312 523964 730551 1222240 273088 404332 973372 808557
6455 808557 690205 405151 694581 1320743 656046 1051557 1140592 383752 556168 -293695
6445 -293695 654184 -208423 233206 -110582 547053 769917 916854 -507344 -1002232 226388
6435 226388 -111261 165925 386876 -399853 -342268 1644 115580 -426196 -62327 512929
6425 512929 -50576 -255191 304268 -494084 112972 200863 -1041054 158281 -80275 -632219
6415 -632219 -452360 594857 387417 -400262 -779289 447083 -527898 34685 225400
6406 225400 587358 379342 -78606 -531261 -245963 72297 1896 -294002 79590 11564
6396 11564 164116 -603936 -334381 -5669 58753 -602411 -67205 -65223 -48937 -1502266
6386 -1502266 58807 -1293070 111775 255509 -380969 -598180 -347547 -41559 549993
6377 549993 -135066 -137750 222536 131869 226165 116134 647490 53216 -223977 -289568 -352871
6366 -352871 173851 172933 -162136 178323 -1069083 -433788 -178456 -786860 -383773 810229
6356 810229 -416816 -70904 -55568 -405682 -1098310 -843009 -963908 -558843 798159 18778
6346 18778 69129 309999 -49207 60357 -388090 -479363 -453743 -159131 -214130 -54388 563745
6335 563745 -352046 76317 -345807 -342199 487188 78679 -245580 983414 246914 381997
6325 381997 193354 -145445 19670 160162 309531 -551587 263774 556686 -1051758 58517
6315 58517 25926 275754 331109 72975 -974679 -760628 430086 144001 52960 739496
6305 739496 205077 110843 268285 427407 1745715 1616056 2312020 2146470 1794596 1168964
6295 1168964 1123441 1460022 1300532 1182386 1251155 828463 1254685 1001330 817005 549679
6285 549679 870317 1384655 765198 247202 536893 764218 897851 1284440 1091543 1421572
6275 1421572 2948334 3801584 4846705 5440735 5478711 5014193 3886541 3015635 2977830
6266 2977830 1833808 2098319 1254658 364273 1408919 819276 879011 1204029 746601
6257 746601 900514 874340 942307 1225415 758358 1083424 1355408 1781556 2658647 2947286
6247 2947286 4034945 4567525 5184426 5244917 4590940 4157988 3866511 3213793 2721892 2305249
6237 2305249 1841121 1814615 1402588 913066 1282160 1198084 1135496 1251662 1953338 1860443
6227 1860443 1345741 1911273 2278391 1925157 2215565 2257773 2256088 2162857 2929331 2854772
6217 2854772 3462412 3419611 2265406 2814297 2558958 1854640 2428745 2920429 2522255 3362846
6207 3362846 2538886 3203805 3053718 2546293 3096084 2812717 2806900 3377136 2734121 3362840
6197 3362840 2278929 2368499 2484239 2355979 1666155 2466546 1768548 1526666 2392593 1844359
6187 1844359 1673753 2479888 1437372 2508762 1996607 2317043 3029020 1512088 2417309
6178 2417309 2306743 1846333 2247502 1817276 2783290 1577493 1493577 1756711 1368650 1572705
6168 1572705 1213035 1347518 1931457 1946063 2109310 1886535 2566642 773212 1964656
6159 1964656 1719938 1842854 1502547 2096440 1892357 2479258 1425322 1407473 1015528 1364773
6149 1364773 1307277 1691249 1404980 1209692 1382736 1815859 748685 1596789 2435441 2353706
6139 2353706 1376447 1749223 1190489 2366692 2036236 1704562 1989479 1889953 1936339 2758533
6129 2758533 1406781 2353263 2077957 1878836 1095515 2080113 2145239 1793807 1591060 1673912
6119 1673912 1514370 1834949 2507315 2215246 2138810 2915009 3264570 2696024 3115096 2346362
6109 2346362 3365496 3325805 3869246 3400211 2733330 3463371 2994701 3738684 3711626 3187820
6099 3187820 2872340 2960044 3548222 3748727 4000748 4036332 4580336 4381064 4553945 3967192
6089 3967192 4305744 4705603 5026472 4690459 5655781 4557184 5513504 4735747 6532749
6080 6532749 6440713 7309368 7415035 7794894 7739003 8645308 9340026 10063404 10942270 11685820
6070 11685820 12476878 13564353 13313278 15148246 13762595 14687600 14706483 14575692 15179225
6061 15179225 15156190 14254263 14949460 14535206 14127673 13961517 14454167 14614421 15283337 14887633
6051 14887633 15016593 16048763 17842707 19135992 20918109 22986478 24153299 25286788
6043 25286788 26178798 27068611 27411494 27544799 27548913 28342778 28607578 29005256 28666252 28876205
6033 28876205 29940074 30683085 30381617 31352979 31738998 32204703 32050910 31973559 32502260
6024 32502260 31532673 30926147 30944367 31292474 31341952 30931425 31829347 32089620 32619173 33977610
6014 33977610 33600420 34023083 34421796 33730488 34968965 35230447 35492231 36328591 36579028
6005 36579028 37014297 37040849 37071041 36902279 36066011 36571910 36376143 35654864 35237474 34972360
5995 34972360 34183219 32401330 31727590 29797098 28798878 27878309 27205428 27202190 27096551
5986 27096551 25489042 24600956 24258715 21739373 21185145 20535658 19607189 19320151 19823595
5977 19823595 19299053 19837002 20464423 19889319 19752026 19401075 18207139 17843432 18303749
5968 18303749 17158791 15982649 15180752 14283010 14176365 12316894 11463684 10676837 9555234
5959 9555234 9861225 8422155 7775058 7808588 6773241 6309918 6017218 5061114 5137727 5315731
5949 5315731 5475260 4370472 5513290 5087339 4106513 3793529 4125867 4209201 4752089
5940 4752089 4088473 4130046 4402192 4040417 4367394 3886902 3908059 3274173 3339600 3306679
5930 3306679 2011487 3934232 3306907 2532599 3036164 2881324 2277880 2327176 1954412
5921 1954412 2557994 3386335 2624282 2812854 2272728 2234285 2703832 1648281 2234647 1642774
5911 1642774 2087595 1940150 1075214 2241732 2060980 2486247 2355974 1330030 1971082
5902 1971082 2088493 1305842 2296922 2707474 1971751 1373389 1971472 1550376 2126972 2459996
5892 2459996 1609905 2001200 2042117 2020903 1919698 1523411 2133486 2205587 2143306 1719818
5882 1719818 1750693 2076825 1669880 1480244 1948371 1867748 1913876 1263897 1287593 1548947
5872 1548947 1843639 1690422 1631557 1102846 1422124 1099559 1755153 1098565 1411668 1115749
5862 1115749 1363893 2200523 1044052 1905744 1841334 2257475 2337039 1911999 2437854 2304150
5852 2304150 1832890 2342864 1925323 1743957 2111931 1673782 1593929 2068719 2035598 2329504
5842 2329504 1776064 2050574 1873348 1575083 2397082 2761569 2109595 2734971 1886566 2921792
5832 2921792 2725623 2301705 2592210 2564350 1843274 3081518 2526587 2869018 2699787 2743964
5822 2743964 2430109 1965867 3526181 3120151 2957264 3023774 3427282 3432893 3739288 2909693
5812 2909693 3074326 3643153 3542035 3941980 4262276 3514040 3753684 3209053 2903668 3240376
5802 3240376 3546318 3690521 3280028 4110111 3335219 3137450 2694700 4126946 4438910
5793 4438910 4321160 4095543 4476271 3725688 4281209 4005985 5009261 5341728 5776870
5784 5776870 5871160 5629723 5459642 6251198 5870461 5790702 6693522 7100111 7165579 7967165
5774 7967165 7329672 7511276 7918029 7451875 7817632 8481257 8105362 8830234 9261965 8785806
5764 8785806 8574061 9727580 10515797 10062974 11201122 12163911 12373779 13404788 13055033
5755 13055033 14505425 15766541 16443478 18049736 18743805 21890327 24939710 27428868
5747 27428868 30087691 33316157 37445868 41808823 45827093 49579616 52590960 55126157
5739 55126157 56595878 57250528 58115630 57128186 55374111 53082343 50629116 49055271 46148583
5730 46148583 43857069 42450574 41661248 41079630 40620766 41302064 43085132 44343708 47186383
5721 47186383 49823312 53870178 58800471 65115684 71802545 81007828 88917999 99462465
5713 99462465 107372683 115263464 123413056 128580255 131615786 133309883 130924855 127804403
5705 127804403 122666099 116593316 109029030 102902168 96172742 88850237 84083927 78873795
5697 78873795 73376077 71308993 68706922 67396772 66450386 66297174 66383974 69107570 70407383
5688 70407383 73914619 77527691 83165001 89815203 96740230 105714113 114720294 122519371
5680 122519371 129049993 134843910 138080008 137971531 135354646 130562261 124421990 117240535
5672 117240535 110264370 102707041 98088686 93236493 90941288 88848055 88969456 89254050
5664 89254050 90523787 92509031 93729498 95279901 97024512 97771619 99067120 100105389
5656 100105389 101649523 103925896 106617549 108878533 112731084 117048969 121726477 126100469
5648 126100469 130593947 133090009 136739324 138891660 141987858 143689247 145102969 146465404
5640 146465404 147275156 147737892 147141190 146698207 146033759 143979841 142019668 139360958 137341816
5631 137341816 134410102 131560886 129039100 126505218 125484841 124159706 122065246 122243995
5623 122243995 121328970 123178174 123194521 124252291 124437237 124631279 124124654 123601809 122116960
5614 122116960 121617471 119233536 117389470 114479121 112759123 110256452 106989070 103578813
5606 103578813 99581786 95700206 92397640 89039843 86671758 84032358 82222588 80418338
5598 80418338 79256709 78592236 77105655 76235437 74830834 75283874 74575258 74239344 74654881
5589 74654881 76084337 76006736 77815436 79122562 81520268 86045855 91468171 98430782
5581 98430782 107139369 115924293 123383180 129626506 128111862 125033210 118267378 108808267
5573 108808267 102048394 95017374 88767766 85760817 82210394 80580002 80985462 81020202
5565 81020202 84065758 88825008 95916189 105649836 118894687 133767295 150836601 165563531
5557 165563531 177583440 183069783 182659730 176649531 167637718 160064119 153910765 148841392
5549 148841392 144912920 140084272 131803183 122817438 113772356 105675160 99573945 93763185
5541 93763185 89979440 87887555 88159279 90122424 95451190 101913790 110696968 120991374
5533 120991374 132229488 140420613 144322098 142850343 135535151 128319779 119296367 112998000
5525 112998000 106044104 101859275 96642338 92832188 88374807 85034101 81271983 77625943
5517 77625943 74318855 73087105 70651731 68632528 67068621 66916933 65763279 67054711
5509 67054711 67071311 67360813 67341826 69156675 68647936 71064709 71889895 73071303 74822706
5500 74822706 75408731 77583071 77786118 77905264 77949665 78716050 78293782 78067500 77993844 78404021
5490 78404021 77671279 77729432 77936758 77142311 76252148 76214993 74413311 73880795 73839104 72361315
5480 72361315 72965747 73156379 73259199 74760661 75397112 76896430 78139410 79316172 80744981
5471 80744981 80742101 81452109 81927892 82268144 81538582 80660323 79464472 77663569 76658951
5462 76658951 75440775 74969725 75341725 73824175 74085087 74418577 74325727 74391524 73055057
5453 73055057 74848225 73353223 73017889 73781955 73327381 71449481 71677253 69834261 68891441
5444 68891441 68775402 67816897 65668132 65404633 64534853 63960369 62146962 61212817 59038248
5435 59038248 58851289 56903937 56108569 55636971 56248032 55614282 56304139 56218302 58117168
5426 58117168 58552101 59116610 59998774 61833761 61849655 63880807 64489723 65842475 65741211
5417 65741211 67221809 66727165 65919121 64161149 61740413 58994001 57801283 54931293
5409 54931293 53737692 53982849 53592920 54599808 55680857 56340855 58461578 59576461 60514252
5400 60514252 61943040 62630928 64100259 64323471 63162705 63645556 62882284 61970333 61083833
5391 61083833 59656600 58352776 56692578 55569909 53941126 52482310 52980209 51779665
5383 51779665 50840286 50444886 50529721 51098553 50341101 50814511 51181067 50365742 49957841 49669149
5373 49669149 48523867 47936654 47333366 45939168 43909384 43443370 41651181 39314980 37908033
5364 37908033 36746578 34638725 34239636 32177151 31248648 30587615 30037052 29026989 28436404
5355 28436404 28821373 29217752 27550803 27458761 27769526 27815434 27585040 27625570 28100263 27894709
5345 27894709 28395046 27888313 28541421 29172716 29521872 29621427 29597701 29603773 29673654 29924678
5335 29924678 30573883 29934496 30598108 32141878 31251752 31436673 31648435 32955851 32608664
5326 32608664 33743509 34821144 35580667 36138428 36943218 37147377 38698347 38515761 39247857
5317 39247857 40068689 40461110 41375881 41318713 40542679 40210161 39792817 39923780 39177190 38398729
5307 38398729 38384213 38349047 36914612 36613028 36683278 36491922 35857002 35159557 34788014 34689446
5297 34689446 33877209 33436213 33512669 32725086 32851070 31757075 31188605 30674697 30664930 30167122
5287 30167122 30923318 29572633 29524571 29891725 30221637 28911041 29302391 29097274 29449508
5278 29449508 28949874 29375046 29676901 29230733 29019219 29530360 29460350 29374034 29584348 29079206
5268 29079206 29753937 30287430 30477468 31127984 30272254 31096459 32011172 32423153 33489927
5259 33489927 32953537 33412899 33801746 33812618 34827674 34590317 35153204 35692443 36870512
5250 36870512 37609564 38645181 39761303 41381735 41786408 43310736 44971611 46412012
5242 46412012 46453164 46471828 46297971 44739345 44170622 43880583 42275564 41868527 40780446
5233 40780446 40068763 40454706 41476881 40799251 41478859 43811166 44870614 46367038 48123025
5224 48123025 47954837 48364736 48945460 48265068 48274846 49178565 48720787 47706443 46516837
5215 46516837 45047713 43302658 41355960 38991228 36882007 36222423 35283641 35474212 34201498
5206 34201498 35450866 35919810 37564973 39129494 40399126 40387975 40794070 40418234 39876694
5197 39876694 38562535 39011926 37875601 37596632 38769426 39279302 39830653 41033070 41010476
5188 41010476 41653434 41046956 39439402 37421074 35673925 34334128 32458156 31539354 31148387
5179 31148387 30721240 31791640 32243239 32877077 33624952 33457461 34008979 33420315 34504418
5170 34504418 35854737 38023178 41038379 45815731 49355367 52905246 53297367 51108425
5162 51108425 47563284 43704357 40283699 36615051 33516323 31014101 29690876 27847755
5154 27847755 27969753 27025669 26555234 26538879 26627876 27687730 29109784 31693615 34447035
5145 34447035 38582405 41449501 44596671 45491610 43663004 41514758 37751116 33402511
5137 33402511 31029667 26904662 24576454 22803476 20898156 19555274 19125060 18536115
5129 18536115 16982144 16886828 17042046 16668841 18748617 18195333 19383519 20574353 20308804
5120 20308804 20731946 20852959 20459986 18551033 16919314 16424144 14118088 13497869 13099380
5111 13099380 11714306 11746791 10823056 11070483 10270771 10554999 9876850 9774135 9756043 9497901
5101 9497901 9532426 10509151 9115353 9548597 9180419 9561880 9155947 9008878 8783928 7944651
5091 7944651 8554621 8064076 8444627 8103680 8332516 8418702 8500697 8140290 7492045 7697911
5081 7697911 7911397 8470687 8229130 9076680 8665446 8879922 9040916 8801811 9089345 8314702
5071 8314702 8893986 8441513 8020664 8206727 8416995 8172556 9153126 8596074 8503142 9696385
5061 9696385 8924648 9014673 10155051 9231943 10007735 9688068 9492157 9254280 9748616 10001577
5051 10001577 10036391 9888204 10727768 11340153 12183728 13106727 13905880 15710170 16565104
5042 16565104 17233506 17687386 17396257 16362031 15916947 15799638 15432801 16588459 15343875
5033 15343875 15443743 15685011 16326509 16347510 16558946 17050198 17917690 18750161 20529085 20226303
5023 20226303 21909776 22777772 23428054 24907867 24812462 25248879 26211149 25359346 26047255
5014 26047255 26628604 28555394 28432864 28999879 28806580 29346925 31249439 32363995 32042996
5005 32042996 33881785 34068724 35351500 36191318 37277991 38616572 40008645 41042131
4997 41042131 42906543 44312383 47639908 50160036 54127471 57274528 59613624 61601885
4989 61601885 62133333 62483128 62253018 60290236 59817473 59795117 60093088 60105861 60671384 60917495
4979 60917495 62661502 63111887 64391771 65016345 66325122 66661544 67914356 69309825 70643880
4970 70643880 72383279 73710549 75901465 78594887 80983806 83976728 86623908 89732401
4962 89732401 93158603 95753546 96950975 96954333 94741813 92495532 89756038 88842954 88724534
4953 88724534 87864438 90027756 90200966 91021303 92829286 95101547 95252265 98300813 99350350
4944 99350350 103428533 107225351 116298606 130505992 156842083 193385075 247294233 324081364
4936 324081364 409352662 470645999 465955413 395903053 324417648 266772933 224145797
4929 224145797 187543540 157578396 135108828 119770024 109251519 102146251 95498037
4922 95498037 90878799 86629824 82455810 79616296 77745933 75290739 74433881 73433115
4914 73433115 73961930 74352414 74817219 75548870 75665755 73860985 72596397 71288679 70291971
4905 70291971 69393023 67618971 67079224 66378036 64836868 63704959 62272695 61395016 59624061
4896 59624061 57993114 57748296 57515239 57595626 59358145 59992571 63614435 66527008 70021893
4887 70021893 71412655 73573251 71421463 70155880 68255699 65469469 62694676 61016412
4879 61016412 57614105 55826570 54527137 54593433 53564226 53732297 54120854 54545253 56714869
4870 56714869 56952659 58086419 60901165 61852762 65281785 69273238 72283856 76863940
4862 76863940 79839958 83981579 86627778 88651002 89511035 87560317 85562046 81277578
4854 81277578 77933606 74526587 72182423 70022028 68956002 67063049 66866665 66240403
4846 66240403 65910281 65863102 67443942 67698822 68438404 69786487 71526385 73605347 76525322
4837 76525322 78762914 80852522 82034274 81951532 81985216 81095610 80716209 81081648 81957028
4828 81957028 82451274 82025889 80274642 78990947 75698842 74311763 72815232 70473205
4820 70473205 68786797 66777515 65886116 65705852 63803849 64054363 64521571 65671399 66753751
4811 66753751 67741006 68924148 70895726 71711847 71982200 70057536 70116070 67734928 67603633
4802 67603633 65680814 66421820 67292521 68897560 68890279 68599817 66931546 66583588 67448176
4793 67448176 66688867 68494910 69987017 71086668 72996170 74924727 76746699 79375864
4785 79375864 81174754 84067308 87193883 89259981 92450935 95064638 96601044 98157659
4777 98157659 98177737 99626772 98733146 99414017 100980108 101279500 103678698 107321405 109746463
4768 109746463 114958426 118284286 122172902 128681040 133491629 137647184 141102326 144551078
4760 144551078 147684915 150625133 152685839 155263155 156784232 158716469 158843207 158322880
4752 158322880 159074823 158632464 158699580 159491478 159131595 160191927 160299316 158491429 158292884
4743 158292884 159372270 161411186 162120519 165472622 167906335 171109061 172652948 174423684
4735 174423684 175459737 176921483 176742742 176147469 174227628 172859749 170604945 168463751
4727 168463751 164530298 161901994 159535928 156746495 153162471 151534064 149947302 147942747
4719 147942747 146218640 145038349 144195431 141832670 140067749 138566860 138079019 136001743
4711 136001743 134820143 134468489 132928753 132544577 130790606 129800158 128841694 127310512 126631953
4702 126631953 125001254 124832184 124673902 123243497 123787639 121260766 121197055 121581026 119765110
4693 119765110 119698843 118755491 117932295 117534953 117870054 117488073 118019642 117160209 116366647
4684 116366647 115772361 116037767 114983713 113748611 113335982 113092824 111566010 110996586 109834144
4675 109834144 108050098 106904432 105621796 104460503 104055694 102763270 103392933 103310055 103662542
4666 103662542 104376186 105326754 106129012 107749985 108638700 109856007 111875904 113084942 113477370
4657 113477370 114679095 115813442 116759824 118778369 119608552 121741140 123545116 125359614
4649 125359614 126487325 126815594 127769949 128568241 128561552 128973378 129147630 129789282 131265677
4640 131265677 131203309 132203245 133099174 133923180 134049277 134661661 133291176 133131398 131551944
4631 131551944 128821055 126435411 124722158 121986706 119689178 117642545 115686722 112780744
4623 112780744 111186045 109538893 107919938 105869550 105081866 103793164 102770878 101809305
4615 101809305 101198421 99963034 100008112 99240554 98560646 96612072 95301997 94095731 93246710
4606 93246710 91510984 89859700 88158360 86345897 84826644 83218105 81920152 80771535
4598 80771535 78970794 77139915 75360764 73696954 72474943 70449902 69040836 68176819
4590 68176819 67306650 67541189 66371718 65091752 64131339 63895398 62907324 61516460 59677844
4581 59677844 58819979 58496920 57596312 56640764 56744940 56070810 56519430 56580518 55991699 54848339
4571 54848339 55002676 54994441 55849011 54887138 55385279 54905150 54407355 54133796 54321353 53772219
4561 53772219 54105050 53197312 54272740 53284297 52660482 51596869 52436496 51926214 52052129
4552 52052129 50634107 51943050 50996022 51465504 51732343 52605732 52025935 53992898 53968001
4543 53968001 55544795 57886012 58516800 59427132 59837725 58750309 58516634 56630860 56480811
4534 56480811 55159839 54825626 54357360 54436355 52989246 53929904 52261626 52486905 52541696
4525 52541696 52143642 51827445 50708330 49179217 49244099 48220820 48595291 48314615 48612385
4516 48612385 48552817 48071220 48278694 47381043 46962698 47329804 46152992 46687584 46414978
4507 46414978 46536191 46865296 47413894 47150455 47642433 45813728 46233696 45060623 44345861
4498 44345861 43605528 44209138 42665697 43581707 44067762 43803894 43882601 43943934 44151397 43594552
4488 43594552 43126181 42317123 41060814 39719953 39333435 37376581 37197781 35411701 33973451
4479 33973451 33203185 31384006 30141546 29280227 27842742 28182301 27009486 26724230 26366451
4470 26366451 26294038 26104935 25230506 25539349 26728655 26081169 26537634 27043174 26325770
4461 26325770 26745535 26662144 28412015 27625998 28044008 27614165 27682165 26678198 27608207
4452 27608207 26165662 26245154 26372309 24777732 24860760 24597333 24192457 24723620 24061567
4443 24061567 24632929 24285046 23400714 22889666 21902171 21172685 21126751 19667312 21127014
4434 21127014 19595716 18673494 19949566 19598654 19012902 18971383 19440570 18711350 18848364
4425 18848364 18858358 18804280 19452797 19036781 18700799 19774048 20035657 20075154 20275871 20490514
4415 20490514 21304283 21585866 23195671 22172687 22906162 24760472 24225734 25838342 26744124
4406 26744124 29602941 33148128 36035857 42835728 47847784 54299800 57091189 56402117
4398 56402117 53980787 49237631 45119446 40120148 36405885 34103439 32371549 30611854
4390 30611854 28525127 28258436 27554554 26944733 28359651 28423940 29070680 30773390 32226931
4381 32226931 36361684 38273262 43191850 49336308 55518635 63272684 72552177 82615574
4373 82615574 93043560 101876228 102597165 95033940 85319714 75589306 66694630 58390107
4365 58390107 52102983 47335430 44336574 40906148 38957024 37501130 36904566 37142193
4357 37142193 37142185 38479676 39057137 41003892 44243628 47846374 53836180 59703537 65745706
4348 65745706 69611408 72315321 76822890 83971864 91081193 100242714 109058257 122559352
4340 122559352 141138338 153169955 154115195 133101208 111007804 94983756 82066638
4333 82066638 72888823 65009656 58731959 57538184 55127395 54999973 55208172 55308367 57150143
4324 57150143 60018214 63398494 68477270 73057156 76767814 78281944 81720915 86919657
4316 86919657 98388771 116097337 139622636 176676834 227111871 273511385 304556058
4309 304556058 287033749 260087190 238245839 220871594 202806184 184736765 165465957
4302 165465957 145503046 128866321 114546771 101834026 92581832 84781058 79487994
4295 79487994 75404372 73290759 71536432 68332705 65407130 62162583 62085353 63849964
4287 63849964 66612501 75838519 88577052 106197665 126143205 138794853 131768703 112050586
4279 112050586 93038988 79106760 68589411 59739331 52437473 47631039 44427113 42047806
4271 42047806 39956115 38897978 37289206 37226694 35911513 35823758 35249640 34354903 30759200
4262 30759200 30105275 27722498 27035793 25856627 25249749 23953834 24316749 22756422 22402133
4253 22402133 21224420 21350612 21141584 20732559 19827533 19405892 18272789 18486249 18837408
4244 18837408 17918436 17835917 17672474 16693052 17512953 16027287 15906051 16057072 15703957
4235 15703957 15325293 15091018 14050023 14727175 13439246 14180210 13981742 13553867 13538221
4226 13538221 12779321 13030545 12606970 12292588 13162085 12122807 11660413 11827769 11741402
4217 11741402 11128987 11527149 10531328 10811033 10229372 10822000 10778350 10191748 9464829 10730344
4207 10730344 9282496 9916080 10009047 10061721 10311503 9084328 9927891 9336493 9178778
4198 9178778 9430894 9549412 9083042 8513681 8673027 8911934 8536861 9348006 8092945
4189 8092945 8757889 8338629 8092571 8626239 7934394 9262826 8591159 8387808 8049416
4180 8049416 7793853 7997421 7835896 7771596 7102447 7322552 7181474 7392781 6459951 7026181
4170 7026181 7628341 6840069 6513357 6182204 6512605 6187414 6328005 6721203 7031737 6522239
4160 6522239 7057979 5698811 6445380 7117214 6771303 6240912 5738668 7156267 6455267
4151 6455267 6156787 5822646 6004411 5807607 5902997 6069999 6421958 4958407 4878994 5715066
4141 5715066 5311796 5463418 5155836 5344299 5349380 4820724 5099886 5023146 5647385 5028002
4131 5028002 5305864 4577308 4564826 4950716 4834571 4312608 5259481 4541606 4672724 4425432
4121 4425432 4921008 5345241 5445534 5481559 4877247 5081020 4581803 4360196 4601706 4655796
4111 4655796 4594392 5176607 4497395 4203602 4729544 4129205 4288557 5064530 4605159 4738180
4101 4738180 5124059 4044381 4464668 5133539 5740319 4818495 4774254 5016783 4459972 4411179
4091 4411179 5176024 4195932 5195500 5200141 4803849 4574893 5017198 4106278 4342882 5183249
4081 5183249 5689264 5030460 4500800 3974682 4237701 3394744 5301537 5430348 5288109
4072 5288109 6304793 5409047 4401349 5360254 4628133 5698291 5951457 4721160 5925920
4063 5925920 5405116 5526558 5619103 5593135 6535577 6908268 5965467 6014053 5029591 5513037
4053 5513037 6076686 6532958 5585574 6076990 6244014 5589511 6605671 7243422 7145779 7596658
4043 7596658 7913370 7304785 7386097 7312400 8127027 7450944 8677394 9231766 8631249 9083780
4033 9083780 9697995 9409986 9989065 9796986 9928699 10132730 9953082 10003549 10328463 10269721
4023 10269721 10051033 10872792 11894472 11685939 10414658 11390497 12595586 11651589 12015188
4014 12015188 13600952 13994875 15392704 15302519 16048485 16984021 16503127 16589972 16085128
4005 16085128 14991169 14612294 13303483 12214600 12258810 11932485 11643823 11191113 12094118
3996 12094118 11714561 12049725 11962864 12527531 12713759 13395075 13873293 14223994 14670895 14469197
3986 14469197 14189199 14824749 14889657 14434915 14261255 14160880 12768571 13369381 12146325
3977 12146325 11611334 10819315 11466303 10362529 10850631 10401978 10330086 10169883 10627706
3968 10627706 9970689 10482050 10617330 10429563 9306357 10534592 9949165 9810114 9325501
3959 9325501 8491983 8103493 7383871 7332247 7020357 7227408 7512617 6175341 6262156 6318152
3949 6318152 6210997 5089880 5379092 4717627 5446211 5442004 5608171 4988082 4920520 4416649
3939 4416649 5849460 4393086 5719136 5201108 4100441 3972813 5071127 4318913 4521276
3930 4521276 3378482 4042549 3517363 4012038 3148459 3994101 3732866 3358911 4087381
3921 4087381 3531939 3190399 3914980 3290796 4516168 3033773 3252823 3769393 3772836 3468705
3911 3468705 3222780 2777405 3876940 2806723 3413933 3252219 3585707 3821677 3439403
3902 3439403 2771085 2932307 2157850 2387003 2906358 2834978 2576152 2497207 1562219 2977934
3892 2977934 2810634 2511858 3220860 2041266 1928822 2430555 2417892 2492574 3095153 2309242
3882 2309242 2483335 2739237 2937630 3398289 3005155 2584427 2708623 2794699 3094778 1877341
3872 1877341 2075483 2415108 2469315 2259549 2705355 1751657 2696752 2673278 2554001 2126929
3862 2126929 1908408 1848895 1841469 1368525 1830891 1074904 1364840 1688131 1716354 1287062
3852 1287062 1612166 1763330 2160749 985523 1824063 1342401 2679754 1605916 2686475
3843 2686475 1357827 2495114 894494 2143088 1463456 1521007 1218725 1233893 1199817
3834 1199817 1950323 1242697 1449324 756906 25066 274188 1579610 1144955 1354441
3825 1354441 832566 1929848 1024334 1875988 275836 1087769 891868 2037346 235159
3816 235159 1414333 1226802 779344 824112 2072496 981353 1732454 -301280 949299
3807 949299 443974 349769 1540416 918876 774445 1747011 260127 766175 833197 952105
3797 952105 70507 942184 1081689 1516546 1133775 258764 1090445 857994 1482935 781343
3787 781343 708805 1456952 617519 955904 889267 388339 1430920 816847 -760119 785295
3777 785295 431553 881754 857835 814678 484861 1407108 739445 569625 306024 755920
3767 755920 1444692 1090464 462254 1412104 549375 911198 141391 310669 518555 832690
3757 832690 957902 1310983 454742 1247702 1033736 944956 705760 825166 -197516 920852
3747 920852 559477 443966 451627 296032 531316 1212734 772803 847542 1597941 1075833
3737 1075833 1423208 868148 413266 746848 339490 -160829 428173 660733 492348 1077615
3727 1077615 702548 -273211 828999 736266 698462 630073 629745 223808 1229732 1022161
3717 1022161 749332 1264575 1465986 1052126 757871 1389827 283135 599038 777856
3708 777856 689532 764578 1336175 921263 268963 1331353 442661 756810 937642 92556
3698 92556 663715 523173 557654 1061701 1236681 1339549 835130 248230 1821515 562694
3688 562694 180987 842287 914381 1337680 807198 128637 615440 328993 544026 545373
3678 545373 136970 1116939 817174 481162 836332 280851 379603 662543 -86247 1022353
3668 1022353 290389 350384 535095 670470 918287 949906 591528 885952 -30016 201937
3658 201937 613503 350831 960102 191308 557627 559665 473085 -212090 731520 671411
3648 671411 794076 262162 -167716 118843 150343 177724 444769 450366 520682 51385 242514
3637 242514 -223947 471039 434591 1016253 788642 237017 423041 859453 -22280 637348
3627 637348 431400 -98818 -291276 872270 -482734 384524 280423 -300341 480068
3618 480068 453185 824032 468803 560992 862615 1127974 581321 839922 -80836 1740277
3608 1740277 259831 -193536 484310 402592 814566 530121 602333 629828 -296926 520146
3598 520146 132916 231719 597035 598034 188941 586492 931323 789042 831164 1127134 2037753
3587 2037753 1132363 573930 827498 226944 195348 521641 72471 683670 657082 -45625
3577 -45625 940317 -296616 570068 654076 424490 300141 200108 -797398 383912 153428
3567 153428 550510 375958 443342 272395 890684 97056 953470 1336876 577349 1180645
3557 1180645 377307 -512574 1053143 -153792 683253 31770 -420286 488414 197031
3548 197031 -376100 -67142 -608372 761055 440901 403939 -29152 1237327 22037
3539 22037 304782 -102309 1094098 853852 67970 297851 1403722 -118313 -291634
3530 -291634 182765 39418 1514439 139121 -607363 1040052 177422 39638 392139
3521 392139 716759 -74960 -41463 -103870 608137 694273 508768 248190 119361 979576
3511 979576 285977 -426638 507473 759237 1033331 -46753 -151753 260914 909428 -48367
3501 -48367 814621 642997 1372950 464337 802833 647620 1041355 361475 -119859 947591
3491 947591 391168 392890 1021738 410545 -181395 874072 -656671 189983 354783 144938
3481 144938 367421 772575 383097 161771 1206647 171227 405352 692186 231811
3472 231811 -179887 422452 857033 640308 1110569 34314 793369 365836 31193 -545047
3462 -545047 140052 664364 772462 416469 -207718 774928 140114 -55562 -164447 1061484
3452 1061484 755398 -513860 -81915 415236 792020 611415 644331 1082189 456685 532811
3442 532811 -336045 312910 714387 1070595 404599 961123 441151 662780 242311 657517
3432 657517 835747 561099 878462 289177 388664 223697 168677 85843 316199 868291
3422 868291 1275055 520038 737308 1156200 442602 784490 -200417 832214 1451402 988296
3412 988296 109036 702906 -252303 692282 27761 463979 612279 -294507 -250271 358152
3402 358152 618638 1169017 575453 462153 382550 91842 -227854 325424 190911 1236122
3392 1236122 264022 2755 907768 59330 757375 1163787 511874 1997368 1398269
3383 1398269 1139100 1698376 2057847 1569148 2259246 1222073 2304938 2324541 3347610
3374 3347610 4268508 5824518 7549410 10025732 12895166 13878029 13636249 11874447 8939560
3365 8939560 7204827 5903618 4516520 3042517 3094817 2403277 1845284 2353007 1632461
3356 1632461 1267862 1675329 1759341 1930945 1629223 1008175 1414875 872090 1481972 1123291
3346 1123291 457034 1301692 140952 451808 1151471 242971 563733 1179787 470559
3337 470559 1284609 394814 1571011 799540 469646 502540 640622 96362 203849 302775
3327 302775 22802 814803 134290 157333 420691 345538 520279 712924 607338 805475
3317 805475 852061 417854 760066 -268237 324291 446136 949058 570647 -471406 298723
3307 298723 449691 -510788 458399 1147318 -219501 775315 -182363 810838 576610 573306
3297 573306 772357 1389666 -218877 432800 76921 325798 761391 -8272 594472 917356
3287 917356 -257541 -52425 226998 -234784 1001618 1338916 699300 556276 1301070
3278 1301070 859013 129950 182303 457723 468244 601783 125183 493929 606909 657029
3268 657029 -183219 22177 739046 273136 943691 321976 214146 315115 116699 415213
3258 415213 136122 197235 102747 -1145163 180705 221533 696291 991727 199670 -76982
3248 -76982 153818 -648175 709382 -529914 980461 533893 324272 569618 446714
3239 446714 -66499 558222 132596 55467 687399 50338 -742526 90033 879115 365608
3229 365608 732677 -239132 646938 -97562 -392308 175363 462083 408672 382336 105648
3219 105648 130391 276150 59375 59875 -215697 -71240 -423793 876336 1145752 179291
3209 179291 101730 -93488 435165 -368682 21475 347894 -408509 814621 -162961 439566
3199 439566 912414 -178260 237877 675425 -152757 -158630 331922 1048240 298279 110410
3189 110410 158929 548620 -350395 42945 -685468 -109679 494176 739726 415350 184310
3179 184310 255987 154888 39596 -356737 81243 -300871 -148515 336906 234946 439048
3169 439048 -532830 236278 114670 515279 -232907 -118623 553572 145951 455373 303350
3159 303350 563011 -84374 -398210 -877370 397584 -47430 1148485 -86810 178709
3150 178709 -548365 -170568 332387 703859 599401 -119325 56561 -321073 -139702 -592415
3140 -592415 465412 293497 -20818 515759 258971 539100 -360601 -59614 510317 940738
3130 940738 963146 -178370 -296884 -61672 -577335 -371165 -66264 -677907 155384 54017
3120 54017 138805 96158 -579002 347650 -214851 638291 653341 125199 -91267 402534
3110 402534 -632754 610026 352888 76317 481085 460039 639780 -121640 -227136 -407107
3100 -407107 114985 2550 182805 -98430 830911 81718 149097 505756 650799 -168768
3090 -168768 -120803 -479695 212691 115786 328032 -763212 208272 335875 -731014 -442441
3080 -442441 1075110 729611 560731 192130 269570 -404652 206918 -226078 316027 20789
3070 20789 628768 675478 -241628 843840 408149 406351 199133 -161978 -216172 690306
3060 690306 485183 293232 -453562 472278 273787 290565 -644702 235874 69340 252847
3050 252847 213944 206072 590104 316506 -464006 171770 28517 -417528 100603 -26332
3040 -26332 52010 -299825 -84504 -375832 128663 -60092 238378 778956 -80918 60890
3030 60890 518037 12334 654436 68564 76347 116743 -280304 -371382 394396 765052 232507
3019 232507 -144111 135988 -918554 -321094 288021 -210132 -122270 -742250 -374318 -554759
3009 -554759 421925 -698039 431829 144831 275554 -597967 -195766 16116 70954 -507374
2999 -507374 800665 476839 -200573 -140387 -41212 231128 263020 138547 620656 -341087
2989 -341087 -224542 -12406 -203752 398073 -117811 -244138 332130 -397766 241012 -113090
2979 -113090 -627744 370928 904395 -35446 274032 -119803 612708 -499886 -409347 163489
2969 163489 -356544 662215 373916 -185989 816870 605755 -328109 109087 -491330
2960 -491330 -66392 -750650 -49805 3202 682110 -349055 -261795 594152 478366 -315619
2950 -315619 -191706 207397 -21305 265300 79355 482750 -187873 -30597 240537 -196852
2940 -196852 -219340 -67278 -547347 -3551 118294 -586099 -229719 -298442 268134 -250504
2930 -250504 672319 87516 209479 480088 503353 284647 152205 -495606 240077 87367
2920 87367 -131471 -86373 332565 -250263 -512930 -860168 300241 263724 -313740 -296888
2910 -296888 -152864 496306 409767 -383181 -228405 67677 354960 -33647 -469062 -234013
2900 -234013 285435 -183347 646923 417367 -317097 307485 263960 4992 797095 985213
2890 985213 -20274 380957 -293776 -122074 616672 -174727 -103813 375206 -300741 519699
2880 519699 694018 220784 547891 -40286 -231487 -25778 136836 40883 562310 397445
2870 397445 1008841 -36491 158354 -807233 -846367 -272836 125015 -132016 577096 422106
2860 422106 -334150 -318953 -52957 19078 104399 153432 -63751 -554435 -83850 -127013 731213
2849 731213 169062 625751 -83264 589132 -61103 -152407 29222 -120397 -563574 47174
2839 47174 -318204 -239959 -43123 -769555 176609 -252758 -91978 25561 176316 1327
2829 1327 -116876 -62610 9937 -155961 315228 332382 111808 -257808 454463 112481 -745019
2818 -745019 -538886 -595285 -308979 96658 -780410 -102645 192414 -332894 -122615 73927
2808 73927 105035 -410013 -421714 -107580 -104331 436460 194073 -999258 -162015 -190264 623530
2797 623530 163983 -627418 252967 -567958 15130 106775 403649 -254536 -449298 -940427
2787 -940427 -41097 317692 -234434 414493 -653852 -599037 71158 -361433 -363152 553856
2777 553856 377689 480038 -525322 452716 -390045 -522067 -48719 105016 531443 215916
2767 215916 -369287 -193612 41530 -301076 397295 -253031 190656 -284358 590846 -263710
2757 -263710 133334 526603 292612 247475 128777 232551 380936 -564475 149096 -444449
2747 -444449 -92718 333573 256617 -341068 -545138 -29067 -156811 12799 -109581 394808
2737 394808 804901 -89829 507790 203200 349171 -206568 400358 -305531 384648 -316540
2727 -316540 331355 14195 510860 -617278 -110686 552207 -112872 121692 814118 303864
2717 303864 684789 636414 70482 -99922 42704 -318001 213185 -260489 418777 -618080
2707 -618080 338867 142534 -100732 582173 263060 -200419 -489806 -567265 -618754 147785
2697 147785 -164955 243086 -19197 -215145 4399 -351685 -74092 -322376 18557 431475
2687 431475 72677 231749 -151822 317032 -731468 -9286 -1016435 -258587 305840
2678 305840 578043 -628355 83446 274914 -68118 223355 -672703 -445165 -356521 -1023566
2668 -1023566 -393824 500071 -765727 182039 83048 -150471 224233 -607114 -578737 -951936
2658 -951936 605918 -343902 -124884 -378611 -336744 -4282 180348 111350 548976 456182
2648 456182 33029 697748 -107373 673490 25550 -259338 826261 -175605 -117865 -233322
2638 -233322 11301 145044 -483654 -6786 697016 -343096 140337 193130 -797105 253457
2628 253457 467198 -298467 -127502 -396870 -57334 -78990 107933 -142579 466638 111186
2618 111186 -438995 107967 -357431 -374045 -193218 -111356 -22220 314730 -845 277914
2608 277914 23492 76023 176020 -753335 212236 935401 -285547 -272505 -588684 -17319
2598 -17319 204875 417811 173627 -435935 -7891 -317277 -342050 -516241 -71834 546237
2588 546237 139807 -307929 -56668 335933 -463853 -118968 -211799 98004 -478052 737927
2578 737927 -54026 -392660 111501 431004 83753 861034 214897 441156 -434126 655097
2568 655097 -43748 292060 64161 -4482 537460 729699 38810 -107962 -176335 587280
2558 587280 368333 232475 155841 393208 113102 -309653 -15047 763080 272472 -232417
2548 -232417 -819165 -368545 -496038 305324 359146 -707216 -52387 7270 -107345 193286
2538 193286 -659211 -9124 -24407 -570471 -325054 178610 -129794 -546668 694647 -114471
2528 -114471 -113640 4563 -297055 339358 429724 836482 17219 530225 376152 169626
2518 169626 233762 261329 -758960 1023329 -115726 -245600 -236482 -502084 -353407 368690
2508 368690 -536197 -423477 -998945 -174288 -575286 76989 463933 141516 -422708 -223613
2498 -223613 -517649 -124062 695642 -312354 -293584 145050 -947513 -456411 193607 -58109
2488 -58109 717304 -2278 116741 918519 -238644 210342 -454681 52918 472009 278581
2478 278581 -100981 834558 223435 63801 267950 52557 -61415 346063 368633 161282
2468 161282 509773 306869 -189634 -576377 -557167 -97486 -695598 -859664 186053 132242
2458 132242 -425498 -412428 -581380 -157337 -394006 152073 -657793 11022 -70423 801657
2448 801657 -374439 -287850 88249 -197545 -743559 -433943 10617 -103669 -351101 523228
2438 523228 -464093 225762 155788 -698053 -137413 -48513 -490262 -61429 -168133 437461
2428 437461 -2630 -6915 121571 422940 -208236 -710730 -874093 590410 -555117 -28595
2418 -28595 540783 -468823 -390911 246718 -98075 -161202 -626127 316227 -400590 50698
2408 50698 -76679 711297 -122002 596213 -547205 -578366 129548 -155406 -185918 728837
2398 728837 31591 859928 -415748 -242024 -627718 -462670 -516299 -48410 4328 121581
2388 121581 -114358 394455 -360326 -426791 367580 84702 -314933 -64714 -164568 340424
2378 340424 -471130 -367474 -815488 425408 -165517 -76402 196558 308635 -516880 64857
2368 64857 -457223 -350659 266762 -511299 -374693 -518362 -511771 -169445 624 -874746
2358 -874746 -426549 -176915 36944 -206941 179544 -67402 93116 -166525 -505896 -150054
2348 -150054 290661 74627 165647 513368 542672 -129746 -437245 -428124 26277 306258
2338 306258 781873 389238 767021 -104248 -295641 -114841 -447083 -186981 105685 -536974
2328 -536974 -28145 -460295 405486 -1085711 -50758 -417957 524380 -699808 -380528
2319 -380528 17696 -227161 -389834 30532 -715446 400625 -695811 -395955 -497840
2310 -497840 76528 14901 259086 -60467 739589 172333 436564 444173 741021 205613
2300 205613 529987 -6866 -101138 356068 -295886 -500336 -239618 -732669 -498061 -132360
2290 -132360 378579 -330288 200764 220424 -189066 49792 -423036 -574702 26988 25911
2280 25911 -160176 24005 602968 -339688 370029 585224 505729 -6503 -304421 303516
2270 303516 -406459 -665889 28467 -98081 -534669 31209 -367169 541904 128141 -209447
2260 -209447 207144 -609551 -398256 -574350 -55079 47835 466076 -54483 373066 -1036312
2250 -1036312 139746 72987 -47699 -269838 -20120 -532570 -254197 -854447 -264078 -359748
2240 -359748 543112 657898 -279980 455104 -609977 -427559 29983 -88370 88921 -64252
2230 -64252 452575 464655 743983 428281 -346060 -973052 -572252 -535160 153419 78617
2220 78617 542961 -154040 -171285 -182537 -558590 -158345 66727 -481939 -600077 301125
2210 301125 -132841 -1132621 -9761 -404365 -86961 -98707 324344 177673 253729 -178912
2200 -178912 886151 36629 409525 -673380 423511 86088 -672808 218266 -164921
2191 -164921 -216254 319221 661868 50678 -60384 64357 -126526 740940 -196041 278116
2181 278116 -62991 -886200 533024 -705807 -629846 541803 238825 -984531 -621689
2172 -621689 -469584 -1141158 -809771 300738 -898667 220592 -284881 -832776 -317206
2163 -317206 -356522 -43459 -324450 -353101 -243708 -699786 -67432 -91983 -25472 412602
2153 412602 -148147 336500 168982 -346986 -1096361 280466 -18591 -318902 -372223 -354727
2143 -354727 -354743 335320 -306246 93725 -286595 -112772 -915723 -299746 -423222 485441
2133 485441 612576 -293994 -443574 912 -576935 176517 -713372 -351080 45598 -101549
2123 -101549 271534 -249097 57949 -487132 -745170 -176756 -558086 496616 151005 -197353
2113 -197353 -426154 -492050 -62461 -766179 -69411 46764 290146 154816 425955 -230091
2103 -230091 235722 115858 206657 412328 112798 439477 -626989 -214484 123555 -155321
2093 -155321 -815215 359954 27352 -813365 -444799 -367658 -198207 -395459 -596089 345501
2083 345501 -383658 -329318 -981933 367026 -20302 -436109 20316 -474613 -772808 -602254
2073 -602254 318347 441633 -619993 -13704 -119817 72606 -487121 -327633 -686182 912182
2063 912182 587391 138827 93078 111653 60521 8969 465236 -465424 -670371 -674798 -675545
2052 -675545 44142 190287 -203967 -897347 -518356 -208129 -657126 -1004339 -574758 213182
2042 213182 -695417 -123260 -11533 265720 -94491 -199476 -888536 164439 286231 -82122
2032 -82122 -599567 988699 -412513 -698495 -494275 -428780 -120506 -98135 -382497 -453440
2022 -453440 -51395 -188231 -582391 562930 -107588 -135991 281847 -752771 -642467 466462
2012 466462 238239 69572 490624 542597 152332 -271841 -876074 -247788 522650 573299
2002 573299 -624396 -99254 -380689 -70072 -929388 80194 411769 -95826 -166447 81945
1992 81945 245525 980601 -17867 540767 -446292 -196074 -566808 -166612 -921142 95180
1982 95180 108972 669040 114508 -9249 -884268 -653425 -420209 217462 1007931 514980
1972 514980 -251816 -271272 -347323 101488 -958106 -119416 -1679919 -99629 -549444 -63629
1962 -63629 -327036 424036 -262508 -127803 -787212 -26224 149403 -377486 -147158 -106158
1952 -106158 55359 433414 -768165 196152 -511108 -550809 735599 -175151 -92260 517769
1942 517769 -393712 -132192 -136614 -219328 642192 -396211 -600817 -500267 -260645 -614977
1932 -614977 -206784 45934 88330 127935 -595160 -384979 -141571 306953 -178351 -360554
1922 -360554 -175603 -239675 -171987 -62499 -8288 331680 616616 -1040099 189731 -416834
1912 -416834 -225931 642654 52379 265988 -160405 -509142 -432118 -137870 157361 -124715
1902 -124715 -524657 -88190 -490499 994 575228 -162578 -272896 52091 -157063 -121248
1892 -121248 319913 -1123851 -701046 -30751 -369045 -893833 -364810 -62738 534384 -479358
1882 -479358 -521650 -518235 423287 18483 -68028 192004 248428 588386 193074 -5522 -458227
1871 -458227 366342 -92844 60929 -275953 240157 107806 -95845 -388047 -228356 93822
1861 93822 60296 -354076 -498304 410041 -931922 434306 256920 42914 -734631 -668553
1851 -668553 -934585 -445332 -455472 -290471 -200536 -293583 -187785 200557 318118 739276
1841 739276 -133282 -43025 -1023465 -959912 -113333 60268 -1477152 212467 -69115 -507580
1831 -507580 -717038 -287832 -17289 286724 -824548 -27247 -130070 299657 -282780 906017
1821 906017 -275276 84669 -680829 -81736 -311595 -251448 -249781 27458 -169027 26507
1811 26507 -232601 211280 -242550 -825800 -148848 -725284 -550676 -226521 -189838 -1161899
1801 -1161899 -153183 -888985 -445049 -102726 430708 -213728 410705 -605790 -101969
1792 -101969 -288750 -73622 -423780 -550944 -33177 151763 -233691 44562 -207352 319254
1782 319254 -800440 528677 23648 -93345 -400983 -924154 -1142712 -1033113 -134393
1773 -134393 294950 -711186 -209005 -479817 -779954 -145735 -1034863 -193608 -532219 -875531
1763 -875531 313936 -261272 174245 392715 -406851 193156 128928 -378985 288780 28848
1753 28848 -139704 -371983 -204972 -991202 359976 440034 -587384 -95033 634104 -107056
1743 -107056 -312322 136389 -93850 98717 -457138 -223803 -546408 271829 -726837 211003
1733 211003 -575150 89233 -41343 -299817 -551144 368778 -272866 -200490 -209459 -145883
1723 -145883 -786946 189479 283051 -577372 -138703 286024 -504296 439307 115207 529144
1713 529144 152160 398695 -36213 278435 -449171 479526 550658 -256657 139235 745824
1703 745824 -496598 -283486 -250024 -94229 -210794 832451 -1090575 -102150 -303431
1694 -303431 -429409 -913077 25817 -187230 271805 192020 35966 -1050814 220717 644971
1684 644971 -57498 889978 -369323 -411790 -81125 -342306 -79744 -244090 321759 -75300
1674 -75300 -731535 -418918 85575 4967 -675112 -109424 63914 -167023 31994 289641
1664 289641 111462 215750 100007 -411400 8305 -109367 -441802 204907 344604 -4299
1654 -4299 163678 -913141 -973064 -24863 250068 -251627 209590 73505 -996423 43927
1644 43927 -596678 -120807 -433954 -484486 -417030 -475440 -28577 -229567 -922777 70603
1634 70603 -271964 -614891 -539508 -767272 -1031008 226626 -1127968 392962 122402 298877
1624 298877 25512 -1012010 -509192 -584518 -136274 650348 275266 260418 141034 -596470
1614 -596470 258694 -1053606 -119551 -166789 -348107 -174880 -1237630 114540 -70122
1605 -70122 -174279 732930 -205289 -9590 -163281 -640721 68510 475808 -340289 -755361
1595 -755361 -241336 -815689 -268271 -506915 -547042 780111 346064 -459789 -132286 -379886
1585 -379886 -218839 610662 -168363 283562 -108957 -10533 -167921 -68016 -255308 145706
1575 145706 136288 -315704 -690799 -716314 -45779 -237045 -229807 867272 843092 -466946
1565 -466946 -117182 381044 26093 -522442 -597456 -25762 -171104 -518993 -114368 -411895
1555 -411895 -725190 77579 -236000 -138992 1016276 96341 -542745 -732378 -137634 -118626
1545 -118626 -176683 -567139 -1219974 -272043 -420781 -608779 436614 150139 -221659 -95568
1535 -95568 -95502 -428542 -137653 -92872 285696 -457137 106713 -1489886 -1193700 -298721 -418010
1524 -418010 -223207 -176062 -729255 -550756 -922912 -184635 -329792 335330 722597 740359
1514 740359 -584236 -163902 -339073 -427339 -176478 -57648 -440173 -600903 -99580 228826
1504 228826 -686097 331824 829570 421390 -126894 -396675 -194647 23877 -502773 -349614
1494 -349614 -295363 85024 45258 -997573 -570507 -144035 57906 625915 -177072 -553067
1484 -553067 -666587 -446523 -787868 -781074 -361841 -119670 -778033 33039 42484 233910
1474 233910 20715 -396044 107238 -354393 297861 333788 252893 438732 299195 -332809
1464 -332809 -315695 -723046 -663861 -169285 -1168081 -709016 434901 -730895 261107 456444
1454 456444 503410 1200716 -431406 13137 85939 -506035 -291711 -511869 538861 341555
1444 341555 -454362 -510284 -422672 -638486 354218 -688826 -90746 -121995 -487640 -949378
1434 -949378 -658245 -1225854 -362526 -660879 -225538 -35214 -752095 133953 234651 -457598
1424 -457598 -488592 6753 702939 -533469 330465 129607 477868 813354 762121 -445669
1414 -445669 354556 -695823 -339207 -157176 91901 -896398 -298966 -387783 -376872 -69611
1404 -69611 494510 -434602 -1025082 -1063176 -654123 -412454 -38519 -398384 -655723 -102751
1394 -102751 -14796 417639 -37231 -1034514 79298 -680792 -451245 231631 666411 61304
1384 61304 -757682 -305180 -608593 -320912 -416118 -382676 -258236 371053 -26056 -193422
1374 -193422 -41128 -465246 -277330 183068 -104124 -408857 -235548 -606634 -198724 -67432
1364 -67432 -86798 -170625 -167628 -445140 -1411123 -314791 -250373 -459535 54219 -452341 -482862
1353 -482862 -347589 -376200 -165579 -851967 402240 252864 -397719 -17183 -442988 -848202
1343 -848202 -518204 -433941 112863 -93584 -416796 -1008981 -352272 -719207 -23345 705920
1333 705920 -241250 -291027 -660946 -712028 -418799 -21205 65431 -358672 -188203 -22130
1323 -22130 -649541 -337809 191683 47540 -565699 97825 -447803 -74173 -512788 -406721
1313 -406721 -464020 231405 672627 5816 -762696 -789394 -197155 -650417 47763 91000
1303 91000 3239 -75519 415207 192423 -199333 547605 -172671 -132534 -236685 -84820
1293 -84820 -765121 522090 -518066 -1012642 -270703 -443937 -839777 148871 -249071 -1176021
1283 -1176021 -304156 491218 24325 532423 423462 -141432 904890 -358643 -757934
1274 -757934 361832 -880316 870819 297462 409330 172512 -526166 -1170055 246732
1265 246732 -1128371 274160 -713932 82682 -657716 -324642 -215104 -593100 -849715
1256 -849715 74562 -347359 -440713 -824774 139162 442379 320241 -975452 -10317 -63483
1246 -63483 -135228 -813550 -224150 -187979 -53687 -770589 -272390 -445665 -865071 -221916
1236 -221916 344732 405725 -863556 176326 -16480 -516819 488512 -742138 -47167
1227 -47167 214769 288337 -618570 -635470 198406 135713 340433 431593 -370406 725846
1217 725846 -792125 -1111022 -514810 -654541 88720 66727 218071 -282183 124912 -501522
1207 -501522 -1003469 -223311 302152 -356398 136273 -226934 -215364 -414310 -357927 -55206
1197 -55206 283348 -457078 -57269 -277298 298775 -549995 -145861 -808738 -15593 -408105
1187 -408105 -545010 -388756 -228764 182395 -666687 -370700 -500730 -540294 -115150 -90614
1177 -90614 -353843 -222235 -187290 -614672 -443851 -376071 145900 -229863 -786374 378341
1167 378341 369401 -656667 -74607 -498825 -160479 -663013 -50476 -28413 32956 289305
1157 289305 -877348 -263096 -131162 -158574 89594 219327 -175163 -166380 -373931 -463842
1147 -463842 214659 -518040 -418113 -886863 -338614 -940305 -43195 -278461 -222134 289454
1137 289454 271623 -864766 -612733 -741668 -24805 -146909 133787 -500141 -190803 218799
1127 218799 167926 30227 -382549 -780763 19801 -804828 -246796 -1683 -858984 -679042
1117 -679042 -415415 123388 -434951 -1053665 -188533 238973 -599908 -498128 -112292 156863
1107 156863 -422461 -714466 379481 -609059 -57311 -117612 -332663 -130685 660903 -851226
1097 -851226 -154639 -145157 115412 -200668 -300453 -266646 -391034 -544126 -710599 -646384 -21474
1086 -21474 -616588 -419120 -547869 317151 -197119 -53425 -210880 -79393 318897 -225779
1076 -225779 119870 -183407 -353137 -296371 28802 -95395 140978 -40669 185653 -149325
1066 -149325 -846090 -679893 -49366 -472180 -518691 -503165 -915990 -1049981 -419333 -107906
1056 -107906 -412639 -436450 -222021 -147439 -649120 -58473 -246682 -143284 29548 -1052225
1046 -1052225 357556 95276 -988016 -139841 29888 -820173 -409829 -487790 -470582 482647
1036 482647 -134701 -335406 345309 -28281 -294482 589892 -674166 -187053 301129 7092
1026 7092 -684151 -842349 22645 -586543 -598620 405125 -313908 -292884 186551 -1191411
1016 -1191411 -579142 -645443 -299419 -540832 77649 -165234 -194356 -777195 -94411 -919650
1006 -919650 -279093 -589190 -291501 -519647 -551654 -392162 702785 -487004 -204036 -195273
996 -195273 -422572 -657669 -215325 -314656 -248361 -305697 259237 -50754 -140436 -51973 -88108
985 -88108 -195105 588173 258521 257123 -415389 370070 20163 320535 -522841 -246153
975 -246153 -776286 275564 390102 -390459 -1034157 -79539 -463020 -278296 -632866 -488260
965 -488260 80472 -491391 -214054 249083 -1427250 -996596 -369001 -922567 -413868 335122
955 335122 153295 -145511 -464772 -156740 -739453 -142306 -60240 507283 152478 -311029
945 -311029 -308181 -74535 62231 -417346 -1008760 -112874 -623036 2292 387255 -615730
935 -615730 -83582 24853 -196465 -250595 -954859 -30286 -50518 -171032 -248877 -748405
925 -748405 -981680 -371868 -96135 -121063 -55403 280887 193150 -60404 126291 525056
915 525056 498733 -46546 -53399 -856888 901587 -169568 -457824 26723 100674 -393365
905 -393365 394192 399420 131890 -865131 109537 -180910 -6451 -121946 -85983 -61618 700303
894 700303 -675518 49365 -788268 -457900 -97361 -110371 -739074 22927 -316239 -222261
884 -222261 -1372524 -1002251 82550 -122434 171462 509366 9919 367861 -447169 -112729
874 -112729 332275 -333364 -353452 200177 -1282186 -113055 -213980 581625 -317656 -318232
864 -318232 -445257 -212843 -139632 -400893 333720 -246196 215530 487922 -485516 -634736
854 -634736 113855 -587510 -153468 -316769 -171989 -952849 -506577 -694113 447486 -297169
844 -297169 -481081 569600 -612423 -884790 505416 -757398 -757542 -306169 -564611 -568131
834 -568131 -377693 -618217 56106 -791965 -748373 171981 -133876 -276153 149906 212300
824 212300 27748 51415 -186276 8470 31761 144454 -685761 -233027 551615 -6043
814 -6043 -232510 -475814 267589 -251336 -129621 245110 389273 -112142 -357398 -344899
804 -344899 -3022 -865789 403878 -366401 -1335530 74052 -338174 -801862 42872 7155
794 7155 -648446 -28075 -205899 -557715 -279095 -597093 -841765 160038 -564063 -368345
784 -368345 -789475 -274607 394830 -256255 617915 511348 -374197 158388 -1014431 227337
774 227337 579843 -124635 182409 -321352 -103330 6807 -743779 422947 -487708 63674
764 63674 -924103 -657254 -380981 -351073 -56645 -518233 -35201 -332081 152588 -261350
754 -261350 -50626 -503202 -613436 -313324 -149392 -527494 -119678 -783991 -854672 394829
744 394829 -43036 -669721 -359054 -1044047 -729044 -535006 222954 -621506 -368549 -444084
734 -444084 -559556 15462 118349 -1126786 -1085806 91523 -550626 -145914 -475290 -537599
724 -537599 -1116176 -329211 -463973 685413 -979467 -717482 -22181 -462124 418681 -314039
714 -314039 264937 -116015 -483434 -468999 -79086 -424293 194184 -866761 -160911 -407297
704 -407297 -1061474 -234220 -12851 -44201 382682 -300171 -527847 -101241 -1047592 -794034
694 -794034 -495722 -498284 -545947 -291434 -517204 -493455 -114598 -572 136316 -524933 682508
683 682508 350993 -466726 222764 -411266 -830680 -453266 46819 -289234 -338367 -646431
673 -646431 -93507 -822949 -927681 -384955 -232014 -576155 -486509 163917 -423249 203231
663 203231 -178793 6213 124886 -196186 280930 -401470 -301346 830091 -165891 348040
653 348040 -15210 -153999 -370888 -694714 116208 -27855 512812 -514398 -447632 -283003
643 -283003 -1133195 -1108105 -1361033 -1223478 -176414 490121 -187149 -976228 -559915 -344203
633 -344203 -631966 -501421 -183315 -188898 -56039 -805227 -465135 -645832 287125 60139
623 60139 -69795 424252 -297721 81503 897674 178690 -189995 322614 -165403 398777
613 398777 -32482 377141 232200 -587110 -268678 -446288 532555 -556879 -892871 434564
603 434564 655155 -710171 -262110 154957 -463799 637921 -1264666 -1090637 -743306
594 -743306 470057 -59958 485362 240701 345970 -209095 91331 -526480 192630 102871
584 102871 -1613731 -400020 -144740 -397809 -1081611 -673574 -451804 -525895 -134701 -306239
574 -306239 -169757 221427 -458132 -368023 -348581 -61487 -228248 -570757 72670 458424
564 458424 -146545 -274677 -904505 150281 73685 -26547 -1139020 9909 -102110 -622292
554 -622292 209826 188761 148884 -418257 -536988 26637 -606889 -189709 -1062216 -281520
544 -281520 126380 -300641 -1052911 44416 -838368 -258070 -693506 -148620 -538165 -432838
534 -432838 -378432 -258946 -489091 -275632 -266589 -443427 -570599 159536 589089 -88711
524 -88711 181528 1142994 -473315 -522513 105252 -949363 -272527 119969 71586 271014
514 271014 -221825 -722041 -113710 -450935 -433096 -432420 -26577 363032 -41924 661056 107873
503 107873 101218 174863 -429670 -776138 -168580 -161265 -695632 255641 -36435 -329747 -71060
492 -71060 -1231506 -757676 -22673 -314190 -228097 -591845 -379600 -711358 -292285 -453407
482 -453407 324820 214873 -534730 -161756 78914 -36576 -552048 150033 472734 116703
472 116703 359856 156374 -951505 114967 -180893 -264195 296501 -154160 -619763 -38732
462 -38732 -498923 101122 -776996 -882287 -780296 -1116920 -365106 106615 -501251 -266383
452 -266383 -304217 -560769 -890692 -783142 -15419 -28878 -457768 -364132 -44983 1225 -844111
441 -844111 -623115 -615557 167303 -230454 -66473 -535673 -267330 -497968 -323075 -618660
431 -618660 -368756 -531109 -20414 153999 -272258 215421 747637 -885012 -484129 -234009
421 -234009 195174 392573 238567 -304157 -1244995 -770256 -934135 -35563 -107249 39693
411 39693 -331880 -57143 -695049 26534 -548402 -202208 -206203 284364 387838 -725844
401 -725844 -698541 -501753 3530 193601 158319 -543831 -39261 -289155 680167 -961212
391 -961212 498388 -415411 -620697 -289528 -19874 81564 -109447 -253511 186604 -1281875
381 -1281875 273201 -267483 -453322 436749 792860 -813581 79819 -585653 -63301
372 -63301 219944 68403 -487090 110093 -314616 16480 -1046066 -825936 -607063 377639
362 377639 -293873 -544441 -224146 -794363 -1115755 -437461 -379626 -231109 -1027414 -705452
352 -705452 -196058 34812 -684986 -349516 -200746 -223572 -296696 -93095 179909 -766944
342 -766944 622525 -336760 -886870 328266 -781722 -25926 -326936 13212 51003 -906706
332 -906706 -808886 -828746 -1152247 710496 -619026 -503492 108292 -915856 -399606 -357867
322 -357867 -889621 -335249 -121915 -346681 -925093 -505047 -350468 -162182 -124366 -529363
312 -529363 233268 151448 96348 -1133994 -743404 -397266 -134841 -562365 -482394 -269613
302 -269613 69617 -690984 -110319 125708 -157115 -360341 -905618 -278692 -466444 -427434
292 -427434 -1109231 178969 3315 -624747 -724511 12246 -855077 -97800 -679883 -859520
282 -859520 -374731 -262825 -470110 -482253 -214956 795560 -330078 464548 -146703 -779717
272 -779717 138608 -328217 -1026241 1235688 411545 297521 -455321 115347 21997 -442745
262 -442745 -603965 -597200 -51606 -488823 -645084 -1042843 -119673 -269528 -454998 -240480
252 -240480 -716362 -790510 -29807 342844 -335086 -82040 -576647 -686715 -646425 -455962
242 -455962 -85488 -169865 461344 108084 -1007468 117260 -787854 -417799 115871 33134
232 33134 -387293 109337 117016 -781158 -33203 -747980 5378 -764922 212766 -443871
222 -443871 -147945 274149 -80598 383344 244229 -152524 213899 -316968 -800430 -554349
212 -554349 -26109 -1200461 -331025 -537619 -296410 -233901 -702401 -499876 790497 -781621
202 -781621 -609282 -790973 -425279 174732 -390971 815 48195 -461138 -107204 -781441
192 -781441 -811657 -206115 356477 298380 -1091035 -111328 445942 -41431 692985 228254
182 228254 346586 -774383 -341514 -639286 -251774 -368272 -464626 -229122 261415 -194413
172 -194413 -50071 -907709 -336852 -128654 -817167 -664013 -115415 -717841 -749311 -739615
162 -739615 -767910 -759612 -883677 -760253 -671446 -582074 -163273 -314835 -99426 -490903 249676
151 249676 -200609 139582 -116796 458078 -1033042 -441202 -203319 -211195 -754923 -965479
141 -965479 -473219 -707081 -755857 -478211 -268653 -262242 -579168 -317195 -680925 -442395
131 -442395 -456886 177665 -597685 -222307 -250184 -611353 -385738 104361 -1048933 -915325
121 -915325 -3463 -470207 -106811 -373918 -755246 -584366 -274527 -629217 -544290 -797246
111 -797246 -377128 -231908 273603 -193514 -69398 -418388 -1130135 -950193 -493148 -413230
101 -413230 -193083 -762396 260377 -643619 -57153 -1042643 -554878 -313499 -21908 -988233
91 -988233 390759 -808372 -333575 -500490 12700 -300076 109588 -1100320 -388516 -50380
81 -50380 -433642 -780337 -596346 -626039 -259889 -664612 -454795 -284058 -402911 -427337 -713550
70 -713550 -1138073 -990015 -406786 302731 -27619 -294661 -179859 -890901 -488841 -576050
60 -576050 -694004 -392436 -255845 -6120 -414773 -1032166 -1448918 -1278107 -1038451 -378043
50 -378043 -381438 -1008152 -853138 -748514 -740733 -525275 -642016 -107512 -593680 -287337 -502575
39 -502575 -654371 -325688 -920791 -216953 -19263 -716323 -760485 -313276 -917355 -758160
29 -758160 -388806 -345090 -686031 -587262 -682089 -1604933 -630891 -896401 -1127682 -809934 -534718
18 -534718 -871173 -1274993 -728140 -239104 -798609 14436 -1221317 -1218068 -325332 -1257071
8 -1257071 -857714 -1012692 -766313 -859779 -932813 -1462230 -224122 -654932
0 -654932
$$ Imaginary data points
##PAGE= N=2
##DATA TABLE= (X++(I..I)), XYDATA
16383 -1861343 -1841757 -1549485 -1884327 -1843029 -1723496 -1837843 -1694601 -1837323 -1846232 -2044048
16373 -2044048 -2265462 -1433178 -1994431 -1437022 -1585085 -961659 -1975399 -1363050 -1096142
16364 -1096142 -1005618 -1077214 -949417 -1305681 -602311 -911960 -1284610 -1094728 -691819 -1144637
16354 -1144637 -824452 -824376 -1072634 -581689 -1147030 -1139713 -874459 -812779 -690747 -1158989 -639827
16343 -639827 286296 -787151 -402361 -563941 -648903 43218 -451180 -158194 121815 36654
16333 36654 -293258 -146983 238822 292774 -569228 -29741 -598727 -44552 9315 5681
16323 5681 -31098 701790 516943 -291109 -518817 99681 -421067 130088 394534 1085535
16313 1085535 1008064 314345 306493 862173 644815 505462 368492 483947 993226 816354
16303 816354 334690 751273 1802317 909812 900076 682673 978773 1193337 1250491 975480
16293 975480 921076 1493192 914893 934904 1880896 699966 878122 696609 1549836 1507088
16283 1507088 1566415 921876 1349372 1185519 1399420 1372861 1426366 1922448 1503552 2258978
16273 2258978 2273581 1437328 1582196 2089707 1503123 1925462 2180193 2192324 2184181 1865188
16263 1865188 3056332 1774851 2138306 2028810 1413796 1585011 1929772 1862407 2373482
16254 2373482 2213820 1312058 1710976 1712550 1327459 1835155 2413405 2133728 2375511 1713311
16244 1713311 2214946 2176127 2402353 2725414 3018506 2770975 2869428 2322765 2382983 1733406
16234 1733406 2293651 2361391 2175234 2122235 2668716 2252027 2774363 2981277 2381224 2700670
16224 2700670 2817318 2486118 2581457 2897578 2768154 2108814 2715254 3142541 3075281 3113098
16214 3113098 2631716 2724892 3242296 2152874 3250815 2588384 3062674 2604426 2919133
16205 2919133 3102414 3170322 3284088 3798612 3426469 3046949 3006569 2965485 3079951 2985328
$$ [...]
##END NTUPLES=NMR SPECTRUM
##END=
