##TITLE=abcd
##JCAMPDX= 6.0         $$ Bruker NMR JCAMP-DX V2.0
##DATA TYPE= NMR SPECTRUM
##DATA CLASS= NTUPLES
##ORIGIN= UXNMR, Bruker Analytische Messtechnik GmbH
##OWNER= root
$$ XWIN-NMR		Version 3.5
$$ Wed Jul 15 15:53:27 2026 Russian Standard Time (UT+4h)  servis@DPX200
##.OBSERVE FREQUENCY= 200.131235884673
##.OBSERVE NUCLEUS= ^1H
##.ACQUISITION MODE= SIMULTANEOUS
##.ACQUISITION SCHEME= undefined
##.AVERAGES= 32
##.DIGITISER RES= 18
##SPECTROMETER/DATA SYSTEM= spect
##.PULSE SEQUENCE= zg
##.SOLVENT NAME= CDCl3
##.SHIFT REFERENCE= (INTERNAL, CDCl3, 0, 16.4885)
##AUDIT TRAIL= $$ (NUMBER, WHEN, WHO, WHERE, WHAT)
$$ ##TITLE= Audit trail, XWIN-NMR		Version 3.5
$$ ##JCAMPDX= 5.01
$$ ##ORIGIN= Bruker BioSpin GmbH
$$ ##OWNER= servis
$$ F:\spectra/data/av/nmr/H1/1/pdata/1/auditp.txt
$$ ##AUDIT TRAIL=  $$ (NUMBER, WHEN, WHO, WHERE, WHAT)
(   1,<2026-07-15 15:52:55.39 +0400>,<servis>,<DPX200>,
      <created by zg, POWCHK disabled, PULCHK disabled
       configuration hash MD5:
       00 E9 B6 7A A2 85 ED C7 34 08 36 98 17 FE 4E 26
       data hash MD5: 32K
       FF 49 10 8C 8F 1C 89 DE D8 5B D4 83 1B C9 4F 49>)
(   2,<2026-07-15 15:52:56.85 +0400>,<servis>,<DPX200>,
      <Start of raw data processing
       efp BC_mod = 2 LB = 0.05 FT_mod = 6 PKNL = 1 PHC0 = -415.39 PHC1 = 3.101563 SI = 16K 
       data hash MD5: 16K
       1E 05 F9 A0 8C C9 99 6C CE A3 C5 49 3A 97 1B A9>)
$$ ##END=
$$ 
$$ hash MD5
$$ F9 99 9A 06 57 70 F9 DD 37 84 A9 1E BC A4 D7 29
##$RELAX= 
##$RELAX= 
##$RELAX= 
##$RELAX= 
##$RELAX= 
##$RELAX= 
##$RELAX= 
##$RELAX= 
$$ Bruker specific parameters
$$ --------------------------
##$DU= <F:\spectra>
##$EXPNO= 1
##$NAME= <H1>
##$PROCNO= 1
##$TYPE= <nmr>
##$USER= <av>
##$AMP= (0..31)
100 100 100 100 100 100 100 100 100 100 100 100 100 100 100 100 100 100 
100 100 100 100 100 100 100 100 100 100 100 100 100 100 
##$AQSEQ= 0
##$AQ_mod= 1
##$AUNM= <au_zg>
##$AUTOPOS= <>
##$BF1= 200.13
##$BF2= 200.13
##$BF3= 200.13
##$BF4= 200.13
##$BF5= 500.13
##$BF6= 500.13
##$BF7= 500.13
##$BF8= 500.13
##$BYTORDA= 1
##$CFDGTYP= 0
##$CFRGTYP= 5
##$CHEMSTR= <none>
##$CNST= (0..31)
1 1 145 1 1 1 1 1 1 1 1 1 1 1 1 1 1 1 1 1 1 1 1 1 1 1 1 1 1 1 1 1 
##$CPDPRG= <>
##$CPDPRG1= <>
##$CPDPRG2= <>
##$CPDPRG3= <>
##$CPDPRG4= <mlev>
##$CPDPRG5= <mlev>
##$CPDPRG6= <mlev>
##$CPDPRG7= <mlev>
##$CPDPRG8= <mlev>
##$CPDPRGB= <>
##$CPDPRGT= <>
##$D= (0..31)
0 2 0 0 0 0 0 0 0 0.06 0 0 0 0 0 0 0.0002 0 0 0 0 0 0 0 0 0 0 0 0 0 0 
0 
##$DATE= 1784116374
##$DBL= (0..7)
120 120 120 120 120 120 120 120 
##$DBP= (0..7)
150 150 150 150 150 150 150 150 
##$DBP07= 0
##$DBPNAM0= <>
##$DBPNAM1= <>
##$DBPNAM2= <>
##$DBPNAM3= <>
##$DBPNAM4= <>
##$DBPNAM5= <>
##$DBPNAM6= <>
##$DBPNAM7= <>
##$DBPOAL= (0..7)
0.5 0.5 0.5 0.5 0.5 0.5 0.5 0.5 
##$DBPOFFS= (0..7)
0 0 0 0 0 0 0 0 
##$DE= 6
##$DECBNUC= <off>
##$DECIM= 32
##$DECNUC= <off>
##$DECSTAT= 4
##$DIGMOD= 1
##$DIGTYP= 9
##$DL= (0..7)
0 120 120 120 120 120 120 120 
##$DP= (0..7)
150 150 150 150 150 150 150 150 
##$DP07= 0
##$DPNAME0= <>
$$ [...]
##$SUBNAM4= <"">
##$SUBNAM5= <"">
##$SUBNAM6= <"">
##$SUBNAM7= <"">
##$SUBNAM8= <"">
##$SUBNAM9= <"">
##$SW= 20.6817932712277
##$SWIBOX= (0..15)
0 0 3 0 0 0 0 0 0 0 0 0 0 0 0 0 
##$SW_h= 4139.07284768212
##$TD= 32768
##$TD0= 1
##$TE= 0
##$TE2= 300
##$TE3= 300
##$TEG= 300
##$TL= (0..7)
0 120 120 120 120 120 120 120 
##$TP= (0..7)
150 150 150 150 150 150 150 150 
##$TP07= 0
##$TPNAME0= <>
##$TPNAME1= <>
##$TPNAME2= <>
##$TPNAME3= <>
##$TPNAME4= <>
##$TPNAME5= <>
##$TPNAME6= <>
##$TPNAME7= <>
##$TPOAL= (0..7)
0.5 0.5 0.5 0.5 0.5 0.5 0.5 0.5 
##$TPOFFS= (0..7)
0 0 0 0 0 0 0 0 
##$TUNHIN= 0
##$TUNHOUT= 0
##$TUNXOUT= 0
##$USERA1= <user>
##$USERA2= <user>
##$USERA3= <user>
##$USERA4= <user>
##$USERA5= <user>
##$V9= 5
##$VALIST= <valist>
##$VCLIST= <CCCCCCCCCCCCCCC>
##$VD= 0
##$VDLIST= <DDDDDDDDDDDDDDD>
##$VPLIST= <PPPPPPPPPPPPPPP>
##$VTLIST= <TTTTTTTTTTTTTTT>
##$WBST= 1024
##$WBSW= 30
##$XGAIN= (0..3)
0 0 0 0 
##$XL= 0
##$YL= 0
##$YMAX_a= 121309
##$YMIN_a= -210068
##$ZGOPTNS= <>
##$ZL1= 120
##$ZL2= 120
##$ZL3= 120
##$ZL4= 120
##$ABSF1= 0
##$ABSF2= 0
##$ABSG= 0
##$ABSL= 0
##$ALPHA= 0
##$AQORDER= 0
##$ASSFAC= 0
##$ASSFACI= 0
##$ASSFACX= 0
##$ASSWID= 0
##$AUNMP= <proc_1d>
##$AZFE= 0.1
##$AZFW= 0.1
##$BCFW= 0
##$BC_mod= 2
##$BYTORDP= 0
##$COROFFS= 0
##$CY= 18.4799938201904
##$DATMOD= 1
##$DC= 0
##$DFILT= <>
##$DTYPP= 0
##$F1P= 9.9274215381318
##$F2P= -0.165520771350173
##$FCOR= 1
##$FTSIZE= 16384
##$FT_mod= 6
##$GAMMA= 0
##$GB= 0
##$INTBC= 1
##$INTSCL= 4.127829e-11
##$ISEN= 128
##$LB= 0.05
##$LEV0= 0
##$LPBIN= 0
##$MAXI= 10000
##$MC2= 0
##$MEAN= 0
##$ME_mod= 0
##$MI= 50
##$NCOEF= 0
##$NC_proc= -8
##$NLEV= 6
##$NOISF1= 3.799351
##$NOISF2= 2.8
##$NSP= 0
##$NTH_PI= 0
##$NZP= 0
##$OFFSET= 16.48848
##$PC= 4
##$PHC0= -415.39
##$PHC1= 3.101563
##$PH_mod= 1
##$PKNL= yes
##$PPARMOD= 0
##$PSCAL= 4
##$PSIGN= 0
##$REVERSE= no
##$SF= 200.130005582386
##$SI= 16384
##$SIGF1= 3
##$SIGF2= 2
##$SINO= 400
##$SIOLD= 16384
##$SREGLST= <1H.CDCl3>
##$SSB= 0
##$STSI= 16384
##$STSR= 0
##$SW_p= 4139.07284768211
##$SYMM= 0
##$S_DEV= 0
##$TDeff= 32768
##$TDoff= 0
##$TI= <>
##$TILT= no
##$TM1= 0
##$TM2= 0
##$TOPLEV= 0
##$USERP1= <user>
##$USERP2= <user>
##$USERP3= <user>
##$USERP4= <user>
##$USERP5= <user>
##$WDW= 1
##$XDIM= 16384
##$YMAX_p= 325123837
##$YMIN_p= -1702989
$$ End of Bruker specific parameters
$$ ---------------------------------
##NTUPLES= NMR SPECTRUM
##VAR_NAME=  FREQUENCY,     SPECTRUM/REAL,   SPECTRUM/IMAG
##SYMBOL=    X,             R,               I
##VAR_TYPE=  INDEPENDENT,   DEPENDENT,       DEPENDENT
##VAR_FORM=  AFFN,          ASDF,            ASDF
##VAR_DIM=   16384,         16384,           16384
##UNITS=     HZ,            ARBITRARY UNITS, ARBITRARY UNITS
##FACTOR=    0.252644378177508, 1,           1
##FIRST=     3299.83951724647, 0,            0
##LAST=      -839.233330435636, 0,           0
##MIN=       -839.233330435636, -1702989,    0
##MAX=       3299.83951724647, 325123837,    0
$$ Real data points
##PAGE= N=1
##DATA TABLE= (X++(R..R)), XYDATA
$$ [...]
12064e5940L40610J04824n44704M36657K5293L12216l41327l42813J96257j89152
$$ -55940 284670 389494 -155210 281447 306740 618956 277629 -65184 131073 -58079
12054e8079K49322J45850m41859L83593L56465j254942Q55455O37061q1938l61284
$$ -58079 191243 337093 -104766 278827 635292 -619650 235805 872866 790928 429644
12044D29644o35098N18741N40021l43713o98649O74060L44541R7295k08808l01298
$$ 429644 -205454 313287 853308 509595 -189054 485006 829547 926842 718034 416736
12034D16736J087878j179939K31199p78420M58072n9733k98969O81770q25395
$$ 416736 1504614 324675 555874 -222546 235526 175793 -123176 558594 -266801
12025b66801P3564O54412k13747L57067j550712P46170M55454l22744J258715
$$ -266801 -193237 461175 247428 604495 -946217 -200047 255407 -67337 1191378
12016A191378p47951p7293k40794N25746J07082k57895R6038l66557m07528R29867
$$ 1191378 443427 366134 125340 651086 758168 500273 596311 229754 -177774 752093
12006G52093o94634N56056L10702r01650R7707L33014j7975m13055L41939L87586
$$ 752093 57459 613515 924217 22567 120274 453288 435313 22258 364197 751783
11996G51783o60694M26929K5438N4342k05337L81510m20500J45396K64880l0007
$$ 751783 91089 518018 543456 597798 392461 773971 353471 498867 763747 733740
11986G33740p21314M11694M54244l43368q7904j349044J508609n5682k60474k31363
$$ 733740 12426 424120 878364 534996 447092 -901952 606657 550975 290501 59138
11976E9138M61844K33890m01633N73695K52993j66877o85576j80503j53161M24479
$$ 59138 520982 754872 353239 926934 1179927 1013050 327474 146971 -6190 418289
11966D18289L05579j69736J79836K07640m98785N94870P199k29770r70681J66100
$$ 418289 723868 554132 733968 941608 442823 1037693 1044892 815122 -155559 10541
11956A0541L50431l21757Q92043m54901n19983P27605q73367J06363M27988n79173
$$ 10541 360972 39215 931258 476357 -43626 683979 -189388 -83025 344963 -234210
11946b34210P67485N9554n78064P78959n81908N2587l74831P16818r3761P09211
$$ -234210 533275 592829 14765 793724 211816 264403 -110428 606390 512629 1221840
11936A221840j365634J31016o81207J302246m94502J05061J365880j357283J064789
$$ 1221840 -143794 -12778 -693985 608261 113759 218820 1584700 227417 1292206
11927A292206p93288m88199N21687J7308L36240j29131l61956k79260K28650J3167
$$ 1292206 498918 10719 532406 549714 885954 756823 394867 115607 344257 357424
11917C57424N22827m15232J48808J63522m86510J027281o83646K93558n00165
$$ 357424 880251 465019 613827 777349 290839 1318120 634474 928032 427867
11908D27867N6311K97910r32856Q12184J09639p33596N85890k03449m33364J142152
$$ 427867 484178 782088 -150768 661416 771055 37459 623349 419900 -13464 1128688
11898A128688o12580l55383K95635R44538j057287o02891J278195n15376j23138
$$ 1128688 516108 160725 456360 1400898 343611 -259280 1018915 503539 380401
11889C80401L03567O7465k15499o20677N13130M82521j6963K09470j260726P16316
$$ 380401 683968 751433 535934 -84743 428387 910908 893945 1103415 -157311 559005
11879E59005m22536L07654P20946j246172J127414j057934P14619K05222o50173
$$ 559005 136469 444123 1165069 -81103 1046311 -11623 702996 908218 258045
11870B58045k95669O15483m73278l6124K61221k5392k00866N94953K3059k92707
$$ 258045 -37624 577859 104581 68457 329678 304286 103420 698373 721432 428725
11860D28725K18342M743L66737r58115M1446l21090M95646l00415n21834P09975
$$ 428725 647067 651810 1018547 60432 101878 -219212 276434 -23981 -545815 164160
11850A64160M41221j33474o10848j3462R51014m24408L31661l574m61621j87257
$$ 164160 605381 471907 -138941 -152403 798611 374203 705864 702290 240669 53412
11840E3412N28982p08446R45061J3245l31498M78182j308304N95756K01217k18418
$$ 53412 582394 -126052 819009 832254 500756 978938 -329366 266390 467607 249189
11830B49189J033141j307086Q93420p25983n25980P41202j01575R773n78213J15487
$$ 249189 1282330 -24756 868664 142681 -383299 357903 256328 266101 -312112 -196625
11820a96625N65166l61820n3175R93395j371887Q31393K60573n23442O25218l96017
$$ -196625 368541 6721 -46454 946941 -424946 406447 667020 143578 768796 372779
11810C72779N00417j44606n27100K71949k00095N30913o08255j81489M8365j30880
$$ 372779 873196 728590 201490 473439 273344 804257 196002 14513 62878 -68002
11800f8002J36055K93047P3163N79078j82519k08664k57936N8134N15109m77564
$$ -68002 68053 361100 434263 1013341 830822 622158 364222 422356 937465 459901
11790D59901M39963n97128K0115j55496O13876j673133J174773M72107k34270
$$ 459901 899864 302736 322851 167355 781231 -891902 282871 754978 520708
11781E20708q53897M35503j68614N55188P27896R1707j139290M43468m92126M39839
$$ 520708 -333189 102314 -66300 488888 1216784 1308491 169201 612669 120543 560382
11771E60382L92451j322696N34892k19444p10419N84463J314262o88095l5345
$$ 560382 952833 -369863 165029 -54415 -764834 -180371 1133891 445796 410451
11762D10451o54153P26178J61306r96040P71317J52101k72718J86995j42073K839
$$ 410451 -243702 482476 643782 -352258 419059 571160 298442 485437 343364 346203
11752C46203n95646J044952n92670Q71805r02649K33954M71416j946445J096487
$$ 346203 -249443 795509 202839 1074644 171995 405949 877365 -1069080 27407
11743B7407J12355R1698j50677j15698K38302J63681p68970J247706M39651p58010
$$ 27407 139762 231460 80783 -34915 203387 367068 -401902 845804 1285455 527445
11733E27445m04643L97254j62452M23698m57253r017R90958j864207O59798n7111
$$ 527445 122802 520056 357604 781302 324049 315032 1305990 -558217 101581 44470
11723D4470k29828J390376j385570L73773J01989l90475O20048N08249O1982J9011
$$ 44470 -185358 1205018 -180552 193221 295210 -95265 524783 1033032 1095014 1114025
11713A114025j252754J86720N32607p52452L67846K78686j08513J51690n90607
$$ 1114025 -138729 47991 580598 -171854 195992 474678 366165 517855 -72752
11704g2752j12952M81890M52308j73757j14164j2429l31619N23633o30221R36668
$$ -72752 -185704 296186 748494 574737 460573 448144 116525 640158 9937 946605
11694I46605O78364j037186M68754k16520m05900J59350l13811n94937N05403
$$ 946605 1624969 587783 1056537 840017 434117 593467 279656 -315281 190122
11685A90122N54859k9645q74140J5256J124653l08730n57363L04804l09417K56938
$$ 190122 744981 715336 -158804 -143548 981105 672375 115012 419816 110399 367337
11675C67337N02518j85942m8441o42722L35736K08628K75926J41713o08963k76225
$$ 367337 869855 683913 635472 -7250 328486 537114 813040 954753 345790 69565
11665F9565K91141O36580j81954j99148J08879o10368M5563J049357j237495K24814
$$ 69565 360706 997286 815332 616184 725063 114695 160258 1209615 -27880 196934
11655A96934j87213O70726N40867j225719J30342P53021q10512N15062r83842
$$ 196934 9721 680447 1221314 -4405 125937 878958 68446 583508 -400334
11646d00334J096043K99495m4415m93031J72272l18008Q70294j130595Q6933K56448
$$ -400334 695709 995204 950789 457758 630030 312022 1182316 51721 138654 395102
11636C95102l70828m5662O20810L63783p64373n0761M04714l31320N02386o02201
$$ 395102 24274 -21388 599422 963205 198832 148071 552785 221465 723851 121650
11626A21650M23882l12207L780l69466J078796o01462N04687q08353P65847m13409
$$ 121650 545532 233325 237105 -132361 946435 344973 849660 41307 807154 393745
11616C93745l07090O52288m65873M19093o62903J59466K69320N08484j212575
$$ 393745 86655 738943 273070 692163 29260 188726 458046 966530 -246045
11607b46045P79706n42541K64348q1650l44420J078124J50712l71537j9098k72201
$$ -246045 533661 -8880 255468 173818 -170602 907522 1058234 686697 667599 395398
11597C95398m45832n4050J080844n91529J3950K59280J57187n8473j47063L21702
$$ 395398 -50434 -104484 976360 384831 398781 658061 815248 756775 609712 931414
11587I31414q18258K97989J01734m03479l88174n4997j39242N80756L37890l44845
$$ 931414 113156 411145 512879 109400 -278774 -333771 -473013 107743 445633 100788
11577A00788M99780n83164P87774N29728p78535M37327j37350j018079L47576
$$ 100788 600568 17404 805178 1334906 556371 993698 856348 -161731 185845
11568A85845l09178L86623K4543J26317p40949L53608K45220O45733o79207k8451
$$ 185845 -123333 263290 287833 414150 -326799 26809 272029 917762 238555 210104
11558B10104J34500n84871N68031K74102o87970Q06284K7126j02052j1591k08265
$$ 210104 344604 -240267 327764 601866 -86104 720180 747306 645254 633663 425398
11548D25398K20688J34838k93206n70055M49791r57557J68750N92825J297889
$$ 425398 646086 780924 487718 -82337 367454 -590103 -421353 171472 1469361
11539A469361j252689Q47999q66730K50760m73139O11200k88506j48113P95724
$$ 1469361 216672 1064671 197941 448701 -24438 586762 298256 150143 945867
11530I45867r1160p98994L10402j01342K10741l80911n77546N1151J158498j70046
$$ 945867 854707 55713 366115 264773 475514 94603 -482943 -431792 726706 556660
11520E56660L28859L31994q32315o24528l83486P62501Q17021j018576l8677O82746
$$ 556660 885519 1217513 385198 -239330 -622816 139685 956706 -61870 -100547 582199
11510E82199n77515M32255Q66407j198784L61802l64701J06586j68774K23701
$$ 582199 4684 436939 1303346 104562 466364 101663 208249 39475 263176
11501B63176l68769M03590J15693o39636J81562N45516j214336N32049J27976
$$ 263176 -105593 297997 413690 -225946 -44384 501132 -713204 -181155 -53179
11492e3179L33614q7165j00619N54417Q9529p92269R34525n47162L06057p34652
$$ -53179 280435 193270 92651 647068 736597 -55672 878853 331691 637748 -96904
11482i6904n85309J162494l35950k83403K97516N51563m72695P34543o78256Q47130
$$ -96904 -682213 480281 144331 -139072 158444 710007 237312 971855 293599 1140729
11472A140729j106795N41570n63639O81191o70105L09853k30710l47344P11938
$$ 1140729 33934 575504 11865 693056 22951 332804 102094 -245250 466688
11463D66688m9723k02921M01459l83039n58132M50725O19750j182546L86634K8225
$$ 466688 416965 214044 615503 232464 -325668 125057 744807 -437739 -51105 -22880
11453b2880N78688j08522L09509n02308l19839J170797j239882L36603m36861
$$ -22880 555808 447286 756795 254487 -65352 1105445 -134437 202166 -234695
11444b34695L71117Q5492O8141o7958j56020k74816K99189K46533l1359L31982
$$ -234695 136422 221914 290055 222097 66077 -208739 90450 336983 305624 637606
11434F37606l68821j61389Q60223l99674L82958j154956K72611N49387M16026
$$ 637606 268785 107396 967619 567945 950903 -204053 68558 617945 1033971
11425A033971j085522O99206J2941j73581k05234K55299K75970n29330q91822
$$ 1033971 -51551 647655 660596 487015 281781 537080 813050 283720 -608102
11416f08102L84770K76644P8461K91382j21199j010628J438602j17247L79059
$$ -608102 -223332 53312 131773 423155 301956 -708672 729930 612683 991742
11407I91742p70277m77016K3526J351606j715609J130930k86068m7275Q22900
$$ 991742 221465 -255551 -232025 1119581 -596028 534902 248834 201559 1024459
11398A024459j447033J357478J36378m5972j153472K22423K13307k16585J023703
$$ 1024459 -422574 934904 1071282 1025310 -128162 94261 307568 90983 1114686
11389A114686o02054J29627m35855J94251J4869k78836N93155n40554q23003P93496
$$ 1114686 512632 642259 206404 400655 415524 136688 729843 189289 -633714 159782
11379A59782P87675l2506k38874r11280N31750k46774P14021j89615k33168j86864
$$ 159782 947457 914951 676077 -235203 296547 49773 763794 574179 341011 154147
11369A54147J29955M57225j171514J006822J63904r9640k91900j63114L15148
$$ 154147 284102 741327 -430187 576635 740539 640899 348999 185885 501033
11360E01033K85687q70275J180439k88200o52141j39169N44377k50008J029785
$$ 501033 786720 -83555 1096884 808684 156543 17374 561751 311743 1341528
11351A341528j147217L30611O54192o6715o49823M84612l96568l25127M56154
$$ 1341528 194311 524922 1179114 1112399 462576 947188 550620 225493 681647
11342F81647n96043J232032j132698j17548O32810j89989l9171k59449K88853
$$ 681647 85604 1317636 184938 67390 700200 510211 471040 211591 500444
11333E00444l04849K39689r1729m02931L40227N22901o33295k26034P4438N54102
$$ 500444 195595 435284 343555 -59376 280851 803752 170457 -55577 18861 572963
11323E72963n87782Q9801J60835l09473j31860O09676J65718o647n44933N04581
$$ 572963 -14819 74982 235817 -73656 -205516 404160 569878 563231 18298 522879
11313E22879r35742Q44126j09544M58313J39796j494020N30283N66485N94983
$$ 522879 -412863 431263 321719 780032 919828 -574192 -43909 522576 1117559
11304A117559m37845r15362P51492J82627j277228Q45006l26527k53161K98750
$$ 1117559 679714 -235648 515844 698471 -578757 266249 -60278 -313439 -14689
11295a4689N16778L29775j71772n79047K27703M70462j14588k38648j0411k29780
$$ -14689 502089 831864 660092 81045 308748 779210 664622 425974 415563 185783
11285A85783J522393j561060J19284K37679n521N8406K13095q31473m98595J408404
$$ 185783 1708176 147116 266400 504079 498558 556964 770059 -61414 -560009 848395
11275H48395r59476k45732O29162m27310m8225J169236p9116l32713j08730j471210
$$ 848395 -111081 -356813 272349 -154961 -203186 966050 886934 554221 445491 -1025719
11265a025719J844958m77427M78403n64495r730k22350N85905R22574j282791
$$ -1025719 819239 341812 820215 255720 245990 23640 609545 1532119 249328
11256B49328P08642j513125R34366J32184k44709J50636K74403j09840m46590
$$ 249328 957970 -555155 379211 511395 266686 417322 691725 581885 135295
11247A35295J301080j493650R16839r270l94452o68223K61072K35755j54385P00482
$$ 135295 1436375 -57275 859564 850294 455842 -212381 48691 284446 130061 830543
11237H30543j361536J108801o83159N88491j17700l26582N90301o48545J223143
$$ 830543 -530993 577808 -105351 483140 365440 38858 629159 -19386 1203757
11228A203757j088225M03879j122822J410536n70175K61491N91615k54633L34676
$$ 1203757 115532 519411 -603411 807125 236950 498441 1090056 835423 1170099
11219A170099j669686K065986p08642k35274n325o54668K11332k84117Q38086
$$ 1170099 -499587 1566399 857757 622483 617158 -37510 173822 -110295 727791
11210G27791m17275R20843j056319J79495l5260l29510J549118j551751J083163
$$ 727791 310516 1231359 175040 354535 319275 -10235 1538883 -12868 1070295
11201A070295j010015R54358p60800K57766m0814l90404O76922K55508M38894
$$ 1070295 60280 1014638 253838 511604 470790 80386 757308 1012816 1451710
11192A451710q33008M72640j775408J253047m65354L92021J36191n9696L88856
$$ 1451710 618702 1091342 -684066 568981 103627 495648 631839 572143 960999
11183I60999j220736J236119m69936j27587m58599N15396J32722o29432Q69079
$$ 960999 -259737 976382 506446 378859 -79740 435656 568378 -61054 808025
11174H08025n07635K13122n59983Q28777n46187j94033M86829n73914Q00428j463202
$$ 808025 300390 513512 -46471 782306 236119 42086 528915 -44999 755429 -707773
11164g07773R22409M62219p2989q86522P71705m69149N13417j91146J65148J57937
$$ -707773 214636 676855 603866 -282656 489049 19900 533317 342171 507319 665256
11154F65256n4893o0428L79898j37760m74791N05681l97404K17621K20722k40565
$$ 665256 610363 549935 929833 792073 317282 822963 425559 643180 863902 623337
11144F23337M38797q57885k0363m2511L48630o07432J41636j38816q5366J724152
$$ 623337 1062134 204249 183886 141375 490005 -117427 24209 -114607 -199973 1524179
11134A524179j320589R26889o10955m62569K51830r75648R90940L09489j49202
$$ 1524179 203590 1130479 519524 56955 308785 -666863 324077 633566 484364
11125D84364n05345K71550O3996l45577Q71807n88847L60684l61047k68096M00453
$$ 484364 -20981 250569 314565 -31012 840795 251948 612632 251585 -16511 383942
11115C83942J4679J05796j94602J4571l40976O49137n84471Q45763k80681M00923
$$ 383942 398621 504417 309815 324386 -16590 632547 48076 893839 613158 1014081
11105A014081r52932R42427k82306M74520J21827p84730O23141j160228R73213
$$ 1014081 61149 1003576 721270 1195790 1317617 532887 1156028 -4200 969013
11096I69013j82543j056394P96239j80480J69049l4679j51705p46227L54039N52674
$$ 969013 786470 -269924 526315 345835 514884 480205 328500 -417727 -63688 488986
11086D88986o27843N12184N79225m24623p67820M47670N84324m69921l09249L711
$$ 488986 -138857 373327 952552 527929 -239891 207779 792103 322182 12933 16644
11076A6644q2653M48470j46459J08062J01007l22721K02686l54736N50959k23605
$$ 16644 -66009 382461 236002 344064 445071 122350 325036 -29700 521259 297654
11066B97654L34627N1109K31217l61626j145046J052295r45481J537666N65107
$$ 297654 632281 683390 914607 552981 -592065 460230 -485251 1052415 1617522
11057A617522j160997K8246L00810r16998O51713N98031l09533q10590M29476
$$ 1617522 456525 484771 785581 -131417 520296 1118327 808794 -1796 427680
11048D27680L47171j13186m20195L75265m06236L69736l38654J02367L71838k36920
$$ 427680 774851 661665 241470 616735 210499 580235 241581 343948 715786 478866
11038D78866k23543K4430j80349J58468L36695l4898n02206N00787k32640p015
$$ 478866 255323 279753 99404 257872 594567 559669 57463 558250 325610 318595
11028C18595o6342l67487K92485l89039M76252M72921n91335l2664j21227j91911
$$ 318595 252253 -115234 177251 -211788 264464 737385 146050 113386 -7841 -199752
11018a99752M60923j96930M6911M22396J2540o94785J082136M16895j361183M32803
$$ -199752 261171 64241 111152 533548 546088 -148697 933439 1350334 -10849 421954
11008D21954K54047o26053Q14450L92915m15939K99057m01380j41479k60739O84708
$$ 421954 676001 49948 864398 1257313 841374 1140431 739051 597572 336833 1021541
10998A021541q84536l5834L08840j86782j1945m03872o7575N12064L40404r63581
$$ 1021541 137005 101171 410011 223229 211284 -192588 -260163 251901 592305 -371276
10988c71276O20606j25073J080882j285094M22829M45531l62121l10100j77085
$$ -371276 249330 124257 1205139 -79955 342874 788405 426284 116184 -60901
10979f0901r9288N8966P69626l41889Q15660n26608p9147m84660L55123J63839
$$ -60901 -160189 -101223 668403 326514 1142174 615566 536419 51759 406882 570721
10969E70721M69543q75768K7197K51499J09478k39051N47441j163401L40781L22043
$$ 570721 1040264 164496 191693 443192 552670 313619 861060 -302341 38440 360483
10959C60483n5777M79655J41278p84242J243754m74215L64653r08779N43116p92703
$$ 360483 304706 784361 925639 141397 1385151 910936 1275589 366810 909926 117223
10949A17223O80228k84640J83894o37651O42142k42011O1143q41934O14892j487496
$$ 117223 797451 512811 696705 59054 701196 459185 520328 -321606 293286 -1194210
10939a194210J367302m31257N31070M98426p89439L66698P30819j355101O56830
$$ -1194210 173092 -258165 272905 771331 -18108 348590 1079409 -275692 381138
10930C81138r66750R83871K29925K60506p80699r6678P89515K26277J29326r74138
$$ 381138 -585612 398259 628184 888690 107991 11313 800828 1027105 1156431 182293
10920A82293Q52930k74638m95583K57060L1285K84212p21530Q89471l9508J42982
$$ 182293 1035223 760585 265002 522062 553347 837559 116029 1005500 965992 1108974
10910A108974p22534L82637n20506M4949Q50529j9097p32481O33399j145796m08276
$$ 1108974 386440 769077 248571 293520 1144049 1124952 392471 1025870 -119926 -528202
10900e28202L84420J37918q7378J439211r43891k65456k94050O3579P70563O40168
$$ -528202 -143782 -5864 -93242 1345969 402078 136622 -157428 -93849 676714 1316882
10890A316882j264042q4634n0487Q25869p6876n26176K52783L17407j70361p00844
$$ 1316882 52840 -31794 -82281 743588 666712 140536 393319 710726 540365 -160479
10880a60479Q77380p63991J434318m93369o23730k80238O81434K6817k90256l69077
$$ -160479 716901 -47090 1387228 893859 270129 -10109 671325 698142 407886 38809
10870C8809J089737j38374N9541r28455J2797L85030m39655J196022j336140Q84689
$$ 38809 1128546 990172 1049713 121258 134055 519085 79430 1275452 -60688 824001
10860H24001j017593J3610K49703P29805M47975k4554m36013l37321l00771Q0612
$$ 824001 -193592 -179982 69721 799526 1247501 1222947 786934 449613 148842 229454
10850B29454L16571j43123M39768m23280l21024l56122J237141m79815J90112
$$ 229454 546025 402902 842670 419390 98366 -257756 979385 499570 689682
10841F89682o49472K26996K59313j44950Q1079L30490k46385k62543l66269M5312
$$ 689682 40210 267206 526519 381569 462648 793138 546753 284210 -82059 -36747
10831c6747j64217J755887o30982k23370n64081N83610K3608J01228k67289k24349
$$ -36747 -200964 1554923 923941 700571 136490 720100 743708 844936 577647 353298
10821C53298J007060n35578r87377P51068q05062P76807r0609n14046N10293Q6762
$$ 353298 1360358 824780 -162597 588471 -216591 560216 469607 -44439 465854 552616
10811E52616k52386K34107j96898k37343K39200k50431j66823P92370j73436j65871
$$ 552616 300230 534337 337439 100096 339296 88865 -77958 714412 540976 375105
10801C75105j44333l61559L08629M03686k68404j67467N75276P01738j119498
$$ 375105 230772 -130787 177842 581528 313124 145657 720933 1422671 303173
10792C03173m43199M71126J41973L34031r41382L97151K19289M56022Q13742q91800
$$ 303173 -140026 331100 473073 807104 -134278 262873 482162 938184 1751926 860126
10782H60126K8163m54627J7179K67196j178533J291346j251792J158740k45652
$$ 860126 888289 433662 450841 718037 -460496 830850 -420942 737798 492146
10773D92146k33219K04674k04484J104108o85000l91643J09518m31194K47647
$$ 492146 258927 463601 259117 1363225 678225 286582 396100 -35094 212553
10764B12553J36892L28789j48031J19358j93614l05614J54862k62969K28145N7897
$$ 212553 349445 678234 530203 649561 455947 150333 305195 42226 270371 328268
10754C28268N65669o29415j07450m83202O29556J40604l92259k51428P42439q84802
$$ 328268 893937 264522 157072 -326130 303426 444030 51771 -199657 542782 -342020
10744c42020Q97979O85563q64642J84579l64206j28577N92882K70149k44351K09208
$$ -342020 555959 1241522 376880 561459 197253 68676 661558 931707 687356 896564
10734H96564q55794P1111q4055L26890Q89332q82871N31014j94868m46304N27861
$$ 896564 40770 111881 27826 354716 1244048 361177 892191 697323 251019 778880
10724G78880p38932P04578J72857j35375n19250J46356m82197J136116k02089
$$ 778880 39948 744526 917383 782008 262758 409114 -73083 1063033 860944
10715H60944m72540O68740q53585l00199J57168N9815J15826O21262j191927l25426
$$ 860944 388404 1057144 203559 -96640 60528 120343 236169 857431 -334496 -659922
10705f59922Q68060j82742N24335m57391J99873K32472p950L86036o53764P80502
$$ -659922 208138 25396 549731 92340 292213 524685 516735 902771 249007 1029509
10695A029509J25843k373080J111162M62281q16281N75709K99291M33876n0156
$$ 1029509 1155352 -1217728 -106566 355715 -460566 115143 414434 848310 798154
10686G98154l57972m15528P60826n49063J7483R36540j037335M20362j21746K6754
$$ 798154 440182 24654 785480 236417 253900 1190440 153105 573467 451721 478475
10676D78475K63208m43151P49533l70766m00005m6040p4133P57189m01993J95175
$$ 478475 741683 298532 1048065 677299 277294 231254 157121 914310 512317 707492
10666G07492m03895l82979J59211O21805k20917K53891Q37568o68833j195632
$$ 707492 303597 -79382 79829 701634 480717 734608 1572176 903343 -292289
10657b92289p5989J510923n96494k81327N99271m69013K10274p80661K14473O12649
$$ -292289 -368278 1142645 546151 264824 864095 395082 605356 -175305 39168 651817
10647F51817n35270Q52490l87727k69917j79165K96827k72040L68857j06783j95720
$$ 651817 116547 969037 581310 311393 132228 429055 157015 525872 419089 223369
10637B23369l68140L83809L64332K9859N05382r91017N19128l80844K5912m86131
$$ 223369 -144771 239038 603370 633229 1138611 147594 666722 285878 311790 -174341
10627a74341J28689K90121P9295l12228N05O55435l9383J41085k71153k24015
$$ -174341 -45652 244469 323764 11536 12041 667476 628093 769178 498025 274010
10617B74010k41792N36624m26442O08505k52104k33320L94592k03999O40535o29253
$$ 274010 32218 568842 142400 750905 498801 265481 660073 456074 1096609 467356
10607D67356j133595P52456N17104J17103m29167Q1548N31467n25425j55760L61787
$$ 467356 -666239 86217 603321 720424 291257 372805 904272 378847 223087 584874
10597E84874m41782P42633J93077k46987n53362K26734m2447Q14704q26856K46306
$$ 584874 143092 885725 1078802 831815 278453 505187 462740 1277444 450588 696894
10587F96894M09591q08750J88150j27545J7687J73803o09352Q97213n41361k42936
$$ 696894 1106485 297735 485885 358340 376027 549830 -59522 837691 296330 53394
10577E3394N54538J86684j158614L07764N26708J2553M33403j041964n2503J638909
$$ 53394 607932 794616 -363998 -56234 470474 483027 916430 -125534 -178037 1460872
10567A460872m46849j61205r33952K24964L72410N19087k33675p6603N1962p3121
$$ 1460872 1014023 852818 -81134 143830 516240 1035327 801652 725049 777011 703890
10557G03890j192372J510770M23642p24933k41765M3883q12057J055160N81034
$$ 703890 -488482 1022288 1445930 720997 479232 523115 -288942 766218 1347252
10548A347252n17511o36331O24745p21750O47113j12955l33916R21809p24676
$$ 1347252 829741 193410 818155 96405 743518 630563 296647 1218456 493780
10539D93780l44667K19784o43052J195867n8225m7521p69969Q1290L3558J15466
$$ 493780 149113 368897 -274155 921712 863487 815966 45997 127287 160845 276311
10529B76311K58599m12589J092653k88553j86494M15064r57141N51863m59633
$$ 276311 534910 122321 1214974 926421 739927 1154991 197850 749713 290080
10520B90080O9760j22130m47630J7043j23032Q90126j57295P275K21071K92649
$$ 290080 359840 237710 -209920 -192877 -315909 574217 416922 424197 645268 937917
10510I37917m89668J71537j80622Q5357P28644p46377N46003j082310O05643Q1278
$$ 937917 448249 619786 439164 524521 1253165 506788 1052791 -29519 576124 657402
10500F57402L25027p69292l26062M17341o59997N54888R34739m00182p97764J255068
$$ 657402 982429 213137 -112925 304416 -355581 199307 1134046 733864 -63900 1191168
10490A191168j703007J126817J6002o63156O99546m05545L07974m23497Q68125
$$ 1191168 -511839 614978 630980 -32176 667370 261825 569799 146302 1014427
10481A014427r70227j93183Q66916n81525j17642m67704P71836m09720N78202
$$ 1014427 44200 -148983 717933 136408 18766 -448938 322898 -86822 491380
10472D91380l35840J022456j73256o08688O89403k80227r42441N46397Q05636
$$ 491380 155540 1177996 1004740 396052 1085455 805228 -137213 409184 1214820
10463A214820j231889k94098N30542M11917K33473n74424P5151J19863J64464
$$ 1214820 -17069 -311167 219375 631292 864765 290341 365492 485355 649819
10454F49819N06244p52698J75007K37357k13055r96758M29566J651960p53552
$$ 649819 1156063 403365 578372 815729 602674 -394084 35482 1687442 933890
10445I33890m01716M39431P5951n57526J13687O60332k77776j33363o0523n08645
$$ 933890 532174 971605 1047556 490030 603717 1264049 986273 852910 792387 283742
10435B83742M70850r47224N94111O78306n25756q80739P58292j2748m78172j9618
$$ 283742 754592 -192632 401479 1079785 554029 -326710 431582 418834 -59338 -78956
10425g8956K30402J21102M57047q37155K30470l25985Q71996j236505J519415
$$ -78956 151446 272548 729595 -107560 122910 -203075 668921 -567584 951831
10416I51831r93575J78967K57121K71776L69604p14136L39665j61906r8160J73091
$$ 951831 -41744 137223 394344 666120 1035724 321588 661253 499347 401187 574278
10406E74278K08520J92151P2362q04997J12630M93863m79492M36566k97108P57008
$$ 574278 782798 974949 1047311 242314 354944 848807 369315 805881 508773 1265781
10396A265781r03683M4584J25361L76579K71624m54073j55865j99603k93411N05068
$$ 1265781 362098 406682 532043 908622 1180246 726173 570308 370705 77294 582362
10386E82362q47564J826618j131292K43997j25593M53669r35536J514546j371539
$$ 582362 -265202 1561416 430124 674121 548528 1002197 66661 1581207 209668
10377B09668l34472J198298j330138J174773l10614O07560m12300l0733l99252
$$ 209668 -124804 1073494 -256644 918129 607515 1215075 802775 772042 372790
10368C72790K55108J69579n91365J61626P92512o88007R3929j09400k9377J17070
$$ 372790 627898 797477 206112 367738 1160250 472243 566172 456772 427395 544465
10358E44465O60876l61825J91120j155682q2445Q47161j01719j89083n40934P73130
$$ 544465 1205341 843516 1034636 -121046 -203491 643670 541951 352868 -188066 585064
10348E85064q11922Q80382L90919M31316r21934l53708m11316K85758O69048o28191
$$ 585064 -226858 653524 1044443 1475759 553825 200117 -211199 74559 743607 115416
10338A15416M89593m12005O06539n05459O26270j17435P0599k38079K03665l43414
$$ 115416 605009 193004 799543 294084 920354 802919 873518 635439 839104 495690
10328D95690p34518L90587K87052J58571M21716j59335j13348J82092n76239L42042
$$ 495690 -238828 151759 438811 597382 1019098 859763 746415 928507 352268 694310
10318F94310n417J42355n96905m89140J14884j24349O56647N29492j234643N33675
$$ 694310 688893 831248 234343 -254797 -139913 -264262 392385 921877 -312766 220909
10308B20909o7891O28540k62120J52976l52518R09128k12070j272842K79082N19022
$$ 220909 153018 781558 519438 672414 319896 1229024 1016954 -255888 23194 542216
10298E42216M84510m94797L41453m33088l51283M65712M08862J1679K59497j247506
$$ 542216 1026726 531929 873382 440294 89011 554723 963585 975264 1234761 -12745
10288a2745O69840j71433R21624j125966p0483N80525j65120p99598R76197j467721
$$ -12745 657095 485662 1407286 281320 210837 791362 626242 -173356 802841 -664880
10278f64880P39592N38982j51964k38058N35910p5067k35365R3529K1293L13569
$$ -664880 74712 613694 461730 223672 759582 684515 449150 542679 563972 877541
10268H77541k01230m98265O48478m96171J116954j019573k99156N87752l72264
$$ 877541 676311 178046 826524 330353 1447307 427734 128578 716330 344066
10259C44066K0293N58168N79374q16932J215015j554203j33320l61626Q39996
$$ 344066 364359 922527 1501901 684969 1899984 345781 212461 -149165 690831
10250F90831R65197n11897o81073j18482L35594l67755L13333J46704j00535Q6851
$$ 690831 1656028 1144131 463058 344576 680170 312415 625748 772452 671917 758768
10240G58768K65244o72117L95351n8084k6131m33289R07515m51218l89728K29931
$$ 758768 1024012 351895 747246 689162 663031 229742 1137257 686039 296311 526242
10230E26242n8321m86929Q26946k09898n20444J245314n45062p81929L42811P44328
$$ 526242 467921 -19008 807938 598040 77596 1322910 777848 -4081 338730 1083058
10220A083058k34390p08813k66616M03352N31481N21605k62321j070949P36779
$$ 1083058 848668 139855 -126761 276591 808072 1329677 1067356 -3593 733186
10211G33186j34432k29722Q19207r87000M78562k87521R31700o50308o52074M61342
$$ 733186 598754 369032 1188239 201239 679801 392280 1323980 673672 21598 482940
10201D82940J85350J47939L8278r72975O53878K16345o2099m91053O0136L07421
$$ 482940 668290 816229 854507 -118468 535410 751755 689656 198603 258739 566160
10191E66160K85848p37681O18159o36248j23836K09530k79189M48296L19231m70815
$$ 566160 852008 114327 732486 96238 -27598 181932 -97257 351039 670270 199455
10181A99455L11974p39334N64344q0384L84170j11989K6277N85300m93204L8212
$$ 199455 511429 -227905 336439 256055 640225 528236 554513 1139813 646609 684821
10171F84821q2895k66134K07425j43259L03474p7453Q07840j386848L97499k21264
$$ 684821 601926 335792 543217 399958 703432 625979 1433819 46971 444470 223206
10161B23206O62331K92855p12623m72545J136316m64782q5782n4198l51754K08369
$$ 223206 885537 1178392 465769 -6776 1129540 664758 578976 524778 173024 381393
10151C81393n84022Q96110j30308M67629n08582k74086M47206L37148j80949l34744
$$ 381393 -202629 693481 563173 1030802 522220 248134 695340 1032488 851539 516795
10141E16795Q2416k03335J21962m89582J094668q06915O01772o17103R49978k51534
$$ 516795 599211 395876 517838 28256 1122924 316009 917781 300678 1250656 999122
10131I99122p17076P37694m71487j3031p6724J66233j3165J40311k02769L88510
$$ 999122 282046 1019740 548253 535222 458498 624731 611566 751877 549108 937618
10121I37618k40191j01596L13226K7144p10411m8692N33387o19431o9680Q09073
$$ 937618 697427 595831 909057 936201 225790 177098 710485 91054 21374 830447
10111H30447p60032N18324n97212P64085l33192R36817j448473M26199J10057
$$ 830447 70415 588739 -8473 755612 422420 1359237 -89236 336963 447020
10102D47020L04117q83546P88653j02549M15437K85289l6200M81988j474850J7489
$$ 447020 751137 -132409 656244 553695 969132 1254421 1218221 1700209 225359 242848
10092B42848k02701l0615P50356j454227J249452q69469P55818P4433N17416n93385
$$ 242848 40147 9532 759888 -694339 555113 -314356 441462 515895 1033311 439926
10082D39926M34856P653q03389R88P55284r44629Q40836m57208M14188o9665K5022
$$ 439926 874782 882435 79046 80034 835318 -109311 731525 274317 688505 618840 643862
10071F43862J89965o47891l68019J118534k60907j363361J378970k67534L83222
$$ 643862 833827 185936 -182083 936451 675544 -687817 691153 423619 806841
10062H06841M19387k48952J55838O5265r95377M13955l29214l17149J007494l16479
$$ 806841 1226228 977276 1133114 1198379 203002 616957 287743 -29406 978088 661609
10052F61609j83279n09020Q02844k71356N20216m07427L34007p0486r84724J125846
$$ 661609 478330 -30690 772154 500798 1021014 613587 947594 877108 -107616 1018230
10042A018230q7883r0547J97578N35462j164406l19931O10868N02839k93387n83631
$$ 1018230 930347 839800 1037378 1572840 408434 88503 699371 1202210 908823 325192
10032C25192J082603j607585N50446K46064m86305J044839J10827o48552N69475
$$ 325192 1407795 -199790 350656 596720 110415 1155254 1266081 617529 1187004
10023A187004m16738M05960j75768n63229P05104J11782o06402R53287j084405
$$ 1187004 770266 1176226 1000458 437229 1142333 1254115 647713 1601000 516595
10014E16595M96446l11590J19841j42021O59030k05086J04787l89559j066638
$$ 516595 1013041 701451 821292 679271 1338301 1133215 1238002 848443 -218195
10005b18195M04760J512450k019501J620313o3161p92267K26217N58473n69121
$$ -218195 186565 1699015 -320486 1299827 1236666 444399 670616 1229089 659968
9996F59968j13408q93190J055822L17068p64950Q73203k88050N9824k38701L2135
$$ 659968 546560 -346630 709192 1026260 261310 1134513 846463 906287 667586 699721
9986F99721O00492r62107j80039P60101p32083P49011l24429K2313N4375l47095
$$ 699721 1300213 338106 158067 918168 186085 935096 610667 632980 687355 340260
9976C40260l65069J534357j110165j58968m9386P63943q9328l31463j77520J093171
$$ 340260 -24809 1509548 399383 240415 191029 954972 865644 534181 356661 1449832
9966A449832p33823j582190J125190K74380M99767o36803K18853L10152j160481
$$ 1449832 716009 -866181 259009 533389 1033156 396353 615206 925358 -235123
9957b35123L12884R73315l76101p7564K68027j73488L42641p75430J52090J06377
$$ -235123 77761 1051076 674975 597411 865438 691950 1034591 259161 411251 517628
9947E17628K38789j77058p3521J06233L86625N48277r50122m43957N00177n58951
$$ 517628 756417 579359 505838 612071 998696 1546973 596851 152894 653071 94120
9937I4120L57517M16626r5433l60597L30756K04487o7155n80564J06293l99249
$$ 94120 451637 868263 772830 412233 742989 947476 880321 299757 406050 6801
9927F801J019133q98276J635528p91104j005793P69341j12188K82293M47689N784
$$ 6801 1025934 127658 1763186 972082 -33711 735630 623442 905735 1353424 1359208
9917A359208m8807j75034j103436R49810n11950J908K49399l48397M80094o4870
$$ 1359208 1310401 1135367 31931 981741 469791 471699 721098 372701 852795 787925
9907G87925k12213R1174N01132Q2483j97221Q16911r06006O62685j94214l8651
$$ 787925 575712 666886 1168018 1250501 1053280 1870191 964185 1626870 1432656 1394005
9897A394005r7899K682k35137K95431N95287l85071l24986M16561l81074P2096
$$ 1394005 1296106 1298788 1063651 1359082 1954369 1569298 1244312 1660873 1279799 1351895
9887A351895m17943Q30448n62540k95892j21100K79786J30679M317M28780K89931
$$ 1351895 933952 1764400 1201860 905968 784868 1064654 1195333 1199650 1628430 1918361
9877A918361M10143k17139l73173J4144n55412P99351O9799L17671N9654o2917
$$ 1918361 2328504 2111365 1738192 1752336 1196924 1996275 2066074 2383745 2443399 2380482
9867B380482p38185P37285J7101o10785n95245N83545J32031k60354l76402l96426
$$ 2380482 1642297 2379582 2396683 1785898 1190653 1774198 1906229 1645875 1269473 873047
9857H73047K78355j88319K58309O93132o28963j27919K5855l38176l85039L65535
$$ 873047 1151402 963083 1221392 1914524 1285561 1157642 1183497 845321 460282 825817
9847H25817Q00572l25790K22280Q19581l73387q97319O86352j89319K8395P40817
$$ 825817 1626389 1300599 1522879 2342460 1969073 1071754 1758106 1568787 1597182 2337999
9837B337999n25911o93723m62114M71438M52349m78315M04913o75076O34654m74278
$$ 2337999 1812088 1118365 656251 1127689 1580038 1101723 1506636 831560 1466214 991936
9827I91936l20165J17754Q62961l09518n43451O00330j04523j92611j03044j34845
$$ 991936 671771 789525 1652486 1342968 799517 1399847 1295324 1102713 999669 864824
9817H64824m47209N60841L66214m75383N32083m50389O94853r53399N25114k54989
$$ 864824 417615 978456 1344670 869287 1401370 950981 1645834 692435 1217549 962560
9807I62560J56404m46826l20083P78719l77537k90964O15102M55861j109726J257051
$$ 962560 1118964 672138 352055 1130774 753237 462273 1077375 1533236 423510 1680561
9797A680561q62353n33409J124527j211898K02144M55875J0222m21303J86677
$$ 1680561 818208 284799 1409326 197428 399572 855447 865669 444366 631043
9788F31043j60892L51611j41598M46867j29183l69409N93978k6621K53377n11260
$$ 631043 470151 821762 680164 1127031 997848 628439 1222417 1195796 1449173 937913
9778I37913J44101O76867o11492n65214L16672M40051o39924j80080j08307O46893
$$ 937913 1082014 1758881 1147389 582175 898847 1338898 698974 518894 410587 1057480
9768A057480j94902p33516J500228j405961K50759L10841P0987r78927Q93686
$$ 1057480 862578 129062 1629290 223329 474088 784929 855916 -123011 770675
9759G70675m71907j18897N43924J79425n39757J19821Q71341o80207J92455M15791
$$ 770675 298768 179871 723795 903220 363463 483284 1354625 674418 866873 1282664
9749A282664p45275K36429m48144P16679l55932O1395O92781m80575j51661J76769
$$ 1282664 537389 773818 325674 1042353 686421 747816 1440597 960022 808361 985130
9739I85130J203529j878778J043331j04282r47665J68768J018568k73000M08603
$$ 985130 2188659 309881 1353212 1248930 301265 470033 1488601 1215601 1624204
9730A624204m06216j227881J075287k26946o625J07608L23907k7690r52909K32685
$$ 1624204 1217988 -9893 1065394 838448 831823 939431 1263338 1235648 282739 515424
9720E15424o13997J455744p24965k52592q0656M33432K15695o59390Q97533m15229
$$ 515424 -98573 1357171 632206 379614 298958 732390 948085 288695 1186228 770999
9710G70999J47077o43778K96854j85756K26421j15711j96567K40210K86976m36082
$$ 770999 918076 274298 571152 385396 611817 496106 299539 539749 826725 390643
9700C90643j86884n9028J033392l46967J92512k05430L12796J86516K8969K36172
$$ 390643 203759 144731 1178123 831156 1023668 818238 1131034 1317550 1346519 1582691
9690A582691j192520r9458Q40318J58861j05554K43536J33184r61509N66707K6666
$$ 1582691 390171 290713 1131031 1289892 1184338 1427874 1561058 599549 1166256 1192922
9680A192922j142507L57428J128480o14901M05506l99432l17723K74704L13287
$$ 1192922 50415 407843 1536323 921422 1326928 927496 609773 884477 1197764
9671A197764r03474J018216j56793j39261j10989j42509l5054L79192J70492K48733
$$ 1197764 294290 1312506 1155713 1016452 905463 762954 727900 1107092 1277584 1526317
9661A526317l15093P39523r88201Q09287O5408J12376N19995r31599J59954j08762
$$ 1526317 1211224 1950747 962546 1771833 1837241 1949617 2469612 1538013 1697967 1589205
9651A589205r1139l24184R66075j725706N51528k86062l2948P82718l59580L3580
$$ 1589205 1498066 1173882 2139957 414251 965779 679717 646769 1429487 1069907 1103487
9641A103487J10649K36516L6052k52739o71289J72711r04962P54374O62355j22002
$$ 1103487 1214136 1450652 1486704 1233965 562676 735387 -169575 584799 1247154 1125152
9631A125152N22661l95961J089172r0958n27277k62796M43916J12161j81119J12358
$$ 1125152 1647813 1251852 2341024 2250066 1722789 1459993 1903909 2016070 1834951 1947309
9621A947309m67480m7962K70484j23634L98607j3176o09802l6124l01909R9906
$$ 1947309 1479829 1431867 1702351 1578717 1977324 1964148 1354346 1318222 1016313 1116219
9611A116219Q41599r41541p87900Q57548l09870l00875l801N99059L13943N78047
$$ 1116219 1957818 1016277 228377 1085925 776055 475180 471379 1070438 1384381 1962428
9601A962428j640033R46685K89833p84985K5255p6340m8565j10710L63268Q3393
$$ 1962428 322395 1269080 1558913 773928 799183 722843 674278 563568 926836 1010229
9591A010229j16631M81392p88720j24696O43751q6526j29906k43544K07469K4411
$$ 1010229 893598 1374990 586270 461574 1105325 1018799 888893 645349 852818 877229
9581H77229J5669m77009Q35590p6l81893o67452P14902M32194n49116k86272m5553
$$ 877229 892898 415889 1251479 1251403 869510 202058 916960 1349154 800038 513766 468213
9570D68213P88841K55158R6961l29561l80384M86899m14891l87890J044590o84399
$$ 468213 1257054 1512212 1609173 1279612 899228 1386127 971236 583346 1627936 943537
9560I43537O83565n66135O95886m01118k11724k19194K68804j81093k820J48696
$$ 943537 1627102 1060967 1756853 1355735 1144011 924817 1193621 1012528 1009708 1158404
9550A158404p9103p75586J031455n63531J373245m42418k43499K48291m96296
$$ 1158404 1079301 303715 1335170 771639 2144884 1702466 1458967 1707258 1210962
9541A210962J11070k86091J27781N61391n2773j52243n5896J03853K48841N99188
$$ 1210962 1322032 1035941 1163722 1725113 1672340 1520097 1464201 1568054 1816895 2416083
9531B416083q38697N65880q88529R89629r70409k65421M47820J1286j52132j6715
$$ 2416083 1577386 2143266 1254737 2244366 1273957 1008536 1456356 1467642 1315510 1298795
9521A298795J141700q50052J92666n1802N77765o46639N89685l79143m91100P22986
$$ 1298795 2440495 1590443 1783109 1731307 2309072 1662433 2252118 1872975 1381875 2104861
9511B104861j75992N15770R4697k37908j83324K20929P1392p07674K20738J94856
$$ 2104861 1928869 2444639 2539336 2301428 2118104 2339033 2410425 1702751 1923489 2118345
9501B118345j42510P88148l4598O71706o73533L60379l85851j26528J9519N05980
$$ 2118345 1975835 2763983 2729385 3401091 2727558 3087937 2702086 2575558 2595077 3101057
9491C101057q71142L69829n08655k66864M45831m20422M47348q9719K28806J004631
$$ 3101057 2229915 2599744 2091089 1824225 2270056 1849634 2296982 2207263 2436069 3440700
9481C440700j397342R11213q79512M31103k63091J241661o62931O8217n14704
$$ 3440700 2043358 2954571 2075059 2506162 2243071 3484732 2821801 2890018 2375314
9472B375314K5036K16013M97227r43727L15402K31918J06869q48510L5886K67158
$$ 2375314 2400350 2616363 3113590 2169863 2485265 2717183 2824052 1975542 2011428 2278586
9462B278586J007673n65277J1582j051640Q18929M3429L15949L07014q23091Q92521
$$ 2278586 3286259 2720982 2732564 1680924 2499853 2543282 2859231 3166245 2343154 3235675
9452C235675j242137N05104j66856N25158j04077R5107q9754j47419k63699M93678
$$ 3235675 1993538 2498642 2331786 2856944 2752867 2847974 2758220 2610801 2347102 2840780
9442B840780k83492R33817Q4002p59235K12688J12251J07022k48130q53438R19885
$$ 2840780 2557288 3491105 3575107 2815872 3028560 3140811 3247833 2999703 2146265 3066150
9432C066150K68030m58300n99797O63560j032658O41569l73130M63673L30808
$$ 3066150 3334180 2875880 2276083 2939643 1906985 2548554 2175424 2639097 2969905
9423B969905j080923R66048k61816N10799j194952k37031J988591p79979m23136
$$ 2969905 1888982 2855030 2593214 3104013 1909061 1672030 3660621 2880642 2457506
9414B457506j99798J97087O968p29130O02124o59537O50847M06233n58107J78389
$$ 2457506 2257708 2454795 2461763 1732633 2334757 1675220 2326067 2732300 2174193 2352582
9404B352582l33825J74788P62843n36523n8569j27181l0617J27038N75940l41984
$$ 2352582 2018757 2193545 2956388 2419865 2361296 2234115 2203498 2330536 2906476 2564492
9394B564492n94485J45398j20848N35475m97319N39092n0533j01786M52455J70314
$$ 2564492 1970007 2115405 1994557 2530032 2032713 2571805 2521272 2419486 2871941 3042255
9384C042255m14616N35706j023834Q60736j003810N61202N46017M6033j017987
$$ 3042255 2627639 3163345 2139511 3000247 1996437 2557639 3103656 3149689 2131702
9375B131702L53223j47939Q7238K85234L05838P5494l31475n05394R62840j239274
$$ 2131702 2484925 2336986 2424224 2709458 3015296 3090790 2759315 2253921 3216761 1977487
9365A977487P54567M63480M66215j234561J099275J8142L92895r89562L76106
$$ 1977487 2732054 3195534 3661749 2427188 3526463 3544605 3937500 2947938 3324044
9356C324044K79812N68689j108281K76565J57876r2321J341446q52509P29639
$$ 3324044 3603856 4172545 3064264 3340829 3498705 3406384 4747830 3895321 4624960
9347D624960n45867P76874j38087j42267J178602j721482J146384p51001J048146
$$ 4624960 4079093 4855967 4717880 4575613 5754215 4032733 5179117 4428116 5476262
9338E476262j273446R87650k8246r7901J21234q51412R63474j61731l42782k53856
$$ 5476262 4202816 5190466 5162220 5064319 5185553 4334141 5297615 5135884 4793102 4539246
9328D539246n4310L12457q79817J594648p74263N85537j003522J252955n37441
$$ 4539246 4484936 4797393 3917576 5512224 4737961 5323498 4319976 5572931 5035490
9319E035490M80646J17635L07246j58790M65069J77273n53855J109428j260744
$$ 5035490 5516136 5633771 5941017 5782227 6247296 6424569 5870714 6980142 5719398
9310E719398K83493m24160L80216O56358J039305o60314p51918J61978r153R32038
$$ 5719398 6002891 5578731 5958947 6615305 7654610 6994296 6242378 6404356 6395203 7327241
9300G327241o15170O2435j12762j20576J032777o87078P15929K11748m07796P59994
$$ 7327241 6712071 6774506 6661744 6541168 7573945 6886867 7602796 7814544 7406748 8166742
9290H166742M144j08322K09638k46737l41357P98994J93310J049256p54309K19189
$$ 8166742 8170886 8062564 8272202 8025465 7684108 8483102 8676412 9725668 8971359 9190548
9280I190548K51189Q9789M52226p46252J100645n48535N03002p00983L72016Q4015
$$ 9190548 9441737 9531526 9983752 9237500 10338145 9789610 10292612 9591629 9963645 10047660
9270A0047660O56887k26538K33854N36399N1306K4855k56980m53859J155305M27713
$$ 10047660 10704547 10478009 10711863 11248262 11299568 11324423 11067443 10613584 11768889 12196602
9260A2196602O9831k2464J01350K49237Q60388Q13454L00546N11465O10686R64799
$$ 12196602 12266433 12243969 12345319 12594556 13454944 14268398 14568944 15080409 15691095 16655894
9250A6655894k81120L67610P38602R73495K03645N04687K45788L34637p58405
$$ 16655894 16374774 16742384 17480986 18454481 18658126 19162813 19408601 19743238 18984833
9241A8984833O62703Q04820M58584K071853M81690J299645J23283J638656Q22796
$$ 18984833 19647536 20452356 20910940 22982793 23464483 24764128 24887411 26526067 27348863
9232B7348863O96391J692769J452869J016213J01352J273545n74374Q49393Q07724
$$ 27348863 28045254 29738023 31190892 32207105 32308457 33582002 33007628 33857021 34664745
9223C4664745P92026L2490P79267p62353N46199J079523j67442J296342J546821
$$ 34664745 35456771 35489261 36268528 35506175 36052374 37131897 36964455 38260797 39807618
9214C9807618J086994L346128J410025K033144J916306K885549L395471K821730
$$ 39807618 40894612 44240740 45650765 47683909 49600215 52485764 55881235 58702965
9206E8702965L618524K972035L277146L228083K756491K886651M280660L172614
$$ 58702965 62321489 65293524 68570670 71798753 74555244 77441895 81722555 84895169
9198H4895169L895787K385624K167854K792202K158771J412197K031933N60117
$$ 84895169 88790956 91176580 93344434 96136636 98295407 99707604 101739537 102299654
9190A02299654j184538j329404j942284k44899k58100J101318J177544L892310
$$ 102299654 101115116 99785712 97843428 97598529 97340429 98441747 99619291 103511601
9182A03511601O808613R324120J5296674K0384605K7264532K6342328K3818022
$$ 103511601 110320214 119644334 134941008 155325613 182590145 208932473 232750495
9175B32750495J7792676J0276900N646419L948114N774656P594368J1900990J1441958
$$ 232750495 250543171 260820071 266466490 270414604 276189260 283783628 295684618 307126576
9167C07126576J0400372O172016J424873m699800j1528294j9771756k2745901
$$ 307126576 317526948 323698964 325123837 320424037 308895743 289123987 266378086
9160B66378086k4165887k2794756k0082413j7682148j3562379p480976m409696
$$ 266378086 242212199 219417443 199335030 181652882 168090503 160609527 156199831
9153A56199831k13497K263301M107988J626898J509272j02337m12683k723951
$$ 156199831 155986334 158249635 162357623 163984521 165493793 165391456 164978773 162254822
9145A62254822j178681m0689j482219o31353o9079L3851j50076m21338k12986
$$ 162254822 161076141 161035452 159553233 158921880 158852801 158886652 158736576 158315238 158102252
9136A58102252j703396j302034l261139n136497n827315p100667o102435p278949
$$ 158102252 156398856 155096822 151835683 146699186 140871871 133771204 127668769 120389820
9128A20389820n942590o518780n228046o024561l792068l788764k596135l173685
$$ 120389820 114447230 107928450 102700404 96675843 92883775 89095011 86498876 83325191
9120H3325191l283000k110085k916745j450162k611052o08608j743342j443780
$$ 83325191 80042191 77932106 75015361 73565199 70954147 70345539 68602197 67158417
9112F7158417j499j312283j343492r40299r91922k423719j7310j716227m35581
$$ 67158417 67156918 65844635 64501143 63560844 62568922 60145203 60127893 58411666 57976085
9103E7976085j215213M31788n39778m80918k9382r07815P37491J010879J709746
$$ 57976085 56760872 57192660 56652882 56171964 56142582 55234767 55972258 56983137 58692883
9094E8692883J281100K349912L596910O200544J2927847K8120124L8495712M6186218
$$ 58692883 59973983 62323895 65920805 72121349 85049196 113169320 151665032 197851250
9086A97851250L1568591j287312n940418j8611199k6124641k3986212k6135542
$$ 197851250 229419841 228132529 222192111 203580912 177456271 153470059 127334517
9079A27334517k1483425k1129699j4826355j0173513p112583m620860l241861
$$ 127334517 105851092 84721393 69895038 59721525 52608942 47988082 44746221
9072D4746221l625383k419822j268862k673892j407388j251432n96963j427910
$$ 44746221 41120838 38701016 37432154 34758262 33350874 32099442 31502479 30074569
9064C0074569k48400k34544k149125m11523j367266m95664p0828j234260j068981
$$ 30074569 29826169 29591625 27442500 27030977 25663711 25168047 25097219 23862959 22793978
9055B2793978j65023p61158j222084K0972n09517o18067K87331l95788k78956
$$ 22793978 22628955 21867797 20645713 20666685 20157168 19539101 19826432 19430644 19151688
9046A9151688j76104k002982P85668q42914p39426J30229m06717j58144K31534
$$ 19151688 18975584 16972602 17758270 16915356 16175930 16306159 15899442 15741298 15972832
9037A5972832r15337n8091m13248l67079l72398l95660j224054O19233L89727
$$ 15972832 15057495 14999404 14586156 14219077 13846679 13451019 12226965 12846198 13235925
9028A3235925k30613k63072n44182o21694P36357r01662M61183m36852K7870n25509
$$ 13235925 13005312 12742240 12198058 11576364 12312721 11411059 11872242 11435390 11463260 10937751
9018A0937751o15584M19321k2840q98539O46557j375321L36039K20052j52824
$$ 10937751 10322167 10741488 10718648 9820109 10466666 9091345 9427384 9647436 9494612
9009I494612j128585M20285K90797r74792J044057p07100l67284K18957j517677
$$ 9494612 8366027 8786312 9077109 8102317 9146374 8439274 8071990 8290947 6773270
9000F773270R46403l9553n4975l12545j6617K01407m16937K99049n31968J07321
$$ 6773270 7719673 7680120 7625145 7312600 7295983 7497390 7080453 7379502 6847534 6954855
8990F954855P60097L90793p18102l09573O90975j231025J73134K96047l97203
$$ 6954855 7714952 8105745 7387643 7078070 7769045 6538020 6711154 7007201 6609998
8981F609998k05118l27989N3736O05823n16782l20268J012958o07791q78379J120065
$$ 6609998 6404880 6076891 6130627 6736450 6219668 5899400 6912358 6304567 5426188 6546253
8971F546253m62315m59647J29433m98735K00992l68187Q68534q86866P0948J369344
$$ 6546253 6083938 5624291 5753724 5254989 5455981 5087794 5956328 5069462 5140410 6509754
8961F509754j144459K96608J65001p61479n5814Q6282o30821O65848L41281l75556
$$ 6509754 5365295 5661903 5826904 5065425 5009611 5095893 4465072 5130920 5472201 5096645
8951E096645j97695N71523j611478J009389M8887L78506m36876j90600L28556
$$ 5096645 4898950 5470473 3858995 4868384 4917271 5295777 4858901 4668301 4996857
8942D996857r70566O54984N92759j62234p30874J238390q86932k2631K35829L4764
$$ 4996857 4026291 4681275 5274034 5111800 4380926 5619316 4732384 4709753 4945582 4980346
8932D980346L29708L37483j316025O94375P20130q32889j8757L66662n92564j38743
$$ 4980346 5310054 5647537 4331512 5025887 5746017 4913128 4894371 5261033 4668469 4529726
8922D529726J24152n3059j7688J18444J77625K2075l37639k78677j65838M90129
$$ 4529726 4653878 4600819 4583131 4701575 4879200 4901275 4563636 4284959 4119121 4609250
8912D609250l2207P54518J537j015740j61109M13458J99865m62427K64371o51591
$$ 4609250 4577043 5331561 5333098 4317358 4156249 4569707 4769572 4307145 4571516 3919925
8902C919925P6043J67758o02301Q80436J87184n40350j72468l93949n04515Q31394
$$ 3919925 3995968 4163726 3561425 4441861 4629045 4088695 3916227 3522278 3017763 3849157
8892C849157p18065N23348m15216L35679o88451O09727r0113O61603n30247j039718
$$ 3849157 3131092 3654440 3239224 3574903 2886452 3496179 3406066 4067669 3537422 2497704
8882B497704N54760P9605O6745M80813l10306N71107r62503l37352J147783j3544
$$ 2497704 3052464 3132069 3198814 3679627 3369321 3940428 2977925 2640573 3788356 3774812
8872C774812M16621m43494j40606p24951M52715l85446J15434N88111j426316
$$ 3774812 4191433 3747939 3607333 2882382 3335097 2949651 3065085 3653196 2226880
8863B226880J262796o61540O72150k79490N58857j257420o475N31057k32790K8979
$$ 2226880 3489676 2828136 3500286 3220796 3779653 2522233 2515758 3046815 2814025 2843004
8853B843004k10993K08451j85887J10177k32945L8408m93605J140179m54946K96764
$$ 2843004 2632011 2840462 2654575 2764752 2531807 2570215 2076610 3216789 2761843 3058607
8843C058607n04506k67914L73594k02250M21618N32646j159123P2465Q46282l92794
$$ 3058607 2554101 2286187 2659781 2457531 2879149 3411795 2252672 2325137 3171419 2778625
8833B778625J68164K36905j98599k83871l60579K73874R0603r06048J452425j520223
$$ 2778625 2946789 3183694 2985095 2701224 2340645 2614519 2705122 1799074 3251499 1731276
8823A731276M28657q058o10850J174693m14529M48312n84080N4543j82581O32146
$$ 1731276 2159933 2151875 1541025 2715718 2301189 2749501 2165421 2219964 2037383 2669529
8813B669529k60658M01851p91774k81310L05126l5105J7976J88274L61680q15953
$$ 2669529 2408871 2810722 2018948 1737638 2042764 2007659 2025635 2213909 2575589 1759636
8803A759636L93613k26157J86160K1876o00980O9314P29109j504927Q28208r9896
$$ 1759636 2153249 1927092 2113252 2135128 1534148 1603462 2332571 827644 1655852 1555956
8793A555956R1067J09133N60082p08821L44450J81261K5678l622m8846l54877
$$ 1555956 1647023 1756156 2316238 1607417 1951867 2133128 2158806 2155184 2106338 1751461
8783A751461L87057k82530o23204Q62543j46720j9498l80447l52395O56062j821
$$ 1751461 2138518 1855988 1232784 2095327 1948607 1929109 1548662 1196267 1852329 1850508
8773A850508O3679Q09984o44345R53474o70193j592618J390536N46319M9561j58511
$$ 1850508 1914187 2724171 2079826 3033300 2363107 770489 2161025 2707344 2756905 2598394
8763B598394r14408N56667q26842P4937Q18089J79305M82288o35250K58318n69699
$$ 2598394 1683986 2240653 1413811 1488748 2306837 2486142 2968430 2333180 2591498 2021799
8753B021799J00131R21631k25656k915L67371j42601j107077N21484L31489M79673
$$ 2021799 2121930 3043561 2817905 2814990 3182361 3039760 1932683 2454167 2785656 3265329
8743C265329j343819j8578R0242K14528J298234j576778O83305N04975j337207
$$ 3265329 1921510 1902932 1993174 2207702 3505936 1929158 2612463 3117438 1780231
8734A780231K88575M80519p45939k98345l45679K7395P92355k85688n18804R80514
$$ 1780231 2068806 2549325 1803386 1505041 1159362 1186757 1979112 1693424 1174620 2155134
8724B155134j68792l95913Q9691k19332O08005r84170N16946o3371j91895N7451
$$ 2155134 1986342 1590429 1680120 1460788 2068793 1084623 1601569 1538198 1346303 1403754
8714A403754K73302k87649O84164l57746J14162J46298j665099J023763K72316
$$ 1403754 1677056 1389407 2073571 1715825 1829987 1976285 311186 1334949 1607265
8705A607265o70097O62354j788j409362P20224m35043J282881p54899K14763M53151
$$ 1607265 937168 1599522 1597734 188372 908596 473553 1756434 1001535 1216298 1669449
8695A669449m20941J12862J79185j47746o26338J21985J89742K41671L71787o83206
$$ 1669449 1248508 1361370 1540555 1392809 766471 888456 1078198 1319869 1691656 1008450
8685A008450L53703l75545K13619j043195N77731O54076L44599o26894J249749
$$ 1008450 1362153 986608 1200227 157032 734763 1388839 1733438 1106544 2356293
8676B356293r87568r06547J031990K39456K90334k69168P91075L7189K6037p92126
$$ 2356293 1368725 462178 1494168 1733624 2023958 1754790 2545865 2583054 2609091 1816965
8666A816965k42111M10002j206074J338368r83162N54952n48487J13321R75919
$$ 1816965 1574854 1984856 778782 2117150 1133988 1688940 1140453 1253774 2229693
8657B229693n53984p53671Q74782q31624m08080P57015K19604j334317J381925
$$ 2229693 1675709 922038 1796820 965196 557116 1314131 1533735 199418 1581343
8648A581343j020624N38323m25051P47587m98507O23843k08037m03937J97438
$$ 1581343 560719 1099042 673991 1421578 923071 1546914 1338877 934940 1132378
8639A132378Q6025j189J86990o91008N25672q92830k629J10856J111556L87124
$$ 1132378 1218403 1217214 1404204 713196 1238868 346038 343409 454265 1565821 1952945
8629A952945r73974M955N66480n78929M0868J29667m98243P37306j210117L86951
$$ 1952945 978971 983926 1550406 971477 1012345 1142012 643769 1381075 170958 557909
8619E57909L10550k67811k21550L4260J19822L15748l13063O10982p86989J243180
$$ 557909 868459 600648 379098 413358 533180 848928 535865 1146847 359858 1603038
8609A603038l94827M02426n30986J75225n66928Q18863n28845N07632j223546
$$ 1603038 1208211 1610637 1079651 1254876 687948 1506811 977966 1485598 262052
8600B62052O34004L75758K32285k12957J95288m68426n51635J354242n87354k60566
$$ 262052 896056 1271814 1504099 1291142 1486430 1018004 466369 1820611 1233257 972691
8590I72691r2588k34041J82835M50027K63813p91425J30798K75787K4497k27604
$$ 972691 880103 646062 828897 1278924 1542737 751312 882110 1157897 1182394 954790
8580I54790j23067M08713n2712n60680k44539K44833L58572K25001M79236j50924
$$ 954790 831723 1240436 1187724 627044 382505 627338 985910 1210911 1690147 1539223
8570A539223r9624L6702j48833q3306K68591j81922P42007o41733L77119J61443
$$ 1539223 1439599 1476301 1327468 1244162 1512753 1330831 2072838 1431105 1808224 1969667
8560A969667j783208J385839n61457N94933K96777j001068K03480k365L1763L13976
$$ 1969667 186459 1572298 1010841 1605774 1902551 901483 1104963 1102598 1134361 1448337
8550A448337M06413p52359M03021l74401K84184l54691Q30611l51206k78211J051574
$$ 1448337 1854750 1102391 1505412 1131011 1415195 1060504 1891115 1539909 1261698 2313272
8540B313272q68771q53725J565627j55192K312278k585360j532193J524109q4269
$$ 2313272 1444501 590776 2156403 2001211 4313489 1728129 195936 1720045 1635776
8531A635776r3284L78620J17768k54007j70615j292871P59413P38217o57630p16716
$$ 1635776 1542492 1921112 2038880 1784873 1614258 321387 1080800 1819017 1161387 444671
8521D44671J052727N64747p71835j66660M96501n60480r0055Q24067j112748R61254
$$ 444671 1497398 2062145 1290310 1123650 1620151 1059671 969616 1793683 680935 1642189
8511A642189j401217N69491q0842J472799k29119k119258J786139j91015j16799
$$ 1642189 240972 810463 729621 2202420 1973301 -145957 1640182 1449167 1332368
8502A332368P12216o13444m19960J00008L16735J84043j003475L04377L21631
$$ 1332368 2044584 1431140 1011180 1111188 1427923 1611966 608491 912868 1234499
8493A234499l50189M20802k06036O2353l7090k29424O02962k66146N37782n71801
$$ 1234499 884310 1305112 1099076 1161429 1124339 894915 1497877 1231731 1769513 1197712
8483A197712j37434P65962p65206j65262N95374k29197o39339Q50711j236647
$$ 1197712 1060278 1826240 1061034 895772 1491146 1261949 622610 1473321 236674
8474B36674J267213m07727j43584Q29113k99481j97033r2758j074049R90560L96104
$$ 236674 1503887 1096160 952576 1781689 1482208 1285175 1192417 118368 1108928 1505032
8464A505032m37020K77539K72989o53785K98340r03956N58197n1069J380897p69164
$$ 1505032 1068012 1345551 1618540 964755 1263095 359139 917336 866267 2247164 1478000
8454A478000N20103o72037q16354N25938O57678j160566j15212J76513M65836
$$ 1478000 1998103 1326066 509712 1035650 1693328 532762 417550 594063 1059899
8445A059899O2042M60152m32407j12985O02639k64010q5549k52433J17532N74065
$$ 1059899 1121941 1582093 1149686 1036701 1639340 1375330 1289781 1037348 1154880 1728945
8435A728945n82190L13954p8928k42210N48691n87875J5953J30242K93066q41218
$$ 1728945 1146755 1460709 1381781 1139571 1688262 1100387 1116340 1246582 1539648 698430
8425F98430Q28183j59777q2656l58006J80547L18614j164026M03548J69940o33066
$$ 698430 1526613 1366836 1284180 926174 1106721 1425335 261309 664857 834797 201731
8415B01731M36715N6961K38354J99256n3703l91094k6996K70550l16598j43115
$$ 201731 638446 695407 933761 1133017 1079314 688220 661224 931774 615176 472061
8405D72061J026073o78378K64309N61035o02694j93143K592p62172O39961o84212
$$ 472061 1498134 819756 1084065 1645100 1042406 849263 851855 89683 729644 45432
8395D5432J161752j42316J37197L23459n31827N43356m10033j61470N39025j02251
$$ 45432 1207184 1064868 1202065 1525524 993697 1537053 1127020 965550 1504575 1402324
8385A402324l56586k25894l73605M45599Q0667n13159m05493Q19559O7408n00400
$$ 1402324 1045738 819844 446239 891838 972505 459346 53853 873412 940820 440420
8375D40420N69192l57707j32496L42770q73398M19391K42447k49111l35060j82210
$$ 440420 1009612 651905 519409 862179 -11219 408172 650619 401508 66448 -115762
8365a15762J335927O5134j621964J345465j79821l24436p11193J047504m25116
$$ -115762 1220165 1285299 -336665 1008800 828979 504543 -206650 840854 415738
8356D15738P78644m73460n68283k20837O73486K21233J22692J36839n78513N77434
$$ 415738 1194382 720922 152639 -68198 605288 826521 949213 1086052 507539 1084973
8346A084973m48750O05523r31920P18349j12004p51490O27681N16897m63096r27733
$$ 1084973 636223 1241746 309826 1028175 916171 164681 792362 1309259 846163 -81570
8336h1570M88612K33362R89570p10480M48274o27332n34596O70144J90341j00694
$$ -81570 407042 640404 1629974 919494 1367768 740436 205840 875984 1066325 965631
8326I65631L26423j032592j46101P26869L62103k26938l00882R84918p52741j286653
$$ 965631 1292054 259462 113361 840230 1202333 975395 674513 1659431 906690 -379963
8316c79963J686608o16950l31084R31688r21201J39481J98331N90821r30885N86933
$$ -379963 1306645 689695 358611 1290299 369098 508579 706910 1297731 366846 953779
8306I53779J70910L0728K71239q48686j68528q86003J057574R78237p70549l94965
$$ 953779 1124689 1155417 1426656 577970 409442 -476561 581013 1559250 788701 393736
8296C93736O80430L53502o27787m22576J65490O58526l11850k99264L98651O89943
$$ 393736 1074166 1427668 799881 377305 542795 1201321 889471 590207 988858 1678801
8286A678801j566389P01009N9666j425763J123263k5996J32854J57160j90275
$$ 1678801 112412 813421 873087 -552676 570587 544591 677445 834605 644330
8277F44330m93014J256637p03735M99262j54552o37043K10799l30714M70933L88433
$$ 644330 151316 1407953 704218 1203480 1048928 411885 622684 291970 762903 1151336
8267A151336j203934N02120m10290J100458j61112L46281K31499j07141j464564
$$ 1151336 -52598 449522 39232 1139690 978578 1324859 1556358 1449217 -15347
8258a5347Q12734q22848O05480l94895R20738n92649M04395J37313K10921N21911
$$ -15347 797387 -25461 580019 185124 1105862 513213 917608 1054921 1265842 1787753
8248A787753p93160j30717P64705o51517L95581m22391K05326k57250m45192O17821
$$ 1787753 994593 863876 1628581 977064 1372645 950254 1155580 898330 453138 1070959
8238A070959l57432M84965n45909Q98426r57484J068183n61505J68780l70455
$$ 1070959 713527 1198492 652583 1551009 593525 1661708 1100203 1268983 898528
8229H98528m08937J11482N71343K24835p80224J537066r94658R73382N5925j49217
$$ 898528 489591 601073 1172416 1397251 617027 2154093 1159435 2132817 2188742 2039525
8219B039525r20162J47733j0762J8545L12368L22533O17043l01522j57477n02622
$$ 2039525 1119363 1267096 1256334 1274879 1587247 1909780 2526823 2225301 2067824 1565202
8209A565202R4307N27834m38745L29142l79254j93336O29152j060876J140935
$$ 1565202 1659509 2187343 1748598 2077740 1698486 1505150 2134302 1073426 2214361
8200B214361n09070L81681n7520O24027O77433l53602L63534j518787M591751
$$ 2214361 1705291 2086972 2029452 2653479 3330912 2977310 3340844 1822057 6413808
8191F413808n686737l7490K76869K6925M17546J050629J84651J61423o19913j97410
$$ 6413808 727071 689581 966450 993375 1410921 2461550 2646201 2807624 2187711 1990301
8181A990301L11887j063925j91452K99996K56523M59238q73033O3901M16685L60050
$$ 1990301 2302188 1238263 1046811 1346807 1603330 2062568 1189535 1253436 1670121 2030171
8171B030171o568R21532j079248R34082q29328J017734k56474m7796p53980l60214
$$ 2030171 2023603 2945135 1865887 2799969 1970641 2988375 2731901 2684105 1930125 1569911
8161A569911J88603m73034J65852l78768Q26997n0740m94340P01611n15904k67975
$$ 1569911 1758514 1285480 1451332 1072564 1899561 1848821 1354481 2056092 1540188 1272213
8151A272213K87681o24988O66220N2396l44087Q09003p58233J033775n73157k64440
$$ 1272213 1559894 934906 1601126 1653522 1309435 2118438 1360205 2393980 1820823 1556383
8141A556383R22186j136384O59514p48998J041038j506933L80760O4862o53682
$$ 1556383 2478569 1342185 2001699 1252701 2293739 786806 1167566 1232428 578746
8132E78746O94953O87450l54824q99851O62459o55165J249010r66186K06084M35518
$$ 578746 1273699 1961149 1606325 706474 1368933 713768 1962778 996592 1202676 1638194
8122A638194n3437m86132L51420N27388j055815L56172o43430O71421j175378
$$ 1638194 1584757 1098625 1450045 1977433 921618 1277790 634360 1305781 130403
8113A30403L84243J502912j420104N23239P36695l99806n26413M56665L20178
$$ 130403 514646 2017558 597454 1120693 1857388 1457582 931169 1387834 1708012
8104A708012r57526L79918N16003K10697j155780M08152o66326N60489L05489
$$ 1708012 750486 1130404 1646407 1857104 701324 1109476 443150 1003639 1309128
8095A309128M5077n40374M23858L982m1579M73254k40443o03277P34766j954902
$$ 1309128 1354205 813831 1237689 1241671 1200092 1673346 1432903 829626 1564392 -390510
8085c90510J919340J89564p04116P74434r82391R90885p76541M66408k27703r05716
$$ -390510 1528830 1718394 1014278 1788712 806321 1797206 1020665 1487073 1259370 353654
8075C53654R15105R7955p56489M64133L48942N80531j530276J928296q11367J70681
$$ 353654 1268759 1366714 610225 1074358 1423300 2003831 473555 2401851 1590484 1761165
8065A761165j89171o27429k59267J148669r82398K12283j08972J88032m14088
$$ 1761165 1571994 944565 685298 1833967 851569 1063852 954880 1142912 728824
8056G28824J752164j046559j184521J99527M60409n52637K58164L81057N6515
$$ 728824 2480988 1434429 249908 449435 909844 357207 615371 996428 1052943
8047A052943Q70500p43761O90290J38955M94805o16705l48283k26070L13676N03401
$$ 1052943 1923443 1179682 1869972 2008927 2503732 1887027 1538744 1312674 1626350 2129751
8037B129751k36918J00989l47550j1013j88299j2169j75543p4464K90350N96078
$$ 2129751 1892833 1993822 1646272 1635259 1446960 1434791 1259248 1184784 1475134 2071212
8027B071212j276228J86407K74872K28148l00783L15345N85921n80695P78788
$$ 2071212 794984 981391 1256263 1484411 1183628 1498973 2084894 1504199 2282987
8018B282987o10849M59521n35895J62403O62313p50957M2521j32537j46087N29486
$$ 2282987 1672138 2131659 1595764 1758167 2420480 1669523 1712044 1579507 1433420 1962906
8008A962906M32655j842044R94736L02958r08402l54523O43828n82079L37051
$$ 1962906 2395561 553517 1548253 1851211 942809 588286 1232114 650035 987086
7999I87086Q00086K83501l88718k15711K298O46617o01017k35410L80208l44502
$$ 987086 1787172 2070673 1681955 1466244 1468542 2115159 1514142 1278732 1658940 1314438
7989A314438P85201j075514M38575k84707L80024k35568M9236O94980p46594k12245
$$ 1314438 2099639 1024125 1462700 1177993 1558017 1322449 1371685 2066665 1320071 1107826
7979A107826l47372j22501n59874P72310J097l52491R59522K30036l72337K38024
$$ 1107826 760454 637953 78079 850389 851486 498995 1458517 1688553 1316216 1554240
7969A554240r10992J277558n28460j31699j69104n42555O37530M76802p49201
$$ 1554240 643248 1920806 1392346 1260647 1091543 548988 1186518 1663320 914119
7960I14119P99406j34632m83885J559934j630628J107442m58880k87269J019359
$$ 914119 1713525 1578893 1095008 2654942 1024314 2131756 1672876 1385607 2404966
7951B404966j778864R35176L13178l39177N14392k32220n33990j82020O95918
$$ 2404966 626102 1561278 1874456 1535279 2049671 1817451 1283461 1101441 1797359
7942A797359j69139N23551j119561M62963P4872j34928M31673q4019P4109o72130
$$ 1797359 1628220 2151771 1032210 1495173 1570045 1435117 1866790 1782771 1856880 1184750
7932A184750L46123r18010R19314J55714J19579n02244N75248r88543Q55874N68097
$$ 1184750 1530873 612863 1532177 1687891 1807470 1305226 1880474 891931 1747805 2315902
7922B315902K47246q07071k28008L98850j058167J498941k51244m3789N43103
$$ 2315902 2563148 1756077 1528069 1926919 868752 2367693 2116449 2072660 2615763
7913B615763j159308R15766j80390p38056n7172O63144l26633K69525M66444p36854
$$ 2615763 1456455 2372221 2191831 1453775 1396603 2059747 1733114 2002639 2469083 1732229
7903A732229J094896n27165N2974R64252m19802M01703k83313o64243p4586O23463
$$ 1732229 2827125 2299960 2352934 3317186 2897384 3299087 3015774 2351531 2276945 2900408
7893B900408j25534J08481K266J74055J27113j30791O18077l58575M382l25565
$$ 2900408 2774874 2883355 2885621 3059676 3186789 3055998 3674075 3315500 3319882 2994317
7883B994317M7077O95071J8561L38903M33330j85650L75433J475110j490560O51973
$$ 2994317 3041394 3736465 3755026 4093929 4527259 4341609 4717042 6192152 4701592 5353565
7873E353565L94263Q6871N59987K217538L63437J729698J111990J626510J145012
$$ 5353565 5747828 5834699 6394686 8612224 8975661 10705359 11817349 13443859 14588871
7864A4588871M20279N49021m40321m77125q56562k42575n00209j291290L55560
$$ 14588871 15009150 15558171 15117850 14640725 13784163 13541588 13041379 11750089 12105649
7855A2105649r58673o34387L07466j81001L75236P90642J225107P57926p418277
$$ 12105649 11146976 10512589 10820055 10639054 11014290 11804932 13030039 13787965 6369688
7846F369688M853281K160477K109774J110359L660035L658683M691323M040891
$$ 6369688 11222969 13383446 15493220 16603579 20263614 23922297 28613620 32654511
7838C2654511M561449L417780J986208J078783j037866k655513l156616k607658
$$ 32654511 37215960 40633740 42619948 43698731 42660865 40005352 36848736 34241078
7830C4241078m807562k127173l470217k327172k593227k784558O77278k407568
$$ 34241078 29433516 27306343 23836126 21508954 18915727 16131169 16808447 14400879
7822A4400879M49197r99888J43133l35036J119415P95743J171729J827994J661414
$$ 14400879 14850076 13850188 13993321 13658285 14777700 15573443 16745172 18573166 20234580
7813B0234580M011211L631254M607022M796292K726847K503184J40726j017751
$$ 20234580 24245791 27877045 32484067 37280359 40007206 42510390 42651116 41633365
7805D1633365k373074k858473m173992l384621m043013k776949l241082j818498
$$ 41633365 39260291 36401818 32227826 28843205 24800192 22023243 18782161 16963663
7797A6963663l497315o35524j344218q00968k25984j281607J45134k54794j51810
$$ 16963663 13466348 12830824 11486606 10685638 10459654 9178047 9323181 9068387 8916577
7788H916577O35729J90718M63865Q28265O93292R29511K500050j81660J458131
$$ 8916577 9552306 9743024 10206889 11035154 11728446 12657957 15158007 14976347 16434478
7779A6434478n23213m84205m68883n56402k288817q07949k155101k23023q20529
$$ 16434478 15911265 15427060 14958177 14401775 12112958 11305009 9149908 8926885 8106356
7770H106356j006001j86002q35612j796937P54427J90021j255700M50355l12718
$$ 8106356 7100355 6914353 6078741 4281804 5036231 5226252 3970552 4420907 4108189
7761D108189R8255o68985O55620j455195J045065j260989J282507j137346r441
$$ 4108189 4206444 3537459 4193079 2737884 3782949 2521960 3804467 2667121 2657680
7752B657680O21717j169617j68881K97586P8614P41718q32868k18796N34758o77602
$$ 2657680 3279397 2109780 1940899 2238485 2317099 3058817 2225949 2007153 2541911 1864309
7742A864309O51800p71327R11661l26986K37098m43033M92376j224627j54398
$$ 1864309 2516109 1744782 2656443 2329457 2566555 2123522 2615898 1391271 1236873
7733A236873N43268J08019j91744n8790M12421p68266K18595Q0704J09825J01048
$$ 1236873 1780141 1888160 1696416 1637626 2050047 1281781 1500376 1581080 1690905 1791953
7723A791953K16136J60078k74658j1234p58264J031964j182966M41436K32969
$$ 1791953 2008089 2168167 1893509 1882275 1124011 2155975 973009 1414445 1647414
7714A647414m33535K66627N2323M44194p28209L6455N69454K42287o53438l40724
$$ 1647414 1213879 1480506 1532829 1977023 1248814 1285269 1854723 2097010 1443572 1102848
7704A102848l1732k54608N7129O11787l60710O44628p77685Q66920k6440j059306
$$ 1102848 1071116 816508 873637 1485424 1124714 1769342 991657 1858577 1832137 772831
7694G72831K34441j87906J99393Q52963p83337L65791K72212o82129j9999L871
$$ 772831 1007272 819366 1018759 1871722 1088385 1454176 1726388 1044259 1024260 1028131
7684A028131j53071N13909n86238M00922j67533j37577M11094N36380q83500J289434
$$ 1028131 875060 1388969 802731 1203653 1036120 898543 1309637 1846017 962517 2251951
7674B251951q67590k46294j85379R95530j059377k00213M77835j41333R5031R9696
$$ 2251951 1384361 1138067 952688 1948218 888841 688628 1166463 1025130 1120161 1219857
7664A219857L73694j47597m9181p19750M10078L57216r38149O16821j93817o39956
$$ 1219857 1593551 1445954 1396773 677023 1087101 1444317 506168 1122989 929172 289216
7654B89216J385682l30032j5688P88654o38545n86199m6950O55787j068456P17872
$$ 289216 1674898 1344866 1329178 2117832 1479287 893088 846138 1501925 433469 1151341
7644A151341K72396M94224j595930Q85121K12806J99377n64347K87708j338055
$$ 1151341 1423737 1917961 322031 1207152 1419958 1619335 1054988 1342696 4641
7635D641J039921j68876o12604N88903J73611k20979Q30398q99102J238380j294090
$$ 4641 1044562 875686 263082 851985 1025596 804617 1635015 735913 1974293 680203
7625F80203O67249q44503J306101q94089M79334j6826o96228l90373M36228O5789
$$ 680203 1347452 502949 1809050 914961 1394295 1377469 681241 290868 727096 792885
7615G92885P42891k38724R11810p03295o6158k67127J20300J21587j196025N80815
$$ 792885 1535776 1297052 2208862 1505567 1439409 1172282 1292582 1414169 218144 798959
7605G98959K74720L61823q8634K21530p82090J97089R00803p34284j5371K97534
$$ 798959 1073679 1435502 1346868 1568398 786308 983397 1884200 1149916 1134545 1432079
7595A432079o86904J69173J43395K49055K92288r1411r5775n81765m94604J332104
$$ 1432079 745175 914348 1057743 1306798 1599086 1507675 1411900 830135 335531 1667635
7585A667635l71306K08832J31829j81240k76604N71375l11360j63188P14586j25690
$$ 1667635 1296329 1505161 1636990 1455750 1179146 1750521 1439161 1275973 1990559 1864869
7575A864869M92720o81031O19147o905k67779K50969o51698J153703o74409P78677
$$ 1864869 2357589 1676558 2295705 2288800 2021021 2271990 1620292 2773995 2099586 2878263
7565B878263r70549P3923j342728K189602m51250l81932R95321n39824m99780
$$ 2878263 1907714 1981637 638909 2828511 2377261 1995329 2990650 2450826 1951046
7556A951046R16728l91964n09201l01625k96447L65610l31155n36870L17287M22672
$$ 1951046 2867774 2475810 1966609 1664984 1368537 1734147 1402992 866122 1183409 1606081
7546A606081r28453J149166R654n54859O8704M33134n75631J25897o16318P24883
$$ 1606081 677628 1826794 1836448 1281589 1350293 1783427 1207796 1333693 717375 1442258
7536A442258q21900P76475j42590J02917r4364L91566J81307p20410J049574n67147
$$ 1442258 620358 1396833 1254243 1357160 1262796 1654362 1835669 1115259 2164833 1597686
7526A597686N6809O9022m96423K28146l42424l45629N94442K05478k21670P97781
$$ 1597686 1654495 1723517 1227094 1455240 1112816 767187 1361629 1567107 1345437 2143218
7516B143218p16121o85304Q16189k21854p3474j78534Q4856Q13388L91780j503959
$$ 2143218 1427097 741793 1557982 1336128 1262654 1084120 1168976 1982364 2374144 870185
7506H70185R85346l70738l64096Q99919j434055J645056j384488j99648P68973
$$ 870185 1855531 1484793 1120697 2020616 586561 2231617 847129 647481 1416454
7497A416454M58222p76700M21700m49910P15059j208820M2851Q75802j15268O89405
$$ 1416454 1874676 1097976 1519676 1069766 1784825 576005 618856 1494658 1379390 2068795
7487B068795j022315j37076J281318j055176Q19078o62743K74800n22418Q54400
$$ 2068795 1046480 909404 2190722 1135546 1954624 1291881 1566681 1044263 1898663
7478A898663o37743o56250M20903k1203L42340o11585m0692o8036O03292m5007
$$ 1898663 1260920 604670 1025573 1004370 1346710 735125 694433 626397 1229689 1184682
7468A184682p34074K94022N91264r727R0812n13390j88753R01096p35826O21254
$$ 1184682 450608 744630 1335894 1326167 1416979 903589 714836 1615932 880106 1501360
7458A501360o25614l84745J224798O1835q22882r4516O92741m45503J67562j80612
$$ 1501360 875746 491001 1715799 1777634 954752 860236 1552977 1107474 1275036 1094424
7448A094424K26260M44883m43200j78698J34863k81689M38501j38910O08062j496213
$$ 1094424 1320684 1765567 1322367 1143669 1278532 996843 1435344 1296434 1904496 408283
7438D08283L40903J189013r30191M2069P52514j552030P61912l21275J374931
$$ 408283 749186 1938199 1008008 1050077 1802591 250561 1012473 691198 2066129
7429B066129k41382l09327P5522J68567p95831M94227K80404o9262Q1107M116
$$ 2066129 1824747 1515420 1590942 1759509 963678 1457905 1738309 1669047 1750154 1754270
7419A754270j31941J227921j538488K1949l04819r2352M01083L01710j75860J18138
$$ 1754270 1622329 2850250 1311762 1333711 1028892 936540 1337623 1639333 1463473 1581611
7409A581611J19083l55710K20167j32162K62540j359979J224973l37818o14437
$$ 1581611 1700694 1344984 1565151 1432989 1695529 335550 1560523 1222705 608268
7400F08268P82887L23695p05654J26791j65493Q95296p58572j11617q03425J557911
$$ 608268 1391155 1714850 1009196 1135987 970494 1865790 1107218 995601 192176 1750087
7390A750087q5152l11465M45221r9234K6982l84275J0377J72607l71978O01502
$$ 1750087 1664935 1353470 1798691 1699457 1726439 1342164 1352541 1525148 1153170 1754672
7380A754672m54507p02032P81514k30404J026180q49529n46598Q56122J46632
$$ 1754672 1300165 598133 1379647 1149243 2175423 1325894 779296 1635418 1782050
7371A782050n44641k14658P10100o34647r5003P55176l72722m70281j17322Q94551
$$ 1782050 1237409 1022751 1732851 1098204 1003201 1758377 1385655 915374 798052 1692603
7361A692603k78151p02102N53760O82623q21413m53377N17191o4604O69477p42618
$$ 1692603 1414452 712350 1266110 1948733 1127320 673943 1191134 1126530 1796007 1053389
7351A053389o98769P22190k9485K94671m01379M102J95191P92676j653710J541230
$$ 1053389 354620 1076810 1047325 1341996 940617 944719 1139910 1932586 278876 1820106
7341A820106N09972m03728m65087q91211L91425N95859m76958J17126O24745r84945
$$ 1820106 2330078 1926350 1461263 570052 961477 1557336 1080378 1197504 1822249 837304
7331H37304N69209p61045P76650o904o5919J80397j81464l92683O41351n28234
$$ 837304 1406513 645468 1422118 1415214 1349295 1529692 1348228 955545 1596896 1068662
7321A068662k51789N04665K43627m5901L06215j20748J86664j149905J69415M36301
$$ 1068662 816873 1321538 1565165 1519264 1825479 1704731 1891395 741490 910905 1347206
7311A347206P3638J74400k31659l85327R1393l22580M97405M60798l97736p96485
$$ 1347206 1420844 1595244 1363585 978258 1069651 747071 1244476 1705274 1307538 511053
7301E11053J017895q47730N43359J14519P1894j706603J088346q850N38879l63299
$$ 511053 1528948 681218 1224577 1339096 1410990 -295613 792733 783883 1322762 959463
7291I59463Q12319l31590r53466O99686O00983J81066m07491j556005Q97085l31667
$$ 959463 1771782 1440192 486726 1186412 1787395 1968461 1560970 4965 902050 570383
7281E70383J538178k98017j99926o87913N69569J62456o38422P64816j77093m46077
$$ 570383 2108561 1810544 1610618 922705 1492274 1654730 1016308 1781124 1604031 1157954
7271A157954o2344k21926M07674P5909q31463L33494L15442o61449J075916k59967
$$ 1157954 1095610 873684 1281358 1357267 525804 859298 1174740 513291 1589207 1329240
7261A329240o86902R40075n61734L42365P71028o18933o67631J64785J358754
$$ 1329240 642338 1582413 1020679 1363044 2134072 1515139 847508 1012293 2371047
7252B371047j264891Q30610j381270N78317M65710k69732N1094m59261L15304
$$ 2371047 1106156 1936766 555496 1133813 1599523 1329791 1380885 921624 1236928
7243A236928j57724n25103J073429k83471R72652p19512r93640M61173l38462
$$ 1236928 1079204 554101 1627530 1344059 2316711 1597199 603559 1064732 726270
7234G26270K79934L85653O02474j031893Q24695K825j39200J00366j87244k02832
$$ 726270 1006204 1391857 1994331 962438 1787133 1789958 1650758 1751124 1563880 1361048
7224A361048n08141P60768o4773l3470O49893q82301o16109P06121p34185J352495
$$ 1361048 852907 1613675 1548902 1515432 2165325 1283024 666915 1373036 638851 1991346
7214A991346k98618P87833j726506N37184J95460O8855L97558q63829J55727J23267
$$ 1991346 1692728 2480561 754055 1291239 1486699 1555554 1953112 1089283 1245010 1368277
7204A368277l62573R56561k540086J986782o38389O97882k01744n02252L11617
$$ 1368277 1005704 1962265 -577821 1408961 770572 1468454 1266710 764458 1076075
7195A076075M57210l96115R33094p33815k30874k47570M1432L65827j70022L15034
$$ 1076075 1533285 1137170 2070264 1336449 1105575 858005 899437 1265264 1095242 1410276
7185A410276K00650q55363K80901O93210j19743O08503j041132m61091J71386
$$ 1410276 1610926 755563 1036464 1729674 1609931 2218434 1177302 716211 887597
7176H87597N16982n7337N81302l36040L4320n28679l88991L94362N83412k75916
$$ 887597 1404579 1347242 1928544 1592504 1626824 1098145 709154 1103516 1686928 1411012
7166A411012m38233p2018P93790j018693J665800o04861l18974J81475m91373
$$ 1411012 972779 900761 1694551 675858 2341658 1736797 1417823 1599298 1107925
7157A107925M95074q49629N35979O09566q17318L98175j30348N7562m16424J98837
$$ 1107925 1602999 753370 1289349 1898915 1081597 1479772 1349424 1406986 990562 1189399
7147A189399M61814o13380K22865j63483L51341j18116l45672P11078j71538j98217
$$ 1189399 1651213 1037833 1260698 1097215 1448556 1330440 984768 1695846 1524308 1326091
7137A326091N74740M10002n95860Q0019n04326L98291M2058Q38051o31383J76289
$$ 1326091 1900831 2310833 1714973 1794992 1290666 1688957 1731015 2569066 1937683 2113972
7127B113972l79952k24993Q0712l08021R749K33130j016845J337826p63856J79008
$$ 2113972 1734020 1509027 1589739 1281718 1291467 1524597 507752 1845578 1081722 1260730
7117A260730J51444K00160o9030N15938q45542Q96727m52464o30951Q27272o98598
$$ 1260730 1412174 1612334 1543304 2059242 1213700 2110427 1657963 1027012 1854284 1155686
7107A155686Q79178j055039R52650j181667J705018j202488J361604q83774m27582
$$ 1155686 2034864 979825 1932475 750808 2455826 1253338 2614942 1731168 1303586
7098A303586P2423M79174j62252k32662R51758q01037M46425j95682n17923N70860
$$ 1303586 1376009 1855183 1692931 1460269 2412027 1610990 2057415 1861733 1343810 1914670
7088A914670k36034L62182n98949L57086l59164K14791q37116J454426n85570
$$ 1914670 1678636 2040818 1441869 1798955 1439791 1654582 817466 2271892 1686322
7079A686322p24052P98163M20402k02453n83359P76874j277254L83156J80620
$$ 1686322 962270 1760433 2180835 1978382 1395023 2171897 894643 1277799 1458419
7070A458419l89199K52606N20465m45027R45759l98187r7164Q3940q05885P14110
$$ 1458419 1069220 1321826 1842291 1397264 2343023 1944836 1847672 1931612 1125727 1839837
7060A839837J26485L00246j88797m01569L87627J29803j09059p9129k33266Q0425
$$ 1839837 1966322 2266568 2077771 1676202 2063829 2193632 2084573 2005444 1772178 1852603
7050A852603K02859O00822M18287j051286J092125r08212l94776l0961k95813
$$ 1852603 2055462 2656284 3074571 2023285 3115410 2207198 1812422 1781461 1485648
7041A485648P98326M05501j063126J338980p95698N52884n63056j26324J22181
$$ 1485648 2283974 2689475 1626349 2965329 2169631 2722515 2159459 2033135 2155316
7032B155316J56382P63533o85514O89313p25386n16275J63103M31352k95147p7217
$$ 2155316 2311698 3075231 2389717 3079030 2353644 1837369 2000472 2431824 2136677 2059460
7022B059460O2959M54899o1533n9907J13558j30664Q4581L78218l61293P559M87415
$$ 2059460 2122419 2577318 2515785 2455878 2569436 2438772 2523353 2901571 2540278 2547837 3035252
7011C035252K83538j156667L77278j02541P66715j89442J245466q27703P23598
$$ 3035252 3318790 2162123 2539401 2436860 3203575 3014133 4259599 3431896 4155494
7002D155494N44728J6038k52212O17838k41320k88134L42749K04526m43560N43691
$$ 4155494 4700222 4716260 4464048 5081886 4840566 4552432 4895181 5099707 4656147 5199838
6992E199838j18069Q15554L7328J551352J384194Q92359J414018J479802J159960
$$ 5199838 5081769 5897323 5934651 7486003 8870197 9762556 11176574 12656376 13816336
6983A3816336r53111p32262p03706l99936r88973q50570k43511r66277n35639
$$ 13816336 12863225 12130963 11427257 11027321 10038348 9187778 8944267 7977990 7442351
6974G442351j064960L78736m84814Q9582k03887N98653k36158Q96021P35965j47524
$$ 7442351 6377391 6756127 6271313 6360895 6157008 6755661 6519503 7415524 8151489 8003965
6964H003965J465870J92101J273167K916826K690431M955379M401669L108504
$$ 8003965 9469835 9661936 10935103 13851929 16542360 21497739 25899408 29007912
6956B9007912l26629k69086k349687k551266l407184l457602k685832k458806
$$ 29007912 28681283 28412197 26062510 23511244 20104060 16646458 13960626 11501820
6948A1501820j149453j278610m03845m77304o39905k89774j15931m26028O9149
$$ 11501820 10352367 9073757 8669912 8192608 7552703 7262929 7146998 6720970 6790119
6939F790119L30955l16072J388648o69003R67785J995764K072564K621480M304085
$$ 6790119 7121074 6805002 8193650 7524647 8492432 10488196 12560760 15182240 19486325
6930A9486325M907342L734165j03430j16034k346117j471922m118087k883534
$$ 19486325 24393667 28127832 28024402 27908368 25562251 24090329 19972242 17088708
6922A7088708k693893j707555k388285j080660K6568j808011j448930J5635M2120
$$ 17088708 14394815 12687260 10298975 9218315 9244883 7436872 5987942 6003577 6045697
6913F045697N47836j576829q3492O47540Q69870j21326o36785Q73765O26389L38021
$$ 6045697 6593533 5016704 4933212 5580752 6450622 6329296 5692511 6566276 7192665 7530686
6903G530686K176334M18516J093117L51295j98277K06808j648654l59121j986136
$$ 7530686 9707020 10125536 11218653 11569948 11371671 11578479 9929825 9570704 7584568
6894G584568l13514n63104q47140p33608o1428j68069q19548o9307k16457p55541
$$ 7584568 7271054 6707950 5860810 5127202 5065774 4897705 4078157 4008850 3792393 3036852
6884C036852Q62702q05771R34358q25817Q86003J65618n70447k77447P75851j720404
$$ 3036852 3899554 3093783 4028141 3202324 4088327 4253945 3683498 3406051 4181902 2461498
6874B461498R29984L20119K7168j56871j12254J72038k57310K10289J10938P08322
$$ 2461498 3391482 3711601 3738769 3581898 3469644 3641682 3384372 3594661 3705599 4413921
6864D413921o71476k62160m61295j89156R85571p94535L80699J50389j270929
$$ 4413921 3742445 3480285 3018990 2829834 3815405 3020870 3401569 3551958 2281029
6855B281029Q42248N99379m40952o81016J325079m801p68919l71580P31607q39996
$$ 2281029 3123277 3722656 3281704 2600688 3925767 3920966 3152047 2780467 3512074 2672078
6845B672078r2563O33725n13449J17403p61918J185465j40897m06496J078915
$$ 2672078 2579515 3213240 2699791 2817194 2055276 3240741 3099844 2693348 3772263
6836C772263J08112p79182k19847J52936J40963J554459j160275l60032l040L5633
$$ 3772263 3880375 3101193 2881346 3034282 3175245 4729704 3569429 3209397 3206357 3241990
6826C241990J51570P42121L85094q74156Q9394l07717M10797J32281o9525l6602
$$ 3241990 3393560 4135681 4520775 3646619 3736013 3428296 3839093 3971374 3901849 3865247
6816C865247L03573L88670j105515M35930P54602r54001j36882O24837Q63093
$$ 3865247 4168820 4557490 3451975 3887905 4642507 3688506 3551624 4176461 5039554
6807E039554n92762q21272J59130M64605j72266J228236q20043l67076O87942
$$ 5039554 4446792 3625520 3784650 4249255 4076989 5305225 4485182 4118106 4806048
6798D806048r03478Q37666l41075M63151j278897Q81569n13567o88111O20362
$$ 4806048 3902570 4740236 4399161 4862312 3583415 4464984 3951417 3263306 3883668
6789C883668L80739P10632j150138J236088j307543O73431j071368N12758L70460
$$ 3883668 4264407 4975039 3824901 5060989 3753446 4426877 3355509 3868267 4238727
6780D238727k0740Q93155q6775k63966k02840N78800n95231P62376o48772j0787
$$ 4238727 4217987 5111142 5024367 4760401 4557561 5136361 4541130 5303506 4654734 4643947
6770D643947K18222J09512m90237p25220P03513j042174J835039p97515L8263
$$ 4643947 4862169 4971681 4481444 3756224 4459737 3417563 5252602 4455087 4493350
6761D493350K36441p68593J135480j054735M14713n44267L39261N76463j059281
$$ 4493350 4729791 3961198 5096678 4041943 4456656 3912389 4251650 4828113 3768832
6752C768832Q55326p58154L15907J93859N19870o79948O91813j014099Q36316
$$ 3768832 4624158 3866004 4181911 4375770 4895640 4215692 4907505 3893406 4729722
6743D729722J0220j84047k51400J70146L05407J90522R94779o46725M78338N15027
$$ 4729722 4739942 4555895 4304495 4474641 4780048 4970570 5965349 5318624 5796962 6311989
6733F311989j99548J08386l11042k89430r4660j13652J80128j202248K83422j52473
$$ 6311989 6112441 6220827 5909785 5620355 5525695 5412043 5592171 4389923 4673345 4520872
6723D520872K68927q95041R2256K00876R45327m28406O65551p22716m94564P20053
$$ 4520872 4789799 3894758 3987014 4187890 5133217 4704811 5370362 4647646 4153082 4873135
6713D873135n7565L15550O4045K01344J167514J199040J98909J066809O54960
$$ 4873135 4815570 5131120 5195165 5396509 6564023 7763063 7961972 9028781 9683741
6704I683741m17659j15615J7929j307302l20832N0594j957821M8164m79877J27205
$$ 9683741 9266082 9150467 9168396 7861094 7540262 7590856 5633035 5681199 5201322 5328527
6694E328527M90016l99384Q6763q98888K80678l01001L0030K72077K09098J80273
$$ 5328527 5818543 5419159 5505922 4607034 4887712 4586711 4616741 4888818 5097916 5278189
6684E278189m44089M71300J038417M37367R96435Q24583P68701J135131n74045
$$ 5278189 4834100 5305400 6343817 6781184 7777619 8602202 9370903 10506034 9931989
6675I931989j513456m36348k27828k28544j968354n89341N53222q9558k39160
$$ 9931989 8418533 7982185 7754357 7525813 5557459 4968118 5521340 5431782 5192622
6666E192622k02785J65861m01750P76978r18532O02352p72972k21978K05056K52782
$$ 5192622 4989837 5155698 4753948 5530926 4612394 5214746 4441774 4219796 4424852 4677634
6656D677634l61819j54205N15207J7828M33568J41665Q83227M24279k36609p7449
$$ 4677634 4315815 4161610 4676817 4694645 5128213 5269878 6153105 6577384 6340775 6263326
6646F263326q72452J23064K23887j200731R83427L25007K11218m90003K111388
$$ 6263326 5390874 5513938 5737825 4537094 5520521 5845528 6056746 5566743 7678131
6637G678131N58323Q02519L27427l42816m71835j207579M67052o69126M543j048465
$$ 7678131 8236454 9038973 9366400 9023584 8551749 7344170 7811222 7142096 7146639 6098174
6627F098174l14750r51607P10851j41982J27244k65602o47063O62664k51038m96960
$$ 6098174 5783424 4831817 5542668 5400686 5527930 5262328 4615265 5277929 5026891 4529931
6617D529931J025232n06878O20427p55419J106356J241348L79315K485664K539132
$$ 4529931 5555163 5048285 5668712 4913293 6019649 7260997 7640312 10125976 12665108
6608A2665108K378923K117680K93335j498945o41918j589524j639050j153496
$$ 12665108 15044031 17161711 17455046 15956101 15314183 13724659 12085609 10932113
6600A0932113j120129j491261o98835q67713j39106J17938j334473P42900k66195
$$ 10932113 9811984 8320723 7621888 6754175 6615069 6733007 5398534 6141434 5875239
6591E875239K54445j11478l11544J8048P3226M97609O09171j13193J730549J562071
$$ 5875239 6129684 6018206 5706662 5724710 5797936 6295545 6904716 6791523 8522072 10084143
6581A0084143K619429K830767J539336M73806k37842r56431j741667j803274j486357
$$ 10084143 12703572 15534339 17073675 17547481 17309639 16353208 14611541 12808267 11321910
6572A1321910j565754j659832j96137j051432L25640j611923L33134J73727K81249
$$ 11321910 9756156 8096324 7900187 6848755 7174395 5562472 5895606 6069333 6350582
6563F350582o75616K28636j81559m956j49023o01867R29020N36605k0280Q36154
$$ 6350582 5674966 5903602 5722043 5717087 5568064 4966197 5895217 6431822 6411542 7247696
6553G247696P03925k7110J268349N01185m77589J5325j229895O37955r09866o14488
$$ 7247696 7951621 7924511 9192860 9694045 9216456 9231781 8001886 8639841 7729975 7115487
6543G115487P8334k69793m80721K25472m29470N22475L7541l97865M08735L09481
$$ 7115487 7193821 6924028 6443307 6668779 6239309 6761784 6799325 6401460 6810195 7119676
6533G119676L2505r40436j42533m5694k94469K59157n53326r1000k90246J42744
$$ 7119676 7152181 6211745 6069212 6023518 5729049 5988206 5434880 5343880 5053634 5196378
6523E196378L64386L6676J18961o83975j26313m7117M88484o10388J187201j043162
$$ 5196378 5560764 5597440 5716401 5032426 4906113 4858996 5347480 4737092 5924293 4881131
6513D881131J209584O16688n89798O98832k50610k17871J07986K06785m61832
$$ 4881131 6090715 6707403 6117605 6816437 6565827 6347956 6455942 6662727 6200895
6504F200895n37609J200392j239808N36919p67264K48684J48262M34372j69471
$$ 6200895 5663286 6863678 5623870 6160789 5393525 5642209 5790471 6224843 6055372
6495F055372p53559L2366J54765J54163q06322O5078O36871l86462m7944N4546
$$ 6055372 5301813 5334179 5488944 5643107 4836785 4901863 5538734 5152272 5104328 5158874
6485E158874o1113K10847Q96436r50831K87011l89047m2419R9924L05095p26723
$$ 5158874 5097761 5308608 6205044 5254213 5541224 5152177 5109758 5209682 5514777 4788054
6475D788054R84875P52674o95725m08192k89630J77911N54812n19931R1101J36330
$$ 4788054 5772929 6525603 5829878 5421686 5132056 5309967 5864779 5344848 5435949 5572279
6465E572279p32450J066978J53377p44920K69527m45280L27925k1062l29323P47953
$$ 5572279 4839829 5906807 6060184 5315264 5584791 5139511 5467436 5446374 5117051 5865004
6455E865004j51214j32500k53083O13264P68343j450454O37571L6467M09205n3651
$$ 5865004 5713790 5581290 5328207 5941471 6709814 5259360 5896931 5933398 6342603 6288952
6445F288952j035085l18664M88421M95598O0443m85274m530J130948j551167Q23840
$$ 6288952 5253867 4935203 5423624 5919222 5979665 5494391 5489861 6620809 5069642 5893482
6435E893482K60209q8610l94662l38105M65464M15825j98980l9277M23704l26530
$$ 5893482 6153691 6065081 5670419 5332314 5797778 6213603 6014623 5975346 6399050 6072520
6425F072520k15855L77102M14442J39715O4953q68379M08707P16706j047400K68321
$$ 6072520 5856665 6233767 6648209 6787924 6852877 5984498 6393205 7109911 6062511 6330832
6415F330832L57062K63459N04086p24542N95573L32014k42064j05336o28156L77646
$$ 6330832 6687894 6951353 7455439 6730897 7326470 7658484 7416420 7311084 6682928 7060574
6405G060574K08665J71088j11258R951o63844M08146K10731O8879J08202L78054
$$ 7060574 7269239 7440327 7329069 7339020 6675176 7083322 7294053 7362932 7471134 7849188
6395G849188k62346K12876j10789N55981l47577O5307L49576J82466K20003q42502
$$ 7849188 7586842 7799718 7688929 8244910 7897333 7962640 8312216 8494682 8714685 7872183
6385G872183M90828L82356l36357K27927J85813m64002R27498q03204P59952n16801
$$ 7872183 8363011 8745367 8409010 8636937 8822750 8358748 9286246 8483042 9242994 8726193
6375H726193O85547p05220m48883J305995j04648n42305Q84796M8234q57481j27088
$$ 8726193 9411740 8706520 8257637 9563632 9458984 8916679 9801475 9849709 8992228 8865140
6365H865140k99457J100328m71687P42435l40977K73305M60873l53068N2176O61352
$$ 8865140 8565683 9666011 9194324 9936759 9595782 9869087 10329960 9976892 10029068 10690420
6355A0690420N78985p256j357291K14962M33291j7976J20758K32938o53635j14445
$$ 10690420 11269405 11262149 9904858 10119820 10553111 10535135 10655893 10888831 10235196 10120751
6345A0120751j151493R18041l86320P51329K18212k25018L67503P0273n79193
$$ 10120751 8969258 9887299 9500979 10252308 10470520 10245502 10613005 10683278 10104085
6336A0104085M86399k18896m66733j9820M23328L11434K96024R8043j09986J73876
$$ 10104085 10590484 10371588 9904855 9885035 10308363 10619797 10915821 11013864 10903878 11077754
6326A1077754K5937J39557J21240K25255m6162k7502K97126o39896N69403r0461
$$ 11077754 11103691 11243248 11364488 11589743 11543581 11516079 11813205 11173309 11742712 11652251
6316A1652251M49430o08685Q18800n39114Q9950N31245j48401J57735N12088r74073
$$ 11652251 12101681 11492996 12311796 11772682 11862632 12393877 12245476 12403211 12915299 11941226
6306A1941226k2650j1846M43170M22076o12249P69498N26133j044997O42641j75093
$$ 11941226 11918576 11906730 12349900 12771976 12159727 12929225 13455358 12410361 13053002 12877909
$$ [...]
##END NTUPLES=NMR SPECTRUM
##END=
