##TITLE=abcd
##JCAMPDX= 6.0         $$ Bruker NMR JCAMP-DX V2.0
##DATA TYPE= NMR SPECTRUM
##DATA CLASS= NTUPLES
##ORIGIN= UXNMR, Bruker Analytische Messtechnik GmbH
##OWNER= root
$$ XWIN-NMR		Version 3.5
$$ Fri Jul 17 16:00:04 2026 Russian Standard Time (UT+4h)  servis@DPX200
##.OBSERVE FREQUENCY= 200.131235884673
##.OBSERVE NUCLEUS= ^1H
##.ACQUISITION MODE= SIMULTANEOUS
##.ACQUISITION SCHEME= undefined
##.AVERAGES= 32
##.DIGITISER RES= 18
##SPECTROMETER/DATA SYSTEM= spect
##.PULSE SEQUENCE= zg
##.SOLVENT NAME= CDCl3
##.SHIFT REFERENCE= (INTERNAL, CDCl3, 0, 16.4885)
##AUDIT TRAIL= $$ (NUMBER, WHEN, WHO, WHERE, WHAT)
$$ ##TITLE= Audit trail, XWIN-NMR		Version 3.5
$$ ##JCAMPDX= 5.01
$$ ##ORIGIN= Bruker BioSpin GmbH
$$ ##OWNER= servis
$$ F:\spectra/data/av/nmr/H1/1/pdata/1/auditp.txt
$$ ##AUDIT TRAIL=  $$ (NUMBER, WHEN, WHO, WHERE, WHAT)
(   1,<2026-07-17 15:59:13.51 +0400>,<servis>,<DPX200>,
      <created by zg, POWCHK disabled, PULCHK disabled
       configuration hash MD5:
       00 E9 B6 7A A2 85 ED C7 34 08 36 98 17 FE 4E 26
       data hash MD5: 32K
       E0 7C 38 68 47 95 86 BB CF 22 2F D5 6E E3 80 92>)
(   2,<2026-07-17 15:59:35.93 +0400>,<servis>,<DPX200>,
      <Start of raw data processing
       efp BC_mod = 2 LB = 0.05 FT_mod = 6 PKNL = 1 PHC0 = -414.59 PHC1 = 3.101563 SI = 16K 
       data hash MD5: 16K
       59 42 41 E9 12 74 C9 13 3D 7F E3 20 98 72 CC CD>)
$$ ##END=
$$ 
$$ hash MD5
$$ C0 28 CB D0 0A 3E 14 2E 72 19 03 D7 EE 6C 50 5C
##$RELAX= 
##$RELAX= 
##$RELAX= 
##$RELAX= 
##$RELAX= 
##$RELAX= 
##$RELAX= 
##$RELAX= 
$$ Bruker specific parameters
$$ --------------------------
##$DU= <F:\spectra>
##$EXPNO= 1
##$NAME= <H1>
##$PROCNO= 1
##$TYPE= <nmr>
##$USER= <av>
##$AMP= (0..31)
100 100 100 100 100 100 100 100 100 100 100 100 100 100 100 100 100 100 
100 100 100 100 100 100 100 100 100 100 100 100 100 100 
##$AQSEQ= 0
##$AQ_mod= 1
##$AUNM= <au_zg>
##$AUTOPOS= <>
##$BF1= 200.13
##$BF2= 200.13
##$BF3= 200.13
##$BF4= 200.13
##$BF5= 500.13
##$BF6= 500.13
##$BF7= 500.13
##$BF8= 500.13
##$BYTORDA= 1
##$CFDGTYP= 0
##$CFRGTYP= 5
##$CHEMSTR= <none>
##$CNST= (0..31)
1 1 145 1 1 1 1 1 1 1 1 1 1 1 1 1 1 1 1 1 1 1 1 1 1 1 1 1 1 1 1 1 
##$CPDPRG= <>
##$CPDPRG1= <>
##$CPDPRG2= <>
##$CPDPRG3= <>
##$CPDPRG4= <mlev>
##$CPDPRG5= <mlev>
##$CPDPRG6= <mlev>
##$CPDPRG7= <mlev>
##$CPDPRG8= <mlev>
##$CPDPRGB= <>
##$CPDPRGT= <>
##$D= (0..31)
0 2 0 0 0 0 0 0 0 0.06 0 0 0 0 0 0 0.0002 0 0 0 0 0 0 0 0 0 0 0 0 0 0 
0 
##$DATE= 1784289553
##$DBL= (0..7)
120 120 120 120 120 120 120 120 
##$DBP= (0..7)
150 150 150 150 150 150 150 150 
##$DBP07= 0
##$DBPNAM0= <>
##$DBPNAM1= <>
##$DBPNAM2= <>
##$DBPNAM3= <>
##$DBPNAM4= <>
##$DBPNAM5= <>
##$DBPNAM6= <>
##$DBPNAM7= <>
##$DBPOAL= (0..7)
0.5 0.5 0.5 0.5 0.5 0.5 0.5 0.5 
##$DBPOFFS= (0..7)
0 0 0 0 0 0 0 0 
##$DE= 6
##$DECBNUC= <off>
##$DECIM= 32
##$DECNUC= <off>
##$DECSTAT= 4
##$DIGMOD= 1
##$DIGTYP= 9
##$DL= (0..7)
0 120 120 120 120 120 120 120 
##$DP= (0..7)
150 150 150 150 150 150 150 150 
##$DP07= 0
##$DPNAME0= <>
$$ [...]
##$SUBNAM4= <"">
##$SUBNAM5= <"">
##$SUBNAM6= <"">
##$SUBNAM7= <"">
##$SUBNAM8= <"">
##$SUBNAM9= <"">
##$SW= 20.6817932712277
##$SWIBOX= (0..15)
0 0 3 0 0 0 0 0 0 0 0 0 0 0 0 0 
##$SW_h= 4139.07284768212
##$TD= 32768
##$TD0= 1
##$TE= 0
##$TE2= 300
##$TE3= 300
##$TEG= 300
##$TL= (0..7)
0 120 120 120 120 120 120 120 
##$TP= (0..7)
150 150 150 150 150 150 150 150 
##$TP07= 0
##$TPNAME0= <>
##$TPNAME1= <>
##$TPNAME2= <>
##$TPNAME3= <>
##$TPNAME4= <>
##$TPNAME5= <>
##$TPNAME6= <>
##$TPNAME7= <>
##$TPOAL= (0..7)
0.5 0.5 0.5 0.5 0.5 0.5 0.5 0.5 
##$TPOFFS= (0..7)
0 0 0 0 0 0 0 0 
##$TUNHIN= 0
##$TUNHOUT= 0
##$TUNXOUT= 0
##$USERA1= <user>
##$USERA2= <user>
##$USERA3= <user>
##$USERA4= <user>
##$USERA5= <user>
##$V9= 5
##$VALIST= <valist>
##$VCLIST= <CCCCCCCCCCCCCCC>
##$VD= 0
##$VDLIST= <DDDDDDDDDDDDDDD>
##$VPLIST= <PPPPPPPPPPPPPPP>
##$VTLIST= <TTTTTTTTTTTTTTT>
##$WBST= 1024
##$WBSW= 30
##$XGAIN= (0..3)
0 0 0 0 
##$XL= 0
##$YL= 0
##$YMAX_a= 808427
##$YMIN_a= -1458420
##$ZGOPTNS= <>
##$ZL1= 120
##$ZL2= 120
##$ZL3= 120
##$ZL4= 120
##$ABSF1= 0
##$ABSF2= 0
##$ABSG= 0
##$ABSL= 0
##$ALPHA= 0
##$AQORDER= 0
##$ASSFAC= 0
##$ASSFACI= 0
##$ASSFACX= 0
##$ASSWID= 0
##$AUNMP= <proc_1d>
##$AZFE= 0.1
##$AZFW= 0.1
##$BCFW= 0
##$BC_mod= 2
##$BYTORDP= 0
##$COROFFS= 0
##$CY= 18.4799938201904
##$DATMOD= 1
##$DC= 0
##$DFILT= <>
##$DTYPP= 0
##$F1P= 9.9274215381318
##$F2P= -0.165520771350173
##$FCOR= 1
##$FTSIZE= 16384
##$FT_mod= 6
##$GAMMA= 0
##$GB= 0
##$INTBC= 1
##$INTSCL= 4.127829e-11
##$ISEN= 128
##$LB= 0.05
##$LEV0= 0
##$LPBIN= 0
##$MAXI= 10000
##$MC2= 0
##$MEAN= 0
##$ME_mod= 0
##$MI= 50
##$NCOEF= 0
##$NC_proc= -5
##$NLEV= 6
##$NOISF1= 3.799351
##$NOISF2= 2.8
##$NSP= 0
##$NTH_PI= 0
##$NZP= 0
##$OFFSET= 16.48848
##$PC= 4
##$PHC0= -414.59
##$PHC1= 3.101563
##$PH_mod= 1
##$PKNL= yes
##$PPARMOD= 0
##$PSCAL= 4
##$PSIGN= 0
##$REVERSE= no
##$SF= 200.130005582386
##$SI= 16384
##$SIGF1= 3
##$SIGF2= 2
##$SINO= 400
##$SIOLD= 16384
##$SREGLST= <1H.CDCl3>
##$SSB= 0
##$STSI= 16384
##$STSR= 0
##$SW_p= 4139.07284768211
##$SYMM= 0
##$S_DEV= 0
##$TDeff= 32768
##$TDoff= 0
##$TI= <>
##$TILT= no
##$TM1= 0
##$TM2= 0
##$TOPLEV= 0
##$USERP1= <user>
##$USERP2= <user>
##$USERP3= <user>
##$USERP4= <user>
##$USERP5= <user>
##$WDW= 1
##$XDIM= 16384
##$YMAX_p= 388721848
##$YMIN_p= -1095245
$$ End of Bruker specific parameters
$$ ---------------------------------
##NTUPLES= NMR SPECTRUM
##VAR_NAME=  FREQUENCY,     SPECTRUM/REAL,   SPECTRUM/IMAG
##SYMBOL=    X,             R,               I
##VAR_TYPE=  INDEPENDENT,   DEPENDENT,       DEPENDENT
##VAR_FORM=  AFFN,          ASDF,            ASDF
##VAR_DIM=   16384,         16384,           16384
##UNITS=     HZ,            ARBITRARY UNITS, ARBITRARY UNITS
##FACTOR=    0.252644378177508, 1,           1
##FIRST=     3299.83951724647, 0,            0
##LAST=      -839.233330435636, 0,           0
##MIN=       -839.233330435636, -1095245,    0
##MAX=       3299.83951724647, 388721848,    0
$$ Real data points
##PAGE= N=1
##DATA TABLE= (X++(R..R)), XYDATA
$$ [...]
9894 687439 701174 725262 680393 702414 779986 650400 719387 845037 890322 768352 861762
9883 861762 890952 814599 829871 787689 820431 630265 687521 714086 850612 812368 883114
9872 883114 969903 960745 1010508 879621 978589 1004441 994841 909406 1077724 1048296 1198781
9861 1198781 1139094 1285576 1352608 1469174 1789590 2157936 2487784 2763986 3327986 3470269
9851 3470269 3655402 3838016 3950377 3884437 3793828 3643380 3616978 3335322 3093028 3081045
9841 3081045 2901734 2944454 3120329 3156505 3212504 3213709 3364237 3304463 3206149 3109736 3075260
9830 3075260 2961891 3071621 3052469 2968383 2981078 3100483 3128549 3168223 3076498 3310753 3344016
9819 3344016 3664185 3779201 4021983 4015651 4121175 4253266 4096615 4205423 4081992 3991707
9809 3991707 3760337 3759290 3639076 3846423 3968157 4132639 4246307 4285675 4379998 4450573
9799 4450573 4588658 4550446 4427784 4125309 3910298 3581556 3276656 2951734 2732574 2541697
9789 2541697 2339476 2223366 2108017 1925357 1867502 1692773 1824523 1795064 1761783 1783916
9779 1783916 1772212 1829635 1921616 2065647 2047578 2125913 2129007 2192926 2239644 2410302 2294038
9768 2294038 2372253 2612698 2689861 2963515 2921760 2670209 2558769 2442247 2258417 1929683
9758 1929683 1757875 1575538 1516960 1470566 1451023 1519942 1437935 1358358 1394564 1538885 1515392
9747 1515392 1392070 1491648 1400893 1330723 1480726 1399216 1432143 1395025 1293143 1213973 1365021
9736 1365021 1184522 1271099 1052488 955920 999093 992053 1059981 930757 868126 782598 659355
9725 659355 857269 696659 816626 753502 736900 874633 940783 924642 1119891 988708
9715 988708 1062399 1038060 1064773 1123286 1033827 969564 1077189 976985 1119967 986770 834167
9704 834167 881601 733903 691964 757258 753123 681101 671225 676948 589139 511226 521344 437991
9692 437991 404729 452001 406666 489976 474079 289136 333069 394372 488299 403803 500995
9681 500995 403477 463484 473803 537411 363999 377508 458549 519133 455673 426508 529266
9670 529266 379368 337689 326416 368282 252317 242317 250843 235695 260971 151523 167482
9659 167482 190310 163919 217776 153756 107704 180950 122961 218885 162891 255755 246744 185006
9647 185006 253349 233282 263764 300126 289892 163536 132771 182546 102447 170955 162887 141539
9635 141539 123173 128192 71834 164598 32054 94380 181490 96121 188225 122078 114212 112052
9623 112052 193307 209869 237592 246270 153272 253600 231191 167051 208275 217599 70522 187891
9611 187891 65360 64951 6196 107247 46470 46341 97359 129244 -5362 123481 60170 168030
9599 168030 132949 55461 165435 100326 173061 112131 233090 156284 326215 199876 308472
9588 308472 255887 303210 325528 324239 348851 213812 325077 412104 386995 365131 242633
9577 242633 453172 352128 504535 389990 558173 522770 657753 741301 955878 1098153
9567 1098153 1311977 1608636 1683928 1704259 2099675 2063218 2122283 2175132 2147855 2087153 1888811
9556 1888811 1779594 1707827 1512344 1427003 1147068 1114711 948604 812814 782151 686471
9546 686471 678447 757281 796056 935975 972564 909977 970864 1238601 1414784 1751457 1997510
9535 1997510 2422122 2537952 2585040 2580444 2483479 2636101 2646922 2560883 2367711 2284736 1920054
9524 1920054 1717606 1387466 1241125 865653 813886 629159 723192 640161 588947 545791
9514 545791 493055 522364 462205 410181 292817 222767 308140 282103 323076 294745 239412
9503 239412 402139 294062 484309 476824 479705 609883 697580 624515 676043 570905 598794
9492 598794 596933 517464 542340 538857 416005 356379 468534 381650 429755 384205 393180 404331
9480 404331 535566 596104 560091 615079 614856 555620 586401 729342 750881 868881 786678
9469 786678 839047 908638 994452 1022410 1056551 1020609 1088571 1140826 1201753 1103656 1084733 1017233
9457 1017233 1120846 1057482 1014125 1084831 965739 1050922 1044518 1090163 1041142 1289654 1285129
9446 1285129 1328382 1372105 1311755 1418887 1502217 1643953 1782249 1859160 1915959 2138791 2207063
9435 2207063 2400440 2549383 2529082 2764535 2756406 2823905 2889319 2890438 2816838 2852839 2757941
9424 2757941 2639691 2640324 2626199 2624617 2692629 2703018 2723937 2724199 2651940 2682131 2549320 2409285
9412 2409285 2422768 2367219 2487787 2448652 2635989 2662518 2938862 3142518 3293849 3476251
9402 3476251 3572675 3672436 3604191 3744238 3537353 3738430 3669352 3724542 3599364 3388664
9392 3388664 3401958 3278041 3217740 3051667 2953520 2767818 2620213 2402796 2221007 2210752
9382 2210752 2018354 1908741 1796277 1754747 1581456 1714511 1778904 1610226 1629172 1704499
9372 1704499 1663097 1639600 1704504 1623911 1611582 1710656 1876289 2029519 2131084 2459219 2558470
9361 2558470 2464233 2524267 2466071 2254160 2187043 2078464 1972892 2044200 2187628 2216581 2396011
9350 2396011 2468749 2473809 2740721 2632452 2678921 2686875 2675246 2648746 2674677 2712312 2845156
9339 2845156 2795666 2748545 2704166 2831757 2822302 3142624 3017320 2972978 2953177 2940701 2985806
9328 2985806 3138647 3098768 3111050 3053355 3178325 3304835 3647123 3851673 4314836 4536740
9318 4536740 4807901 4792052 4750174 4601871 4264917 4143893 3967357 3856392 3674000 3645092
9308 3645092 3654815 3852062 4042768 4437248 4692577 5090859 5373970 5632656 5709186 5742538
9298 5742538 5891131 6018644 6263180 6467815 6974614 7145131 7336636 7698463 7791467 8046438
9288 8046438 8096793 8297863 8450285 8454661 8287194 8309987 7975880 8051449 8071849 8113932 8149714
9277 8149714 8281024 8344410 8574650 8865961 8938236 9267487 9262507 9355630 9433725 9331797 9447508
9266 9447508 9651254 9752956 9796089 10112074 10344205 10571245 10834127 10940915 10866531 10848197
9256 10848197 10721689 10469108 10577017 10234504 10213490 10220813 10290348 10355042 10679548 10603079
9246 10603079 10565179 10616552 10438218 10308023 10295233 10237290 10245820 10141154 10041068 9750056
9236 9750056 9501243 9123930 8919475 8489953 8260151 8070331 7794837 7620719 7742412 7790964
9226 7790964 7783930 7987359 7960128 8233589 8396539 8656936 8801620 8895412 8932121 9043101
9216 9043101 8902826 9075179 9151834 9184430 9414982 9504855 9555787 9661392 9737061 9803190 9831705
9205 9831705 9936015 10140681 10364090 10692765 11121375 11742228 12423439 13368263 14536882
9196 14536882 15873934 17059268 17907197 18544704 18942988 18964566 18965039 19193977 19895107 21410030
9186 21410030 23363713 25858865 27499204 28154065 28013212 27809206 27012325 26265391 25938675
9177 25938675 26262820 27093328 28685705 30638222 33129296 35649506 37452376 38499832
9169 38499832 38891648 39255577 39500483 40124489 42116103 45514722 49784304 53982403 56828867
9160 56828867 59471026 61130135 62968481 65472868 69884763 76163929 83420655 89528401
9152 89528401 93821786 95958955 97607908 98337751 98295658 97055719 95733499 94664016 94488685
9143 94488685 95964658 99669361 106304221 117077798 131823915 149819834 169500274 190908192
9135 190908192 215698169 239585624 258091371 267159324 266599033 260032373 250092520 238588505
9127 238588505 227782751 220676833 219603829 222089850 225631568 230089614 238048107 248309500
9119 248309500 259081402 269077958 276591603 281324646 283053321 282061762 276363382 264305014
9111 264305014 248275811 230891526 212904123 195445485 180488577 168615109 158940314
9104 158940314 149802202 142283444 136426452 131950590 127702827 123165646 118643350 114083342
9096 114083342 110569131 108290710 107870756 108956348 111227143 113785290 116490793 120367092
9088 120367092 125335102 130670498 133628280 130754266 127974350 123465798 116476671 108227656
9080 108227656 100033311 92336494 84998924 78389329 73133580 68465095 64673380 61008684
9072 61008684 57808304 54802522 52324756 50264319 48377622 46635617 45067884 43332369
9064 43332369 41682682 40192373 38855840 37757190 36681394 35858382 34892551 33817184
9056 33817184 33041387 31863137 31038716 30211359 29325725 28741208 28186676 27604892 27130020
9047 27130020 26824096 26418469 25884797 25223584 24544561 23755782 22982185 22435348 22050717
9038 22050717 21589118 20875527 20496478 19688793 19314152 18771029 18107247 17511676 16864645
9029 16864645 16374246 15889362 15418245 14937608 14476072 13910007 13530172 13028075 12692119
9020 12692119 12177685 11970800 11502449 11197032 11105035 10836732 10608857 10388721 10148569 10029109
9010 10029109 9758228 9623120 9388277 9347701 8988387 8865972 8752346 8639649 8394302 8196004
9000 8196004 8105894 7843857 7853850 7753037 7497214 7121436 6913004 6756983 6669942 6493763
8990 6493763 6359798 6229762 6067125 6001647 5930956 5796191 5557483 5418881 5406269 5234818
8980 5234818 5205534 5052839 4917230 4799004 4794305 4726306 4533482 4487464 4398065 4187621 4228505
8969 4228505 4211153 4217857 4141528 4051456 3898278 3947332 3789487 3708424 3562275 3644266 3482279
8958 3482279 3511303 3457558 3500959 3302774 3105758 3341812 3229107 3173454 3050222 3040241 2845751
8947 2845751 2887928 2886043 2913993 2754503 2784953 2710925 2711138 2742978 2670048 2498543 2443363 2460051
8935 2460051 2357207 2287874 2332013 2268447 2214131 2107054 2123152 2197557 2096463 1789519 2041167
8924 2041167 1962152 2002792 1896709 1886063 1779746 1760005 1825458 1925209 1789449 1560700 1574400
8913 1574400 1592226 1417838 1538789 1434742 1463526 1355172 1476562 1490402 1305757 1313898
8903 1313898 1354712 1174388 1104843 1309266 1190721 1225950 1142382 1120438 1123869 959548 1048093
8892 1048093 927184 972517 964197 929814 1034177 861086 893543 854504 866273 835459 905945
8881 905945 1006246 772755 680128 756869 854248 759847 815277 732429 636680 665392 865287
8870 865287 840307 598174 658499 748570 753565 821938 886407 810405 888781 795280 841747 803137
8858 803137 758140 802062 893961 807545 791263 789406 843013 881512 782921 739054 896542 796367
8846 796367 927998 886051 894416 854980 977113 920636 910607 1025466 1011461 964233 962417
8835 962417 1050263 906106 952560 871889 983733 887810 900005 1000208 946747 858624 1003365
8824 1003365 1018737 1006012 1076452 1021825 954911 968648 956254 970980 978546 971455 1226326 1136631
8812 1136631 1131976 1240144 1165514 1131757 1177975 1276561 1250617 1222873 1311906 1196106 1152064
8801 1152064 1165908 1244781 1188673 1104318 1087479 1003373 1030597 1072415 903000 939998 949693
8790 949693 981887 1110918 1109567 1048473 1000840 974460 944977 1018449 985984 846347 907230
8779 907230 828340 1003232 905184 808598 915428 775281 774914 762890 720398 820708 697220
8768 697220 628167 593686 568208 497591 583357 440505 492342 523889 464432 408407 434727
8757 434727 437992 457238 325354 477490 414863 319689 219382 236738 270798 193988 279531
8746 279531 191500 75047 100750 124360 114560 108032 160300 219900 175966 230234 251088 182230
8734 182230 126688 102117 192011 60587 74353 90522 45537 62953 1312 -23592 57032
8723 57032 23211 84484 58401 54681 84329 15613 24212 2334 3812 40124 -108233 61566
8711 61566 -53366 -45192 -124120 -20538 -10655 109328 -137072 -155972 71964 -26226 -4502
8700 -4502 -133443 -3119 -136653 -30366 112362 -97545 25044 -115044 -31412 -129686
8690 -129686 -52981 3120 -107618 -107802 -58772 -36377 -44069 -109801 -171305 -104512 -151268 -8552
8678 -8552 -83687 -150283 -157607 -78446 -139593 -125867 -101663 -30029 -84508 -38177 -12431 -64434
8666 -64434 34991 -35914 -96430 -194778 -75862 -87488 -154004 -150643 -203217 -184886 -203015 -105898
8654 -105898 -209878 -98329 -234337 -204732 -144951 -148586 -219766 -140381 -103898 -150713 -165080
8643 -165080 -160980 -142246 -292605 -200421 -261644 -95992 -227941 -209176 -162239 -258968 -191160
8632 -191160 -155987 -242770 -242714 -136034 -167495 -186765 -141408 -94057 -72977 -182296 -234963 -304344
8620 -304344 -260496 -167928 -270315 -219779 -241421 -152030 -269410 -254734 -244051 -164946 -181894
8609 -181894 -125457 -175193 -300206 -183830 -223997 -257825 -195321 -184463 -298997 -130295 -243339
8598 -243339 -269150 -292556 -151625 -256041 -139716 -150290 -300398 -127734 -271504 -239824
8588 -239824 -202365 -38648 -164709 -220439 -320825 -199376 -171520 -265808 -271967 -283446 -295886
8577 -295886 -276170 -242934 -261903 -243478 -308057 -193034 -320056 -215295 -241743 -250071 -308767
8566 -308767 -285849 -290228 -299887 -390625 -379657 -221713 -272004 -317036 -224053 -308339 -278594 -298378
8554 -298378 -195051 -217042 -271576 -291227 -127526 -286857 -303249 -327349 -251331 -326617 -393207
8543 -393207 -273753 -240626 -356164 -418428 -292424 -625159 75723 -116200 -189120 -145733
8533 -145733 -258953 -175879 -292159 -293007 -312886 -351324 -330271 -239004 -279094 -255755 -334430 -241378
8521 -241378 -241532 -248173 -261822 -312893 -227708 -253441 -256047 -186816 -236992 -302929 -215915 -335571
8509 -335571 -422106 -310335 -337336 -376468 -421772 -317642 -304821 -236302 -244481 -291876 -305495
8498 -305495 -315602 -221497 -282112 -322450 -358056 -358755 -318291 -375723 -334648 -333976 -295078 -349202
8486 -349202 -379780 -411550 -399561 -387016 -367704 -442644 -343632 -309172 -375391 -325265 -259644 -327753
8474 -327753 -256563 -317413 -347550 -396987 -337846 -295822 -261621 -123259 -362839 -289895 -329598
8463 -329598 -260480 -342572 -325664 -351792 -318071 -321320 -249635 -232787 -252713 -349281 -315812 -347251
8451 -347251 -294283 -273144 -349138 -284878 -383357 -359813 -285406 -259114 -346953 -338920 -310753 -330822
8439 -330822 -360323 -243143 -369935 -339648 -358576 -439858 -392631 -313305 -316205 -372485 -391216
8428 -391216 -416407 -339559 -437330 -346797 -415979 -270443 -328833 -210171 -320668 -510482 -405839
8417 -405839 -273084 -261235 -196472 -273348 -285687 -258348 -247344 -222360 -238671 -358303 -354563
8406 -354563 -362535 -347682 -247439 -400041 -166998 -300833 -358253 -260963 -195714 -278991 -419193
8395 -419193 -295767 -436650 -294431 -348672 -289843 -269692 -359448 -320938 -269320 -303033 -300809
8384 -300809 -351902 -397610 -395439 -372707 -382068 -279590 -395633 -350022 -376133 -310412 -317487 -460775
8372 -460775 -406210 -396847 -445902 -411262 -363208 -461866 -444138 -417434 -377700 -374440 -390618 -375233
8360 -375233 -375698 -347785 -270557 -308412 -314394 -358774 -369891 -291213 -338805 -341912 -297738 -384911
8348 -384911 -383566 -286564 -391844 -429943 -447631 -367259 -239583 -212935 -410299 -442558 -320254
8337 -320254 -411818 -333768 -239941 -470890 -441137 -425923 -464145 -309808 -395290 -292957 -420313
8326 -420313 -197501 -249393 -197533 -237920 -250980 -351134 -388430 -373147 -354072 -242637 -321832
8315 -321832 -383437 -345481 -310533 -322791 -180322 -276826 -220938 -282180 -224263 -216754 -204963 -191913
8303 -191913 -158768 -157036 -86368 -42261 -88637 -216587 -152569 -198111 13971 -110225 -121681
8292 -121681 -162531 -170992 -195975 -119281 -172303 -225770 -315421 -203773 -266312 -221112 -321525
8281 -321525 -333299 -459108 -357624 -296998 -334723 -393514 -324160 -272108 -199742 -226945 -333470
8270 -333470 -328292 -365665 -342570 -263762 -305896 -371097 -338929 -399027 -480522 -410532 -390329 -322128
8258 -322128 -546748 -421704 -383457 -411292 -240158 -195830 -351037 -426312 -389756 -270200 -333551
8247 -333551 -212951 -302445 -348952 -442483 -391616 -359880 -273073 -417285 -401213 -308565 -348881
8236 -348881 -391778 -406830 -373579 -438504 -419535 -454881 -421055 -412928 -426468 -368014 -361319 -388397
8224 -388397 -446517 -370561 -484091 -249923 -344053 -347084 -370126 -335961 -437987 -452215 -472615
8213 -472615 -392698 -271643 -443320 -322092 -489243 -330991 -352208 -364898 -434357 -572778
8203 -572778 -494660 -471945 -246529 -382267 -534505 -414545 -457210 -302524 -164031 -325969
8193 -325969 -93415 -626774 -289698 -594187 -569441 -450861 -485186 -447865 -427680 -461901 -352801
8182 -352801 -451220 -445940 -446278 -513800 -445613 -430577 -362100 -537928 -419127 -427427 -417251 -435604
8170 -435604 -425555 -471531 -476400 -407258 -426892 -482419 -438258 -391367 -466572 -466655 -417422 -378307
8158 -378307 -518413 -517312 -411199 -396977 -438659 -403481 -328507 -440337 -397880 -451271 -293836
8147 -293836 -402745 -405092 -493232 -394063 -384092 -393621 -359281 -409665 -411377 -357497 -393506 -414911
8135 -414911 -426218 -401398 -351993 -495007 -398249 -261252 -488013 -489756 -341938 -355957 -406877
8124 -406877 -165682 -455607 -496039 -374729 -393565 -410154 -466165 -515158 -481924 -522891 -436817
8113 -436817 -346190 -405424 -421455 -408111 -389270 -403249 -305590 -505461 -512727 -538106 -413986
8102 -413986 -286492 -581311 -574800 -498934 -516326 -507943 -454133 -408445 -372199 -448481 -516182 -311279
8090 -311279 -376581 -496913 -440446 -443411 -482934 -383010 -371800 -466043 -412554 -390290 -468730 -411929
8078 -411929 -370578 -400907 -492372 -495277 -446030 -390398 -442373 -380260 -418713 -483251 -445697 -443496
8066 -443496 -411714 -416689 -391069 -441538 -343863 -377639 -409212 -433932 -458225 -386507 -268983 -422080
8054 -422080 -433499 -349316 -370786 -505406 -496265 -512417 -507144 -460489 -531933 -543532 -400329 -348652
8042 -348652 -433671 -499003 -492358 -431075 -347536 -334736 -416086 -471455 -406633 -457895 -401077 -461901
8030 -461901 -456396 -482258 -484690 -369094 -552810 -446844 -513778 -613005 -478903 -422153 -446502
8019 -446502 -328031 -518442 -421573 -395064 -521764 -393893 -498882 -460006 -529387 -419180
8009 -419180 -431279 -473602 -365845 -357424 -313568 -445082 -390612 -387612 -408054 -517627 -468639
7998 -468639 -492487 -424750 -536722 -457329 -435077 -471862 -368561 -434122 -422952 -473878 -292680
7987 -292680 -430092 -374741 -387451 -448221 -526377 -450467 -370463 -483155 -414924 -400420 -349858
7976 -349858 -387016 -386696 -407212 -542906 -502352 -422022 -337734 -404134 -378339 -403791 -484650 -381661
7964 -381661 -403983 -481892 -528270 -474790 -365341 -410763 -332066 -367595 -378751 -393548 -393881 -489654
7952 -489654 -396105 -383940 -426471 -501175 -468418 -503579 -475359 -526749 -511785 -467705 -408627 -417346
7940 -417346 -372724 -390388 -424676 -383861 -321826 -449258 -324782 -314998 -350365 -489257 -366167
7929 -366167 -395136 -412504 -483838 -419215 -550622 -501187 -437389 -287752 -461964 -489320 -441477
7918 -441477 -362583 -442319 -461764 -312209 -400022 -490803 -481618 -402370 -556986 -298018 -302269
7907 -302269 -276520 -371747 -419361 -386313 -405987 -381774 -327098 -328204 -478629 -306222 -359199
7896 -359199 -374997 -508497 -389422 -443254 -479064 -464052 -508677 -503905 -499795 -443136 -368850 -442441
7884 -442441 -417453 -362665 -423486 -418073 -411054 -384953 -403712 -493668 -429216 -482820 -399274 -428435
7872 -428435 -379772 -439673 -407411 -340214 -430828 -414580 -352942 -452919 -470941 -443945 -438454 -464989
7860 -464989 -467677 -519864 -447932 -502434 -414363 -320819 -414371 -466078 -401739 -508454 -405797
7849 -405797 -548717 -669255 907750 148924 -324758 -298957 -336892 -461684 -423554 -397669
7839 -397669 -450146 -432206 -321565 -370683 -340992 -407239 -402690 -358739 -390111 -301237 -360620 -467993
7827 -467993 -307860 -268130 -300674 -395964 -429691 -387125 -375907 -418111 -365639 -360748 -387405 -358043
7815 -358043 -401365 -376974 -366729 -358485 -459366 -374617 -330805 -375005 -463996 -479588 -304138
7804 -304138 -396911 -196402 -306227 -245093 -298200 -321764 -424203 -204316 -282748 -255803 -251377
7793 -251377 -237756 -328385 -116598 -199417 -262116 -415880 -331469 -349554 -388830 -311682 -332967
7782 -332967 -270753 -190058 -225308 -239113 -247228 -165686 -170541 -239717 -204604 -140301 -133002 -299381
7770 -299381 -136522 -119606 -122344 -88624 -189113 -222292 -331086 -188308 -117039 -205846 -298373
7759 -298373 -198292 -168996 -179169 -172854 -135847 -179673 -181599 -207761 -180748 -163624 -243805 -246235
7747 -246235 -253438 -336882 -186073 -140331 -242242 -224317 -106839 -75549 -165713 -150470 -245791
7736 -245791 -174520 -270731 -201019 -219360 -165684 -268183 -237679 -378471 -202903 -220805 -261888
7725 -261888 -218713 -168120 -199980 -136145 -186085 4975 -203370 -129208 -148660 -201801 -100710
7714 -100710 -154949 -81233 -225353 -107285 -81411 -153946 -172795 -69951 -198868 -25396 -95637
7703 -95637 -43474 -248088 -172189 -113316 -65142 -8796 -102506 -195854 -118441 -93538 -6048 25258
7691 25258 -7238 -98854 25618 -41534 -54726 -95905 -135279 -88692 -162522 -117249 -168017 -241923
7679 -241923 -217254 -289269 -274821 -192692 -214597 -174754 -285696 -232281 -253749 -221570 -247325
7668 -247325 -321945 -312214 -196836 -272823 -251141 -233618 -238483 -286442 -254574 -99421 -158443 -326995
7656 -326995 -370889 -222438 -339942 -306497 -207884 -321279 -320888 -190543 -313866 -297733 -293707
7645 -293707 -167669 -273231 -389775 -368941 -290799 -376506 -409697 -371426 -418366 -399721 -418245
7634 -418245 -299850 -332881 -397828 -306161 -300059 -301011 -435212 -337330 -422197 -360055 -355221 -393175
7622 -393175 -377112 -326692 -254715 -325759 -271898 -234229 -307313 -378293 -279134 -333146 -327236 -387434
7610 -387434 -440911 -339263 -369386 -217003 -189713 -131125 -99722 -166688 -275626 -241632 -162326
7599 -162326 -238332 -340136 -274175 -183534 -208977 -383144 -332460 -284808 -359574 -360090 -163072
7588 -163072 -386570 -298135 -255132 -294128 -293217 -357128 -386270 -371146 -285608 -368077 -382882 -442414
7576 -442414 -305476 -337422 -335584 -172489 -232891 -207858 -156209 14338 -47081 -16250 63719
7565 63719 53956 -76696 -59675 -56022 36890 -148001 -115463 -238071 -184519 -205470 -134642 -71832
7553 -71832 -270817 -285879 -133105 -272605 -242181 -196824 -223510 -147034 -122382 -195651 -99697
7542 -99697 -200782 -142893 -201707 -191237 -119798 -81017 -184184 -165518 71928 90659 -64876
7531 -64876 11212 8764 -13530 12273 53375 -55094 -140470 -178326 -98308 -117644 -238071 -164565
7519 -164565 -263845 -272774 -237490 -191825 -381022 -299496 -248585 -256956 -239239 -319112 -315488 -371148
7507 -371148 -371588 -318339 -454384 -265885 -213893 -234420 -186501 -300912 -369559 -187333 -273713
7496 -273713 -368030 -421914 -443517 -352281 -338142 -395948 -401492 -274804 -275212 -212842 -222988 -335251
7484 -335251 -250407 -405592 -358938 -415137 -461329 -474915 -363207 -272050 -327550 -385165 -335812
7473 -335812 -491000 -361830 -287993 -494986 -452322 -320145 -359427 -368417 -415424 -361332 -425974
7462 -425974 -477962 -284555 -420875 -500242 -499929 -372700 -379413 -355798 -325726 -250052 -290914 -259114
7450 -259114 -357596 -396298 -382690 -344347 -320211 -363945 -338957 -286472 -310606 -278740 -295514 -352176
7438 -352176 -280398 -242711 -252759 -329074 -141033 -213875 -408872 -298157 -332931 -215960 -361114
7427 -361114 -287634 -421193 -422684 -333913 -343197 -424667 -430727 -415775 -242469 -290349 -377469 -356240
7415 -356240 -328402 -329491 -81131 -277379 -350007 -275127 -255360 -275432 -246799 -170414 -244935
7404 -244935 -230045 -188491 -158694 -222732 -174436 -190634 -274625 -314054 -274401 -246476 -274818 -189464
7392 -189464 -160894 -261060 -235415 -297051 -272670 -298405 -259345 -275526 -73906 -268003 -304404
7381 -304404 -152146 -210368 -240741 -150302 -105988 -223562 -190348 -54705 -109721 -161596 -71548
7370 -71548 40110 36102 225554 171883 253848 118127 392575 375217 342456 306165 210960
7359 210960 272770 135290 111492 67658 103467 -28208 23248 81352 9980 -84513 -191862
7348 -191862 -136251 -221721 18955 2746 -83231 -44562 -87384 -70460 54211 -169832 -106815
7337 -106815 -130312 -169884 41122 19428 69165 -85503 -116292 1094 -6742 118485 -23835
7326 -23835 46862 29754 41788 98498 189423 62256 89655 281476 309202 363296 423117
7315 423117 568959 536058 594564 842415 945933 1205677 1273080 1469238 1579075 1605462
7305 1605462 1644278 1783446 1573949 1643801 1524020 1482375 1381084 1314430 1301022 1232173 1281046
7294 1281046 1425851 1441376 1442379 1485468 1370894 1170162 1237094 1067619 1002509 747143 755692
7283 755692 537927 529963 520296 396039 340775 461110 421228 515590 651791 656091 756647
7272 756647 821888 1063830 1353478 1414723 1737540 1856541 1896452 1783533 1649340 1380637
7262 1380637 1262079 1051390 1039897 915236 894387 667115 609006 588214 613855 548006 484300
7251 484300 513503 510075 487512 563434 293275 375219 230871 279942 437003 476742 387525
7240 387525 435381 484057 452551 389190 545473 553285 459539 563212 570516 555323 656540
7229 656540 767052 754350 864877 983615 1041109 1041033 1008092 829033 972491 1022740 1131124
7218 1131124 1267049 1295681 1476032 1643275 1924903 2224063 2890928 3434985 4167377 4736075
7208 4736075 5256452 5256968 5161335 4903157 4298993 3940505 3471879 3232569 2783916 2504063
7198 2504063 2282778 2195548 1940578 1865765 1799895 1607620 1446127 1480393 1340099 1246032
7188 1246032 1365722 1290742 1318131 1327476 1332185 1359150 1445153 1313922 1360879 1430732 1428807 1408214
7176 1408214 1465420 1405985 1615757 1547655 1621250 1576934 1787924 1766617 2046250 2122069 2198827
7165 2198827 2357806 2519222 2824843 2992764 3455003 4001407 4556769 5388587 5951125 6149487
7155 6149487 6066979 5709001 5428749 4889092 4482010 4073347 3608323 3464063 3489825 3520870
7145 3520870 3447115 3482273 3778497 4001426 4545481 4856402 5460925 6022727 6558695 7100685
7135 7100685 7508571 7590453 7617895 7353161 7005138 6553696 6050920 5587365 5028341 4737451
7125 4737451 4270713 4023809 3857702 3679366 3467662 3507476 3283707 3195472 3290428 3142275
7115 3142275 3180502 3089641 3062524 3191982 3336766 3273669 3413993 3464663 3462723 3525814 3569713
7104 3569713 3615387 3707469 3850733 4181288 4619263 4812281 4954801 4985300 5019695 4901430
7094 4901430 4911547 4547116 4431315 4313605 4348412 4229599 4257218 4315325 4386836 4472352 4477981
7083 4477981 4638873 4788610 4954022 4914507 5156496 5307406 5383778 5598331 5831169 5890233
7073 5890233 6153538 6307325 6655647 6862474 7086026 7382671 7743388 8001879 8499321 8664521
7063 8664521 8997987 9283618 9630206 10046070 10499055 11155146 11623527 12347995 13108841 14107659
7053 14107659 15031325 16122123 17330182 18796253 20281373 22314241 24388815 27040761
7045 27040761 30000752 33903761 38649758 44102567 51041532 59640795 70917563 86414990
7037 86414990 107324457 133871788 164208400 194612374 220380743 237487507 243562635
7030 243562635 238812580 224663550 203800883 179746562 155396012 132589319 112865129
7023 112865129 96794253 84189376 75137557 68503943 63424320 58930945 54460263 50347120
7015 50347120 46281299 42406373 38767965 35621500 33037500 30916224 29388006 28302982
7007 28302982 27348849 26868948 26540155 26864698 27668112 29146689 31401304 33591252 35875169
6998 35875169 37785456 38922448 39317117 38643636 37030085 34678034 32063786 29408814
6990 29408814 26860761 24546087 22597267 21385724 20187883 19258901 18665694 18313280 18047186
6981 18047186 18447134 19452223 20928192 22867795 24703352 25718624 26002160 25506986 24220256
6972 24220256 22260968 20058478 17963040 16139397 14624429 13324502 12295035 11378326
6964 11378326 10682895 10215323 9949718 9761461 9629510 9604909 9696936 10041390 10247821 10598324
6954 10598324 10695273 10767654 10680005 10614080 10370074 10097225 9840315 9675450 9654794 10109034
6944 10109034 10825445 12084731 13713086 15083065 15790647 15930188 15629979 14990786 13956431
6935 13956431 13081946 12208718 11460048 10841589 10331048 9846595 9460332 9260749 8948073
6926 8948073 8695373 8497143 8399645 8434583 8554503 8886117 9364297 10062293 11091777 12833381
6916 12833381 15768680 20275705 25921162 31269506 33838338 33965183 32920092 30407716
6908 30407716 26920119 23064935 19701162 16649236 14132055 12194263 10954777 10007103
6900 10007103 9454896 8848155 8472208 8290206 8250371 8370147 8622829 8999941 9485107 10152323
6890 10152323 11303905 12915875 15518141 19804276 25259628 30704839 33662472 33693149
6882 33693149 32552701 29862617 26169367 22090738 18595202 15503570 12954199 11113790
6874 11113790 9896747 9172902 8520269 8323055 7942012 8010624 7980519 8108362 8141292 8348058
6864 8348058 8137891 8221276 8185434 8300534 8789978 9859461 11203714 12771295 13544158
6855 13544158 13765396 13385422 12691361 11512209 10139457 9169871 8166447 7262936 6663160
6846 6663160 6182971 5826904 5593521 5274278 5063642 4711682 4572773 4299574 4043667 3982497
6836 3982497 3859822 3788256 3589086 3458295 3410308 3374362 3323343 3427522 3380118 3408296 3381901
6825 3381901 3475350 3470231 3424380 3332452 3381127 3244173 3327085 3331726 3422386 3401857 3417768 3588325
6813 3588325 3767486 3971516 4213212 4391385 4623724 4662153 4496950 4313201 3988550 3657249
6803 3657249 3481054 3113129 2859784 2682471 2483246 2352997 2297970 2149481 2039363 1890135
6793 1890135 1960645 1837146 1857456 1816987 1824783 1723729 1668355 1749102 1800957 1659206 1804542
6782 1804542 1677159 1694065 1538292 1616572 1609592 1558586 1477250 1623609 1412595 1636996 1368931
6771 1368931 1418376 1307764 1401908 1480980 1302511 1379619 1484497 1396040 1549097 1598092 1664413
6760 1664413 1802148 1829479 1982143 2078168 2127397 2291394 2267916 2313344 2302039 2380294 2361723
6749 2361723 2311104 2223560 2046595 1867583 1798180 1734933 1538393 1386451 1495984 1385618
6739 1385618 1469116 1473891 1487579 1536267 1578807 1500954 1564386 1455774 1515177 1461310 1454635 1536121
6727 1536121 1561149 1678068 1803803 1953619 2031004 2234166 2162350 2401705 2445451 2437412 2492472
6716 2492472 2341517 2332278 2383686 2217691 2341990 2480944 2495163 2507864 2670399 2760143 2876904
6705 2876904 3185771 3440897 3790981 4190239 4844873 5695347 6520786 7654612 8647271
6696 8647271 9519996 10328378 10669697 10672085 10252683 9650986 8771440 7958657 7293240 6759719
6686 6759719 6244102 6080736 5840129 5821683 5517466 5174422 4807207 4307304 3882537 3470091
6676 3470091 3198703 2827332 2645947 2406259 2203267 2064212 1954533 1886484 1955641 1958942
6666 1958942 1936852 2030535 2055345 2134203 2152875 2377495 2566370 2976499 3554677 4494987
6656 4494987 5780462 6890106 7396254 7388314 7078862 6347552 5731538 4889149 4227392 3785310
6646 3785310 3171038 2868148 2485561 2387100 2232271 2087648 1989500 1980492 2082137 2028795
6636 2028795 2121560 2178156 2213909 2309271 2570467 2835671 3407647 4228638 5649771 6730978
6626 6730978 7440941 7515153 7256055 6793593 6022532 5356940 4652301 4162358 3666301 3367760
6616 3367760 3052443 3008295 2989181 2813047 3049840 2968406 3032430 3187089 3416456 3415955 3430460
6605 3430460 3388948 3347198 3255386 3405730 3538334 3645859 3856212 4084189 3965452 3736509
6595 3736509 3505073 3248647 2901295 2776286 2564552 2367010 2225322 2071584 1823563 1745197
6585 1745197 1758537 1488169 1478973 1376546 1396009 1227167 1436826 1349034 1449401 1440315 1409018
6574 1409018 1346362 1407027 1340035 1305095 1222651 1185452 1192033 1136414 1215593 1154124 1271121
6563 1271121 1261976 1306902 1293468 1284596 1220752 1252862 1181169 1203528 1262762 1239626 1230518 1313495
6551 1313495 1316057 1445276 1620807 1655034 1729614 1915013 1937767 2028617 2222487 2329918 2412365
6540 2412365 2401429 2350349 2427520 2226740 2303745 2146789 1968309 1891831 1894390 1972111 1844532
6529 1844532 1912305 1944694 2018168 2033374 2145198 2310139 2440267 2777767 3075405 3334008
6519 3334008 3561856 3871535 4174765 4531869 5326547 6116882 7413048 8859845 9981453
6510 9981453 10428141 10406856 10049412 9199620 8260070 7262663 6421672 5724636 5173744 4779641
6500 4779641 4496000 4259632 4098813 3982044 3936946 3809342 3685139 3658918 3779160 3930569
6490 3930569 4023992 3996278 4071610 4056797 4066719 3820557 3682943 3826642 3724865 3780547 3879635
6479 3879635 3939768 4036066 4096162 4267852 4169182 4509576 4636155 4935951 5241083 5849975
6469 5849975 6366060 7040369 7855197 8715662 9743946 10940339 12208511 14009508 16460845
6460 16460845 20243710 25784663 33361254 42591097 52237162 60042930 64333616 65191907
6452 65191907 62791390 57646661 50990315 43836790 37019358 31225770 26673034 23315872
6444 23315872 20888941 19032188 17486014 16160357 14846012 13770928 12692393 11867931
6436 11867931 11104624 10371673 10106985 9761293 9690837 9971384 10308925 10504170 10984123 11236356
6426 11236356 11210486 10969417 10901528 10550465 10233350 9979182 9872115 9617015 9554624 9514836
6416 9514836 9710195 9917071 10128100 10202648 10345397 10415315 10504909 10415827 10321831 10111006
6406 10111006 10012844 9769950 9614724 9402191 9367357 9279413 9296656 9202988 9082186 8874545
6396 8874545 8811388 8546335 8318281 8022074 7965640 7769977 7644166 7579008 7621174 7457431
6386 7457431 7477967 7256638 7135928 6797822 6698893 6715096 6688446 6880377 7222342 7761486
6376 7761486 7939142 8284640 8281716 8184491 7730874 7499609 7093649 6769607 6395377 6324409
6366 6324409 6137491 5917590 5780321 5690652 5570927 5352557 5324557 5176270 5184421 5266564
6356 5266564 5395223 5471081 5569238 5707374 5783209 5736836 5746008 5654802 5367049 5080984 4943335
6345 4943335 4814273 4591460 4352855 4403330 4175365 4198010 4328208 4344610 4400336 4393063 4664700
6334 4664700 4854892 5032737 5153107 5474374 5545041 5675474 5980955 6181662 6250795 6415046
6324 6415046 6565383 6793015 6870921 7157447 7383126 7585932 8147189 8871440 9703994 10539757
6314 10539757 11416844 12090067 12330921 12380385 12217669 11876249 11280981 10819790 10638083 10311175
6304 10311175 10136867 10265409 10175815 10178381 10222764 10264761 10151296 9866539 9604348 9466437
6294 9466437 9131186 8903403 8772058 8510140 8422290 8291975 8348919 8235924 8372025 8551245
6284 8551245 8643108 8985600 9420546 9722730 10315122 10889794 11600626 12135392 12844877 13684161
6274 13684161 14496833 15373390 16590240 18104781 20084848 22382619 25854727 30581199
6266 30581199 36678884 43888610 51342682 57598887 61886001 63719121 62672144 59395215
6258 59395215 54688704 49463757 43771433 38976823 34937425 31986009 29658466 28161059
6250 28161059 27295100 27016961 27217928 27680002 28694547 30124729 32234183 35250921 39489581
6241 39489581 45594151 53892536 65158831 79548686 96214009 113116690 128134424
6234 128134424 138594017 142597569 139950240 131990639 120443986 106680844 92385970
6227 92385970 79120555 67914492 58591359 51367841 45988301 42374195 39842977 38463739
6219 38463739 37877936 37900253 38308210 38989244 40003796 41308054 43115909 46175842 50746586
6210 50746586 57286163 65913424 75174236 83325503 88920680 90766347 88561131 83172441
6202 83172441 75523667 66822865 58079426 49920029 43091635 37380387 32838913 29379460
6194 29379460 26578596 24201678 22377280 20872894 19657703 18874596 18155624 17783851 17282091
6185 17282091 16816718 16184284 15441474 14831221 14255008 13704188 13185241 12704754 12482880
6176 12482880 12263900 12158915 11887236 11859349 11851111 11741600 11704281 11528955 11421504 11120422
6166 11120422 10651803 10356121 10081924 9863343 9558643 9367279 9364761 9329524 9197860 9132106
6156 9132106 8958507 8766904 8506381 8320540 8233951 8043979 7907388 7896802 7748868 7780401
6146 7780401 7863527 7780634 7695380 7608068 7483304 7342244 7344996 7274544 7125421 6970007 6901371
6135 6901371 6916010 6889628 6839999 6804236 6649194 6654507 6439079 6640505 6687988 6896032 6808413
6124 6808413 6860672 6930317 6807314 6705393 6506525 6529547 6376547 6332138 6179346 6310116
6114 6310116 5974295 6013325 5805743 5621579 5502657 5333963 5222457 4960251 4781398 4746775
6104 4746775 4650228 4616200 4526383 4515479 4455370 4422395 4425557 4308965 4323934 4189750 4087176
6093 4087176 3879272 3793399 3698631 3582703 3490082 3460797 3429801 3179313 3305399 3285038 3281649
6082 3281649 3178332 3084062 3032899 2898378 2820900 2864884 2772519 2869861 2788419 2836768 2722888
6071 2722888 2645840 2672633 2653243 2578837 2660690 2636497 2647493 2706042 2758882 2808677 2841822
6060 2841822 3076059 3217671 3300666 3210292 3192418 3183917 2990032 2909273 2690873 2701153 2647268
6049 2647268 2539956 2605600 2476207 2477400 2463896 2424710 2378163 2513840 2484471 2518507 2557340
6038 2557340 2538388 2521974 2593808 2490533 2681273 2697251 2802974 2818227 2871784 3058487 3149661
6027 3149661 3262560 3335817 3423925 3465489 3628557 3550097 3552856 3483790 3607770 3515747 3489861
6016 3489861 3596166 3523541 3431155 3399563 3325793 3194277 3369274 3353687 3276143 3342301 3304729
6005 3304729 3456606 3458087 3567930 3574599 3711795 3786777 3940944 4093466 4295786 4504808
5995 4504808 4475967 4628353 4597956 4673094 4780154 4878044 4991802 5123011 5367922 5496351
5985 5496351 5642490 5779562 5957587 6065404 6265753 6311204 6580741 6539618 6544030 6650391
5975 6650391 6713094 6694389 6802016 6858879 6855584 6993913 7230106 7275037 7509079 7626006 7838229
5964 7838229 7897271 8122193 8341991 8643723 8985728 9248091 9635610 9921574 10348962 10662584
5954 10662584 11133873 11435439 11855110 12009020 12348827 12541509 12728508 13103385 13287604
5945 13287604 13758482 14352523 14948614 15811770 16939237 18110801 19955399 21986074 24784831
5936 24784831 28530148 33829107 40897440 49942136 60331308 70893062 79523921 85008037
5928 85008037 86670213 84629145 79891196 73354321 66001189 58611697 52263944 46896032
5920 46896032 42599986 39122184 36894249 35382150 34497459 34065133 34496951 35307094 36965059
5911 36965059 39418222 42928225 47847977 54411592 63605212 76055863 92372520 111163637
5903 111163637 129698809 145132108 155988599 161188503 160879974 155988860 148056108 138842859
5895 138842859 129133636 119585781 110836160 102696052 95301879 88256543 81879826 75946548
5887 75946548 70840669 66368609 62829877 60142473 58473349 57547527 57568075 58819702 61294094
5878 61294094 65497346 71319754 78618105 86390869 93942037 100658495 105747861 109239499
5870 109239499 112190140 114991313 117991532 121246224 124981244 128398666 130797611 131652624
5862 131652624 130385580 126979586 121368070 113946501 105458565 96372764 87485703 79010499
5854 79010499 71480414 64755143 59196321 54657727 50867352 48079394 46117851 44751369
5846 44751369 43944017 43955950 44355148 45134194 46419043 48351673 50595840 53696889 57180830
5837 57180830 61148744 65324059 69064503 72283138 74479968 75063601 74334170 72053237
5829 72053237 68477164 64268716 59607777 54762343 50355266 46117238 42748000 39752746
5821 39752746 37604479 36205099 35446706 35747550 36766622 38246221 39186932 39481115 38872980
5812 38872980 37717559 35999278 33721474 31726696 29911488 28324037 27372291 26691690
5804 26691690 26049355 25719670 25589595 25705722 26450445 27667989 29569780 31778737 34258117
5795 34258117 36887866 39167377 40423259 41022277 40206040 38787375 36531218 34160845
5787 34160845 31705661 29514364 27632896 26304281 25295465 24390472 23889355 23433257 23079841
5778 23079841 23141132 23608013 24792133 26483497 28531817 30158844 30890451 30941573 30338337
5769 30338337 29037748 27374010 25435256 24034845 22681334 21510468 20810631 20368044
5761 20368044 20160175 20082390 20069079 20322258 20589854 20996098 21523996 22159532 22966896 23747555
5751 23747555 24982743 26239886 27919500 29858183 31874935 34156997 36691691 39312972
5743 39312972 42139701 44986936 47965782 50638610 53221046 55620289 57561964 59406494
5735 59406494 60742190 61818268 62563583 63240722 63832061 64615837 65333877 66415537 67896688
5726 67896688 70171935 72623726 75846931 79201388 83104003 87155751 91214054 95230336
5718 95230336 99341570 102856549 105868635 108129817 109658202 110418975 110243983 108951455
5710 108951455 107107524 104440343 101273624 97899141 94292604 90672473 87288111 84125963
5702 84125963 81316928 78803879 76759027 75054139 73802991 73019215 72771154 72599889 72681446
5693 72681446 72791286 72778436 72656267 72403844 71936995 71214794 70673272 69947557 69346395 69158583
5683 69158583 68897591 68704526 68256570 67610398 66515144 65070024 62888569 60534585 57782138
5674 57782138 54689297 51421562 48310200 45235013 42220400 39715479 37458078 35488279
5666 35488279 33883250 32657833 31707461 30944088 30486494 30267005 30329775 30424033 30918363
5657 30918363 31531503 32254700 33309471 34539177 35785120 37156543 38545377 39780797
5649 39780797 40556629 41138917 41273538 41156367 40586374 40185894 39531724 38781684 38259839
5640 38259839 37919339 37611684 37607473 37514653 37721690 37663901 37776890 37908308 37961331 38042598
5630 38042598 38090958 38260788 38507370 38670921 39087514 39479280 39723413 40177790 40601188 40964176
5620 40964176 41617299 42224122 43054284 43747595 44476576 45283901 45968647 46592666 47097437
5611 47097437 47328324 47599419 47480716 47651188 47550645 47606269 47793265 48164345 48839227 49865072
5601 49865072 51403335 53541158 56185339 59519107 63596780 67754774 72188020 76780916
5593 76780916 80879223 84160465 86405190 87560616 87282372 85936847 83531271 80372945
5585 80372945 76749489 72908284 69436383 65891896 62954589 60439463 58579087 57275445
5577 57275445 56568355 56633996 57415585 58819791 61302615 64559479 68767502 74001222 80378483
5568 80378483 87414764 95072970 103070115 110981536 117948099 123659485 127903286 129971441
5560 129971441 130000477 128139559 124178093 118856540 112320217 105255047 97981905 90698424
5552 90698424 84065659 77933082 72572727 68194324 64698877 61975972 59922405 58549887
5544 58549887 58034278 57884402 58442652 59726396 61406954 63640222 66451029 69761444 73214882
5535 73214882 76565939 79450313 81768305 82755100 82874182 81738526 79117715 75611750
5527 75611750 71073549 66394137 61137334 56196282 51267872 46749519 42714531 39096288
5519 39096288 36207385 33419272 31116601 29135259 27559105 26080325 24998694 23923682
5511 23923682 23023500 22105322 21499384 20853555 20239225 19870735 19303484 18857417 18307471
5502 18307471 18006727 17801657 17271790 16954898 16563874 16313413 16010869 15871979 15442525
5493 15442525 14978175 14734539 14497645 14266348 13930970 13545862 13220212 13047180 12781907
5484 12781907 12668693 12373129 12173792 12007482 11823652 11856299 11742284 11702823 11590993 11475671
5474 11475671 11553959 11751600 11596468 11525336 11310674 11317773 11401560 11470846 11353613 11225705
5464 11225705 11289218 11282675 11209333 11227339 11199946 11085588 10898878 10868859 10894497 10961322 10999512
5453 10999512 11108034 11213146 11286633 11465228 11712839 11920780 12118253 12417937 12731308 13328577
5443 13328577 13666205 14257231 14875511 15470791 16319025 17047880 17929978 18821506 19439363
5434 19439363 20329170 20968996 21608779 21985018 22326708 22403214 22530884 22451633 22291316 22095145
5424 22095145 22104312 22065854 22165596 22455616 22676783 23149741 23893231 24739248 25756250 27012492
5414 27012492 28298860 29766969 31197681 32642033 34233609 35630461 36908129 37880134
5406 37880134 38664910 39525009 40512891 42029028 44445799 47834347 52242615 56971372 61063296
5397 61063296 63787383 64278793 62842532 59629911 55396995 50709592 45995144 41647071
5389 41647071 38116309 35345537 33270472 31631071 30379799 29277203 28319558 27415823
5381 27415823 26550969 25778720 24755527 23855338 23114545 22350294 21792464 21161276 20746931
5372 20746931 20521825 20434600 20447844 20685714 21221104 21749060 22513532 23497886 24854645 26369109
5362 26369109 28029401 30071316 32235395 34528071 36979601 39392547 41643297 43900510
5354 43900510 45775720 47399672 48480752 49340281 49717589 49857070 49797831 49652457 49454754
5345 49454754 49273641 49357764 49751599 50651544 51963767 53826281 56201275 59086850 62549374
5336 62549374 66443259 70690303 75079720 79493243 83475651 87171380 90126979 92272260
5328 92272260 93459307 93528755 92796636 91277590 88833160 86004602 82807997 79564461 76290435
5319 76290435 73348434 70722690 68467950 66692294 65284987 64383577 63588072 63172365 62960865
5310 62960865 62479113 62122487 61516200 60701902 59425263 57734768 55745133 53463689 50711749
5301 50711749 47926204 44924054 42023589 39142077 36438891 34008127 31721254 29623364
5293 29623364 27707977 25967777 24578064 23211584 22122203 21005315 20174333 19414256
5285 19414256 18535822 17855655 17198009 16591475 16021066 15619987 15346274 15078326 14971031
5276 14971031 14823850 14756763 14688590 14687154 14377097 14183064 13766077 13330890 12903545 12355581
5266 12355581 11872109 11511106 11170780 10786019 10503693 10312190 9930271 9659643 9390018
5257 9390018 9242536 9099515 8846729 8747603 8417401 8359987 8225135 8164883 8029401 7746765
5247 7746765 7604532 7525093 7285355 7314083 7085613 6965867 6793909 6739219 6636337 6465018
5237 6465018 6284157 6262894 6052270 5897249 5799436 5721824 5639594 5493851 5455245 5209593
5227 5209593 5227551 5143695 5052986 5056269 4891179 4897758 4907632 4781279 4708292 4582877 4556425
5216 4556425 4564553 4481165 4433094 4263982 4092087 4080594 4119637 4083861 3935516 3915991 3890229
5205 3890229 3922358 3874179 3837661 3852281 3838227 3733812 3709141 3818284 3706820 3751721 3691817
5194 3691817 3706685 3620231 3688265 3640328 3612343 3495281 3385134 3542100 3587957 3454333 3448689
5183 3448689 3513669 3596835 3464183 3549799 3637548 3536014 3437984 3452719 3484882 3501543 3424970
5172 3424970 3431939 3494522 3654716 3556435 3590409 3630183 3689825 3815564 3752703 3698846 3714548
5161 3714548 3718777 3805110 3839965 3980450 4109307 4184962 4335151 4225860 4462458 4666172
5151 4666172 4723951 5044338 5293879 5422982 5671070 5769200 6002819 6025643 6104456 6292512
5141 6292512 6286564 6420068 6462734 6566220 6734937 6825281 7009432 6947286 7015391 6970303 7069111
5130 7069111 7141679 7222434 7317962 7300925 7218103 7367807 7250026 7257095 7246367 7234900 7253818
5119 7253818 7210224 7178015 7244522 7312050 7434084 7517217 7882745 7952126 8358842 8708869 8997381
5108 8997381 9652854 10096077 10943604 11856668 12856354 13924615 15321446 16873806 18548950
5099 18548950 20432286 22193498 23856853 25275568 26027458 26246924 26223643 25592441 24695639
5090 24695639 23798295 23038972 22338025 21518122 21126369 20610211 20493446 20427743 20511335 20885095
5080 20885095 21226361 22023176 22960584 24132978 25800848 27704412 30109397 33215099 36992780
5071 36992780 41372656 46183341 51212866 56512262 61074352 65020804 67484707 68275277
5063 68275277 67445408 65424450 62325683 58948962 55357985 51816486 48663501 46047216
5055 46047216 43903746 42424853 41427224 40799643 40716208 40992419 41837315 42975494 44791893
5046 44791893 47203943 50167720 54046900 58521375 64089360 70678611 78517248 87902861
5038 87902861 99490505 113574655 130053347 145739863 158354975 164436976 164886456 161349790
5030 161349790 154469141 149165834 147600600 159520552 205492458 276637108 356150293
5023 356150293 388721848 371548396 365613435 327220061 277037254 222676327 182393859
5016 182393859 148747332 122095097 103599645 95425127 91168748 88077252 86249369 85475238
5008 85475238 85541038 85704083 85350150 84275497 82214004 78873943 74999136 70372684 65575787
4999 65575787 60911218 56771799 53294952 50382072 48065021 46390186 45178510 44338879
4991 44338879 43714514 43804330 43832540 44261113 44852762 45393733 46035540 46333641 46182283 45872738
4981 45872738 44983568 44220192 43071050 42174963 41259723 40413237 39454574 38407608 37273932
4972 37273932 35879903 34331750 33054855 31590343 30633972 29632735 29127676 28686997 28557474
4963 28557474 28878005 29357857 30054597 31049200 32013189 33207131 34501642 35736252 36765004
4954 36765004 36951643 36564721 35541857 33863479 31966976 29555019 27454232 25375690
4946 25375690 23674738 22263715 21178152 20171302 19316812 18822960 18565930 18140057 17936953
4937 17936953 17891494 17860475 18083011 18398996 18506899 18963121 19342718 20134313 21072434 22371797
4927 22371797 23615712 24518518 24973191 24938446 24430082 23653524 22405667 20918578 19292668
4918 19292668 17880389 16528583 15290295 14253215 13384802 12656775 12144748 11611997 11395774
4909 11395774 11010069 10769143 10594647 10447463 10246203 10237721 10252524 10302904 10405639 10398549
4899 10398549 10594773 10675512 10732886 10848256 10890121 10733229 10446383 10243895 9918492 9430178
4889 9430178 8975331 8760996 8438439 8144648 7806750 7690872 7576710 7441499 7292368 7089176
4879 7089176 6929663 6835712 6830685 6802485 6584493 6729779 6697366 6588226 6584615 6722216 6489479
4868 6489479 6470161 6457806 6460923 6471216 6535688 6476042 6440365 6481565 6500481 6554354 6659585
4857 6659585 6684807 6614888 6633686 6659761 6755881 6808942 6719516 6722066 6808587 6880976 6852423 7042972
4845 7042972 7008418 7087385 7238565 7339670 7459145 7490896 7694665 7735301 7873692 7966177
4835 7966177 8219898 8338809 8468334 8600365 8932349 9181648 9290027 9582775 9837313 10136769
4825 10136769 10326693 10755998 11004978 11298605 11924893 12512452 13259813 13957741 14731364
4816 14731364 15294168 16168568 17012342 17801463 18620277 19455899 20350277 20981270 21598577
4807 21598577 22420341 23098936 23600093 24563403 25434803 26499154 27615892 28647083 29809258
4798 29809258 30657191 31565602 32393222 33165587 34035368 34702736 35477676 36395607 37401343
4789 37401343 38585097 39837585 41276889 42663237 44484297 46245335 48201677 50267597
4781 50267597 52496116 54896595 57747275 60476905 63660845 66479702 69230733 72137528
4773 72137528 74613093 77037000 79024436 80626110 82255808 83660579 85058016 86352423
4765 86352423 87864760 89575720 91606695 94181572 97446239 101455084 106441637 112245633
4757 112245633 119118198 126427542 134122994 141582417 148309994 154019840 158523503 162119483
4749 162119483 164339327 165924694 166978890 167741612 168406019 168767352 169179711 169502334 169573367
4740 169573367 169361494 169004673 168504491 167921891 167502268 167248879 167173794 167596462 168290594
4731 168290594 168867181 169691992 169736779 169133679 167155734 164079334 159877304 154821815 149123894
4722 149123894 143289721 137469464 131637260 125944862 120697430 115815712 111156062 107108473
4714 107108473 103267347 99698127 96554320 93700591 91332636 88987460 87076859 85271543
4706 85271543 83393607 81554853 79393185 77328898 74628150 72306589 69851526 67589620
4698 67589620 65386091 63235918 61106642 58993288 56985498 54897944 52918652 50957174
4690 50957174 49156628 47419311 45889283 44418954 43160676 42121761 41127312 40182365
4682 40182365 39141123 38226342 37150432 36029921 34912301 33683516 32720061 31614087
4674 31614087 30641358 29825492 29011386 28008095 27200467 26270870 25393367 24559387 23682047
4665 23682047 22801360 22121452 21382204 20616215 19950501 19118319 18326412 17715399 17105414
4656 17105414 16401091 15807554 15267229 14628803 14154216 13687887 13210836 12745087 12340417
4647 12340417 11956960 11552555 11200523 10947910 10759163 10345138 10284797 10047542 9922289 9676403
4637 9676403 9577856 9310682 9151747 9117343 8867228 8691313 8547414 8454573 8352341 8199418
4627 8199418 8035990 7806203 7647738 7354902 7226567 7100665 6996337 6861393 6785034 6592112
4617 6592112 6483101 6399119 6438216 6297093 6250271 6391509 6103683 6102340 6046697 5799706 5755572
4606 5755572 5762707 5681819 5622344 5522562 5447578 5465657 5274831 5266791 5097320 4961277 4829976
4595 4829976 4701751 4690131 4595233 4608569 4584543 4406087 4396189 4388962 4348994 4236740 4265302
4584 4265302 4150604 4269016 4178228 4231871 4095014 4084500 3867942 3957664 4032463 3754446
4574 3754446 3861081 3884841 3798144 3845643 3845682 3985174 3749273 3791499 3813139 3730698 3595929
4563 3595929 3536412 3554484 3464452 3400891 3389399 3207773 3327055 3293589 3264672 3275985 3209667
4552 3209667 3145966 3102319 3100902 3079017 3147693 3122913 3132510 3382451 3403494 3506050 3591631
4541 3591631 3647819 3598611 3382489 3264104 3299107 3069824 2878511 2939349 2931405 2737898 2808270
4530 2808270 2841039 2941608 2908996 2829087 2874573 2807801 2867666 2948354 2886157 3034310 2960049
4519 2960049 3032924 2922728 2882894 2946462 2846725 2935261 2944672 2982040 2803504 2874362 2806798
4508 2806798 2886184 2906498 2847460 2809297 2677630 2919552 2823060 2819055 2789361 2873077 2824347
4497 2824347 2977752 2888864 2931268 2914963 3005130 2944629 2912027 2921133 3001303 3100682 3115795
4486 3115795 3068812 3072168 2951364 2980770 3038570 3020298 2916405 2952954 2973559 2910770 2910023 3002539
4474 3002539 2943771 2989535 3097944 3043650 3059406 3030653 3112916 3207618 3101140 3125200 3334807
4463 3334807 3356867 3339804 3398524 3442560 3236287 3141747 3395970 3309019 3259965 3235335 3379073
4452 3379073 3414770 3503276 3435293 3450972 3394090 3414443 3494681 3460896 3392825 3553693 3618924
4441 3618924 3573788 3912135 3920353 4018579 4166978 4191022 4321100 4432021 4510297 4373929 4409106
4430 4409106 4326793 4368408 4203863 4317470 4273149 4269947 4212965 4297307 4444013 4371193 4368789
4419 4368789 4393380 4360393 4351803 4471788 4622289 4719015 4809385 4952488 5067256 5267181 5593469
4408 5593469 5809301 6235302 6443287 6653230 6874513 6962903 7058135 7183494 7530028 7787722
4398 7787722 8258629 8614481 9465635 10237842 11787375 14207662 18110841 23343287 29189056
4389 29189056 33310097 34393458 34132659 32211347 29260556 25493719 22082627 19217275
4381 19217275 16818300 15110220 14180935 13749427 13280650 13132242 13082251 13223405 13478983
4372 13478983 14140765 15281916 17088660 19279874 21668675 23710151 26070759 29786736
4364 29786736 36155788 45820249 57000460 65448695 67241842 65900490 62226505 55609633
4356 55609633 47626733 40168892 33836176 28519072 24571193 22071946 20475664 19413270
4348 19413270 18435860 17856787 17554369 17593416 17911745 19208123 21433190 24566407 27786438
4339 27786438 29369200 30556592 31818327 33714330 36580771 40116257 43008410 43384074
4331 43384074 42118559 39976463 36827135 32981778 29327588 26250599 23534454 21494015
4323 21494015 20135624 19279513 18808017 18490979 18425462 18186870 18355868 18499366 19249769
4314 19249769 20320273 21846834 23558782 24838403 25584230 26454768 27495442 28416094 29815791
4305 29815791 31746624 33797524 36450110 39844815 44193641 50443888 60441467 77681192
4297 77681192 104023251 136092038 162813381 173986245 172596370 163687744 147060705
4290 147060705 125545054 103578992 84720124 69053166 56341347 47070543 40942252
4283 40942252 36336003 32595155 29425462 26749878 24517126 22814636 21314466 20228926
4275 20228926 19229549 18457408 17788253 17154106 16676975 16031528 15862061 15392251 15076162
4266 15076162 14706265 14267177 13884249 13425451 13013983 12615717 12163188 11752717 11410601
4257 11410601 11120568 10861218 10568549 10283849 10017944 9695816 9454541 9194444 8951599
4248 8951599 8700115 8383901 8289351 8058150 7936680 7647240 7601248 7475600 7407009 7298585
4238 7298585 7210868 7166890 6951265 6823317 6644470 6582961 6427981 6214495 6118777 6029416
4228 6029416 5894944 5753049 5640113 5561811 5360266 5389062 5362012 5195289 5005839 4976565
4218 4976565 4721248 4626843 4667127 4552765 4483794 4449991 4460846 4308977 4356690 4430946 4387182
4207 4387182 4446306 4300434 4308648 4249217 4124072 4145268 3986690 3974894 3756295 3827887 3647878
4196 3647878 3586886 3539215 3498883 3432585 3401516 3374670 3499556 3324785 3284320 3403309 3180197
4185 3180197 3245721 3320166 3232937 3072614 3132122 3240766 3136824 3131975 3065685 3004727 3023824
4174 3023824 2915375 3011093 2891793 2883202 2924303 2817224 2795935 2795292 2791441 2676017 2702691
4163 2702691 2602314 2628927 2499165 2512072 2416249 2455282 2509053 2440494 2420315 2226191 2304414
4152 2304414 2380363 2374791 2294460 2349454 2301206 2251589 2264966 2239068 2193788 2155285 2133048 2027304
4140 2027304 2056228 2059215 2105329 2117645 2086200 2174643 1977909 2010550 1947369 1955427 1780900
4129 1780900 1839889 1855886 1822173 1865830 1751380 1727186 1706015 1764043 1772243 1692049 1657901
4118 1657901 1647834 1609898 1666312 1652023 1569544 1617279 1564346 1755396 1717217 1768637 1787856
4107 1787856 1908601 1855076 1768372 1842064 1767130 1680591 1595815 1499755 1574870 1533181 1497997
4096 1497997 1518877 1529874 1488095 1505524 1616016 1534197 1512188 1604813 1618581 1586181 1569285
4085 1569285 1517884 1521108 1576214 1568214 1668411 1722880 1766412 1731748 1794361 1648964 1620063
4074 1620063 1661655 1549186 1474907 1512201 1507633 1465039 1537727 1530541 1576653 1541693 1546870 1613461
4062 1613461 1669102 1758373 1680621 1823608 1775231 1773626 1786967 1844027 1762826 1832055 1849235
4051 1849235 1870670 1982622 2070937 2092167 2235117 2354710 2449550 2469315 2478524 2443253 2457128
4040 2457128 2246844 2238443 2279357 2316321 2267369 2412804 2360676 2374172 2493074 2518024 2540895
4029 2540895 2697688 2669355 2656761 2760400 2847423 2930114 3003800 3131724 3262213 3204208 3340861
4018 3340861 3389324 3435810 3295506 3384717 3374352 3306085 3391060 3511493 3555505 3634599 3764278
4007 3764278 3849756 4044290 4067624 4264072 4290720 4513582 4815822 5078902 5320653 5541225
3997 5541225 5903471 5930633 6013677 5886645 5673670 5579543 5239907 5246963 5033800 4755545
3987 4755545 4769512 4729807 4788847 4800772 4922038 4867505 5023995 5115989 5078442 5260888 5333821
3976 5333821 5382979 5513692 5444177 5620780 5608592 5412725 5513166 5172347 5156084 5063652
3966 5063652 4801748 4711689 4416139 4276752 4305941 4149567 4146036 4018976 4074890 4078757 3906386
3955 3906386 3983008 3857888 3900975 3812728 3728419 3595969 3429534 3400510 3197315 3068280
3945 3068280 2985416 2742722 2733515 2479595 2368544 2357933 2230124 2115792 2106862 2119632 2011979
3934 2011979 1994606 1923939 2016438 1931595 1894979 1796447 1689383 1650765 1858742 1704402 1571601
3923 1571601 1671108 1504095 1473624 1472147 1471817 1402019 1251511 1242513 1359247 1312404 1225338 1204642
3911 1204642 1104750 1044051 1035381 1067186 1030002 1004942 1033332 958573 971620 884173 999856
3900 999856 932353 929064 936390 983625 1026587 1012760 949682 1076596 1098676 1095537 1113119 930803
3888 930803 967505 991285 896138 836136 697891 891863 727656 760170 776072 837280 688636
3877 688636 690861 764180 666925 739070 610844 722498 604693 600994 749426 745591 596764
3866 596764 698769 800156 678004 768402 736721 747778 666465 661433 594576 624303 547685
3855 547685 551116 438489 260030 441071 434861 287850 328129 341889 319241 321575 426375
3844 426375 437303 285272 217338 251810 238884 284513 273832 339555 279200 228134 425795
3833 425795 414658 499979 296940 369586 332670 277486 281035 212567 170423 262360 284063 285826
3821 285826 251955 178292 271425 202160 257131 200474 263372 73687 142960 109225 90056
3810 90056 94605 172782 151812 164212 130617 261616 180797 128254 85694 41137 137295 164723
3798 164723 130782 75007 69832 64509 -9806 117499 99796 -11451 73840 43496 105580 250408
3786 250408 12861 133783 68577 14876 80885 140770 59846 127490 101873 22610 65882
3775 65882 112787 158285 109026 112921 80872 182028 51217 80337 -24439 13014 16579 51203
3763 51203 87829 74675 20477 136058 13706 66842 70114 23441 29977 89813 -43272 -24192
3751 -24192 59151 -67129 9035 -40954 44313 -110010 39548 -34165 103835 -62980 146040
3740 146040 -24363 11974 16968 -57924 -70783 -93443 -88263 -97247 -72626 53222 -1525 33251
3728 33251 -4641 68321 9916 22674 105225 35649 6318 109571 51161 86984 16872 -16595
3716 -16595 16951 -49732 120106 81333 62302 -40682 -4705 -14400 -154623 40347 21290
3705 21290 37462 34488 172824 66447 121149 52831 -28532 -168729 -20526 53028 91637
3694 91637 -96496 -69145 -94803 40318 89966 20508 65600 5371 -12323 42283 -24691
3683 -24691 -76264 -16155 -81593 -198764 -61127 114020 -99388 -72509 -174034 -21642 -73725
3672 -73725 119553 -35273 -29590 -54996 21010 64420 -74946 -24958 -71382 -138344 -92008
3661 -92008 -1108 -79234 -115563 -209266 -60884 -91997 -73774 -13585 -139443 -35602 -72885
3650 -72885 -156509 44042 -171911 -82782 -118887 -127983 -63878 -36018 -85045 -234915 -78271
3639 -78271 -197960 -47279 -16977 -119778 -109210 -121914 -78886 114275 -102437 -130948 -22532
3628 -22532 11155 33838 -74510 -39215 -126524 -153466 -104229 -89167 -14984 42701 -170915
3617 -170915 1363 -82567 -32532 -131570 -79439 -156826 -98943 -142204 82468 -237088 -104633
3606 -104633 -129422 -158785 -98300 -89143 -154458 -91718 -95537 -102458 23989 -177254 -78752 -88011
3594 -88011 -62670 -75749 -49121 -147187 -244956 -217210 -62899 -119793 -105740 -152521 -128403 -185685
3582 -185685 -101466 -54893 -85953 -175774 -144101 -245696 -199264 41262 31521 -13758 -184588
3571 -184588 -80582 -141669 -36945 -89137 -8843 -142715 -139897 -217430 8130 -52777 -209833
3560 -209833 -103153 -24142 30386 -76311 -147944 -289915 -250442 -123043 -83312 -79767 -62761
3549 -62761 -194332 -49811 -196408 -88615 -136081 -104404 -227557 -130001 -10726 -181657
3539 -181657 -196532 -153825 -210594 -157498 -156071 41075 -84347 -130978 -148207 -188394 -25556
3528 -25556 -32747 -145721 -104195 -205289 -79796 39302 -117606 -52851 -172231 -251029 -88874
3517 -88874 -42560 -10397 -100468 -94580 -251555 -114423 -207296 -113127 -157195 -177442 -302813
3506 -302813 -179282 -254454 -145694 -172944 -185870 -66881 -98659 -109309 12604 -156792 -226774
3495 -226774 -128239 -173071 -191655 -38680 -115652 -200135 -31433 -98459 -117780 -132201 -293332
3484 -293332 -90473 -91697 -115049 -89272 -212825 -222707 -254044 -130290 -72379 -188329 -176291
3473 -176291 -257161 -155348 -166515 -74010 -234435 -262274 -103468 -121945 -32384 -73323 -217015
3462 -217015 -108162 -96731 -13167 -20623 57536 -164296 -208226 -125885 -146889 -194858 -105354
3451 -105354 -222758 -229722 -113668 -94821 -68627 -128520 -268137 -201951 -102464 -13095 -66984
3440 -66984 -187806 -200015 -188344 -83929 -189803 -239477 -190062 -174455 -26696 -84746 -60553
3429 -60553 35518 -99765 -103000 -36224 3430 -38029 -93421 -89343 -57295 -165699 -100448 -9998
3417 -9998 -75725 -174459 -97352 -74012 -24677 -59354 -499 35546 37441 27217 67656 60335
3405 60335 53797 -9063 -12161 -70441 -40045 -41681 -73798 -20603 5942 17658 21245 75247 68821
3392 68821 138331 43855 184495 36849 29794 -45575 28746 -36509 16319 175343 168849 210952
3380 210952 283121 304527 460637 487031 603756 634566 676627 813485 845903 882629 1047904
3369 1047904 1104935 1539314 2110576 3315125 4910839 6569486 7457310 7348917 7184772
3360 7184772 6533135 5532353 4448803 3460611 2726238 1976897 1533192 1257168 1055231
3351 1055231 865843 839434 737391 781146 687364 634288 511255 512628 561258 549069 459034
3340 459034 409839 390052 392891 251987 169606 90800 190631 219508 179520 127826 179347 214647
3328 214647 152775 212137 216973 274390 261036 334475 239376 264124 162202 207003 128291 168845
3316 168845 274478 252480 333371 477579 591590 508102 598004 626527 704974 747228 865495
3305 865495 1053655 1346246 1972652 3264777 5047760 6672261 6762182 6629635 6441982
3296 6441982 5616284 4595103 3531551 2792461 1959131 1656183 1184744 1046471 917463
3287 917463 808653 588300 476135 486681 414250 365869 442647 260591 219718 179357 215762
3276 215762 197026 34406 106193 193231 235970 214648 166427 78661 -6971 54589 215321
3265 215321 91538 113749 75235 96272 19215 52421 39868 54249 59304 41449 119707 64320
3253 64320 24941 -29719 88308 -55886 -80537 -13858 87877 -81784 -50272 -22882 57557
3242 57557 -89107 -161312 -45767 -44160 -81824 13540 -61662 -144628 -83212 -124303 -227921
3231 -227921 -120787 -103137 -115857 -130828 -144126 -135502 -76235 -174622 -191665 -86623 -232419
3220 -232419 -119132 -155319 -71521 -180317 -224272 -79329 -251808 -90947 -173759 -126683 -78867
3209 -78867 -4751 -191539 -56374 -170814 -137523 -53761 -22353 -143628 -72015 -118485 -121975
3198 -121975 -70182 -46345 -185680 -154078 -161773 -164363 -121175 -112004 -92324 -166940 -172010 -166261
3186 -166261 -196471 -218941 -152232 -185976 -283682 -289075 -244802 -184421 -165528 -250547 -162239 -227162
3174 -227162 -290361 -172878 -196421 -235341 -183276 -131854 -283652 -126773 -196844 -274757 -292512
3163 -292512 -77177 -240023 -142933 -187066 -177188 -143384 -111320 -174022 -106714 -137467 -125000
3152 -125000 -243618 -211726 -262365 -242967 -184117 -172924 -236847 -229208 -199415 -220069 -104763
3141 -104763 -118643 -111978 -166560 -142019 -47622 -160493 -239326 -270392 -242605 -186728 -166459 -181138
3129 -181138 -129546 -200896 -99984 -211398 -110900 -187940 -136216 -272820 -137083 -213634 -130135
3118 -130135 -161865 -162211 -231210 -109568 -273696 -243227 -242238 -234808 -313033 -309333 -162825 -111024
3106 -111024 -113885 -255196 -265043 -228042 -222065 -189246 -173702 -302282 -246939 -203627 -173002 -259389
3094 -259389 -288045 -187409 -278389 -223053 -126646 -175260 -196759 -230906 -224582 -204310 -292887 -217863
3082 -217863 -302806 -288548 -338353 -139519 -125381 -166982 -205181 -164408 -164628 -166703 -131235 -254794
3070 -254794 -314850 -212492 -207764 -219115 -298640 -227455 -149163 -242414 -146816 -150649 -220303 -322955
3058 -322955 -156156 -183972 -258484 -111663 -94662 -314712 -196441 -232803 -205124 -212144 -241286
3047 -241286 -208764 -247209 -190752 -236346 -266312 -316887 -343111 -317133 -167784 -346336 -413039
3036 -413039 -327589 -188165 -255934 -150135 -209396 -193787 -112984 -244755 -282147 -222356 -242625
3025 -242625 -300138 -254049 -307619 -252560 -173617 -171358 -123604 -95287 -219653 -191300 -154650 -190895
3013 -190895 -263074 -161815 -98338 -101435 -95882 -162498 -115913 -78559 -76432 -69002 -217003 -267973
3001 -267973 -250196 -242988 -262562 -355269 -342204 -376338 -260709 -391625 -335653 -263982 -298714
2990 -298714 -321722 -296127 -215489 -282813 -187174 -288793 -254214 -291165 -246279 -181374 -243793
2979 -243793 -290954 -150047 -221121 -194586 -201053 -267330 -245569 -220142 -184772 -157361 -299533
2968 -299533 -232237 -211534 -192715 -292182 -242883 -254667 -229465 -192229 -148415 -330468 -209229
2957 -209229 -222304 -236371 -357175 -280891 -269117 -315072 -289623 -257640 -225755 -200475 -248208
2946 -248208 -110075 -147819 -246294 -324995 -223454 -205307 -198278 -354202 -333602 -281569 -136065
2935 -136065 -220464 -178858 -109889 -181252 -188913 -130996 -203053 -196534 -211800 -245114 -257608 -223137
2923 -223137 -88170 -224306 -184261 -376621 -238280 -250804 -221182 -237844 -239336 -234639 -303012
2912 -303012 -210453 -257289 -337661 -262295 -118766 -172195 -232755 -175072 -258090 -282331 -239455
2901 -239455 -310306 -295150 -190714 -203137 -291874 -344076 -294480 -298802 -199869 -262661 -288603 -165853
2889 -165853 -270764 -158197 -152986 -294364 -312341 -285091 -258935 -266252 -215218 -307706 -277945
2878 -277945 -270227 -250788 -346197 -225010 -206165 -177532 -146941 -284575 -207529 -243790 -254611
2867 -254611 -166781 -223935 -230599 -325439 -285159 -213895 -284736 -39644 -268045 -234175 -277896
2856 -277896 -90131 -257407 -145412 -173000 -229399 -312490 -268253 -265435 -274876 -145641 -339702
2845 -339702 -291187 -244396 -203471 -376884 -376541 -254656 -279464 -254550 -208973 -214625 -270712 -261871
2833 -261871 -266634 -294159 -246594 -240193 -150948 -208056 -224771 -200303 -318537 -265817 -303920 -328310
2821 -328310 -275515 -266100 -144894 -308846 -348034 -209765 -182583 -239587 -215722 -177173 -153447
2810 -153447 -311989 -227916 -221392 -322832 -174608 -252160 -239208 -168404 -122350 -147375 -378884
2799 -378884 -181668 -309363 -333819 -342174 -250947 -305676 -341963 -229079 -266072 -205371 -302980
2788 -302980 -258014 -274698 -266350 -332433 -228819 -243247 -180494 -190224 -204680 -278772 -288462 -202556
2776 -202556 -208635 -313408 -315593 -269069 -277852 -352469 -343033 -162730 -238962 -297339 -200560 -376895
2764 -376895 -356130 -282173 -220341 -259647 -312176 -157303 -245327 -266312 -282626 -291288 -235881 -278287
2752 -278287 -216248 -193440 -281371 -253848 -378804 -282336 -401297 -288718 -223902 -301238 -214313
2741 -214313 -192987 -374244 -214860 -282298 -250557 -241806 -367032 -215659 -206079 -363469 -300461
2730 -300461 -323092 -275438 -334996 -304340 -272854 -249935 -402461 -286973 -179838 -238850 -137125
2719 -137125 -271941 -220863 -260313 -182158 -232923 -273100 -446960 -318245 -313711 -265196 -365983
2708 -365983 -278153 -289915 -289081 -242683 -225860 -261968 -256433 -188008 -222814 -93400 -183342 -276086
2696 -276086 -204500 -235665 -214440 -312603 -319438 -445897 -409386 -357795 -347416 -393668 -418665 -276682
2684 -276682 -183824 -264256 -300399 -275034 -269040 -262704 -324064 -334038 -395629 -227898 -117905 -190245
2672 -190245 -273700 -238572 -167153 -176152 -147802 -190001 -245303 -338202 -252339 -239295 -239130 -346341
2660 -346341 -262638 -287077 -187818 -318947 -294616 -264205 -253037 -220606 -188516 -350636 -219572
2649 -219572 -257500 -246416 -274340 -333167 -276810 -277837 -398599 -271453 -315925 -344905 -263022
2638 -263022 -213363 -282793 -369589 -202234 -371127 -281217 -303037 -279202 -312592 -293824 -222781
2627 -222781 -233928 -276251 -282063 -199922 -306629 -380327 -353601 -296271 -316575 -177461 -221476
2616 -221476 -204899 -247858 -185183 -170128 -154705 -166556 -333176 -276637 -300718 -255187 -299883
2605 -299883 -406531 -357967 -380630 -226765 -265816 -257202 -252382 -285780 -270171 -232843 -237858 -334692
2593 -334692 -227074 -279829 -275773 -346444 -231084 -394582 -455365 -301002 -430306 -256614 -274179
2582 -274179 -252985 -252402 -299345 -313434 -253534 -188682 -207217 -253709 -233728 -304295 -275890 -294628
2570 -294628 -288573 -317662 -272435 -139408 -128984 -164333 -217688 -124889 -249582 -133358 -144508
2559 -144508 -132788 -275762 -189370 -241386 -363311 -338017 -278316 -313615 -309658 -299308 -283224
2548 -283224 -296288 -354495 -248682 -339342 -258379 -264401 -235592 -214254 -357454 -235434 -262609
2537 -262609 -129115 -219228 -313645 -247147 -335321 -273587 -355315 -286265 -289599 -441938 -258224
2526 -258224 -175077 -235708 -177283 -262361 -277703 -290551 -221471 -250463 -319868 -297759 -208292 -156383
2514 -156383 -243776 -275987 -275856 -368368 -296642 -296184 -278420 -186084 -246732 -296644 -354855 -177681
2502 -177681 -286475 -314408 -243699 -287753 -303972 -293448 -243525 -319223 -293784 -310108 -232327
2491 -232327 -268117 -260916 -237019 -294051 -353030 -176507 -256996 -243923 -271810 -134968 -198122
2480 -198122 -246615 -297882 -344738 -353427 -363620 -316534 -300085 -367745 -234837 -313400 -316077 -292583
2468 -292583 -183013 -240689 -200437 -318409 -217930 -146968 -199807 -268065 -250276 -274521 -225240
2457 -225240 -282404 -347035 -312970 -367167 -306803 -275983 -247643 -149855 -219914 -275519 -171512
2446 -171512 -250630 -243608 -385821 -316327 -382875 -338673 -410473 -247236 -425021 -302892 -351507
2435 -351507 -329354 -310879 -197205 -272280 -325273 -314560 -154386 -184746 -213525 -341348 -305331
2424 -305331 -328342 -270213 -220939 -246613 -377381 -360658 -397555 -294077 -318199 -175225 -320573
2413 -320573 -260137 -270530 -232865 -241508 -267526 -299969 -331115 -176653 -269423 -190438 -235251 -297951
2401 -297951 -318642 -313285 -241624 -203833 -287232 -330069 -267574 -338175 -274040 -358474 -374176 -420765
2389 -420765 -454262 -308483 -302046 -386468 -287966 -319226 -385536 -336934 -344801 -239217 -340957
2378 -340957 -312303 -296292 -260021 -407241 -367105 -329464 -409869 -343017 -348014 -322376 -370134 -375937
2366 -375937 -318335 -284926 -279178 -192054 -288294 -352888 -340880 -235390 -333800 -360959 -329032 -260649
2354 -260649 -337812 -306976 -293445 -252865 -277540 -178376 -247344 -261920 -226191 -231749 -202661 -278973
2342 -278973 -347453 -241032 -432902 -213975 -373853 -330687 -343021 -342752 -270384 -316026 -358808
2331 -358808 -363327 -175649 -231762 -285568 -237639 -405858 -312596 -255583 -271567 -329612 -395770
2320 -395770 -375545 -269168 -357891 -219332 -236771 -358044 -286089 -358237 -254030 -362287 -370065
2309 -370065 -352381 -266060 -224349 -327809 -214737 -377820 -227822 -351686 -208966 -349001
2299 -349001 -184005 -315081 -253112 -308054 -237536 -163540 -180544 -111151 -201431 -249711 -267140
2288 -267140 -196133 -202059 -378843 -357659 -280392 -332915 -246280 -256442 -235609 -359871 -300256
2277 -300256 -257204 -262210 -382420 -331279 -393879 -295476 -329074 -230881 -303839 -327725 -390157 -316053
2265 -316053 -248435 -387112 -186746 -271733 -307125 -345874 -222675 -314812 -251912 -266334 -228307
2254 -228307 -360395 -279168 -333930 -401604 -324728 -419788 -282710 -300434 -215656 -225561 -377771
2243 -377771 -232792 -193085 -244614 -199437 -274768 -271441 -209171 -352836 -277652 -262233 -300634
2232 -300634 -219059 -334294 -337812 -246929 -290341 -312730 -319770 -311567 -462718 -377120 -437605 -346144
2220 -346144 -378529 -300622 -343594 -337175 -431854 -332829 -362994 -300171 -357822 -307015 -285968 -283488
2208 -283488 -267023 -323824 -330118 -195133 -294893 -331444 -192743 -306814 -309215 -396143 -278139
2197 -278139 -345084 -241969 -251632 -149582 -192082 -287139 -327334 -146170 -279782 -230020 -307168
2186 -307168 -261476 -264503 -328842 -266058 -330314 -327295 -306788 -234873 -192610 -295858 -193060 -318985
2174 -318985 -418669 -326271 -315558 -234152 -286111 -311557 -347982 -388421 -320102 -336895 -398393 -325543
2162 -325543 -289233 -349140 -169266 -298888 -182891 -260275 -324234 -312285 -289804 -443647 -329655
2151 -329655 -261818 -305778 -339223 -304534 -379526 -340491 -246619 -272539 -213524 -267672 -274789 -240063
2139 -240063 -351971 -378595 -267936 -212513 -311396 -232524 -250516 -376563 -354208 -296225 -284898
2128 -284898 -262436 -312337 -304215 -282355 -329150 -290421 -304777 -349430 -361772 -295947 -310940 -286861
2116 -286861 -206897 -266354 -192246 -237904 -207050 -333208 -249279 -339481 -354440 -292279 -263901
2105 -263901 -364603 -323352 -220559 -195544 -307844 -238237 -290815 -332397 -289136 -259488 -353411
2094 -353411 -291715 -279357 -281496 -278946 -213509 -359321 -353614 -260992 -320470 -368941 -202231 -347119
2082 -347119 -306861 -369527 -243002 -332802 -193815 -249335 -351736 -237765 -260249 -287160 -220031
2071 -220031 -314775 -300065 -346712 -364550 -432863 -284360 -325625 -366629 -428717 -330085 -253867
2060 -253867 -305171 -307993 -206865 -269074 -278947 -355135 -354205 -342240 -317394 -391169 -323227 -331229
2048 -331229 -415489 -359296 -339790 -387381 -269338 -306762 -298282 -322684 -220739 -253418 -256799 -288073
2036 -288073 -302950 -343652 -264332 -321679 -216676 -264516 -216058 -191365 -208250 -311026 -198037
2025 -198037 -254883 -268396 -316102 -167291 -285394 -288005 -314493 -298268 -361296 -314458 -307059 -241522
2013 -241522 -207322 -391893 -358384 -287638 -334760 -386447 -268034 -351110 -284438 -335580 -344930
2002 -344930 -380045 -328336 -247691 -440303 -297356 -322026 -248047 -296947 -337844 -372863 -383257
1991 -383257 -400153 -422441 -318962 -329448 -382163 -316039 -273775 -418124 -274880 -249532 -288899
1980 -288899 -299058 -260484 -270726 -300662 -309573 -325661 -368755 -363006 -241382 -243811 -291041 -298044
1968 -298044 -273993 -322406 -326606 -241267 -359196 -427225 -298625 -241351 -343729 -430376 -361835
1957 -361835 -305279 -286480 -266278 -299110 -333760 -291586 -273963 -301447 -394293 -351560 -273817 -328448
1945 -328448 -409249 -243617 -354110 -296649 -309579 -311673 -318724 -332304 -252815 -352452 -417223 -416562
1933 -416562 -359694 -325566 -359360 -360562 -263497 -377029 -216558 -319760 -297401 -275406 -241233
1922 -241233 -248192 -268680 -323202 -253135 -312177 -404384 -356485 -319314 -364382 -395325 -273060 -319847
1910 -319847 -325479 -315198 -321964 -323006 -322912 -370384 -341127 -373679 -369483 -319650 -307874 -357604 -369892
1897 -369892 -343198 -400776 -314633 -234033 -290965 -262923 -150049 -337021 -342582 -363849 -386752
1886 -386752 -322148 -337433 -222158 -277122 -322787 -380779 -381637 -208126 -275551 -260491 -309603 -282226
1874 -282226 -276082 -364986 -289564 -320869 -256961 -377204 -240176 -330747 -328718 -270338 -366710 -280061
1862 -280061 -376906 -403569 -338685 -389401 -297911 -355426 -367436 -392981 -394961 -306512 -289748 -288454
1850 -288454 -377249 -349860 -357667 -377087 -442633 -282089 -311567 -332696 -258607 -258817 -265299 -236496
1838 -236496 -253151 -334375 -342207 -299896 -330821 -332072 -356653 -483207 -225557 -422229 -334400
1827 -334400 -345970 -210323 -388684 -238251 -358469 -283716 -278064 -273305 -264299 -338640 -336881 -329781
1815 -329781 -278865 -381270 -409751 -383653 -338610 -380196 -164032 -303259 -244376 -317217 -222980
1804 -222980 -323628 -269218 -192995 -272116 -410010 -303034 -243630 -321834 -251318 -304586 -308391
1793 -308391 -405451 -412118 -307366 -401670 -319498 -265691 -273042 -369534 -163296 -283914 -331762
1782 -331762 -265934 -284553 -368086 -258481 -384873 -304563 -274234 -464212 -303074 -248560 -375703
1771 -375703 -340900 -202266 -371410 -371155 -197341 -354345 -292690 -438221 -227759 -428588 -364743
1760 -364743 -342503 -261330 -388143 -352684 -349567 -339080 -416806 -410064 -279707 -333419 -362707 -257817
1748 -257817 -246680 -336777 -305524 -345274 -334675 -352205 -235185 -429771 -392412 -297251 -344251
1737 -344251 -317682 -393538 -163568 -376213 -329112 -189344 -252054 -369709 -271856 -286210 -203754
1726 -203754 -380052 -281503 -361690 -431775 -393100 -303974 -183607 -261177 -383691 -230619 -436156
1715 -436156 -255419 -410257 -327777 -333829 -355972 -329870 -348942 -426726 -172496 -366477 -475952
1704 -475952 -503864 -317874 -349780 -388088 -374158 -320548 -353848 -399904 -353539 -331342 -410553
1693 -410553 -325336 -321905 -431817 -368735 -254700 -354307 -363446 -313920 -97765 -374555 -274917
1682 -274917 -394491 -270362 -281289 -350251 -336101 -337804 -403434 -410965 -218798 -296805 -396856
1671 -396856 -370320 -428614 -339926 -278386 -336593 -299938 -310934 -307496 -312882 -366235 -361197 -455412
1659 -455412 -377807 -340479 -372742 -332816 -316274 -283077 -371229 -418313 -346619 -365585 -424731 -390971
1647 -390971 -313006 -396770 -354744 -457594 -354737 -353358 -302150 -293646 -249882 -336309 -260736 -309897
1635 -309897 -312972 -281935 -262721 -145832 -220721 -340593 -263472 -232893 -219314 -337987 -349229
1624 -349229 -266666 -295388 -296122 -221332 -322109 -352976 -337549 -314984 -272165 -241605 -399972 -390854
1612 -390854 -406204 -385307 -341242 -348599 -333765 -434944 -347794 -285472 -444160 -420607 -503751
1601 -503751 -356043 -416061 -342879 -333704 -315078 -262816 -321735 -279813 -235693 -280971 -282441 -334584
1589 -334584 -161443 -401863 -285674 -276846 -255967 -347989 -211288 -311867 -224029 -262951 -412490
1578 -412490 -319995 -347568 -341105 -382904 -354341 -342827 -199620 -290135 -288962 -350514 -395281 -351279
1566 -351279 -330873 -446311 -394924 -360725 -400891 -362303 -432830 -398061 -244886 -304787 -308404
1555 -308404 -320084 -204350 -367756 -283476 -424640 -349367 -419313 -426220 -444314 -403119 -526652
1544 -526652 -378444 -402027 -323815 -224896 -192093 -386955 -208063 -186660 -230811 -223386 -313917
1533 -313917 -285278 -369417 -346839 -371584 -347427 -409963 -288451 -383857 -388799 -346839 -225046
1522 -225046 -388345 -292526 -321323 -389026 -396134 -356493 -204228 -418691 -387649 -306154 -265637
1511 -265637 -533643 -349893 -337254 -372898 -234387 -273936 -401548 -389742 -334995 -342265 -338619
1500 -338619 -323551 -359282 -285698 -406242 -457970 -321972 -345613 -413112 -270617 -279971 -380959
1489 -380959 -382792 -234871 -266654 -339892 -274944 -182337 -275803 -210762 -322241 -270612 -296274
1478 -296274 -270126 -231173 -362752 -342410 -319713 -313008 -294881 -368190 -315302 -405502 -333746 -360043
1466 -360043 -157611 -283128 -326798 -332500 -294058 -405559 -250787 -358495 -343469 -309647 -256724
1455 -256724 -349401 -382660 -360605 -414378 -307553 -332958 -278321 -298437 -325981 -327456 -357856 -329227
1443 -329227 -311686 -379597 -383308 -326215 -195235 -353566 -394506 -268964 -291790 -378627 -332322
1432 -332322 -285076 -247035 -453524 -367008 -288927 -284960 -241149 -348074 -303531 -319174 -258693
1421 -258693 -300116 -191837 -402397 -312394 -416905 -291007 -360555 -301560 -381721 -366862 -435540
1410 -435540 -438632 -404265 -397434 -400438 -396241 -282257 -283697 -435694 -365544 -325877 -275481 -453965
1398 -453965 -222647 -311703 -377376 -402729 -278946 -297805 -250175 -420046 -287615 -261502 -258133
1387 -258133 -376106 -450111 -380389 -408466 -375567 -247721 -164657 -204223 -284568 -363601 -308100
1376 -308100 -274850 -315430 -405122 -320502 -290148 -343331 -317185 -368089 -444524 -317514 -451806
1365 -451806 -359174 -375793 -321437 -344319 -376743 -359546 -501601 -398727 -320404 -421804 -460892
1354 -460892 -430636 -332781 -420789 -348738 -347102 -334042 -244185 -272090 -211103 -330780 -266316 -264070
1342 -264070 -302984 -350895 -348623 -423875 -332813 -281998 -317120 -319247 -291963 -400344 -358993 -328564
1330 -328564 -317691 -243747 -359204 -253335 -313677 -305509 -322469 -420190 -430389 -389521 -333020
1319 -333020 -427075 -265642 -372504 -365294 -277597 -294587 -357742 -353680 -374082 -299843 -284615 -316348
1307 -316348 -415424 -414157 -277956 -421242 -321695 -329365 -449989 -438560 -447972 -448459 -448710 -392445
1295 -392445 -397376 -279820 -205072 -433738 -386455 -267469 -352734 -331606 -360795 -365671 -332816
1284 -332816 -277410 -374568 -402363 -430806 -325103 -296476 -307115 -393163 -304433 -272216 -297186
1273 -297186 -383677 -302662 -436435 -375289 -316953 -424182 -349285 -303326 -358177 -365192 -383912
1262 -383912 -242955 -308464 -372215 -390784 -311920 -369149 -366782 -395031 -334819 -348598 -316004 -279515
1250 -279515 -342383 -296874 -484939 -310317 -372978 -369599 -351912 -265597 -387578 -382401 -318409
1239 -318409 -368981 -405730 -403290 -461026 -396119 -280215 -297229 -356674 -361310 -258960 -274313 -273088
1227 -273088 -303169 -339400 -399951 -271042 -340627 -199605 -251952 -495735 -395053 -440076 -430398
1216 -430398 -385596 -334572 -523264 -438798 -386005 -275006 -383017 -345677 -356341 -266235 -259551
1205 -259551 -206178 -315932 -348222 -383007 -388406 -373666 -300422 -340149 -255810 -377924 -398358
1194 -398358 -248358 -304391 -305870 -313874 -283023 -243424 -286672 -255451 -291813 -468938 -457657 -443818
1182 -443818 -455340 -409831 -360628 -397647 -301459 -196866 -229973 -245702 -382902 -247258 -230491
1171 -230491 -334591 -278267 -337700 -367505 -289307 -376130 -301880 -439940 -388745 -441109 -464853
1160 -464853 -429879 -267553 -439578 -430232 -450672 -388041 -426058 -432841 -429753 -306932 -352957 -346580
1148 -346580 -379991 -341320 -293469 -299379 -331015 -313112 -254759 -227470 -308784 -362697 -269645 -269298
1136 -269298 -271331 -291828 -295896 -348114 -393685 -420689 -341502 -412240 -401631 -381778 -328709 -277594
1124 -277594 -378319 -381482 -440174 -355480 -250138 -271366 -282761 -310836 -290709 -352424 -347558 -290465
1112 -290465 -369036 -402172 -353131 -443877 -421532 -367281 -404753 -481817 -487815 -317323 -399608 -367799
1100 -367799 -382527 -429995 -546349 -412516 -353454 -443571 -464464 -336279 -314673 -296937 -388466
1089 -388466 -266954 -320309 -372944 -233880 -287422 -218038 -311914 -388707 -407356 -448620 -373913
1078 -373913 -350194 -307520 -427983 -362796 -260161 -309166 -408165 -305815 -422422 -349056 -317637
1067 -317637 -333276 -266428 -424896 -383003 -330817 -429190 -428326 -356348 -234297 -273383 -198244 -226169
1055 -226169 -343353 -348948 -463550 -265612 -319799 -399722 -394323 -396430 -296315 -528731 -368948
1044 -368948 -425833 -427177 -424523 -367691 -410940 -401068 -428457 -367819 -382454 -256697 -338802 -406083
1032 -406083 -279005 -234534 -415745 -362723 -412510 -211718 -313573 -322167 -404580 -419020 -258790
1021 -258790 -322613 -375089 -414137 -429706 -281334 -334490 -309076 -405498 -427645 -335623 -422584
1010 -422584 -394342 -361009 -465170 -360417 -375744 -391598 -352595 -388169 -193562 -278524 -349134
999 -349134 -236347 -361687 -327084 -303636 -332630 -433420 -346890 -321359 -505480 -346091 -416722
988 -416722 -433144 -405005 -438537 -372794 -373356 -338099 -375817 -371365 -306146 -375473 -408057 -427014
976 -427014 -405069 -355553 -352571 -368604 -350712 -292001 -398313 -327724 -358597 -251974 -389134
965 -389134 -269360 -400128 -330088 -486058 -230259 -417060 -417782 -476519 -392123 -431421 -368244
954 -368244 -377770 -242901 -397969 -389567 -246252 -339164 -232155 -319501 -486234 -356888 -361892
943 -361892 -226066 -290338 -266930 -289276 -387858 -284896 -286214 -358260 -478707 -511711 -334394
932 -334394 -439490 -406424 -263855 -327544 -339773 -376203 -257642 -335299 -379137 -439980 -432151
921 -432151 -260992 -307900 -223515 -344181 -234606 -288300 -339882 -256376 -311851 -442946 -399352
910 -399352 -433425 -317742 -255985 -369030 -362061 -382321 -311183 -304828 -444938 -428152 -489109 -398739
898 -398739 -309900 -318810 -315977 -336297 -313833 -272758 -237842 -260599 -371687 -317694 -343941 -386348
886 -386348 -232020 -424831 -447144 -302759 -446547 -353514 -360504 -313863 -396722 -411632 -440168
875 -440168 -432449 -478187 -447786 -507035 -442114 -462404 -318077 -309673 -285928 -297880 -437883 -417751
863 -417751 -421356 -397992 -423888 -298791 -391077 -381536 -376810 -418956 -331377 -323733 -430519 -338204
851 -338204 -365854 -378368 -390180 -492428 -363023 -387704 -292837 -422338 -284540 -253608 -338319
840 -338319 -316235 -361240 -388058 -251589 -274154 -272960 -241184 -301226 -327171 -334976 -358836 -326404
828 -326404 -373536 -300202 -408938 -345951 -324512 -355683 -312240 -417148 -471124 -398435 -425091
817 -425091 -330515 -449807 -443506 -370988 -383223 -302532 -426857 -342812 -297927 -473243 -248818
806 -248818 -327880 -269009 -444342 -414632 -437713 -286889 -339738 -342094 -300171 -335708 -426823 -424829
794 -424829 -372484 -411334 -234870 -387848 -300045 -270510 -206905 -387239 -347956 -345932 -289024
783 -289024 -247396 -359402 -361551 -323789 -571506 -338282 -344285 -446051 -419233 -350744 -381870
772 -381870 -354721 -348967 -409246 -419413 -322727 -376243 -314351 -300442 -508396 -315835 -416263
761 -416263 -446252 -279757 -395713 -421828 -319672 -191262 -282345 -418895 -360065 -425520 -365789
750 -365789 -235747 -302016 -219226 -299290 -334679 -286954 -356263 -364228 -327265 -346039 -309311 -295426
738 -295426 -295723 -361117 -339937 -269873 -415260 -438265 -423192 -418409 -507860 -420933 -338894 -465547
726 -465547 -376909 -389135 -502262 -438438 -310933 -338518 -487632 -393675 -450906 -419552 -475753
715 -475753 -366542 -274750 -409253 -463314 -359602 -460988 -384758 -396935 -371295 -309475 -379534
704 -379534 -301952 -307356 -369181 -359093 -349949 -447711 -292856 -435356 -306960 -334274 -234965 -391065
692 -391065 -220391 -348556 -354203 -379981 -273545 -231663 -171888 -317489 -318516 -334325 -250429
681 -250429 -317960 -266236 -221475 -338312 -368437 -426498 -426600 -341480 -501797 -383137 -483963
670 -483963 -436377 -428503 -373453 -362344 -470078 -505740 -372094 -423818 -411364 -490473 -375507
659 -375507 -393022 -324456 -398904 -209560 -379861 -323052 -364053 -252715 -362024 -358594 -347975
648 -347975 -358256 -448125 -361510 -355360 -443542 -328530 -316987 -315351 -332305 -348587 -314594 -386478
636 -386478 -296799 -345097 -194887 -308231 -272516 -277094 -286486 -247013 -290776 -283310 -425627 -188119
624 -188119 -332438 -427872 -429114 -361139 -364050 -408734 -324647 -326974 -430173 -413918 -361896 -504726
612 -504726 -489487 -467175 -360182 -353418 -355630 -331217 -301898 -414187 -265999 -380919 -472984
601 -472984 -417151 -349056 -296036 -343605 -388533 -375641 -417895 -368251 -423874 -353799 -379275 -397797
589 -397797 -437299 -365791 -382245 -371610 -384845 -422875 -416319 -389501 -408468 -387137 -291188 -438835
577 -438835 -399865 -277637 -308967 -352715 -373312 -386630 -514330 -300934 -422821 -375695 -416601
566 -416601 -492849 -459805 -405187 -474294 -466943 -455732 -396381 -350789 -322189 -434221 -409677 -345521
554 -345521 -423601 -212440 -395521 -303242 -424216 -419631 -166840 -350213 -288983 -316623 -419425
543 -419425 -373284 -325310 -304954 -278833 -224595 -158786 -308787 -293628 -371459 -299898 -428290
532 -428290 -473107 -398914 -355453 -439997 -352083 -443659 -483704 -465631 -284697 -340389 -344676 -336879
520 -336879 -252367 -390071 -380578 -316443 -307715 -376649 -345699 -315391 -524453 -331612 -437976
509 -437976 -372975 -341457 -426545 -404219 -390067 -459333 -414222 -336009 -398806 -345714 -343123 -402723
497 -402723 -317853 -406926 -454681 -271612 -423655 -271625 -411450 -375550 -247474 -277224 -239701
486 -239701 -286492 -317838 -352214 -305797 -390473 -477870 -486144 -295876 -504498 -394390 -365151
475 -365151 -464209 -359361 -297864 -312438 -238555 -267182 -237406 -377184 -369113 -472352 -307775
464 -307775 -335905 -324758 -350370 -332530 -388166 -332146 -413429 -322239 -466869 -343021 -243392
453 -243392 -336534 -216303 -364788 -460437 -360904 -409493 -382269 -543520 -338579 -419660 -343473
442 -343473 -429040 -421365 -406652 -389743 -279064 -257833 -415266 -396841 -290209 -366391 -358862 -351786
430 -351786 -341408 -429495 -318177 -406648 -320194 -435142 -362705 -358996 -357293 -394110 -379399 -361620
418 -361620 -341362 -306058 -393741 -275603 -349772 -404193 -366184 -421094 -315519 -406756 -344208
407 -344208 -374119 -286869 -284255 -412679 -330294 -408319 -417783 -383715 -394291 -338350 -322769 -480225
395 -480225 -396380 -372815 -336675 -348160 -227224 -390628 -513525 -328890 -358332 -420703 -411561
384 -411561 -464556 -340815 -341585 -333318 -264441 -414782 -428354 -385595 -502712 -427313 -299081 -439393
372 -439393 -277847 -354588 -374344 -342201 -250536 -324363 -379428 -305284 -384924 -317302 -419263
361 -419263 -384745 -515733 -456926 -302438 -313974 -392704 -360775 -413764 -375082 -390538 -297613
350 -297613 -286464 -252254 -296995 -316697 -401652 -374693 -435745 -354500 -453532 -381049 -388043 -456967
338 -456967 -359409 -369214 -317741 -362460 -343542 -343593 -306233 -379103 -373723 -312076 -441305 -410231 -435537
325 -435537 -371703 -446841 -480543 -407197 -344858 -535071 -444704 -363661 -362253 -340286 -318127 -438271
313 -438271 -292075 -324683 -282753 -403462 -325224 -457309 -377847 -413067 -301161 -385748 -400166
302 -400166 -448406 -418196 -582822 -446874 -307159 -368032 -414393 -360110 -322746 -280015 -409682
291 -409682 -355513 -449503 -425124 -398787 -412006 -460644 -435758 -504378 -355833 -348824 -343319 -373096
279 -373096 -377455 -390072 -388945 -326270 -420668 -392427 -365433 -358631 -334222 -419634 -380049 -534026
267 -534026 -450288 -341644 -302517 -265571 -263719 -283088 -335178 -271797 -206754 -341530 -404119 -317911
255 -317911 -412115 -354796 -441602 -349487 -441347 -402768 -427379 -423544 -404561 -386069 -247178 -391284
243 -391284 -425758 -400852 -366309 -498530 -393222 -478941 -387425 -327527 -399499 -425895 -415475
232 -415475 -554769 -408824 -417970 -466304 -406376 -385925 -430473 -493101 -449347 -359006 -357185 -472137
220 -472137 -370215 -440859 -389473 -493331 -493372 -420954 -468809 -388447 -305047 -452655 -376027 -299404
208 -299404 -349529 -496770 -345398 -262421 -357822 -289850 -304714 -302050 -370115 -343837 -346282 -262936
196 -262936 -319074 -364726 -445045 -394597 -407916 -374936 -446522 -367600 -433055 -445774 -495806 -488678
184 -488678 -404373 -435897 -538316 -499608 -401175 -395543 -450847 -380021 -336421 -492348 -519340 -536795
172 -536795 -478381 -503251 -522115 -422940 -611203 -467483 -487296 -474932 -539912 -403092 -483568
161 -483568 -508706 -364841 -528668 -493469 -405212 -481336 -506725 -432209 -446478 -493967 -344582
150 -344582 -486320 -514404 -434990 -415572 -445935 -343425 -481394 -446463 -467086 -440691 -485170
139 -485170 -512681 -465123 -412641 -535590 -505772 -565182 -527970 -473317 -420129 -523276 -505404
128 -505404 -562874 -504226 -556486 -550234 -525794 -536934 -497155 -506002 -531796 -488408 -538965 -545090
116 -545090 -526993 -518427 -516487 -486090 -639377 -579098 -630375 -617828 -553181 -541081 -600587 -499747
104 -499747 -532573 -554235 -555464 -585560 -560699 -530414 -588680 -660938 -600386 -511347 -507209 -559316
92 -559316 -592453 -600492 -568372 -603644 -578500 -526095 -685613 -673551 -595740 -605936 -631677 -580601
80 -580601 -627149 -669472 -532561 -599145 -665118 -575177 -532969 -674779 -571817 -670038 -575386
69 -575386 -631776 -583446 -572884 -741627 -659753 -535876 -656302 -473558 -633656 -615285 -621688
58 -621688 -654410 -714691 -658041 -799329 -652104 -683149 -660586 -639556 -701382 -731462 -672378 -608940
46 -608940 -660041 -631673 -700912 -668178 -617500 -714902 -787010 -740301 -752353 -734452 -674230 -767711
34 -767711 -679606 -729212 -764494 -680783 -748198 -761290 -741166 -712052 -718393 -764199 -661256 -761978
22 -761978 -768196 -818466 -758778 -776359 -732017 -752224 -636127 -804530 -796738 -746968 -805383 -696155
10 -696155 -784841 -783605 -722287 -770068 -668938 -806484 -796516 -857930 -752445 -704760
0 -704760
$$ Imaginary data points
##PAGE= N=2
##DATA TABLE= (X++(I..I)), XYDATA
16383 -1070678 -893492 -946700 -990706 -845821 -823257 -794241 -722449 -764551 -688838 -685702 -615162
16372 -615162 -516144 -586643 -469110 -462018 -497105 -535428 -545116 -407981 -431143 -341861 -372890
16361 -372890 -330190 -285186 -250695 -312721 -207640 -263925 -178937 -41780 -86320 -118638 -19227
16350 -19227 -22858 121607 47914 178712 110833 227426 292553 276346 250900 285853 279476
16339 279476 396580 333975 380704 320779 464387 370384 435605 482394 535004 539665 641321
16328 641321 730868 682567 610212 640537 711483 704130 765725 848180 766852 975522 932734
16317 932734 948553 1007144 988764 1038967 1021540 1026614 1107797 1053692 1150263 1226779 1165591 1177941
16305 1177941 1158456 1308830 1301950 1247146 1383622 1359907 1429849 1402382 1436347 1442926 1505926
16294 1505926 1600898 1683930 1549982 1566483 1639704 1605695 1653834 1740897 1757981 1765206 1664709
16283 1664709 1860994 1756107 1836994 1790851 1863610 1827345 1903577 1934276 1872625 1927167 2072052
16272 2072052 2000478 1949919 2054801 1996590 2131323 2037513 2122910 2128578 2030632 2158107 2256378
16261 2256378 2234952 2253182 2264552 2279902 2304017 2283117 2327477 2299807 2324839 2255106 2425594
16250 2425594 2302741 2372878 2438956 2466962 2403604 2638110 2448363 2515290 2536927 2601729 2602942
16239 2602942 2606943 2704480 2691155 2729221 2756897 2744318 2740493 2791275 2844319 2753967 2830493 2748420
16227 2748420 2788000 2799865 2855916 2897681 2884075 2879025 2864262 2948462 2909212 2904928 2978345 2986408
16215 2986408 2862146 3026784 3008109 3054607 3101283 3120341 3223116 3132886 3026982 3115139
16205 3115139 3168774 3023779 3126271 3091943 3127019 3146735 3221188 3234535 3353952 3116284
16195 3116284 3166778 3188539 3176824 3173447 3242157 3151204 3264858 3179931 3248405 3303264 3458363
16184 3458363 3341280 3375311 3430403 3408158 3397254 3410801 3421258 3390480 3355473 3405561 3512877
$$ [...]
##END NTUPLES=NMR SPECTRUM
##END=
