##TITLE=abcd
##JCAMPDX= 6.0         $$ Bruker NMR JCAMP-DX V2.0
##DATA TYPE= NMR SPECTRUM
##DATA CLASS= NTUPLES
##ORIGIN= UXNMR, Bruker Analytische Messtechnik GmbH
##OWNER= root
$$ XWIN-NMR		Version 3.5
$$ Thu Aug  6 19:20:34 2026 Russian Standard Time (UT+4h)  servis@DPX200
##.OBSERVE FREQUENCY= 200.131235884673
##.OBSERVE NUCLEUS= ^1H
##.ACQUISITION MODE= SIMULTANEOUS
##.ACQUISITION SCHEME= undefined
##.AVERAGES= 16
##.DIGITISER RES= 18
##SPECTROMETER/DATA SYSTEM= spect
##.PULSE SEQUENCE= zg
##.SOLVENT NAME= CDCl3
##.SHIFT REFERENCE= (INTERNAL, CDCl3, 0, 16.4885)
##AUDIT TRAIL= $$ (NUMBER, WHEN, WHO, WHERE, WHAT)
$$ ##TITLE= Audit trail, XWIN-NMR		Version 3.5
$$ ##JCAMPDX= 5.01
$$ ##ORIGIN= Bruker BioSpin GmbH
$$ ##OWNER= servis
$$ F:\spectra/data/av/nmr/H1/1/pdata/1/auditp.txt
$$ ##AUDIT TRAIL=  $$ (NUMBER, WHEN, WHO, WHERE, WHAT)
(   1,<2026-08-06 19:20:10.01 +0400>,<servis>,<DPX200>,
      <created by zg, POWCHK disabled, PULCHK disabled
       terminated by command 'halt'
       configuration hash MD5:
       00 E9 B6 7A A2 85 ED C7 34 08 36 98 17 FE 4E 26
       data hash MD5: 32K
       3C 24 6C 2D 48 7E B4 28 45 99 6F B0 EA F4 AE 32>)
(   2,<2026-08-06 19:20:11.82 +0400>,<servis>,<DPX200>,
      <Start of raw data processing
       efp BC_mod = 2 LB = 0.05 FT_mod = 6 PKNL = 1 PHC0 = -413.9518 PHC1 = 3.101563 SI = 16K 
       data hash MD5: 16K
       D6 4A 5F 8E 06 BA 05 21 34 F7 DD FD 5F E7 43 70>)
$$ ##END=
$$ 
$$ hash MD5
$$ A2 82 71 C7 55 4B 0A 88 0B D3 5A 1F 81 8C 9D 82
##$RELAX= 
##$RELAX= 
##$RELAX= 
##$RELAX= 
##$RELAX= 
##$RELAX= 
##$RELAX= 
##$RELAX= 
$$ Bruker specific parameters
$$ --------------------------
##$DU= <F:\spectra>
##$EXPNO= 1
##$NAME= <H1>
##$PROCNO= 1
##$TYPE= <nmr>
##$USER= <av>
##$AMP= (0..31)
100 100 100 100 100 100 100 100 100 100 100 100 100 100 100 100 100 100 
100 100 100 100 100 100 100 100 100 100 100 100 100 100 
##$AQSEQ= 0
##$AQ_mod= 1
##$AUNM= <au_zg>
##$AUTOPOS= <>
##$BF1= 200.13
##$BF2= 200.13
##$BF3= 200.13
##$BF4= 200.13
##$BF5= 500.13
##$BF6= 500.13
##$BF7= 500.13
##$BF8= 500.13
##$BYTORDA= 1
##$CFDGTYP= 0
##$CFRGTYP= 5
##$CHEMSTR= <none>
##$CNST= (0..31)
1 1 145 1 1 1 1 1 1 1 1 1 1 1 1 1 1 1 1 1 1 1 1 1 1 1 1 1 1 1 1 1 
##$CPDPRG= <>
##$CPDPRG1= <>
##$CPDPRG2= <>
##$CPDPRG3= <>
##$CPDPRG4= <mlev>
##$CPDPRG5= <mlev>
##$CPDPRG6= <mlev>
##$CPDPRG7= <mlev>
##$CPDPRG8= <mlev>
##$CPDPRGB= <>
##$CPDPRGT= <>
##$D= (0..31)
0 2 0 0 0 0 0 0 0 0.06 0 0 0 0 0 0 0.0002 0 0 0 0 0 0 0 0 0 0 0 0 0 0 
0 
##$DATE= 1786029609
##$DBL= (0..7)
120 120 120 120 120 120 120 120 
##$DBP= (0..7)
150 150 150 150 150 150 150 150 
##$DBP07= 0
##$DBPNAM0= <>
##$DBPNAM1= <>
##$DBPNAM2= <>
##$DBPNAM3= <>
##$DBPNAM4= <>
##$DBPNAM5= <>
##$DBPNAM6= <>
##$DBPNAM7= <>
##$DBPOAL= (0..7)
0.5 0.5 0.5 0.5 0.5 0.5 0.5 0.5 
##$DBPOFFS= (0..7)
0 0 0 0 0 0 0 0 
##$DE= 6
##$DECBNUC= <off>
##$DECIM= 32
##$DECNUC= <off>
##$DECSTAT= 4
##$DIGMOD= 1
##$DIGTYP= 9
##$DL= (0..7)
0 120 120 120 120 120 120 120 
##$DP= (0..7)
$$ [...]
##$SUBNAM4= <"">
##$SUBNAM5= <"">
##$SUBNAM6= <"">
##$SUBNAM7= <"">
##$SUBNAM8= <"">
##$SUBNAM9= <"">
##$SW= 20.6817932712277
##$SWIBOX= (0..15)
0 0 3 0 0 0 0 0 0 0 0 0 0 0 0 0 
##$SW_h= 4139.07284768212
##$TD= 32768
##$TD0= 1
##$TE= 0
##$TE2= 300
##$TE3= 300
##$TEG= 300
##$TL= (0..7)
0 120 120 120 120 120 120 120 
##$TP= (0..7)
150 150 150 150 150 150 150 150 
##$TP07= 0
##$TPNAME0= <>
##$TPNAME1= <>
##$TPNAME2= <>
##$TPNAME3= <>
##$TPNAME4= <>
##$TPNAME5= <>
##$TPNAME6= <>
##$TPNAME7= <>
##$TPOAL= (0..7)
0.5 0.5 0.5 0.5 0.5 0.5 0.5 0.5 
##$TPOFFS= (0..7)
0 0 0 0 0 0 0 0 
##$TUNHIN= 0
##$TUNHOUT= 0
##$TUNXOUT= 0
##$USERA1= <user>
##$USERA2= <user>
##$USERA3= <user>
##$USERA4= <user>
##$USERA5= <user>
##$V9= 5
##$VALIST= <valist>
##$VCLIST= <CCCCCCCCCCCCCCC>
##$VD= 0
##$VDLIST= <DDDDDDDDDDDDDDD>
##$VPLIST= <PPPPPPPPPPPPPPP>
##$VTLIST= <TTTTTTTTTTTTTTT>
##$WBST= 1024
##$WBSW= 30
##$XGAIN= (0..3)
0 0 0 0 
##$XL= 0
##$YL= 0
##$YMAX_a= 484169
##$YMIN_a= -763826
##$ZGOPTNS= <>
##$ZL1= 120
##$ZL2= 120
##$ZL3= 120
##$ZL4= 120
##$ABSF1= 0
##$ABSF2= 0
##$ABSG= 0
##$ABSL= 0
##$ALPHA= 0
##$AQORDER= 0
##$ASSFAC= 0
##$ASSFACI= 0
##$ASSFACX= 0
##$ASSWID= 0
##$AUNMP= <proc_1d>
##$AZFE= 0.1
##$AZFW= 0.1
##$BCFW= 0
##$BC_mod= 2
##$BYTORDP= 0
##$COROFFS= 0
##$CY= 18.4799938201904
##$DATMOD= 1
##$DC= 0
##$DFILT= <>
##$DTYPP= 0
##$F1P= 9.9274215381318
##$F2P= -0.165520771350173
##$FCOR= 1
##$FTSIZE= 16384
##$FT_mod= 6
##$GAMMA= 0
##$GB= 0
##$INTBC= 1
##$INTSCL= 4.127829e-11
##$ISEN= 128
##$LB= 0.05
##$LEV0= 0
##$LPBIN= 0
##$MAXI= 10000
##$MC2= 0
##$MEAN= 0
##$ME_mod= 0
##$MI= 50
##$NCOEF= 0
##$NC_proc= -5
##$NLEV= 6
##$NOISF1= 3.799351
##$NOISF2= 2.8
##$NSP= 0
##$NTH_PI= 0
##$NZP= 0
##$OFFSET= 16.48848
##$PC= 4
##$PHC0= -413.9518
##$PHC1= 3.101563
##$PH_mod= 1
##$PKNL= yes
##$PPARMOD= 0
##$PSCAL= 4
##$PSIGN= 0
##$REVERSE= no
##$SF= 200.130005582386
##$SI= 16384
##$SIGF1= 3
##$SIGF2= 2
##$SINO= 400
##$SIOLD= 16384
##$SREGLST= <1H.CDCl3>
##$SSB= 0
##$STSI= 16384
##$STSR= 0
##$SW_p= 4139.07284768211
##$SYMM= 0
##$S_DEV= 0
##$TDeff= 32768
##$TDoff= 0
##$TI= <>
##$TILT= no
##$TM1= 0
##$TM2= 0
##$TOPLEV= 0
##$USERP1= <user>
##$USERP2= <user>
##$USERP3= <user>
##$USERP4= <user>
##$USERP5= <user>
##$WDW= 1
##$XDIM= 16384
##$YMAX_p= 389888558
##$YMIN_p= -901667
$$ End of Bruker specific parameters
$$ ---------------------------------
##NTUPLES= NMR SPECTRUM
##VAR_NAME=  FREQUENCY,     SPECTRUM/REAL,   SPECTRUM/IMAG
##SYMBOL=    X,             R,               I
##VAR_TYPE=  INDEPENDENT,   DEPENDENT,       DEPENDENT
##VAR_FORM=  AFFN,          ASDF,            ASDF
##VAR_DIM=   16384,         16384,           16384
##UNITS=     HZ,            ARBITRARY UNITS, ARBITRARY UNITS
##FACTOR=    0.252644378177508, 1,           1
##FIRST=     3299.83951724647, 0,            0
##LAST=      -839.233330435636, 0,           0
##MIN=       -839.233330435636, -901667,     0
##MAX=       3299.83951724647, 389888558,    0
$$ Real data points
##PAGE= N=1
##DATA TABLE= (X++(R..R)), XYDATA
$$ [...]
9401 -6886 -59803 -12823 21522 -74530 -78783 -46521 -18080 9072 -35748 -5526 -59923 -55178
9389 -55178 -83353 -85187 -36416 -33665 -116870 -105749 -34767 -51800 3475 19648 -129770 -95982
9377 -95982 -80775 -80810 -76370 -96960 -91259 -102566 -78071 -109213 -25726 -59987 -120184 -58756 -101503
9364 -101503 -101954 -102970 -98827 -97969 -98745 -148791 -123562 -70661 -126993 -112175 -41735 -128227 -95332
9351 -95332 -15166 -74431 -117665 -109193 -103465 -42837 -159355 -109456 -119231 -102676 -89626 -95393
9339 -95393 -138873 -187047 -54483 -135812 -81156 -163946 -139424 -137874 -97129 -118702 -152092 -93256
9327 -93256 -141647 -132838 -80788 -145875 -202791 -164581 -151458 -177230 -82139 -113391 -54447 -99255
9315 -99255 -168637 -83543 -97155 -67597 -84318 -106332 -45880 -61976 -82168 -111076 -96159 -100788
9303 -100788 -25804 -141270 -21749 -6474 -49195 -64681 -27935 -72841 30860 -84788 -59849
9292 -59849 -85791 -32381 -89218 -29557 3924 1411 -24623 -84531 18616 23661 -41349 -47907
9280 -47907 -21694 -47580 -70023 -17870 -46671 -10100 10230 -16413 -47846 -112281 -79362 -51445
9268 -51445 -110362 -141938 -88480 -28924 -96758 -4394 20999 -53820 -67266 -77276 5605 -56524
9256 -56524 -53359 -125643 -107796 -150777 -47967 -22518 -110647 -73577 -4443 -96381 -121243 -46128
9244 -46128 -122099 -84577 -82369 -78304 -142946 -61787 -75666 -56683 -23267 -88309 -52798 -115564
9232 -115564 -93961 -78453 -92505 -137436 -81200 -118395 -97128 -154073 -114448 -100415 -65937 -105752
9220 -105752 -179746 -60872 -131860 -187263 -108858 -59857 -80294 -74372 -120778 -133713 -149790 -129926
9208 -129926 -215002 -35154 -179901 -152329 -132846 -70953 -60361 -127906 -63140 -102126 -87229
9197 -87229 -28551 -99110 -56098 -103459 -143133 -128526 -55147 -113014 -83687 -79160 -73926 -98923
9185 -98923 -141476 -176819 -151780 -175925 -86045 -51073 -34636 -128131 -155032 -44441 -157551
9174 -157551 -173888 -76385 -53899 -1080 -156368 -90069 -105414 -97834 -46091 -130435 -86295 -131217
9162 -131217 -14420 -74418 -88814 -88193 -83481 -136122 -93559 -114483 -110249 -175891 -6395 -106082
9150 -106082 -13853 -116290 -35341 -82816 -56792 -40719 -57641 1404 -30764 -44742 -65396
9139 -65396 -7329 -22535 -64014 -45602 -84189 -9408 19288 -42804 706 -32239 61512 -40968
9127 -40968 50536 -14216 15378 -4376 61899 28868 62753 68482 62669 82503 76475 40146
9115 40146 104209 82083 140232 46365 120789 156594 229400 158922 214416 194364 254591 290919
9103 290919 359008 292093 310384 327167 445164 429596 503942 609904 729202 844745 1030939
9092 1030939 1156623 1509204 1825497 2997077 5233515 7666767 8756432 9499989 9658718
9083 9658718 9058696 7666887 6259905 4922538 4000053 2931706 2193318 1497736 1314978
9074 1314978 1050285 932981 714321 705247 583584 553184 453675 424794 416909 398926 385259
9063 385259 357787 298007 329608 257140 258276 256936 312098 283563 290850 220284 215864 198325
9051 198325 126808 167896 182336 73137 166897 138814 169303 95286 185831 59626 16079
9040 16079 -46655 22184 -11885 -18083 -15911 25467 -30961 4061 10758 -1405 -19229 57355
9028 57355 -59391 -22264 42148 -50038 -126739 54286 -77316 -64620 -109735 -10970 -24052
9017 -24052 -57545 -84381 -12648 -41397 -23188 -117998 -81520 -150197 -20675 -83257 -106686 -96397
9005 -96397 -94294 -61379 -107034 -129563 -95934 -81675 -111028 -124573 -68262 -88895 -96120 -77275
8993 -77275 -62013 -137739 -100720 -72077 -151870 -120818 -98291 -150855 -175890 -93741 -123003 -111884
8981 -111884 -107496 -96580 -136544 -34422 -92201 -27641 -132643 -102661 -161721 -58092 -102852
8970 -102852 -83546 -114761 -93594 -128485 -93724 -89333 -93168 -79857 -64219 -60514 -91875 -80863
8958 -80863 -100553 -118313 -16323 -36857 -58973 -95474 -24460 -85559 -46331 -119522 -32612 -135694
8946 -135694 406 -7375 84937 -23987 -23335 -97429 77515 -71404 45523 -62734 -32450
8935 -32450 -69201 -12305 -49359 35872 -12030 66727 43230 17764 -10687 75459 16766 66665
8923 66665 -8788 87901 23499 26746 -42401 33998 60574 73728 47570 172697 -8845 96189
8911 96189 93275 89757 12729 128460 83274 127115 120265 97932 123354 144344 153479 265119
8899 265119 180204 222536 200554 208784 221302 197343 218253 168612 266987 237262 283638 228181
8887 228181 245349 260063 272813 183792 349047 283713 281935 302006 337489 221111 268100
8876 268100 334432 317747 278355 317538 225740 267246 205687 257378 227714 245819 177053 207371
8864 207371 179319 222145 270256 225870 199426 231734 184300 214583 146193 222399 117013
8853 117013 102074 128135 162641 157612 94598 131225 90640 67326 118972 -39726 68171
8842 68171 20820 -22728 29042 60865 56920 23760 5499 21415 -31659 -21154 -40545 18042
8830 18042 -25227 -15362 -19432 -15334 71338 -28126 8717 -51380 14691 -84631 36893 2233
8818 2233 -20310 3188 21165 -91903 6900 -2412 -5968 -28503 -25411 -89399 51202 -44322
8806 -44322 -12401 -102344 6084 -66091 15529 -55144 -31060 -64966 -2238 -74719 12872 -44370
8794 -44370 -20744 -51646 -19220 -78722 -40622 -18133 -613 -31293 -41658 -89712 18886 -88624
8782 -88624 -1376 -63783 -21845 -37128 -42998 -32372 -40669 -41556 889 -3183 -117937 -42272 -21079
8769 -21079 -35084 -28277 -6116 -10422 -47572 -51084 -36868 -22347 -16870 -1972 -63968 20211 -23528
8756 -23528 -34403 -26990 -53397 14298 -22239 -60237 3477 30292 23558 -24471 13508 -59912
8744 -59912 -22129 21854 -27484 9793 20465 30471 -50096 -4005 101547 13151 -32395 12323
8732 12323 75520 31998 29678 33420 10559 -57800 41316 23035 34692 10443 31200 -20045
8720 -20045 84988 81505 27897 55802 58787 -20715 54000 48341 26347 111947 74623 47107
8708 47107 129903 82394 104980 172954 143166 146590 119226 104944 71141 131628 146493 125463
8696 125463 116560 41150 113670 192730 186491 160377 122286 166002 199632 211823 168813 185399
8684 185399 287421 288110 343059 243731 266251 276610 199256 183394 301539 183839 240562
8673 240562 270488 236221 277132 310524 344125 331553 349031 347224 288682 342047 320081 361470
8661 361470 259072 286669 335702 357444 326290 432989 370116 361015 301743 328282 328528 323516
8649 323516 425059 406009 377617 318685 415179 413068 449826 453648 481576 378875 479179
8638 479179 464549 427987 417319 497000 485478 479204 501924 551650 572730 514385 525353 620550
8626 620550 571785 591908 620228 631040 553141 694493 641147 642495 726979 720623 705823 790778
8614 790778 751205 865341 867914 789369 824224 900111 886808 988600 963303 1011437 1038202
8603 1038202 1123205 996325 1094648 1039293 1071898 1062258 1203398 1220362 1274254 1253322 1375087
8592 1375087 1334827 1387779 1492049 1570672 1548805 1589152 1644769 1718538 1648184 1745617 1820817
8581 1820817 1901830 1942657 2002753 2105940 2222035 2326052 2264749 2421260 2364700 2483297
8571 2483297 2514672 2712824 2720943 2914927 2880257 3092531 3070734 3222924 3248866 3426642 3473713
8560 3473713 3567024 3645564 3877879 3948702 3944294 4057707 4194647 4249887 4385009 4444712 4530512
8549 4530512 4536052 4628045 4625950 4779425 4747038 4874065 4815966 4970543 4875039 4917203 4876124
8538 4876124 4936583 4827569 4860621 4815040 4838350 4663535 4646047 4616560 4616635 4369523 4237548
8527 4237548 4161978 4187399 3961699 3924364 3788579 3736563 3582243 3564767 3433808 3312832
8517 3312832 3211368 3184859 3033577 3019923 2940528 2889942 2739527 2706622 2579962 2507194 2445924
8506 2445924 2410015 2327755 2291597 2131736 2056985 2140559 1930386 1876845 1853796 1877844 1708728
8495 1708728 1705945 1596946 1561249 1660342 1495859 1501278 1454056 1431622 1393242 1348935 1295561
8484 1295561 1197450 1203861 1149859 1159849 1018417 1106581 1081952 1093647 943309 996322 932580
8473 932580 928032 888114 970892 880580 876768 872095 736126 734696 697997 678126 676083 654195
8461 654195 665680 632603 626637 669216 578725 612827 563234 483487 552428 471793 484247 466091
8449 466091 573144 419235 479285 377670 387900 357520 436280 419818 335419 382877 304466
8438 304466 304885 241144 255072 301468 231945 381101 306958 178216 286245 281987 200893 295357
8426 295357 187674 174159 198575 255371 223600 135239 151186 158853 178726 197213 73739
8415 73739 105228 90305 108845 112583 97202 167272 105148 132164 16151 88953 13369 16523
8403 16523 69251 38169 49435 71052 -9185 1994 53315 45284 33506 39812 4344 6025
8391 6025 -61833 -63217 26555 26717 -18514 -44319 -97950 -127692 90032 -39323 -103205 -44731
8379 -44731 -29746 -92592 -41222 -2684 -70895 -87629 -56040 -23691 -29127 -87329 27202 -39325
8367 -39325 -4575 -100114 -102208 -187658 -13198 -116554 -83917 -54672 -83577 -135821 -124650 -91898
8355 -91898 -52298 -91671 -146914 -88255 -58765 -110798 -78066 -135341 -126686 -89099 -103604 -81656
8343 -81656 -92342 -69037 -44709 -158560 -82384 -150698 -90444 -67782 -62505 -156992 -77355 -49043
8331 -49043 -33768 -96680 -155733 -59627 -126104 -93925 -74115 -28277 -73044 -152170 -73871 -170522
8319 -170522 -91224 -124217 -113735 -138232 -194108 -65228 -108689 -164458 -105842 -162816 -134926
8308 -134926 -143320 -182981 -98110 -112406 -135645 -219992 -163936 -139105 -134732 -130270 -114314 -251531
8296 -251531 -195721 -210949 -171528 -167890 -116966 -195565 -166004 -181360 -122533 -123519 -153052 -204218
8284 -204218 -209605 -149364 -170342 -186392 -136341 -206937 -120696 -195859 -155539 -165528 -211977 -155136
8272 -155136 -136752 -216834 -181478 -183706 -205835 -250112 -188797 -222254 -175299 -146300 -126014 -237711
8260 -237711 -208097 -199773 -213338 -179095 -263020 -199304 -163278 -292285 -185017 -166816 -159446 -202134
8248 -202134 -210200 -197827 -178686 -211516 -177313 -214417 -255099 -316644 -223043 -209584 -198905 -131835
8236 -131835 -228945 -202587 -203239 -165640 -255706 -251793 -212702 -269468 -205261 -215660 -237427 -206459
8224 -206459 -249926 -249785 -266375 -244069 -255779 -224133 -229759 -205578 -224646 -199265 -160606 -185889
8212 -185889 -203242 -293117 -223427 -181560 -273397 -177802 -254416 -168535 -237337 -257145 -88261
8201 -88261 -255339 -186203 -225038 -132346 -233769 -208831 -228438 -275773 -115795 -901667 -228392
8190 -228392 -365526 -194015 -368750 -252834 -239905 -221799 -195862 -216614 -99042 -241290
8180 -241290 -199963 -191531 -199119 -266080 -327633 -224602 -242590 -269765 -244192 -205754 -163019 -109210
8168 -109210 -150140 -221827 -243712 -214680 -175131 -280781 -272820 -268861 -273788 -245612 -225769 -226001
8156 -226001 -166769 -183025 -259522 -256666 -229817 -328711 -228022 -192972 -262673 -196339 -170513 -279831
8144 -279831 -239015 -182639 -216730 -169192 -190055 -186295 -247655 -256856 -145580 -238857 -177232 -256045
8132 -256045 -258877 -273694 -133803 -230088 -211087 -186077 -278845 -244140 -266734 -166720 -154414
8121 -154414 -132463 -282276 -187915 -188020 -159624 -171504 -212825 -188506 -243172 -213746 -245473 -164949
8109 -164949 -194155 -140684 -221268 -213727 -171402 -112148 -196031 -194887 -155770 -152106 -165740 -227825
8097 -227825 -212261 -189682 -192497 -273469 -187576 -130701 -160441 -204501 -179318 -178618 -115800 -124863
8085 -124863 -149766 -215343 -192426 -128267 -166320 -98768 -198568 -182912 -111632 -187752 -131631 -182985
8073 -182985 -97352 -150947 -133640 -208410 -196448 -280866 -182699 -70475 -173161 -176569 -133667
8062 -133667 -167722 -184037 -175184 -211374 -168537 -214238 -174416 -185476 -187601 -197540 -160897 -186172
8050 -186172 -226557 -225908 -143588 -255673 -90869 -207585 -221557 -274446 -179710 -310919 -223713
8039 -223713 -202913 -183382 -229267 -174281 -216766 -195975 -210357 -178816 -208948 -266003 -301756 -220376
8027 -220376 -253231 -182586 -161967 -210896 -272807 -213918 -236207 -210853 -297321 -277943 -312470 -226614
8015 -226614 -242997 -175424 -219851 -263811 -189453 -279327 -249669 -273720 -275985 -333794 -235115 -154838
8003 -154838 -200831 -173319 -138552 -213991 -221384 -268857 -210686 -169007 -145446 -242363 -282138 -214531
7991 -214531 -223345 -216049 -179630 -195386 -112365 -233108 -151645 -151967 -154448 -224193 -191201 -250426
7979 -250426 -172335 -194712 -233929 -183808 -191164 -198262 -140325 -181416 -150133 -223091 -191139 -229665
7967 -229665 -203467 -240064 -238639 -208687 -160243 -136973 -128633 -154252 -139598 -161487 -99478 -184369
7955 -184369 -131468 -199155 -226601 -230153 -145702 -162064 -84413 -99077 -105372 -132943 -190584 -188449
7943 -188449 -147343 -178738 -163790 -67827 -169304 -181731 -147224 -157139 -129714 -112708 -107840 -116021
7931 -116021 -192433 -60070 -25272 -145108 -81076 -154313 -94311 -90165 -74102 -29256 -32826 -140942
7919 -140942 -74012 -57888 -138267 -46268 -99696 -54775 -43030 -106673 -79541 -60918 -112154 -57665
7907 -57665 -84905 -86506 -23469 -159345 -18698 -40825 -34242 -156041 -77067 -91748 -110235 -118030
7895 -118030 -54279 -81508 -52521 -104044 -17897 -36141 -84458 -76469 -42216 -32843 -32670 -49375
7883 -49375 -24805 -69684 -62463 555 49455 -69837 29898 -13465 -23614 -31669 49342 19038
7871 19038 60452 13511 28612 21313 69098 73723 96174 81131 137449 90624 76466 112958
7859 112958 168942 142319 98527 141878 -38410 62447 180719 181165 190804 197797 170928 191177
7847 191177 307566 269762 258217 307381 318334 326709 332063 413692 469025 460603 422633 452915
7835 452915 445052 468232 560849 515854 556487 584222 588084 700307 748939 773154 801990 796725
7823 796725 828598 941475 1051760 986770 1119871 1162649 1232634 1341226 1442919 1507813 1575534
7812 1575534 1623992 1721526 1847954 1931675 2047772 2183442 2219829 2436961 2496154 2572568 2626540
7801 2626540 2762790 2771575 2805103 2915014 2910188 2988836 2958511 2903546 2881167 2899443 2842273
7790 2842273 2751610 2643908 2586338 2436961 2371782 2291781 2234541 2105327 2079019 1895535 1846072
7779 1846072 1733018 1622693 1589430 1560953 1381800 1395141 1285898 1262027 1131688 1112114
7769 1112114 1003262 947852 965288 896697 870958 872630 769363 750856 652143 652977 675313 635810
7757 635810 484477 575893 562583 482738 477823 475079 444033 520257 469800 482086 393802 469581
7745 469581 411974 477266 389423 486950 359497 300897 254185 310946 336857 301173 273749
7734 273749 312332 305685 204908 240621 243217 187919 301963 250273 303372 290823 277895 222932
7722 222932 331221 289419 211651 221314 179382 164919 169619 170962 143339 172356 112875 192689
7710 192689 198712 212521 237322 299039 222591 247309 193425 189948 110111 262613 161833 258016
7698 258016 219940 245214 270178 202484 181920 176663 238728 188099 126363 100854 143886 122443
7686 122443 165311 314828 233014 244203 138934 203042 153047 278245 296864 231743 231431
7675 231431 230422 262393 264696 253151 249246 206143 234753 185762 260955 163255 266804 252974
7663 252974 179602 236302 184595 233277 304737 345237 262536 312331 343155 269077 449672
7652 449672 382244 422967 441242 544334 538556 653052 643937 713686 855894 875546 1078207
7641 1078207 1455024 1667449 1935120 2032715 2147088 2167824 2180876 2070442 2028315 1865849
7631 1865849 1799220 1847949 1879581 2020993 2120586 2200472 2226179 2341857 2490672 2740653 3083188
7620 3083188 3548002 4329870 5061302 5834370 6196708 6424067 6260542 6004991 5527801 4996397
7610 4996397 4553556 4215521 4068912 4119232 4199417 4362735 4353815 4370990 4175738 4154853 4061587
7599 4061587 4286881 4479593 5201797 5916989 6362583 6679728 6715508 6526243 6105552 5609378
7589 5609378 5098824 4562284 4204242 3998199 4025581 4109478 4155674 3920800 3750546 3416073
7579 3416073 3212325 3023840 2871835 2810109 2751155 2842858 2832697 2906308 2826196 2613441 2467832
7568 2467832 2278629 2080105 1934851 1850341 1704362 1746999 1689161 1534165 1634410 1401681
7558 1401681 1371445 1093273 1129324 1005433 847788 744417 758901 656068 618121 594797
7548 594797 532732 527690 529212 467367 434922 435847 445585 393326 465019 410151 424005 361368 354661
7535 354661 350572 323064 304602 329262 320817 308440 333579 301272 315731 320741 267903 243183
7523 243183 226882 162369 229676 220715 241704 185546 216179 260954 286696 229208 279582 200495
7511 200495 193461 228965 219338 207932 225572 178074 171656 198131 224376 180278 256104 242058
7499 242058 156303 168745 245485 254766 229384 264854 162546 299768 310636 375109 407442
7488 407442 492252 511409 593104 639628 599976 674872 564082 604717 497675 441412 502185
7477 502185 444564 434187 413022 407096 398858 401841 510986 514557 667190 725553 991491 1158944
7465 1158944 1527024 1541200 1704774 1575225 1536630 1575771 1367793 1204858 1049299 820977
7455 820977 791628 660601 674099 620360 713666 543025 673788 709173 892579 915073 1128421
7444 1128421 1376671 1593035 1767852 1836043 1754751 1737650 1505130 1445222 1167530 1081030
7434 1081030 1037460 966748 703326 818997 629931 566604 658411 702547 696162 656085 792306
7423 792306 847746 904812 984920 1029335 1046178 1012955 946945 939367 870935 896175 780565 851481
7411 851481 830309 789944 743058 885349 811719 846032 819547 911732 856754 938562 870962
7400 870962 820220 881323 889262 921121 978560 867572 984523 916995 1051752 1097525 1252627
7389 1252627 1395220 1566189 1632404 1741752 1764816 1785578 1766181 1783365 1697593 1579930 1603407
7378 1603407 1559125 1580896 1636654 1665308 1705175 1744418 2001033 2196240 2398594 2673182 2976101
7367 2976101 3310457 3615606 3862208 3918272 3872127 3716358 3460406 3296191 3090111 2936542
7357 2936542 2794647 2649675 2637841 2580453 2670227 2794629 3222312 3510535 4123833 4444966
7347 4444966 4795336 5121404 5561170 5763639 5829064 5762790 5605044 5336576 5172120 4819154
7337 4819154 4773737 4592233 4698664 4606175 4635524 4762627 5020981 5301931 5739337 6327548
7327 6327548 7201327 7878640 8674866 9418011 10482756 12044543 14591713 18657737 23213654
7318 23213654 26690830 28545011 29221357 28424740 26626722 24405158 21923263 19537204
7310 19537204 17440908 15727450 14563434 14102266 14249802 14877200 15671539 16798168 18470022
7301 18470022 21080798 25843486 34945830 48951845 63170168 73222732 77879367 78444252
7293 78444252 73860995 66887752 58957390 50371746 42356779 35311986 29097015 24831160
7285 24831160 22358688 21208475 20677641 20640289 21171092 22318565 24920323 30179209 40242735
7276 40242735 54870074 68253818 76642084 80044299 78958134 72851008 65102779 56394508
7268 56394508 47273060 39155625 31735630 25400855 21219310 18477841 16784490 15570659
7260 15570659 14795592 14227661 14172249 14718846 16499372 19877776 24206339 27847984 29842908
7251 29842908 30332214 29231175 26913407 24083609 20972847 17915081 15025553 12491832
7243 12491832 10419029 8953776 7947116 7205050 6608777 6075117 5666644 5193027 4946177
7234 4946177 4631094 4429166 4222528 4054577 3803837 3625218 3483323 3422468 3298437 3270363
7224 3270363 3083677 2999912 2934646 2918410 2763867 2794334 2646832 2565232 2538982 2492198 2421277
7213 2421277 2351794 2300688 2201872 2091451 2016706 1944601 1903123 1815294 1792760 1820217 1732167
7202 1732167 1607963 1730740 1608981 1639599 1632297 1589191 1611030 1557393 1550868 1595617 1540340
7191 1540340 1548665 1594307 1468342 1495405 1585461 1581048 1599276 1612967 1666174 1639176 1480789
7180 1480789 1412655 1278215 1288869 1171344 1175152 1073069 1004524 1036721 966696 956991 931934
7169 931934 920518 816331 792670 869872 822049 852213 770623 713668 743552 775469 674817
7158 674817 713424 751404 682542 661294 625078 731312 686544 606971 706410 639527 706226
7147 706226 568585 665928 633945 668635 620779 624081 609152 585123 595588 581046 606599 615858
7135 615858 630019 603778 512137 556313 591199 553934 487299 535496 558877 502519 498610 686011
7123 686011 766337 739018 791913 709474 713252 691756 708332 662675 689945 682852 616872 621524
7111 621524 725284 716289 716374 588673 669071 624538 546152 507648 532396 521984 711521 707403
7099 707403 699413 658584 639923 697682 579107 586693 585240 568731 447826 436500 487335 558353
7087 558353 563532 630396 636956 614756 512704 504974 453655 597140 418403 407647 312521 403938
7075 403938 391850 450991 364073 370443 285666 256661 320016 371788 350165 372441 321359 432016
7063 432016 289496 365892 383370 422701 342270 330868 334650 264728 304474 357271 304302 227801
7051 227801 301309 336037 232102 318820 278569 364756 316797 365786 286652 361547 340299
7040 340299 413870 354921 438474 383545 395699 425315 480513 408726 388423 429695 416571 441341
7028 441341 464422 471155 385213 401943 441429 404231 412240 388279 442767 528984 492707 466051
7016 466051 548826 629360 611743 613371 675458 738835 646308 698792 679935 574179 622578 605438
7004 605438 568146 570641 528203 501518 526494 533673 569783 489881 501572 568054 655207 619088
6992 619088 660923 724382 637582 734179 653559 712001 740255 691459 777302 693961 705302 750793
6980 750793 728197 771399 779897 836290 910613 882724 970799 1079927 1231026 1330097 1404358
6969 1404358 1450292 1480631 1535027 1421135 1423322 1343339 1425974 1347526 1289609 1417342 1470554
6958 1470554 1526553 1628329 1820586 1822956 2059135 2085322 2334361 2583473 2863960 3125748
6948 3125748 3392936 3447846 3629542 3490184 3523326 3367983 3266440 3003557 2993288 2853269
6938 2853269 2834716 2796616 2876383 2852888 2991982 3164453 3418376 3609314 3974117 4243247
6928 4243247 4501082 4622974 4849655 4911631 4871773 4729587 4559893 4252493 3990214 3749374
6918 3749374 3485462 3211561 3083976 2944590 2746943 2834086 2773239 2795113 2768636 2793467
6908 2793467 2850392 2967084 2999931 2949909 2911761 3009596 2921197 2759692 2519700 2478859 2129127
6897 2129127 1997375 1947967 1733373 1596787 1469019 1299155 1309822 1184503 1240614 1074299
6887 1074299 1119420 1067601 1046384 974148 935249 883278 830164 828370 865346 737500 799368
6876 799368 828360 760971 749278 831943 695232 696518 729194 745768 621413 652677 655472 657499
6864 657499 536382 501535 525425 448100 457389 523762 389183 465103 478624 445514 375137
6853 375137 530908 459306 412541 452111 373170 389226 419385 397014 344166 336755 243887 283631
6841 283631 232099 288046 258702 271697 172943 227845 182074 161612 217183 241496 244756 315498
6829 315498 170042 195745 236789 202996 146027 279206 219593 231974 164115 173171 208192
6818 208192 224956 194838 244062 141222 207755 257337 245448 205651 318954 206441 225163
6807 225163 148315 231878 90582 206952 162265 224125 201665 112027 137195 128626 184396
6796 184396 234546 146436 180992 192745 189135 174723 281476 170961 224457 191252 244231
6785 244231 240287 340135 388191 383427 295177 371851 363428 358885 301324 238168 199933 281898
6773 281898 256804 299706 313862 257228 236886 277489 265044 316687 308329 290124 255569 289814
6761 289814 303020 360956 293178 383590 357014 473126 442377 521030 532383 506006 580248
6750 580248 538474 435662 500376 456282 446722 442925 474025 535242 543737 563079 560119 430252
6738 430252 533743 473734 565056 577846 637919 610402 600760 627206 692111 714483 735711 792066
6726 792066 799511 860379 836313 857186 826886 935444 908140 925999 957475 930266 947476 990412
6714 990412 980576 1117742 1142912 1164546 1235319 1355034 1366215 1403878 1567796 1685044 1810350
6703 1810350 1931523 2126213 2378592 2596446 3011124 3525576 4348107 5564100 7236076
6694 7236076 8711115 9656641 10147533 10126228 9544492 8706017 7856277 6828555 5992282
6685 5992282 5248133 4710789 4259308 4027534 3913319 3838627 3855501 3937554 4061411 4227566
6675 4227566 4613975 4879365 5409739 6144296 7020756 8273021 10223276 13834638 19141831
6666 19141831 24086102 27592918 29125403 29199438 27264952 24627668 21673988 18323342
6658 18323342 15463305 12640019 10389816 8735227 7606764 6942917 6438320 6101137 5861905
6649 5861905 5738496 5822169 5941997 6184774 6556032 7107616 7761390 8898030 10646183
6640 10646183 13942964 19006783 24305842 28033774 29815757 30050387 28454792 25712563
6632 25712563 22630251 19245557 16006352 13127107 10616294 8696470 7392484 6560372
6624 6560372 5861795 5432922 5029690 4731545 4544351 4439371 4435091 4358927 4556303 4671173
6614 4671173 4943481 5394009 6339555 7747089 9431485 10638682 11411844 11385000 11082301
6605 11082301 10117775 9116010 7860708 6808169 5671920 4835759 4052483 3606265 3152301
6596 3152301 2990941 2667116 2564714 2439477 2423254 2383791 2486460 2417432 2436612 2396846
6586 2396846 2301091 2206382 2013417 1853490 1812263 1698134 1555115 1550483 1444998 1406301 1353711
6575 1353711 1398739 1277878 1273046 1271376 1171641 1154368 1216822 1213159 1149538 1236237 1249251 1219368
6563 1219368 1401486 1491115 1564733 1581158 1638776 1509303 1464982 1368647 1277638 1208604 1116501
6552 1116501 1103077 1045089 999625 1005172 911765 877529 879072 951382 889342 907779 842885 916170
6540 916170 906504 922696 898063 898849 935542 946200 1001389 1059497 932297 1043214 982110 1074631
6528 1074631 1018622 1014002 923974 959773 942723 897115 993207 906375 935764 822383 805258
6517 805258 889809 876293 932592 949287 920593 1024673 976085 968725 914276 910177 972593 1087503
6505 1087503 946330 968567 1015575 1025594 966849 1025174 1000183 1039494 1046746 1075640 1115118
6494 1115118 1154166 1241919 1256449 1178748 1299892 1314303 1382640 1378088 1535931 1563090 1559223
6483 1559223 1681791 1667187 1546277 1583870 1645400 1597296 1607802 1634324 1601147 1668095 1791891
6472 1791891 1925500 1911062 2034859 2083165 2066635 2139156 2221060 2184168 2253260 2423262 2426178
6461 2426178 2537129 2646908 2708041 2792185 2982141 2972375 3073282 3148695 3294048 3425921
6451 3425921 3745539 3931588 4274540 4878281 5840793 7486203 9731996 11746323 13012244
6442 13012244 13597064 13697969 12900896 11910874 10714478 9676198 8781707 8072463 7448097
6433 7448097 7219033 6915281 6918784 6733844 6671666 6636664 6751387 6962612 7329751 7769329
6423 7769329 8280021 9040505 10000327 11474868 14073280 18733118 25368595 31439251 35330085
6414 35330085 37355865 37537188 35460193 32570178 29450533 26754097 25591203 25892632
6406 25892632 26457444 26717385 26739066 26171695 24609219 22620884 20665572 18821965 17390522
6397 17390522 16200560 15359731 14888455 15050522 15516996 16495555 18681085 23071910 29545964
6388 29545964 35818300 39946474 42226605 42757818 41355918 39071860 36990887 36084698
6380 36084698 38549208 44375785 50791770 54776538 56758731 56266998 52927551 47611078
6372 47611078 41875924 35858166 30814424 26295814 22457074 19670754 17810465 16707015
6364 16707015 16051486 16047211 16885176 18565839 20339105 21612143 22621019 23034197 23048124
6355 23048124 22906667 23356326 24842882 29222542 36903579 45069361 50348498 52928139
6347 52928139 52875157 49898074 44720151 39162125 33125303 27811316 23133503 18914014
6339 18914014 15725785 13737257 12233173 11145860 10210119 9423148 8780065 8520904 8196465
6330 8196465 8024447 8004948 8095677 8350662 8826519 9632439 11455008 14131827 17025278
6321 17025278 18905035 19981340 20053981 19118458 17346829 15427244 13428090 11600457 9771762
6312 9771762 8426286 7245220 6423647 5943456 5559225 5187880 4938752 4720325 4482651
6303 4482651 4308461 4320975 4283183 4232151 4144423 4173364 4124897 3913894 3851019 3791308 3635469
6292 3635469 3615620 3501890 3486937 3422795 3476262 3409903 3333159 3335300 3319029 3289748 3278055
6281 3278055 3363556 3347646 3359993 3319759 3419947 3396185 3546932 3945155 4090158 4291168
6271 4291168 4356730 4455694 4417277 4287362 4144008 4016531 3892102 3777587 3727328 3680306
6261 3680306 3623669 3654465 3725914 3740338 3740332 3811023 3800278 3888698 3974025 4055235 4254559 4349290
6249 4349290 4483385 4883786 5289231 5872614 6447544 6958412 7403926 7813624 8173635 8904155
6239 8904155 10172358 12412746 15094804 17050476 18217721 18545477 18019344 16808833 15379109
6230 15379109 13861177 12439783 11088615 9940902 9059326 8610567 8307994 8234110 8313303
6221 8313303 8532062 8880749 9605096 10292623 11288996 12281136 13406024 14438000 15967609
6212 15967609 18383022 22897283 30432450 39218950 45936950 49665345 50712647 49101877
6204 49101877 45223166 40951761 36176325 32048737 29028726 27083417 25573497 24680303
6196 24680303 23819060 22835265 21490262 20312022 19208915 18348527 17841859 17492527 17725015
6187 17725015 18089970 18943917 20197147 22710366 27456660 35427584 44450760 51457205
6179 51457205 55362296 56503380 54817714 51115322 47075557 42925698 40324139 40257389
6171 40257389 42136143 43947645 44735453 44383040 42512618 39110643 35342590 31265012
6163 31265012 27499299 24120426 21223206 19031661 17697603 17017258 16816523 17227844 18637661
6154 18637661 21182338 24211950 26443088 27807122 28373590 28024286 27030089 26153155 25523672
6145 25523672 26325810 29484046 34138118 37955320 39989473 40195565 38633966 35348347
6137 35348347 31700938 27544344 23670889 20041483 16841681 14312695 12634953 11538935
6129 11538935 10677984 10091568 9583243 9082812 8772160 8597328 8466461 8311064 8356503 8341437
6119 8341437 8500561 8783720 9730960 11266119 13087575 14501741 15332036 15425949 14866532
6110 14866532 13745979 12484181 11075062 9719361 8390142 7336525 6362274 5882259
6102 5882259 5321431 5042450 4699301 4510420 4282873 4048976 3819824 3722437 3589730 3558511
6092 3558511 3544965 3465763 3367378 3235638 3125916 3012919 2968522 2824268 2782583 2747949 2651511
6081 2651511 2600638 2490712 2447681 2383610 2278988 2277782 2164333 2210604 2136486 2149462 1998699
6070 1998699 2093962 2002090 2077126 2045816 2077852 1990572 2113420 2198522 2086084 2000466 2063764
6059 2063764 1923070 1913940 1753363 1780255 1699811 1651582 1566489 1555480 1499115 1424222 1371336
6048 1371336 1456212 1528878 1413800 1373212 1425318 1322500 1336273 1323999 1344716 1339783 1385801
6037 1385801 1268163 1329699 1311912 1298227 1228255 1252128 1207230 1169132 1275099 1155702 1142143
6026 1142143 1090475 1087358 1108203 1046465 1069605 1047374 1011819 1028022 1031983 1050740 1066087 1180516
6014 1180516 1164566 1135946 1084304 1118719 1148093 1143429 1118267 1054609 985222 1076667 1033047 1125341
6002 1125341 1032187 1098797 988790 1021510 960324 1063991 877548 982863 996710 938095 861106
5991 861106 1012491 927955 979587 948200 951813 1029159 981658 1015981 1046884 981608 981538 1030769
5979 1030769 937222 1073876 1094465 979024 1051344 1074127 1100032 1007967 1067433 994795 1082571
5968 1082571 945210 969609 1012806 930872 942247 910283 855395 911935 873582 943577 960947
5957 960947 886181 955264 949470 979806 992687 1048152 999789 1036275 1083824 1084938 1095694 1008162
5945 1008162 1044198 1010279 1032589 1007148 966343 1050535 947576 1007749 943333 894046 966388
5934 966388 1037671 906966 958581 1006355 975034 961921 1096951 1021512 1091685 1094289 1143730
5923 1143730 1118343 1101363 1191271 1148094 1071976 1040073 1073038 983887 1081179 1092472 1078762
5912 1078762 981433 998280 1016270 1041922 1041665 967183 1075200 1132970 1023836 1148548 1293524
5901 1293524 1234179 1217282 1359307 1280641 1319705 1317150 1355329 1254351 1331613 1269335 1215957
5890 1215957 1265615 1240606 1360284 1273457 1205102 1350581 1185581 1330043 1305289 1272743 1200885
5879 1200885 1266033 1351691 1288470 1348320 1382592 1350805 1324685 1326245 1417092 1407381 1383658 1361143
5867 1361143 1335086 1377604 1409299 1407971 1525846 1421387 1522468 1445400 1618484 1591413 1684886
5856 1684886 1668011 1660928 1725930 1701839 1689220 1684265 1671904 1647406 1700096 1711915 1717594 1732704
5844 1732704 1758718 1702843 1814217 1731949 1862458 1798609 1810866 1849176 1889453 1854120 1937442
5833 1937442 2120757 2086909 2186152 2273535 2215222 2240795 2235020 2304062 2343046 2368750 2359435 2483567
5821 2483567 2472118 2460751 2406977 2388957 2395746 2388240 2365128 2483712 2373607 2440745 2515129
5810 2515129 2635012 2668360 2745417 2775629 2771522 2838529 2818056 2889263 2928742 2964125 2905459
5799 2905459 2881141 2946605 3016267 3058006 3095397 3184261 3182222 3297324 3422081 3508609 3631042
5788 3631042 3708783 3960346 3925882 4090592 3937154 3943684 3862021 3803021 3648347 3628751 3601178
5777 3601178 3560267 3498415 3554611 3609651 3593503 3686271 3787087 3875627 3973893 4121600 4349276
5766 4349276 4421834 4766781 4878713 5114488 5293489 5584653 5734457 5794780 5681078 5725316
5756 5725316 5654889 5506763 5392072 5402878 5327121 5307458 5204245 5193221 5271241 5398767 5443541
5745 5443541 5559942 5647087 5797067 6058780 6226974 6446327 6722447 6953340 7182921 7597301
5735 7597301 7982575 8260557 8802480 9105540 9454351 9775925 9954658 10185198 10380726 10569661
5725 10569661 10864249 11248672 11681938 12456176 13281653 14214423 15378845 16536784 17841871
5716 17841871 19003989 20049873 20856609 21384932 21556278 21455985 21180304 20582388 19999050
5707 19999050 19456154 18733722 18107655 17748048 17302850 17005532 16863613 16724498 16740085 16830339
5697 16830339 17066929 17377848 17906315 18624223 19764741 21020727 22591605 24587028 26743518
5688 26743518 29130771 31506037 33633360 35354764 36780617 37469011 37384741 36765591 35518162
5679 35518162 33812547 31917221 29763414 27643087 25680830 23877969 22400100 21067439
5671 21067439 20010473 19319298 18761310 18303062 18068786 18000046 17942001 18181212 18513161 19062997
5661 19062997 19700179 20570071 21693049 22731753 23883333 25074909 26094854 26830297 27298820
5652 27298820 27416330 27129753 26754864 26075152 25138421 24253331 23332719 22717263 22185562
5643 22185562 21713544 21417184 21289721 21261508 21272476 21483160 21628293 21859228 22076555 22228581
5633 22228581 22513066 22716846 22943955 23345692 23778270 24092040 24576356 25117907 25737630
5624 25737630 26543411 27308262 28108907 29041807 29925310 30733439 31635327 32291369 32867943
5615 32867943 33264177 33433702 33541976 33437773 33205783 32952422 32591663 32192312 31880132
5606 31880132 31566199 31335219 31341907 31417159 31848115 32385708 33135705 34078507 35111666 36184168
5596 36184168 37150459 37825923 38196310 38306011 38124665 37372418 36656911 35643193 34425993
5587 34425993 33187593 31858536 30675579 29489251 28411660 27427428 26627653 25996095 25504655
5578 25504655 25268630 25271420 25403441 25940205 26852517 27915270 29325040 30990218 32688423
5569 32688423 34415320 35964159 37273675 38041086 38404721 38079988 37349598 36063950 34457380
5560 34457380 32584554 30639932 28589910 26678462 24860474 23244090 22001411 20736424
5552 20736424 19788099 19061114 18481361 18116518 17828584 17856530 17838859 18129133 18448219 19019180
5542 19019180 19502452 20263545 20995027 21694171 22199642 22593427 22571661 22393144 21875517 21062707
5532 21062707 20083190 18845138 17606869 16290107 15034912 13943837 12930056 11993605
5524 11993605 11182746 10608556 10035015 9541687 9170606 8869913 8625831 8412929 8157636
5515 8157636 7972097 7807696 7577864 7398842 7236824 7025913 6909257 6789678 6623357 6494267
5505 6494267 6390725 6247698 6192195 6103216 6035219 5913125 5834126 5792494 5766588 5762153 5677598
5494 5677598 5581486 5517418 5553585 5550249 5479839 5414002 5468633 5457705 5574129 5444529 5536025
5483 5536025 5544772 5595271 5660929 5754926 5722103 5768955 5899971 5969485 6003332 6159745 6206086
5472 6206086 6412191 6544103 6720382 6788143 6978263 6992557 7268051 7260176 7436660 7484829
5462 7484829 7593670 7649033 7712005 7760650 7865162 7934342 7995024 8056784 8144381 8218949 8367319
5451 8367319 8406771 8540251 8669808 8860037 8913595 9138289 9140714 9284903 9508021 9692542
5441 9692542 9685218 9876966 9929753 10044199 10030776 10171257 10120946 10165109 9965239 9950593 9831864
5430 9831864 9720244 9636367 9508032 9435579 9261868 9122532 9069291 8916126 8834364 8740082
5420 8740082 8671258 8631810 8654454 8655770 8789131 8854525 8908899 9113739 9286597 9622309 9740420
5409 9740420 9999862 10177295 10404909 10645208 10902405 11219845 11473274 11821141 12265077 12656814
5399 12656814 13064766 13449009 13879410 14020286 14339193 14545315 14691909 14681828 14800306 14812305
5389 14812305 14891705 15134265 15172586 15376296 15644299 15958794 16480549 16950957 17604841 18227373
5379 18227373 19145982 19821223 20790792 21694249 22559401 23248642 23945899 24368029 24693885
5370 24693885 24858951 24827315 24606318 24251673 23753757 23121563 22543628 21910244 21219879 20718375
5360 20718375 20124841 19839595 19361605 19014471 18808465 18600726 18383874 18106432 17855261
5351 17855261 17433114 17158749 16648643 16167589 15635611 14988551 14331266 13614519 12882763
5342 12882763 12173826 11584436 10899455 10221127 9684885 9137427 8721724 8183627 7846470
5333 7846470 7469781 7208678 6883967 6564659 6333022 6071522 5942298 5718474 5466857 5288609
5323 5288609 5188914 4974892 4794909 4746752 4605712 4462867 4361096 4252297 4063343 3972281
5313 3972281 3950120 3805517 3837542 3672554 3633600 3539972 3427132 3449501 3265661 3434277
5303 3434277 3216695 3128710 3047331 3022398 3023363 2922897 2874569 2791673 2822641 2775728 2759691
5292 2759691 2680819 2579914 2592791 2535787 2490651 2476362 2441468 2352235 2399982 2337643 2333753
5281 2333753 2248134 2233102 2290741 2203101 2167363 2216970 2155342 2138470 2163760 2054923 2082264
5270 2082264 2096747 2058572 2000754 2027928 1914094 1929512 1837835 1974457 1864682 1904117 1830092
5259 1830092 1812764 1778492 1810792 1798305 1800556 1780578 1669005 1743376 1728398 1738177 1823464 1731843
5247 1731843 1756824 1737107 1711929 1774040 1792994 1732604 1882760 1791074 1788852 1866093 1887103
5236 1887103 1880481 1855245 1872405 1845325 1901458 1943814 1982964 2056346 1974653 1975571 2001431 2085515
5224 2085515 2156809 2226136 2201179 2240986 2418901 2413057 2525381 2560460 2699822 2741695 2854798
5213 2854798 2952582 3012993 3174371 3196276 3296744 3354450 3431218 3511858 3488066 3522100 3622212
5202 3622212 3639663 3770581 3825858 3919718 4047442 4028978 4199450 4334188 4514993 4505810 4659526
5191 4659526 4785765 4795483 4901775 4874251 4856189 4729304 4686260 4625877 4459210 4458703 4218496
5180 4218496 4157835 4118077 4086782 3799094 3808084 3686183 3696378 3521826 3667738 3466565 3467626
5169 3467626 3338692 3342320 3266631 3303483 3150636 3132881 3019887 2987822 2967939 2801455 2734774
5158 2734774 2670898 2510620 2431889 2436102 2349971 2280155 2126050 2106677 2063898 1969512 1939175
5147 1939175 1884494 1895453 1827724 1768388 1716044 1786171 1705076 1643588 1656537 1622739 1590199
5136 1590199 1572454 1622625 1548041 1545523 1554863 1541443 1518412 1547552 1500228 1494418 1509262 1463666
5124 1463666 1544410 1487437 1494327 1557759 1526716 1510742 1512863 1597938 1521085 1572119 1528299 1547068
5112 1547068 1518876 1591906 1586796 1661202 1503838 1591625 1580978 1599280 1514217 1653477 1637033
5101 1637033 1702026 1772276 1794776 1945727 1833984 1829803 1858706 1860330 1852337 1988029 1913798
5090 1913798 2035254 2010838 2046930 2042661 2139503 2041118 2065635 2175790 2156735 2115770 2251813
5079 2251813 2219148 2271339 2368793 2604972 2663623 2855473 2980293 3145272 3205719 3161467 3177753
5068 3177753 3135853 3018382 3165230 3180413 3376757 3648393 3825145 3913119 4005819 3950330
5058 3950330 3886848 3823442 3834653 3783201 3656175 3639757 3626218 3667849 3704223 3809788 3824159
5047 3824159 3920790 4012278 4229036 4425571 4707882 4934383 4964781 5024818 5034819 4975520 4991602
5036 4991602 4916470 4946921 4898852 4980547 4998441 5155299 5263459 5345934 5522915 5589636 5675557
5025 5675557 5805665 5859977 6045539 6143192 6403032 6445391 6627587 6828096 7173622 7449621
5015 7449621 7854561 8403814 8894739 9410859 9763150 9991502 10218623 10153945 10191136 9990338
5005 9990338 9851091 9684708 9645859 9515669 9653626 9662013 9722137 9817342 10015377 10066772 10143995
4994 10143995 10429622 10633795 10961732 11299668 11790741 12385679 13031477 14081004 15347834
4985 15347834 16680007 18209262 19627033 21126136 22069692 22704466 22716948 22377351 21693127
4976 21693127 20787453 19851743 19050965 18341700 17731639 17229161 16981728 16740082 16729605 16727552
4966 16727552 16815119 16994945 17346017 17650882 18237042 18885914 19889463 21059286 22591097
4957 22591097 24354618 26490290 28815852 31580158 34233073 36966775 39230298 41250756
4949 41250756 42627207 44065999 45484212 47432508 49951634 53097973 56925477 60817423
4941 60817423 64232809 66627421 67768419 67661629 66181254 63366176 59519479 55137960
4933 55137960 50422517 45762695 41548150 37888989 34771412 32477997 30774944 29604279
4925 29604279 29121911 28957952 28745274 28303963 27733406 26800091 25509655 23956640 22446759
4916 22446759 20897006 19370692 17893225 16770982 15661437 14873656 14140935 13510437 13000021
4907 13000021 12702886 12256661 11884360 11485032 11143344 10697517 10401735 10054744 9817879
4898 9817879 9575486 9605212 9451111 9548950 9452310 9601931 9506697 9467811 9176617 9014058
4888 9014058 8562294 8171731 7746320 7387439 7075521 6789602 6443231 6212335 5902484 5761922
4878 5761922 5684750 5559350 5379821 5264450 5186817 4989414 4875499 4859801 4632230 4644204
4868 4644204 4517971 4422406 4362905 4361618 4314909 4210762 4160838 4108138 4116376 4047346 4095725
4857 4095725 4030968 3970439 3967086 3909591 3921860 3873280 3810616 3826930 3776129 3899394 3922896
4846 3922896 3831026 3806167 3877072 3788596 3904343 3891099 3939686 3868071 3892276 3881638 4034950
4835 4034950 4006185 4025089 4042453 4141651 4032783 4191905 4245289 4244232 4334692 4397211 4444732
4824 4444732 4610900 4631411 4739409 4812963 4921736 4834628 5088701 5127840 5308712 5422605
4814 5422605 5545063 5613770 5884686 5935307 6151615 6371612 6571010 6689946 6992102 7119489
4804 7119489 7304987 7506136 7837092 7976764 8246205 8467822 8657078 8951074 9056407 9437097
4794 9437097 9571588 9775488 10025470 10284140 10321709 10498087 10772219 10869348 11030850 11160117
4784 11160117 11315708 11488676 11774126 12050867 12311556 12669976 12997724 13531621 13936866
4775 13936866 14549802 15134271 15824536 16584480 17511682 18388632 19393594 20487075 21539853
4766 21539853 22413756 23202628 23994080 24684392 25226166 25944814 26524555 27201799 27781883
4757 27781883 28795448 29903546 31432639 33251995 35095119 36785134 38170302 39132816
4749 39132816 39980910 40506034 41097614 41776451 42785876 43764897 44974972 46260230 47579905
4740 47579905 48843325 49894159 50702060 51199244 51392850 51092805 50419297 49593651 48512212
4731 48512212 47481960 46675778 46082118 45750580 45685494 45371942 45107873 44388021 43601432
4722 43601432 42424612 41189549 39912991 38688754 37587315 36578897 35820269 34958514
4714 34958514 34290978 33709806 33177563 32590080 31951778 31156695 30398982 29471844 28634300
4705 28634300 27536274 26583222 25801162 24846380 23881958 23111812 22451665 21676634 21044398
4696 21044398 20444732 19870815 19339192 18829624 18343834 17992843 17596204 17204644 16862135
4687 16862135 16583046 16235352 15904756 15535124 15211302 14816892 14468254 14046068 13755254
4678 13755254 13360899 13020825 12644880 12209259 11712307 11430973 11041750 10805160 10520797
4669 10520797 10169142 9824269 9621335 9261900 9038038 8719220 8498952 8167953 7896262
4660 7896262 7634515 7487708 7286769 7050815 6832824 6773788 6565999 6415355 6285014 6104756
4650 6104756 6095048 5980240 5975680 6130138 6283709 6510444 6580180 6664233 6562638 6410705 6169192
4639 6169192 5936981 5559410 5359497 5093161 4851945 4778128 4539242 4428454 4331853 4276504
4629 4276504 4121683 4108085 4188722 4252798 4363638 4737784 4886247 5059471 5050261 5073600 4830383
4618 4830383 4700633 4498422 4235067 4011503 3770175 3652583 3383944 3377769 3249553 3140809
4608 3140809 3066632 3076404 2932944 2921712 2805928 2766922 2779647 2634491 2641755 2614189 2642848
4597 2642848 2589935 2656367 2703567 2767263 2753709 2735426 2620760 2635697 2640861 2566655 2590427
4586 2590427 2461009 2496849 2379253 2413331 2450104 2365022 2277036 2430377 2308681 2255189 2237306
4575 2237306 2312965 2208745 2227455 2259444 2247874 2322638 2340374 2296957 2397882 2345999 2411463
4564 2411463 2410272 2482414 2484455 2529039 2475646 2800993 2850479 2984497 3052304 3007607 2806992
4553 2806992 2839339 2715574 2639570 2486822 2416772 2290850 2345317 2327552 2372462 2356592 2307032
4542 2307032 2342556 2354539 2397320 2517004 2601553 2529538 2700019 2809944 2786171 2964359 3126788
4531 3126788 3574048 3872796 4043184 4169004 4205433 4123188 3920665 3748053 3587065 3437956
4521 3437956 3263601 3162745 3163199 3117176 3042283 3198771 3173835 3223744 3145077 3194581 3274758
4510 3274758 3442984 3456165 3586372 3621501 3705537 3722918 3967937 4156404 4399697 4507531
4500 4507531 4651023 4686394 4706892 4560529 4636303 4578246 4386338 4267499 4296284 4147461
4490 4147461 4296543 4298766 4355776 4447595 4568462 4629140 4708054 4751265 4898381 5026485 5126065
4479 5126065 5268430 5379494 5387896 5395069 5469167 5495174 5621195 5711427 5871033 5912413 6033506
4468 6033506 6041856 6180729 6326767 6374892 6454881 6576348 6648987 6844015 7073141 7214887
4458 7214887 7387695 7542972 7730152 7844486 7960030 8079550 8284351 8497247 8588889 8947614
4448 8947614 9122829 9520008 9848125 10071859 10301184 10510190 10817173 10981332 11105420 11313365
4438 11313365 11311157 11489557 11660519 11764370 12117773 12365994 12668588 12951282 13174451 13459894
4428 13459894 13723311 14062333 14427869 14871446 15238065 15858042 16247249 16933285 17630124
4419 17630124 18527827 19462741 20535789 21594305 22792943 24037909 25795988 28243489
4411 28243489 31951937 36057391 40043787 43137807 45422914 46911079 48045321 49348565
4403 49348565 51227997 53879454 57405676 61841985 67875042 76504037 90660026 115893028
4395 115893028 163203766 231467684 295545740 337600921 357593726 358419515 339267370
4388 339267370 314784927 284527744 250220836 218816993 188066275 161111922 142350297
4381 142350297 130537760 122682618 117656024 114745590 115089023 120253361 134514988 164398338
4373 164398338 218803414 288084288 345928582 379215560 389888558 379763578 351655315
4366 351655315 320489421 282814220 243772478 208738661 175128448 146915091 126806739
4359 126806739 112499617 101191483 92442462 85459507 79464211 74672142 70814736 67376308
4351 67376308 64276182 62374645 61296400 62047924 66292106 76089048 87929008 97541163
4343 97541163 103022958 104511507 101347189 95089815 87600546 79336267 71756257 65468306
4335 65468306 60496285 57117468 54869891 53024997 51239285 49360447 47133755 45267933
4327 45267933 43664436 42517450 41924169 41867256 42748581 44554402 47054336 50622378 55837163
4318 55837163 63103633 71121586 78303437 84071671 89546759 97166613 111415330 137214908
4310 137214908 166710023 188568179 199215651 199711008 189937959 174053526 156902826
4303 156902826 137102411 118361740 101553361 86282971 75080231 68129402 64112282
4296 64112282 61729384 60845500 61555317 63177831 65757713 69932866 74622926 78969876
4288 78969876 83753667 89162867 97198193 112484390 143457767 199479005 262998010 310121317
4280 310121317 333297361 337193948 319363722 288744576 255904448 216902676 179928450
4273 179928450 147013803 116412140 94133863 80005079 71157524 64817756 60249858
4266 60249858 57071672 54879020 53828752 54017031 54800142 55597015 56928940 58870359 62050001
4257 62050001 69169626 83581604 109139193 138168221 159936382 170365121 171320724 162281072
4249 162281072 147066655 130491897 111354364 92925555 76548011 61406284 50028390
4242 50028390 42602655 37649821 33782271 30761401 28118231 25905519 24059065 22565543
4234 22565543 21329465 20183441 19206389 18412877 17717866 17024992 16403669 15873656 15325078
4225 15325078 15006346 14459927 14200237 13885502 13516612 13147389 12848220 12309533 12099263
4216 12099263 11676836 11413839 11094538 10793294 10586894 10394402 10189892 9952287 9763045
4207 9763045 9512886 9265531 8999702 8814501 8595611 8358133 8121653 7949148 7704991 7520108
4197 7520108 7299004 7234684 7065068 6948047 6860351 6649729 6577294 6428535 6233641 6141070
4187 6141070 5972689 5938344 5868606 5789570 5719325 5656071 5495580 5409754 5255704 5176847 5032213
4176 5032213 4973532 4781568 4675559 4542851 4450167 4339227 4213682 4103306 4096783 3998189
4166 3998189 3908814 3924942 3864377 3796516 3746196 3701768 3638160 3614644 3521731 3435973 3446416
4155 3446416 3420387 3473754 3332341 3197028 3175448 3148426 3085240 3022129 3017062 2871845 2912152
4144 2912152 2866787 2862641 2925733 3156517 3332294 3632213 3889679 4064398 4033037 3972605 3742312
4133 3742312 3643103 3440694 3204470 3076709 2944383 2710176 2707707 2595520 2496354 2544933
4123 2544933 2445538 2470360 2526286 2649094 2705081 2933747 3316115 3503029 3637989 3478695
4113 3478695 3347192 3257798 3003430 2688770 2566910 2307188 2098705 1981712 1894350 1829456
4103 1829456 1791450 1729472 1736831 1671570 1672979 1663539 1664777 1607947 1563997 1581288 1562135 1626139
4091 1626139 1654961 1601962 1633790 1655940 1613647 1578433 1491710 1439648 1349785 1367205 1224516
4080 1224516 1252289 1234621 1254792 1281615 1219476 1196804 1186311 1232213 1186331 1225975 1182563
4069 1182563 1175147 1165328 1200148 1262160 1274849 1310625 1415015 1458197 1469439 1646906 1807943
4058 1807943 1922108 1962718 1867033 1848139 1710947 1731112 1522904 1481517 1308534 1233059 1185741
4047 1185741 1176281 1135332 1196204 1101157 1162354 1070155 1142974 1120887 1213492 1262523 1191851 1321737
4035 1321737 1365178 1381925 1639705 1840027 2255732 2394355 2613139 2567295 2499200 2369094
4025 2369094 2206454 1984589 1878031 1640505 1442253 1338909 1196156 1105194 1132427 1049124
4015 1049124 1091716 1085207 1082892 1072293 1065917 1091499 1064370 1184815 1124718 1204134 1364521 1566566
4003 1566566 1761326 1924945 1930885 1920733 1873036 1760092 1634195 1505730 1371969 1175340
3993 1175340 1152137 1078708 984758 938535 873141 843024 880911 819447 836075 872277 920987
3982 920987 905834 818011 901732 844414 819782 882181 880346 836900 803099 836349 744337 833749
3970 833749 728172 786467 708609 798145 666247 713664 683910 723904 656705 674989 655082
3959 655082 586936 622636 647911 512707 626719 573643 522175 455460 535893 476796 529171
3948 529171 425785 522870 446828 489723 429634 500153 405037 465080 416742 397370 324580
3937 324580 403576 289059 426095 366478 466437 362076 353905 372034 303422 238134 344275
3926 344275 283542 206531 193361 297653 271582 267508 217813 216317 136919 264256 187803 158113
3914 158113 259877 243945 80268 118557 186160 212984 161574 201163 195386 238307 239208 178277
3902 178277 185918 144369 153703 152543 141917 112502 222483 123524 244421 110498 150210 131206
3890 131206 115981 151353 107460 121136 48219 189709 89496 97445 32236 59144 59910 114496
3878 114496 59326 47121 64471 105686 105624 65750 6451 156695 40544 66745 46925 100661
3866 100661 43878 54534 13089 96136 -9258 39172 -49383 70729 30796 90860 5059
3855 5059 59992 5010 112177 73243 31748 64884 10106 -7677 34544 79730 49652 61043
3843 61043 80793 58975 60749 29007 71477 68284 132512 114309 113084 44993 84751 55343
3831 55343 111516 71886 42934 64120 44865 88200 96410 91027 46432 118453 81 -303
3819 -303 49988 76567 -2896 171579 45865 91667 -22986 133130 26057 66149 -26367
3808 -26367 15522 66858 52930 -26917 36040 -26307 17973 32696 74352 -15884 7229 64365
3796 64365 51874 29522 42208 -43577 38344 23232 -14000 12725 5319 5815 -30031 61792
3784 61792 1920 33966 56814 2678 38298 28493 -4393 20372 -47904 54166 -61922 -87623
3772 -87623 -32422 -8486 -35585 46549 -65322 -75447 -99385 -59832 3142 -67510 -61217 -17355
3760 -17355 -50403 8319 -46486 3906 3107 15377 -25174 -92090 -40217 -53476 -83388 -44687
3748 -44687 -22675 -8087 -144228 -73899 -30632 -15838 -61070 45095 -36327 -63055 -71515 21503
3736 21503 -95213 -35540 -84050 -90194 -14094 -62036 33839 -31041 -91517 -49606 -56136 -56881
3724 -56881 -33206 -49694 8404 -10900 -641 22941 40637 44131 -51284 7423 54140 24121
3712 24121 -59640 -35898 -11715 -22429 -70272 -34473 37995 -69336 -23861 -64716 79147
3701 79147 -76817 -10343 -46923 -22355 -15881 -68847 -95908 -38312 8033 -1683 23850 -60030
3689 -60030 -35090 13643 100906 -14088 -12960 -78910 -38502 -37684 -69778 23271 1612 -31195
3677 -31195 -85594 -90759 -71159 -17327 -88078 -100620 -111151 -45407 -60589 -16338 -77587 -18875
3665 -18875 22853 7729 9708 -20822 -35914 -41432 -24047 -13032 -8786 -300 -125884 -3882
3653 -3882 -78588 24141 76 -18732 -45728 55037 -84477 -9229 -88499 29310 -128774
3642 -128774 -33911 -96908 -65727 -112657 -42114 -38258 -6813 -98109 -81621 -179767 20236 -145093
3630 -145093 34240 -82967 -63092 -106337 -54399 -112543 927 -135821 -46005 -123565 -116875
3619 -116875 -86204 46969 -71711 -135700 -94756 -57169 -89694 37946 -73001 -52004 -85184
3608 -85184 -98347 -106297 -47066 -23127 -24957 -36901 -90772 -115957 -107279 -122192 -56485 -24195
3596 -24195 -122292 -125683 -76070 -80432 -96050 -102569 -137810 -55692 -89574 -20134 -104558 -55599
3584 -55599 -106419 -99486 -95131 -63098 -51671 -104255 -119594 -97866 -36132 -46431 -124920 -14305
3572 -14305 -79723 -45858 -75826 -4200 -73405 -81416 -112529 -55205 -147673 -62147 31352 -103404
3560 -103404 2524 -90268 -42960 -94023 22393 -15899 -72716 -84057 -125301 -140742 -115350
3549 -115350 -44760 -45554 -101439 -70322 -60225 -109742 -60387 -84352 -72154 -21393 -35648 -100431
3537 -100431 -116210 -6233 -96769 9302 -41407 -18388 -60201 11336 -92439 -66730 -121763
3526 -121763 -32364 -139819 -55759 -83122 -82829 -9524 -68643 -71636 -135530 -78110 -59479 -82004
3514 -82004 -7650 -53697 -33904 -46380 4398 -30315 -61247 -10017 -14812 -43663 -66649 -45008
3502 -45008 -87240 -44793 -38884 -85308 -87919 -28447 -43078 -77310 -27878 -34467 -46908 -26933
3490 -26933 -63356 -53476 -95180 -69711 -42684 -33988 -118840 -107288 -63126 -97624 -58601 -92726
3478 -92726 -58411 -81686 -73825 -27488 -35905 -8616 -44042 -76913 -92320 -10152 -67558 -72333
3466 -72333 -122386 -111857 -89046 -73508 -21341 -148238 -25703 -97348 -32600 -50631 -82433
3455 -82433 -27895 22631 -54321 -26823 -123177 -31994 -58945 -52365 -110169 -76264 -133269 -69474
3443 -69474 -80520 -37435 -74544 4097 -123637 -70092 -96748 -63266 -114406 -26693 -43307 -34260
3431 -34260 -85484 450 -58579 -122093 -49972 -39614 -36971 -34845 -43659 -53946 -75809 -23359
3419 -23359 -69290 -14355 -32461 -121464 -128221 -126149 -103112 -77533 -95227 -109601 -136563 -107162
3407 -107162 -123806 -155540 -108489 -142338 -42726 -166294 -8081 -24294 -135198 -198297 -64866
3396 -64866 -101132 -80881 -124100 -16906 -158346 -33252 -80345 -27739 -111493 -116023 -153179
3385 -153179 -63573 -98388 -61459 -184408 -137149 -124829 -62729 -146983 -88343 -77925 -70860 -95576
3373 -95576 -56298 -34822 -45798 -32625 -31003 -14807 37896 -49191 112200 83870 100611 84276
3361 84276 91604 61583 6329 -84611 -28427 19644 -15832 -62972 1929 -87245 -9511 -64898
3349 -64898 -55238 -100683 -38681 -90793 -47588 -84054 -115189 -77019 -24618 -105354 -42499 -33542
3337 -33542 2820 -105116 -68717 -111760 -46164 -75920 -28403 -63501 -111527 -84714 -24394 -97530
3325 -97530 -63679 -32962 -109290 -32175 -27873 -42006 -10545 -45736 -32752 -8389 -22124 -387
3313 -387 -17853 85044 -26308 5579 11212 182672 314348 385422 469693 473762 431065 333157
3301 333157 397907 303564 182034 106053 54827 34202 49862 15054 -21770 28282 -105402
3290 -105402 -39556 -105923 -24034 -88759 -80778 -88720 14652 -128457 -133036 -43525 -47048 -170635
3278 -170635 -95122 -56911 -68897 -112835 -114265 -219395 -60333 -111575 -103824 -99459 -104806 -177869
3266 -177869 -74101 -23674 -65666 -78795 -167181 -127363 -101911 -174855 -164296 -106472 -123558
3255 -123558 -182308 -129656 -122400 -105017 -86854 -114055 -83817 -131418 -177255 -92704 -114822 -121695
3243 -121695 -94033 -175603 -199304 -132404 -151661 -98771 -94919 -146755 -135134 -122976 -126502 -114389
3231 -114389 -118658 -159469 -127921 -155168 -151310 -170687 -111502 -134082 -132019 -86056 -187075 -97548
3219 -97548 -151737 -162315 -111738 -99501 -108618 -190617 -59804 -140079 -99771 -112407 -151775 -65366
3207 -65366 -8516 -174759 -59740 -108590 -95301 -76478 -162699 -100906 -78724 -151499 -126967
3196 -126967 -76052 -102572 -92099 -91567 -103565 -74298 -65431 -116415 -61945 -92451 -59705 -102538
3184 -102538 -35468 -98670 -93703 -77949 -157567 -67862 -105303 -91055 -75960 -108599 -284 -31889
3172 -31889 -117181 -108690 -127447 -89200 -40279 -59890 -17458 -84537 -102225 -50548 -107673 -85360
3160 -85360 -93434 -104352 -177403 -116676 -75810 -117941 -66992 -67647 -93387 -99060 -131830 -126911 -120213
3147 -120213 641 -77690 -36381 -150985 -127423 -170002 -163372 -103507 -100248 -158387 -157763 -65265
3135 -65265 -34138 -135753 -46753 -196540 -171735 -113728 -157558 -130543 -143177 -156165 -247473
3124 -247473 -67206 -126351 -175475 -152728 -56381 -208064 -168819 -159915 -148680 -97406 -203342
3113 -203342 -148262 -132138 -227785 -95724 -187257 -132427 -84096 -122684 -181234 -103138 -166361
3102 -166361 -122874 -216676 -166043 -166252 -126303 -180119 -132407 -193584 -181107 -190342 -198580 -139121
3090 -139121 -151319 -172885 -120300 -203746 -83764 -144938 -107618 -128769 -134122 -178867 -124518 -213017
3078 -213017 -126319 -173953 -120499 -116080 -38559 -198445 -150232 -135104 -195205 -184346 -153155 -77272
3066 -77272 -171195 -143169 -203563 -186306 -97506 -150166 -133330 -115811 -112807 -146663 -103856 -192376
3054 -192376 -49116 -164403 -90266 -186089 -176171 -162867 -164675 -155072 -148602 -80972 -158627 -120807
3042 -120807 -141388 -168350 -137020 -95267 -221221 -126655 -56282 -129765 -191436 -142128 -210399
3031 -210399 -77715 -121155 -108863 -191232 -127812 -64586 -146797 -182301 -101078 -116745 -103901
3020 -103901 -201626 -57958 -110384 -99516 -154328 -70450 -270917 -109698 -253238 -159363 -174760
3009 -174760 -76733 -154198 -88246 -118635 -166214 -156599 -154407 -155580 -101633 -96384 -135382 -93488
2997 -93488 -37081 -123796 -45698 -140269 -154402 -181415 -156999 -144050 -127706 -138439 -179415 -180737
2985 -180737 -123761 -167826 -120160 -181659 -125522 -103593 -122957 -150089 -160070 -128156 -112030 -164671
2973 -164671 -215918 -196439 -167892 -150287 -93164 -165398 -172255 -147317 -196675 -81497 -95172 -89123
2961 -89123 -158946 -108767 -147399 -70776 -88441 -64174 -143775 -127812 -213846 -146357 -169684 -122325
2949 -122325 -150794 -117859 -196807 -192974 -124217 -112115 -134715 -112711 -201657 -106930 -77747 -122524
2937 -122524 -193906 -98720 -180718 -124490 -145801 -92087 -160104 -193890 -171496 -138260 -160659 -134813
2925 -134813 -151112 -126699 -227137 -161082 -123944 -131981 -150723 -105577 -137966 -226762 -100759
2914 -100759 -138645 -160397 -132608 -173842 -160641 -148902 -163211 -123407 -139213 -181533 -262660 -78208
2902 -78208 -113111 -243714 -185696 -125411 -202973 -186609 -275526 -163921 -128935 -205030 -253767
2891 -253767 -193002 -138870 -112395 -80851 -193531 -188737 -164092 -180309 -92803 -123651 -117675 -118111
2879 -118111 -181640 -179078 -55922 -129919 -130441 -152917 -173506 -181127 -142361 -149536 -132215 -105845
2867 -105845 -157636 -218846 -155825 -123938 -134157 -127712 -249164 -325930 -152230 -176853 -139862
2856 -139862 -133503 -147595 -234296 -168377 -234246 -146074 -150864 -148070 -156946 -191536 -192837 -117732 -104167
2843 -104167 -130658 -183936 -146002 -181244 -122914 -106702 -126885 -86361 -215764 -115279 -163687
2832 -163687 -104856 -131285 -111138 -188176 -152086 -117292 -27713 -115792 -157625 -183527 -204633 -140681
2820 -140681 -218098 -99093 -187777 -139808 -190252 -174755 -162500 -188253 -102178 -150059 -105733
2809 -105733 -165139 -109576 -189951 -96914 -190109 -149077 -167857 -111841 -80712 -120773 -176906 -70451
2797 -70451 -196494 -220483 -142999 -62030 -96234 -187356 -173738 -165340 -141274 -53264 -139328 -127477
2785 -127477 -176248 -165268 -234863 -57257 -153074 -145670 -256381 -120097 -163438 -106265 -174769
2774 -174769 -102197 -137724 -102190 -133291 -111753 -209559 -192814 -222532 -99012 -269922 -179035
2763 -179035 -175485 -133519 -158719 -202162 -196947 -194932 -157843 -185542 -182449 -140640 -240344 -80196
2751 -80196 -157208 -48689 -157054 -150725 -226778 -150428 -61185 -123543 -185389 -170098 -139361 -200083
2739 -200083 -181714 -166395 -153370 -157074 -143486 -223224 -158673 -187170 -61823 -78755 -116361 -261775
2727 -261775 -193315 -133554 -158422 -200497 -134765 -158758 -151159 -207785 -200054 -178559 -210446 -194001
2715 -194001 -187109 -204409 -141645 -151906 -121668 -198681 -28471 -242435 -175965 -194362 -117614
2704 -117614 -237053 -104621 -196998 -159588 -165738 -141780 -154164 -84757 -220738 -138611 -121943
2693 -121943 -83930 -151398 -63655 -169070 -184857 -152046 -126492 -215414 -116168 -139040 -171303
2682 -171303 -110260 -162017 -203697 -48959 -141468 -104737 -180027 -50115 -161586 -155912 -163517
2671 -163517 -156800 -177703 -165784 -182298 -152598 -115992 -171276 -165776 -120476 -208783 -164981 -255405
2659 -255405 -134135 -194340 -116423 -159400 -119867 -121010 -161834 -99820 -150738 -203199 -151445 -144658
2647 -144658 -207494 -137882 -141006 -78162 -106129 -168750 -141784 -133751 -174115 -158527 -173668 -124578
2635 -124578 -190623 -54981 -146627 -96082 -57221 -165903 -128373 -160230 -151657 -141598 -131506
2624 -131506 -126262 -164667 -69951 -201656 -77672 -129077 -182253 -254593 -155752 -170830 -167088 -128930
2612 -128930 -123352 -182030 -182924 -170257 -139283 -173457 -146833 -160519 -194456 -182815 -99829 -234997
2600 -234997 -203352 -202827 -166656 -179002 -171445 -127160 -109405 -183725 -204384 -220789 -206701 -79007
2588 -79007 -167490 -210600 -198463 -187724 -157965 -130871 -101574 -103127 -179585 -147075 -188623 -112983
2576 -112983 -166580 -110339 -124404 -154009 -209210 -172016 -159577 -232531 -211439 -256135 -210504 -185814
2564 -185814 -155835 -181164 -158862 -173020 -198035 -161986 -179200 -145584 -122640 -242108 -164076
2553 -164076 -117223 -179470 -149568 -129430 -168502 -254464 -243711 -182271 -192661 -131901 -147919 -256939
2541 -256939 -148789 -209213 -101553 -197691 -49493 -183632 -168510 -139237 -133094 -183880 -159372
2530 -159372 -186419 -219009 -182888 -162028 -132633 -173519 -159810 -250370 -207421 -175459 -195635 -178518
2518 -178518 -204025 -186172 -143740 -171008 -164252 -55247 -191822 -186707 -226984 -183146 -183914 -115077
2506 -115077 -140398 -179316 -142505 -187741 -78201 -159248 -92647 -93686 -224153 -123313 -163105
2495 -163105 -122437 -107391 -171853 -246285 -231285 -195981 -107746 -185316 -167428 -200290 -102906 -223456
2483 -223456 -117442 -188397 -169930 -103976 -184142 -109131 -97908 -51350 -106389 -146124 -196558
2472 -196558 -141477 -145595 -122038 -177277 -100611 -247013 -209118 -101294 -147232 -162127 -139198
2461 -139198 -133522 -110306 -157607 -167545 -197729 -124542 -170056 -191139 -216303 -139043 -180627 -67114
2449 -67114 -243544 -201816 -93734 -154242 -162465 -145760 -118528 -233046 -148370 -163063 -154401 -141755
2437 -141755 -178757 -171627 -230784 -157175 -177509 -194079 -197616 -127639 -245817 -170279 -263856 -208194
2425 -208194 -125861 -151540 -148253 -161534 -173296 -131821 -151273 -169323 -168209 -126906 -230805 -175673
2413 -175673 -135918 -128242 -87936 -137655 -196334 -176987 -127045 -208334 -154435 -129389 -262331 -225302
2401 -225302 -204509 -174600 -213033 -136406 -237185 -162252 -138221 -170224 -144767 -148502 -186735 -170558
2389 -170558 -158108 -168139 -171167 -175763 -124956 -186048 -184885 -181140 -115051 -190412 -170401 -95249
2377 -95249 -191846 -100926 -156729 -182678 -223340 -243758 -201366 -220976 -153908 -141892 -178347 -196598
2365 -196598 -160419 -144851 -161729 -132950 -175877 -256035 -218812 -154334 -122013 -153470 -166697 -230269
2353 -230269 -128051 -166831 -171448 -164355 -139050 -234040 -129994 -149758 -159301 -155673 -180098 -181327
2341 -181327 -133714 -174097 -228246 -141087 -177341 -209343 -177922 -227364 -209007 -202102 -225436 -133233
2329 -133233 -179304 -136898 -134854 -131078 -177044 -158711 -124002 -218140 -145731 -210245 -121383 -149359
2317 -149359 -229406 -231338 -104785 -254645 -169628 -71946 -176035 -108870 -182254 -163930 -222512
2306 -222512 -86016 -196361 -98092 -193353 -188559 -145172 -66076 -172040 -128607 -201411 -198244
2295 -198244 -139273 -185821 -166965 -179967 -173285 -142405 -172405 -131707 -104815 -147257 -215324 -211659
2283 -211659 -214234 -182103 -148791 -100204 -228546 -133138 -193300 -133173 -213924 -219519 -121234 -210453
2271 -210453 -184932 -152357 -204272 -237061 -140306 -172690 -210040 -153774 -152117 -120324 -173368 -193183
2259 -193183 -154269 -182733 -212991 -180197 -152357 -142495 -183271 -130476 -139756 -141839 -144495 -207014
2247 -207014 -169404 -187621 -152729 -199791 -223600 -158652 -154245 -176980 -188090 -126180 -137325 -209496
2235 -209496 -167658 -182406 -164713 -136671 -140985 -148504 -188871 -187788 -183499 -173006 -170477 -161225 -177504
2222 -177504 -230766 -143761 -151175 -208904 -231917 -195391 -207302 -162284 -177578 -118417 -105737 -180874
2210 -180874 -180147 -141118 -162009 -220927 -228590 -195530 -171845 -188202 -188768 -209066 -208505 -140972 -106436
2197 -106436 -166598 -136315 -209477 -171886 -201555 -218281 -179726 -235935 -164688 -166112 -182448 -101988
2185 -101988 -152382 -166893 -87616 -161514 -199308 -133584 -187472 -108805 -205063 -142880 -146541 -120139
2173 -120139 -135406 -164713 -126167 -102389 -198286 -82924 -205707 -179105 -212567 -157127 -211453
2162 -211453 -147971 -195229 -186160 -198480 -137443 -157159 -173505 -199955 -151789 -180382 -160525 -124611
2150 -124611 -123328 -203950 -178209 -118011 -100210 -219933 -95574 -108123 -145708 -129612 -171609
2139 -171609 -185419 -221048 -165906 -221263 -171107 -82643 -72383 -216215 -167302 -160773 -121472 -164823
2127 -164823 -148387 -149210 -151948 -181439 -164106 -125666 -166955 -123123 -55653 -163911 -85444 -89436
2115 -89436 -161373 -176682 -194267 -119905 -181620 -116024 -130114 -211859 -231479 -272533 -142308 -158269
2103 -158269 -206518 -139073 -211900 -236202 -148363 -204118 -188863 -161701 -183802 -158027 -204049 -212637
2091 -212637 -211313 -203356 -203919 -212230 -278648 -190178 -152438 -161800 -220007 -141805 -124432 -181880 -133033
2078 -133033 -194681 -119974 -247942 -191225 -206344 -103039 -269672 -213929 -266609 -189182 -209243
2067 -209243 -186319 -103341 -238283 -176877 -254792 -173059 -129631 -172751 -189100 -193592 -211820 -142712
2055 -142712 -133775 -140057 -194213 -202486 -236027 -145322 -149351 -155039 -178392 -125729 -229311 -130390
2043 -130390 -160678 -181880 -227261 -201885 -136066 -215487 -207839 -162989 -164786 -236729 -190806 -106747
2031 -106747 -191388 -152342 -143994 -148325 -168427 -177971 -208822 -174084 -223131 -96956 -105329 -159704
2019 -159704 -245754 -105443 -183534 -132214 -202963 -183271 -186611 -81632 -90357 -134183 -204567 -159912
2007 -159912 -150017 -157084 -155528 -144366 -136547 -205641 -156165 -130115 -182848 -181505 -208878 -147991 -183782
1994 -183782 -160073 -206097 -219070 -163104 -210603 -134495 -278732 -174909 -127442 -142647 -201763
1983 -201763 -201255 -150219 -140297 -158972 -152312 -172603 -148784 -189613 -198917 -154352 -120006 -152997 -187678
1970 -187678 -94384 -252152 -133839 -196421 -134783 -166281 -198949 -194737 -210052 -199422 -175495
1959 -175495 -169668 -224818 -181445 -208204 -130678 -235413 -264689 -153518 -208181 -145201 -160561
1948 -160561 -191147 -234533 -170801 -146391 -218455 -133063 -173456 -117359 -168642 -167399 -182434 -187661
1936 -187661 -163116 -95701 -134711 -110321 -216327 -141449 -212701 -203161 -207555 -221862 -209579 -168754
1924 -168754 -148297 -93598 -199978 -182349 -173715 -224839 -247259 -220853 -188209 -209756 -192241 -194735
1912 -194735 -188364 -135884 -156130 -134478 -193856 -110477 -150698 -155171 -168827 -161749 -145605 -138186
1900 -138186 -207866 -275868 -220336 -155242 -124898 -135603 -264944 -203770 -208462 -158738 -269104
1889 -269104 -207705 -196203 -222161 -186851 -148021 -187773 -246790 -235342 -198872 -241347 -174158 -195872
1877 -195872 -241248 -258461 -220040 -200864 -201650 -150411 -242277 -172305 -298705 -232504 -164305 -189896
1865 -189896 -243776 -127960 -207758 -186377 -148235 -159722 -125225 -110274 -187931 -265974 -227485
1854 -227485 -133027 -190624 -164610 -178711 -225582 -275747 -177561 -166436 -123945 -248127 -212202
1843 -212202 -213887 -234756 -190508 -193516 -244230 -236770 -150307 -147057 -176767 -171105 -149677 -246893 -189220
1830 -189220 -106217 -245995 -197498 -260586 -149541 -228016 -219823 -134805 -237893 -202263 -199677
1819 -199677 -170966 -164606 -193137 -190137 -175554 -258892 -229588 -176700 -127363 -220434 -186232 -177073
1807 -177073 -186299 -242053 -201197 -159760 -178896 -189040 -245991 -269278 -165981 -133062 -140809 -243805
1795 -243805 -141617 -234274 -208006 -197575 -114755 -285614 -195819 -250887 -218888 -213600 -127885
1784 -127885 -227215 -197921 -230116 -173081 -114680 -170622 -190517 -167401 -249653 -169072 -232948 -181838
1772 -181838 -201270 -169670 -218592 -207273 -144258 -147464 -212047 -137229 -231067 -214371 -127106 -160429
1760 -160429 -155162 -224495 -216212 -244186 -238847 -177229 -134500 -173619 -192465 -207546 -214375 -187694
1748 -187694 -191731 -173954 -227849 -280002 -215613 -177132 -207476 -195606 -197928 -163363 -222129 -242465
1736 -242465 -171508 -138150 -147327 -263925 -189368 -283573 -170311 -204362 -105048 -202961 -175518
1725 -175518 -245565 -146693 -167242 -204796 -76737 -256080 -203147 -214063 -192628 -193010 -145956 -162359
1713 -162359 -251604 -191360 -203531 -203781 -213085 -186722 -240062 -155768 -144719 -141445 -143961 -163539 -123455
1700 -123455 -205737 -154249 -195700 -187207 -181459 -195668 -275390 -209902 -149543 -188945 -247084 -121410
1688 -121410 -187450 -129274 -172894 -152006 -159493 -101025 -246326 -190347 -127221 -218210 -182176 -160568
1676 -160568 -209187 -198834 -172842 -83494 -187680 -166558 -169208 -168636 -252836 -143651 -182794 -103972
1664 -103972 -221881 -99288 -193900 -200809 -189405 -188569 -151260 -196005 -208009 -163436 -181071 -222503
1652 -222503 -155062 -170267 -211040 -181534 -106230 -219243 -175076 -217743 -117510 -212046 -190039
1641 -190039 -191957 -226227 -186693 -191829 -154298 -201812 -245152 -150286 -270338 -121590 -164094 -160425
1629 -160425 -256275 -147755 -193899 -122000 -216178 -199006 -163310 -243790 -219561 -322482 -171056
1618 -171056 -212479 -145655 -169856 -180861 -140329 -230737 -258699 -176908 -99173 -249151 -132211
1607 -132211 -259519 -286315 -245843 -186791 -180344 -200209 -241680 -130980 -169442 -238279 -175020
1596 -175020 -212211 -230355 -239346 -245291 -247946 -226155 -222912 -189936 -243369 -170052 -246396 -221988
1584 -221988 -176221 -176883 -211058 -161356 -272481 -250294 -146090 -156651 -166334 -193074 -212186 -170713
1572 -170713 -247973 -154039 -203503 -178849 -182062 -226250 -225308 -169183 -129037 -232566 -173089 -83384
1560 -83384 -142056 -130013 -218782 -154932 -230253 -197831 -245352 -211684 -277569 -222403 -158289 -223342
1548 -223342 -184759 -160333 -157317 -210641 -152471 -238643 -208501 -292348 -137050 -191509 -97616 -163379
1536 -163379 -138390 -170283 -129475 -210756 -129113 -154074 -190959 -171867 -127106 -114142 -144110 -95696
1524 -95696 -80053 -116276 -177374 -64704 -143566 -199207 -120350 -196662 -139266 -250321 -96340
1513 -96340 -192942 -197057 -198279 -214043 -174900 -179932 -151077 -106885 -127664 -159266 -172669 -199809
1501 -199809 -130121 -152755 -211688 -165885 -193416 -142815 -145892 -101368 -187726 -187304 -233681 -203863
1489 -203863 -247590 -155810 -227463 -188639 -118131 -120104 -157766 -137059 -195228 -153993 -221964 -182972
1477 -182972 -227189 -155867 -201523 -235264 -163221 -234034 -160463 -161938 -117262 -163732 -184573 -144329
1465 -144329 -217062 -244177 -241342 -120824 -160016 -225410 -211985 -132065 -263147 -297127 -198752
1454 -198752 -345332 -185431 -268702 -211186 -254574 -233400 -164051 -247612 -193262 -175536 -197137
1443 -197137 -257857 -164972 -176444 -188670 -141889 -204231 -242561 -213304 -255991 -171448 -266738 -203433
1431 -203433 -240625 -185001 -201584 -208005 -211508 -224621 -168422 -175646 -179762 -175296 -187427 -231140 -202621
1418 -202621 -152758 -215252 -93073 -239712 -153068 -190361 -192668 -173760 -244496 -231041 -121047
1407 -121047 -254320 -260093 -176364 -176621 -204663 -150225 -180964 -140756 -150821 -138769 -186582 -114477
1395 -114477 -238020 -132598 -184493 -141724 -142948 -162943 -184499 -110359 -169547 -136971 -208484
1384 -208484 -122841 -190682 -143375 -180821 -106070 -165110 -112538 -168241 -128171 -146920 -167321 -155140
1372 -155140 -81748 -244446 -122907 -156872 -77597 -162561 -132095 -202508 -63940 -124306 -116243
1361 -116243 -121158 -201186 -126588 -170320 -166049 -151812 -182597 -241508 -133333 -152402 -201678 -155599
1349 -155599 -134599 -153568 -153357 -217011 -241823 -173134 -159379 -205065 -187392 -150514 -165647 -172171
1337 -172171 -159931 -287454 -133458 -313212 -143565 -255529 -155112 -184206 -142401 -209635
1327 -209635 -135752 -270209 -222099 -236110 -227338 -218632 -172380 -214904 -195951 -164315 -138070 -137506
1315 -137506 -243039 -241860 -177799 -215907 -205373 -242707 -195365 -191641 -219888 -223512 -179382 -185273
1303 -185273 -198026 -175781 -251893 -218938 -209518 -250617 -251133 -157798 -209970 -200488 -207141 -184054 -176768
1290 -176768 -230805 -167195 -239648 -187801 -235379 -217804 -242341 -139516 -194078 -218476 -218298 -212289
1278 -212289 -228509 -222413 -194628 -216565 -182554 -258903 -178032 -267049 -250392 -216018 -150980 -276135
1266 -276135 -239739 -174963 -155199 -182064 -184093 -171778 -181156 -219592 -211626 -222621 -192684 -224057
1254 -224057 -175284 -264266 -215896 -277068 -268451 -176339 -243057 -202531 -231979 -208349 -157959 -187601
1242 -187601 -172674 -306711 -215884 -175814 -211270 -220903 -101160 -205270 -169085 -158474 -225055
1231 -225055 -198367 -186775 -229502 -257010 -238165 -226807 -231928 -177536 -198765 -169800 -332771 -173856
1219 -173856 -183512 -214624 -298149 -247541 -261088 -184642 -244656 -140690 -190963 -257333 -207976 -301012
1207 -301012 -252377 -238875 -204274 -155055 -286114 -235281 -195184 -161310 -244977 -210298 -190020
1196 -190020 -277325 -190066 -111267 -214040 -120678 -157797 -261256 -242533 -235402 -177613 -85369
1185 -85369 -164065 -142745 -168138 -228151 -196722 -120576 -212453 -198477 -103968 -247918 -215858 -81307
1173 -81307 -156964 -169782 -109823 -252869 -152642 -90255 -213806 -167290 -158222 -244354 -141870
1162 -141870 -211441 -190206 -145878 -230238 -154329 -140795 -166061 -123217 -178976 -138562 -108768 -139037
1150 -139037 -191449 -195827 -155951 -190014 -146698 -197336 -164830 -131063 -183098 -225634 -110167 -151103
1138 -151103 -177112 -148663 -167392 -138164 -173439 -204178 -167965 -94540 -222185 -220301 -160026 -266829
1126 -266829 -239357 -188416 -232067 -140647 -249919 -207322 -171394 -191810 -233048 -218569 -192140
1115 -192140 -249293 -318140 -225729 -288464 -172376 -215729 -259449 -198750 -253286 -210958 -235569
1104 -235569 -196069 -202445 -152666 -201143 -266249 -230457 -166256 -120143 -217924 -230385 -252397 -241268
1092 -241268 -281107 -198596 -302771 -236762 -285178 -237179 -258716 -220542 -210092 -258627 -177824
1081 -177824 -271409 -238707 -202382 -264658 -211620 -143216 -188709 -214239 -188442 -300642 -212312
1070 -212312 -256759 -298392 -284410 -205444 -348548 -164732 -260129 -302560 -240823 -192378 -228718
1059 -228718 -182070 -258006 -316865 -215138 -258360 -254599 -271486 -202571 -274225 -196229 -286385 -215798
1047 -215798 -186526 -296180 -187691 -268010 -202035 -251454 -171872 -184758 -204869 -209130 -238812
1036 -238812 -182508 -211841 -218032 -231565 -171572 -241630 -207443 -281160 -226800 -166376 -187373 -315118
1024 -315118 -166464 -265206 -164047 -142762 -234795 -146946 -207197 -271616 -156609 -132005 -217687
1013 -217687 -190616 -198714 -219100 -205913 -189455 -130375 -106742 -147621 -167134 -168684 -144218 -159664
1001 -159664 -176115 -199646 -219408 -178727 -226149 -265579 -162359 -267905 -211652 -205798 -213275 -159681
989 -159681 -239934 -157167 -174070 -172747 -230142 -149456 -78154 -170766 -151018 -249453 -153158 -191040
977 -191040 -240541 -222305 -122122 -229073 -246376 -156133 -193710 -204176 -212731 -183230 -146569 -229816
965 -229816 -235327 -248033 -169804 -241723 -206194 -234990 -116167 -262923 -207625 -139744 -250932
954 -250932 -216334 -199297 -187665 -209070 -261914 -194133 -230010 -196179 -200683 -241647 -186334 -227565
942 -227565 -189270 -197834 -195754 -234319 -190062 -219439 -172075 -185447 -279694 -179637 -203298 -191295
930 -191295 -286561 -273055 -232280 -159289 -233168 -242932 -182900 -177919 -156335 -263015 -157604 -183492
918 -183492 -173337 -223768 -162990 -218398 -178329 -214155 -199641 -259129 -208923 -211302 -175242 -236869
906 -236869 -148783 -238695 -135966 -184437 -176748 -250889 -219896 -185803 -259967 -252667 -233787 -219734
894 -219734 -261320 -217916 -138310 -249953 -134249 -218194 -79758 -160004 -166010 -302828 -257480
883 -257480 -226275 -165159 -189525 -207194 -142555 -234578 -231092 -168204 -222073 -233478 -224059 -195319
871 -195319 -209682 -213454 -193326 -243476 -256948 -212169 -174475 -219642 -135805 -147486 -187627 -160248
859 -160248 -207710 -228036 -124829 -209083 -107745 -253804 -250404 -188693 -156267 -176668 -177641 -283466
847 -283466 -149025 -236939 -231635 -193564 -123350 -274044 -159148 -165812 -221800 -141732 -156491 -220064
835 -220064 -172343 -213139 -164612 -217462 -236091 -197089 -135914 -258281 -185601 -202993 -184583 -260928
823 -260928 -155159 -219489 -168313 -214405 -215671 -194978 -199811 -241033 -237246 -247407 -161503 -204161
811 -204161 -207625 -211468 -221311 -201573 -148056 -133568 -189490 -269145 -165888 -225038 -159040 -259688
799 -259688 -167579 -140931 -241508 -203485 -189492 -153994 -158335 -258388 -271709 -181669 -300040
788 -300040 -121342 -248423 -141539 -225176 -207562 -211233 -222529 -189844 -175038 -224708 -171154
777 -171154 -250170 -255809 -221551 -111759 -252666 -105820 -200044 -174243 -199557 -197949 -209093 -176343
765 -176343 -254023 -161926 -225396 -260125 -180740 -140925 -203511 -133447 -130305 -235989 -199182 -166741
753 -166741 -219866 -259375 -162220 -187381 -181534 -157116 -232809 -218492 -215684 -228245 -238186 -226877
741 -226877 -217865 -134404 -186117 -151233 -259276 -263962 -245250 -244900 -230440 -230161 -95726 -237553
729 -237553 -182936 -278341 -215848 -170719 -272090 -224040 -236414 -131308 -232117 -198455 -200710
718 -200710 -173730 -130797 -213564 -282286 -232968 -196025 -224532 -79295 -223122 -161731 -260839
707 -260839 -227149 -175689 -217414 -115706 -206006 -245182 -168489 -257246 -182848 -258823 -137432
696 -137432 -256287 -136227 -165385 -182190 -246402 -225552 -224976 -205512 -226570 -242806 -188448 -112097
684 -112097 -212979 -208864 -220884 -107733 -159027 -231270 -255350 -147060 -219994 -192441 -194036 -136489
672 -136489 -178474 -256886 -201006 -221838 -146712 -185068 -232919 -212180 -164537 -282046 -146583
661 -146583 -215209 -137792 -213050 -116461 -194968 -237837 -233475 -116462 -201802 -267038 -196915 -247889
649 -247889 -143110 -125290 -212749 -188431 -276411 -185391 -228333 -134731 -204507 -100089 -173151
638 -173151 -167769 -162193 -201782 -242470 -199716 -250291 -235311 -196784 -240412 -185997 -147629 -252767
626 -252767 -259514 -150092 -158236 -215406 -214795 -240529 -166951 -218092 -243584 -147978 -161894 -166910 -137970
613 -137970 -168678 -238114 -148525 -186151 -195670 -206540 -224354 -197997 -223692 -166316 -231820 -197904
601 -197904 -190021 -273770 -140326 -349550 -206681 -248444 -262998 -273564 -216972 -262346 -214269
590 -214269 -227404 -135592 -197217 -161188 -284079 -123646 -229222 -192144 -168581 -159060 -221557
579 -221557 -150880 -230931 -180209 -233116 -188863 -249152 -200065 -233381 -237042 -226642 -213450 -229635
567 -229635 -165809 -257116 -153033 -249571 -173198 -250943 -136888 -211550 -183132 -139482 -225895
556 -225895 -153745 -202442 -215962 -200412 -240966 -167654 -183766 -200773 -140754 -210949 -232011 -258764
544 -258764 -156196 -286948 -191134 -271465 -234712 -251681 -187463 -205782 -192302 -199595 -211692 -153998
532 -153998 -148508 -219136 -222067 -245392 -173097 -157036 -195948 -181098 -147633 -198224 -166264 -226757
520 -226757 -194080 -269449 -163976 -221585 -131084 -228673 -188256 -173886 -112832 -226156 -225984 -214692
508 -214692 -177285 -204861 -244041 -200113 -168275 -164278 -219271 -167789 -154634 -263461 -225806 -166431
496 -166431 -248856 -164571 -239152 -195462 -129254 -166970 -210362 -153909 -278822 -177327 -203741
485 -203741 -146777 -229651 -186394 -297886 -186775 -183125 -204782 -253142 -153965 -189687 -206789 -208307
473 -208307 -118804 -211255 -219246 -199405 -217649 -220908 -190978 -140212 -236046 -315955 -209471 -237805
461 -237805 -206654 -205091 -272760 -253174 -216753 -260467 -182542 -271981 -221021 -201211 -252856 -233759
449 -233759 -219575 -190809 -243462 -285098 -209791 -244249 -203905 -257390 -239682 -250414 -253558 -177679
437 -177679 -244412 -195198 -168357 -191958 -166521 -236071 -200488 -192269 -203084 -254324 -245620 -161104
425 -161104 -282069 -175584 -255838 -196409 -193223 -228233 -195136 -243365 -182320 -170793 -188129 -239464
413 -239464 -242028 -209771 -243385 -157773 -197262 -219629 -204636 -234615 -138684 -180787 -259085 -180030
401 -180030 -184575 -221323 -249473 -144759 -117582 -107574 -183009 -206704 -207584 -199850 -234336 -239352 -260342
388 -260342 -250764 -193947 -192368 -199448 -222454 -190893 -181721 -199032 -149789 -172349 -169790 -127406 -202618
375 -202618 -164958 -177575 -141831 -209461 -154428 -233884 -132555 -154710 -94530 -132571 -119348 -220128
363 -220128 -243155 -239213 -201010 -225738 -146371 -186402 -179748 -167009 -138991 -199914 -167973 -201259
351 -201259 -216920 -181426 -146674 -198126 -198772 -208018 -179291 -196669 -181479 -207597 -130769 -218392
339 -218392 -151335 -184602 -136885 -171535 -220722 -170924 -182263 -114217 -227151 -171514 -159074 -148069
327 -148069 -207959 -228246 -236552 -186958 -237029 -217811 -176473 -258274 -227421 -142634 -186158 -200646
315 -200646 -216243 -239459 -311801 -291313 -259270 -184970 -238700 -165176 -252719 -227092 -285611 -195275
303 -195275 -331934 -251573 -306257 -261794 -317631 -233575 -278805 -223122 -239679 -226713 -208474 -291623
291 -291623 -245666 -243953 -316010 -265506 -337764 -215638 -258955 -158742 -244074 -223657 -263497 -246465
279 -246465 -220827 -287951 -232694 -244430 -275923 -256520 -255025 -226401 -250389 -255743 -289497 -262716
267 -262716 -190076 -327902 -231731 -247093 -241653 -294420 -195163 -280756 -215582 -282612 -255204 -252280
255 -252280 -210774 -295810 -263181 -301910 -265395 -290187 -269224 -240082 -185101 -307621 -236793 -248785
243 -248785 -174887 -254141 -189611 -244757 -161453 -291333 -221711 -210367 -232289 -280532 -166137
232 -166137 -253984 -262690 -211407 -179401 -252174 -165792 -243494 -166859 -251462 -175726 -202294 -202539
220 -202539 -197282 -200537 -280620 -226264 -220588 -151784 -250498 -231114 -217688 -187307 -206910 -175267
208 -175267 -192855 -179489 -208441 -219743 -262959 -219029 -217909 -267870 -270971 -205805 -181819 -270505
196 -270505 -235174 -189112 -239612 -242035 -277437 -237843 -181897 -183696 -180910 -223300 -207097 -227935
184 -227935 -187604 -191061 -199278 -216126 -250712 -271817 -183528 -202012 -226485 -213732 -253614 -271278
172 -271278 -196057 -235040 -159456 -218579 -249968 -295216 -215502 -341795 -220580 -287907 -242852
161 -242852 -254315 -203096 -302323 -237937 -308369 -245413 -293616 -279951 -285539 -226106 -269586 -188534
149 -188534 -274885 -294740 -294176 -268620 -276733 -293077 -304823 -295416 -278503 -240384 -260842 -229225 -301694
136 -301694 -322507 -232430 -262658 -279095 -274975 -246535 -288117 -173590 -243307 -261569 -282465 -271635
124 -271635 -367668 -240181 -277886 -257702 -250665 -255694 -311027 -323794 -288631 -264286 -264921 -350421
112 -350421 -298629 -250044 -270508 -261041 -349517 -276676 -306603 -336953 -288742 -323095 -248249 -261356
100 -261356 -258854 -287448 -293440 -296160 -328873 -294807 -263044 -292460 -305885 -329514 -341331 -289245
88 -289245 -270195 -289063 -272831 -343436 -318540 -302649 -323703 -321884 -332074 -355297 -268774 -317438
76 -317438 -343099 -323183 -324883 -339965 -295220 -318615 -302423 -331785 -335469 -312941 -289739 -380874
64 -380874 -273991 -376447 -343973 -332869 -337163 -362613 -292821 -296739 -343593 -335326 -314457 -332912
52 -332912 -352982 -346736 -314062 -378779 -387299 -395509 -352558 -366276 -347721 -394409 -396203 -381962 -344376
39 -344376 -328707 -344575 -407932 -416270 -367661 -379757 -337811 -346443 -356323 -388193 -365847 -405097 -368146
26 -368146 -333557 -367894 -369865 -410210 -394712 -414087 -397675 -373620 -352474 -391653 -421307 -331840
14 -331840 -394837 -433528 -399880 -421991 -404019 -428636 -473739 -413761 -428290 -425437 -404723 -378935
2 -378935 -406495 -409429
0 -409429
$$ Imaginary data points
##PAGE= N=2
##DATA TABLE= (X++(I..I)), XYDATA
16383 -780318 -775422 -784270 -783961 -698143 -740580 -648685 -697980 -662914 -651568 -647678 -672369 -574677
16371 -574677 -621485 -555035 -591540 -601864 -532080 -460880 -503596 -488938 -447665 -465115 -404629
16360 -404629 -386961 -403159 -375198 -304810 -403582 -361057 -358781 -310664 -250448 -267947 -277038 -215519
16348 -215519 -231073 -188505 -149666 -154541 -94762 -142932 -146190 -117795 -66971 -61652 4995 -5900
16336 -5900 47384 -4829 -34734 64872 54484 104569 15746 121566 100599 113594 148400 134091
16324 134091 169715 219473 191729 206157 224784 243454 235399 277455 273740 354897 305407 317037
16312 317037 330286 345258 345159 502240 390748 414073 404254 467897 502193 549636 435821 462650
16300 462650 491590 593472 532155 615929 580743 644152 577123 609115 628292 649009 657686
16289 657686 711880 724851 682461 749838 685374 728844 842392 739280 750650 737463 826236
16278 826236 820949 894085 829884 821480 828224 877640 891055 877959 906220 928414 965392 973557
16266 973557 962504 986998 934398 1008726 1010048 957482 1026284 1089118 930909 1059069 1063588
16255 1063588 1096325 1144994 1048159 1074946 1070997 1095310 1105383 1112497 1136823 1132003 1141188 1113788
16243 1113788 1158287 1287254 1234407 1268564 1221799 1219697 1170922 1243743 1245299 1348240 1289985
16232 1289985 1340799 1300329 1346974 1332374 1391817 1328159 1414057 1309051 1320944 1279830 1407177
16221 1407177 1320073 1434824 1341643 1393836 1431230 1462468 1401646 1472395 1412891 1431234 1360043
16210 1360043 1486560 1473154 1542267 1461656 1538940 1487957 1497278 1486841 1485449 1519140 1597033
16199 1597033 1536061 1560234 1551373 1502242 1523162 1545835 1550877 1594162 1566686 1628013 1564505 1620339
16187 1620339 1563186 1570743 1562348 1618817 1622787 1588626 1594752 1625376 1637299 1646356 1643073 1647698 1566976
16174 1566976 1643134 1650570 1659292 1670612 1721962 1699019 1676050 1661003 1728449 1692106 1691989 1683330
16162 1683330 1649693 1638615 1662371 1814844 1795320 1807429 1675315 1749056 1693530 1852237 1705629
16151 1705629 1762528 1758649 1766138 1737555 1772422 1764201 1747377 1732013 1778261 1682565 1822074 1767298
16139 1767298 1737308 1812887 1801340 1784460 1785505 1792734 1807373 1849698 1858861 1785845 1838777 1766185
16127 1766185 1752250 1796449 1799148 1793671 1826920 1783532 1781672 1883693 1826087 1863917 1894129 1871206
16115 1871206 1831003 1833849 1868234 1828488 1909399 1887156 1846786 1868868 1879895 1823470 1878512
16104 1878512 1817012 1758465 1878755 1883615 1862974 1843495 1956484 1883103 1929331 1906419 1897628
16093 1897628 1879306 1860174 1904190 1926591 1872413 1892041 1887025 1915060 1891776 1892303 1908601 1885879
16081 1885879 1913905 1878286 1933446 1860834 1909142 1843994 1935414 1916599 1955304 1884123 1996344
16070 1996344 1949116 1898242 1869459 1886725 1845467 1918184 1868596 1918522 1933023 2053798 1966515
16059 1966515 1935325 1918448 1910722 1841894 1964355 1877897 1890234 1859369 1915383 1892081 1864851
16048 1864851 1954322 1914253 1874559 1933261 1865549 1951821 1936796 1944495 1897480 1934009 1885762
16037 1885762 1959001 1860425 1912950 1889501 1919397 1913710 1897733 1860766 1882424 1872176 2012397
16026 2012397 1901302 1927065 1898385 1875280 1923042 1972544 1916316 1919861 1931164 1844963 1931980
16015 1931980 1894170 1862058 1928759 1884769 1956474 1902803 1952596 1906201 1909028 1861197 1857947 1924990
16003 1924990 1934003 1974006 1927998 1919379 2001283 1960889 1923086 1795998 1968988 1910652 1922196
15992 1922196 1944995 1897513 1928614 1864653 1898696 1938955 1895245 1957274 1966556 1933550 1940793 1979620
15980 1979620 1920713 1939884 1942169 1983550 1957841 1991874 1955058 1921143 1977161 1972389 1984595 1922725
15968 1922725 1882992 1879882 1988664 1905020 1994328 1985513 1944641 1962512 1975465 1961018 2024285
15957 2024285 1903575 1934104 1922725 1961628 1892342 1992005 2005191 1990753 1926466 2028388 1956860
15946 1956860 2052898 2007918 1959250 2025754 2042019 1945289 2011200 2003276 2059972 1984333 1957817
15935 1957817 1938750 2043043 1907985 2000331 1997240 2047085 1917611 2053733 1868770 2065884
15925 2065884 1973817 1943260 1948588 1951700 1909384 2097139 1908041 2007803 2034121 1926177 1948271
15914 1948271 1975343 1999899 2015801 1944116 1976305 1963857 1968113 1913744 1997910 1957785 1995176
15903 1995176 1957829 1893686 1912568 1968451 1968000 1889147 1954098 1887703 1980614 1933012 1905553 1901211
15891 1901211 2057742 1958571 1900409 1953301 1914565 1927141 1922434 1966350 1927383 1948954 1950374
15880 1950374 1987790 1881620 1949562 1919467 1977811 2017713 1968804 1963196 1935801 1975011 1921297
15869 1921297 1950980 1898268 1962185 2002856 2006583 1952393 1982734 1946715 1928739 1951193 1935340
15858 1935340 1985818 1969713 2025388 1869457 1996923 1993985 1969685 1949598 1970604 1927738 1991222
15847 1991222 1925740 1915822 1981655 1934274 1944761 1965225 1959334 1952411 1984456 1936671 1929473 2023072
15835 2023072 1984470 1936266 2016827 1977762 2027710 1992910 1917346 2010103 1971720 1959955 1943347
15824 1943347 1984133 2033574 2082818 1989027 1934457 1889197 1958387 1999472 2023134 1969132 2033531
15813 2033531 1959583 1927826 1965116 2021030 1945430 2031724 1965878 1974663 1957715 1973182 2039930
15802 2039930 1956610 2032180 2015859 1943909 1967347 2043528 2023843 2008038 2085910 2005010 1960969
15791 1960969 2025228 2026048 2004403 1974346 1979003 2030567 1970333 2028136 1973967 1980946 1963549 2024606
15779 2024606 1936171 1963633 2012797 1917355 2029384 2014373 2018242 1923422 1965514 2011057 1923895
15768 1923895 2014209 1925261 1994529 1907519 1991120 1916060 1973458 1925525 1998123 1990601 1989782 1994916
15756 1994916 1952143 1984098 2011116 1969627 1985229 2002594 1971320 1908249 2015476 1966442 1867418
15745 1867418 1932381 1939785 1985798 1896991 1988142 1962835 1919471 1987157 1925513 1979676 2022406
15734 2022406 2031996 2051776 1948499 1980664 1963225 1905231 1944744 1958438 1949913 2050774 1901159
15723 1901159 1993723 1938851 2025669 1895622 1976951 1997643 2017045 2055143 2000568 2018685 2008505
15712 2008505 2028808 1964405 2005957 1962872 2024973 1939829 2001502 1921579 2004668 2038762 1951671
15701 1951671 2011467 1951635 2051372 2107459 2013840 1943968 2032467 2022459 2039396 1967592 2003304
15690 2003304 1949929 1930216 2032114 1998196 2024719 2055355 2069475 1988718 2009921 2010954 2004583
15679 2004583 2064577 2052207 2048954 2038909 2083139 2053184 2037524 1992469 2047763 1961760 1990207
15668 1990207 1966100 2004622 1941428 2040702 2001670 2055833 2003581 2112190 2012873 2049138 2016483
15657 2016483 1971563 2017565 2049776 2002820 1953801 1941664 2052826 1983744 2076990 2006438 2061432
15646 2061432 1998205 1989178 2012334 2063113 2014536 2043268 2046056 2006445 2017958 2039023 2032113 2055911
15634 2055911 1944801 1993480 2012242 1987676 1970198 2008602 2005728 2009175 2107785 2028760 2058767
15623 2058767 2043248 2090913 2005554 1969958 1946823 2077004 1982552 1957523 1978563 2008096 2006782
15612 2006782 2009523 2029849 1979580 2015035 2014888 2013075 2032348 2014719 2030468 2055233 2108536 2081603
15600 2081603 1972681 2051339 2001134 2006264 2082662 2020654 1985030 1908330 1950683 2021392 2002053
15589 2002053 1972539 2004645 1986652 1975727 1972346 1919894 1982412 1997358 2007882 1970159 2013964
15578 2013964 2024417 2030238 2040847 2061384 2031519 2052447 2025407 1957401 2064699 2059989 2034464
15567 2034464 2024993 2054432 2058166 1998816 2078784 2071737 2061684 2073308 2077244 1985913 1938830 1955650
15555 1955650 2030810 2030063 2012402 1937575 2037669 2006652 2024642 2020257 2106348 2050790 2027177 2010091
15543 2010091 2061472 2024236 2018723 2060016 2124347 2047224 1994095 2047246 2042716 2031829 2046100 2046156
15531 2046156 2111070 2046127 2011070 1976133 2108815 2082657 2059057 2046892 1978367 2093384 2006858
15520 2006858 2103223 2007243 2051658 2098501 2033419 2003506 2005772 2048985 2043569 2070712 2082324 2147589
15508 2147589 2022295 2010466 2163731 2077145 2049950 2081796 2051221 2057751 2118787 2059199 2108812
15497 2108812 2075448 1962757 2011514 2055123 2120636 2038915 2049177 2103975 2065967 2143714 2077470
15486 2077470 2124414 2086197 2069330 2118419 2120467 2029560 2116343 2090855 2050979 2088370 2066891
15475 2066891 2038909 2048262 2050276 2104167 2098085 2051040 2065641 2082157 2083111 2030945 2047100 2127496
15463 2127496 2053096 2119610 2069031 2093343 2084314 2083628 2079773 2125321 2014539 2090291 2041589 2063203
15451 2063203 2102572 2049935 1984433 2020003 2068629 2103971 2021097 2053214 2031688 2080402 2075736
15440 2075736 2041214 2002641 2127228 2061870 2064931 2014636 2066103 2056289 2062389 2071250 2064204 2051527
15428 2051527 2138311 2035189 2081404 1988881 2096299 1985251 2056854 2059795 2091775 2095331 2122422
15417 2122422 2020473 2085009 2023977 2158481 2114481 2087116 2057703 2074409 2057886 2117809 2039059
15406 2039059 2005720 2034216 2068827 2001670 2087862 2076300 2027515 2040961 2114058 2051229 2049711
15395 2049711 2148640 2077007 2014035 2008835 2044070 2045806 2085620 2106483 2068813 2038587 2060496 2098183
15383 2098183 2017137 2072091 2164696 2044359 2045010 2100349 2109670 2121935 2082718 2109753 2049838 2173603
15371 2173603 2105230 2145438 2128337 2092604 2165743 2037034 2060252 2044128 2128798 2063332 2122994
15360 2122994 2048566 2106693 2168883 2130795 2131480 2112298 2110105 2154364 2096703 2083069 2175508 2100978
15348 2100978 2154083 2102070 2067817 2099872 2107261 2004336 2153032 2123173 2110780 2113640 2197875
$$ [...]
##END NTUPLES=NMR SPECTRUM
##END=
