##TITLE=abcd
##JCAMPDX= 6.0         $$ Bruker NMR JCAMP-DX V2.0
##DATA TYPE= NMR SPECTRUM
##DATA CLASS= NTUPLES
##ORIGIN= UXNMR, Bruker Analytische Messtechnik GmbH
##OWNER= root
$$ XWIN-NMR		Version 3.5
$$ Tue Aug 25 19:12:19 2026 Russian Standard Time (UT+4h)  servis@DPX200
##.OBSERVE FREQUENCY= 200.131235884673
##.OBSERVE NUCLEUS= ^1H
##.ACQUISITION MODE= SIMULTANEOUS
##.ACQUISITION SCHEME= undefined
##.AVERAGES= 32
##.DIGITISER RES= 18
##SPECTROMETER/DATA SYSTEM= spect
##.PULSE SEQUENCE= zg
##.SOLVENT NAME= DMSO
##.SHIFT REFERENCE= (INTERNAL, DMSO, 0, 16.4885)
##AUDIT TRAIL= $$ (NUMBER, WHEN, WHO, WHERE, WHAT)
$$ ##TITLE= Audit trail, XWIN-NMR		Version 3.5
$$ ##JCAMPDX= 5.01
$$ ##ORIGIN= Bruker BioSpin GmbH
$$ ##OWNER= servis
$$ F:\spectra/data/av/nmr/H1/1/pdata/1/auditp.txt
$$ ##AUDIT TRAIL=  $$ (NUMBER, WHEN, WHO, WHERE, WHAT)
(   1,<2026-08-25 19:10:44.17 +0400>,<servis>,<DPX200>,
      <created by zg, POWCHK disabled, PULCHK disabled
       configuration hash MD5:
       00 E9 B6 7A A2 85 ED C7 34 08 36 98 17 FE 4E 26
       data hash MD5: 32K
       F0 06 8B F6 CC F7 D0 42 7E 45 AD FC 6A FD 6F 22>)
(   2,<2026-08-25 19:11:50.95 +0400>,<servis>,<DPX200>,
      <Start of raw data processing
       efp BC_mod = 2 LB = 0.05 FT_mod = 6 PKNL = 1 PHC0 = -415.9518 PHC1 = 3.101563 SI = 16K 
       data hash MD5: 16K
       74 5D 4F 3F 55 98 9D 75 44 FC 97 CE 66 EE 17 06>)
(   3,<2026-08-25 19:12:00.56 +0400>,<servis>,<DPX200>,
      <pk PHC0 = -2.6 PHC1 = 0 
       data hash MD5: 16K
       66 36 9A BF D2 41 90 D6 4D F3 E4 BD A4 ED 81 82>)
$$ ##END=
$$ 
$$ hash MD5
$$ C1 D2 48 E1 5D AD 38 F8 E6 1B 76 37 97 C7 D2 8E
##$RELAX= 
##$RELAX= 
##$RELAX= 
##$RELAX= 
##$RELAX= 
##$RELAX= 
##$RELAX= 
##$RELAX= 
$$ Bruker specific parameters
$$ --------------------------
##$DU= <F:\spectra>
##$EXPNO= 1
##$NAME= <H1>
##$PROCNO= 1
##$TYPE= <nmr>
##$USER= <av>
##$AMP= (0..31)
100 100 100 100 100 100 100 100 100 100 100 100 100 100 100 100 100 100 
100 100 100 100 100 100 100 100 100 100 100 100 100 100 
##$AQSEQ= 0
##$AQ_mod= 1
##$AUNM= <au_zg>
##$AUTOPOS= <>
##$BF1= 200.13
##$BF2= 200.13
##$BF3= 200.13
##$BF4= 200.13
##$BF5= 500.13
##$BF6= 500.13
##$BF7= 500.13
##$BF8= 500.13
##$BYTORDA= 1
##$CFDGTYP= 0
##$CFRGTYP= 5
##$CHEMSTR= <none>
##$CNST= (0..31)
1 1 145 1 1 1 1 1 1 1 1 1 1 1 1 1 1 1 1 1 1 1 1 1 1 1 1 1 1 1 1 1 
##$CPDPRG= <>
##$CPDPRG1= <>
##$CPDPRG2= <>
##$CPDPRG3= <>
##$CPDPRG4= <mlev>
##$CPDPRG5= <mlev>
##$CPDPRG6= <mlev>
##$CPDPRG7= <mlev>
##$CPDPRG8= <mlev>
##$CPDPRGB= <>
##$CPDPRGT= <>
##$D= (0..31)
0 2 0 0 0 0 0 0 0 0.06 0 0 0 0 0 0 0.0002 0 0 0 0 0 0 0 0 0 0 0 0 0 0 
0 
##$DATE= 1787670643
##$DBL= (0..7)
120 120 120 120 120 120 120 120 
##$DBP= (0..7)
150 150 150 150 150 150 150 150 
##$DBP07= 0
##$DBPNAM0= <>
##$DBPNAM1= <>
##$DBPNAM2= <>
##$DBPNAM3= <>
##$DBPNAM4= <>
##$DBPNAM5= <>
##$DBPNAM6= <>
##$DBPNAM7= <>
##$DBPOAL= (0..7)
0.5 0.5 0.5 0.5 0.5 0.5 0.5 0.5 
##$DBPOFFS= (0..7)
0 0 0 0 0 0 0 0 
##$DE= 6
##$DECBNUC= <off>
##$DECIM= 32
$$ [...]
##$SUBNAM4= <"">
##$SUBNAM5= <"">
##$SUBNAM6= <"">
##$SUBNAM7= <"">
##$SUBNAM8= <"">
##$SUBNAM9= <"">
##$SW= 20.6817932712277
##$SWIBOX= (0..15)
0 0 3 0 0 0 0 0 0 0 0 0 0 0 0 0 
##$SW_h= 4139.07284768212
##$TD= 32768
##$TD0= 1
##$TE= 0
##$TE2= 300
##$TE3= 300
##$TEG= 300
##$TL= (0..7)
0 120 120 120 120 120 120 120 
##$TP= (0..7)
150 150 150 150 150 150 150 150 
##$TP07= 0
##$TPNAME0= <>
##$TPNAME1= <>
##$TPNAME2= <>
##$TPNAME3= <>
##$TPNAME4= <>
##$TPNAME5= <>
##$TPNAME6= <>
##$TPNAME7= <>
##$TPOAL= (0..7)
0.5 0.5 0.5 0.5 0.5 0.5 0.5 0.5 
##$TPOFFS= (0..7)
0 0 0 0 0 0 0 0 
##$TUNHIN= 0
##$TUNHOUT= 0
##$TUNXOUT= 0
##$USERA1= <user>
##$USERA2= <user>
##$USERA3= <user>
##$USERA4= <user>
##$USERA5= <user>
##$V9= 5
##$VALIST= <valist>
##$VCLIST= <CCCCCCCCCCCCCCC>
##$VD= 0
##$VDLIST= <DDDDDDDDDDDDDDD>
##$VPLIST= <PPPPPPPPPPPPPPP>
##$VTLIST= <TTTTTTTTTTTTTTT>
##$WBST= 1024
##$WBSW= 30
##$XGAIN= (0..3)
0 0 0 0 
##$XL= 0
##$YL= 0
##$YMAX_a= 1080761
##$YMIN_a= -1410192
##$ZGOPTNS= <>
##$ZL1= 120
##$ZL2= 120
##$ZL3= 120
##$ZL4= 120
##$ABSF1= 0
##$ABSF2= 0
##$ABSG= 0
##$ABSL= 0
##$ALPHA= 0
##$AQORDER= 0
##$ASSFAC= 0
##$ASSFACI= 0
##$ASSFACX= 0
##$ASSWID= 0
##$AUNMP= <proc_1d>
##$AZFE= 0.1
##$AZFW= 0.1
##$BCFW= 0
##$BC_mod= 2
##$BYTORDP= 0
##$COROFFS= 0
##$CY= 18.4799938201904
##$DATMOD= 1
##$DC= 0
##$DFILT= <>
##$DTYPP= 0
##$F1P= 9.9274215381318
##$F2P= -0.165520771350173
##$FCOR= 1
##$FTSIZE= 16384
##$FT_mod= 6
##$GAMMA= 0
##$GB= 0
##$INTBC= 1
##$INTSCL= 4.127829e-11
##$ISEN= 128
##$LB= 0.05
##$LEV0= 0
##$LPBIN= 0
##$MAXI= 10000
##$MC2= 0
##$MEAN= 0
##$ME_mod= 0
##$MI= 50
##$NCOEF= 0
##$NC_proc= -3
##$NLEV= 6
##$NOISF1= 3.799351
##$NOISF2= 2.8
##$NSP= 0
##$NTH_PI= 0
##$NZP= 0
##$OFFSET= 16.48848
##$PC= 4
##$PHC0= -418.5518
##$PHC1= 3.101563
##$PH_mod= 1
##$PKNL= yes
##$PPARMOD= 0
##$PSCAL= 4
##$PSIGN= 0
##$REVERSE= no
##$SF= 200.130005582386
##$SI= 16384
##$SIGF1= 3
##$SIGF2= 2
##$SINO= 400
##$SIOLD= 16384
##$SREGLST= <1H.CDCl3>
##$SSB= 0
##$STSI= 16384
##$STSR= 0
##$SW_p= 4139.07284768211
##$SYMM= 0
##$S_DEV= 0
##$TDeff= 32768
##$TDoff= 0
##$TI= <>
##$TILT= no
##$TM1= 0
##$TM2= 0
##$TOPLEV= 0
##$USERP1= <user>
##$USERP2= <user>
##$USERP3= <user>
##$USERP4= <user>
##$USERP5= <user>
##$WDW= 1
##$XDIM= 16384
##$YMAX_p= 367423343
##$YMIN_p= -199910
$$ End of Bruker specific parameters
$$ ---------------------------------
##NTUPLES= NMR SPECTRUM
##VAR_NAME=  FREQUENCY,     SPECTRUM/REAL,   SPECTRUM/IMAG
##SYMBOL=    X,             R,               I
##VAR_TYPE=  INDEPENDENT,   DEPENDENT,       DEPENDENT
##VAR_FORM=  AFFN,          ASDF,            ASDF
##VAR_DIM=   16384,         16384,           16384
##UNITS=     HZ,            ARBITRARY UNITS, ARBITRARY UNITS
##FACTOR=    0.252644378177508, 1,           1
##FIRST=     3299.83951724647, 0,            0
##LAST=      -839.233330435636, 0,           0
##MIN=       -839.233330435636, -199910,     0
##MAX=       3299.83951724647, 367423343,    0
$$ Real data points
##PAGE= N=1
##DATA TABLE= (X++(R..R)), XYDATA
$$ [...]
9622d2139k754n480l755K6593n767m882M76M259r588L587J2696R047l1253J8899
$$ -42139 -44893 -50373 -54128 -27535 -33302 -38184 -37708 -33449 -43037 -39450 -26754 -17707 -48960 -30061
9608c0061j1478L7803r770j9801M4087k5715l21J1909J0206p845M8796n400K3921
$$ -30061 -41539 -3736 -13506 -33307 10780 -14935 -15256 -3347 6859 -986 47810 42410 66331
9595F6331l937J4888J0371L2708j9596K6848J3477L9029m224j736j066J7405r159
$$ 66331 62394 77282 87653 120361 100765 127613 141090 180119 175895 174159 173093 190498 181339
9582A81339j137j3083J4802k557n4487k8881J6675j8928k537j98m874j3592k2609
$$ 181339 180202 167119 181921 179364 124877 95996 112671 93743 91206 91008 86134 72542 49933
9569D9933p3l2395K056j7645L5359k6700P129l0010K092K3455l3616K9632j7112
$$ 49933 49860 17465 19521 1876 37235 10535 17664 -12346 -10254 13201 -20415 9217 -7895
9556g895N990J1892j1811j26K6119j8081r72p499K2786m4256K0921M438P353j2087
$$ -7895 -1905 9987 -1824 -1950 24169 6088 5116 -2383 20403 -23853 -2932 1506 8859 -3228
9542c228j2365O196K5997n39M839n075K6566j8563L2611j721m393k659J7733r117
$$ -3228 -15593 -9397 16600 16061 20900 15825 42391 23828 56439 54718 50325 47666 65399 56282
9528E6282l409o282K1625m1000N487p668k5317m022J5400j2329o390j1196j0607
$$ 56282 52873 46591 68216 27216 32703 25035 -282 -4304 11096 -1233 -7623 -18819 -29426
9515b9426N171n270O208k4478J1317j5617K6885n98m863l2017K3536m353l606
$$ -29426 -24255 -29525 -23317 -47795 -36478 -52095 -25210 -25808 -30671 -62688 -39152 -43505 -47111
9502d7111j2119J7172k3249J8649k2832K3321j51j378K197j6181j0892L6960k1881
$$ -47111 -59230 -42058 -65307 -46658 -69490 -46169 -46320 -47698 -45501 -61682 -72574 -35614 -57495
9489e7495J1168j5749q152L127q663J3294j564j555M865P396j4972J8129o787
$$ -57495 -46327 -62076 -70228 -67101 -75764 -62470 -64034 -65589 -60724 -53328 -68300 -50171 -56958
9476e6958L581j9897J706K467J3477k7552R280j9522M0454k4687P153N170J2804
$$ -56958 -53377 -73274 -71568 -69101 -55624 -83176 -73896 -93418 -52964 -77651 -70498 -65328 -52524
9463e2524m468j1898M341J200M756j0306n574o607J5372J3107j0788l6659M1573
$$ -52524 -56992 -68890 -64549 -63349 -58593 -68899 -74473 -81080 -65708 -52601 -63389 -100048 -58475
9450e8475L558o112k280M394k7167l330J6466m584R434M448j3841K524K683J9647
$$ -58475 -54917 -61029 -63309 -58915 -86082 -89412 -72946 -77530 -68096 -63648 -77489 -74965 -72282 -52635
9436e2635k7843K0178k0720J5233j0095J9587l2634l501J6798r917Q588n345K5933
$$ -52635 -80478 -60300 -81020 -65787 -75882 -56295 -88929 -92430 -75632 -85549 -76961 -82306 -56373
9423e6373m2180K177K2382j4748L8176m1904J5480J9066j5357K2523k3129R562
$$ -56373 -98553 -96376 -73994 -88742 -50566 -92470 -76990 -57924 -73281 -50758 -73887 -64325
9411f4325l9397L6071P473j2013j2669K2204j4267o640j6935N2196j7454o958
$$ -64325 -103722 -67651 -60178 -72191 -84860 -62656 -76923 -83563 -100498 -48302 -65756 -72714
9399g2714L2417j3951j6091p298K519M8354n1444J7266j824M172j4758l245l257
$$ -72714 -40297 -54248 -70339 -77637 -75118 -26764 -78208 -60942 -62766 -58594 -73352 -76597 -79854
9386g9854M108Q891k0018M1142l196N120o232m5743J0478M3652j8273o555R258
$$ -79854 -75746 -66855 -86873 -45731 -48927 -43807 -50039 -95782 -85304 -41652 -59925 -66480 -57222
9373e7222k0271J1526M994J4017k4354K5022m6788K8164N45J715j3090J5134j5637
$$ -57222 -77493 -65967 -60973 -46956 -71310 -46288 -93076 -64912 -64367 -62652 -75742 -60608 -76245
9360g6245Q279Q769J1009j9658K1781m3730J5003L9995k7880K2548j3160j5525
$$ -76245 -67966 -59197 -48188 -67846 -46065 -89795 -74792 -34797 -62677 -40129 -53289 -68814
9348f8814J4851L920J4141m1126K9668p9o646k2641p337N3766m9639J0162K650
$$ -68814 -53963 -50043 -35902 -77028 -47360 -47439 -54085 -76726 -84063 -30297 -79936 -69774 -67124
9335f7124k470R13n456N265k385K50K850l589J6214m574J4250j2749Q568j1391
$$ -67124 -69594 -68681 -74137 -68872 -71257 -71007 -68157 -71746 -55532 -60106 -45856 -58605 -50037 -61428
9321f1428k169J137Q249j9799O371o24J7352k7397K1045J4249k2044q834R339
$$ -61428 -63597 -62460 -54211 -74010 -67639 -68263 -50911 -78308 -57263 -43014 -65058 -73892 -64553
9308f4553K93k3852J8894L8448l3433m894O981k3777L5633j4418k686R476P056
$$ -64553 -64260 -88112 -69218 -30770 -64203 -69097 -62116 -85893 -50260 -64678 -67364 -57888 -50832
9295e0832j1380J7956r87N42j0184J4108j0525j4479K0988j8806J5095r421P108
$$ -50832 -62212 -44256 -45243 -44701 -54885 -40777 -51302 -65781 -44793 -63599 -48504 -57925 -50817
9282e0817O619n413P711k5537L2007k3787o940K9712k3335J2851p172p873J2900
$$ -50817 -44198 -49611 -41900 -67437 -35430 -59217 -66157 -36445 -59780 -46929 -54101 -61974 -49074
9269d9074J9824l8226K1021J5310j1699k071J9993l2303K2415k9k0614K3004r255
$$ -49074 -29250 -67476 -46455 -31145 -42844 -44915 -24922 -57225 -34810 -34839 -55453 -32449 -41704
9256d1704K8177j2319o962j3614l869J9713k349J0037K065k7393J0422J8280j458
$$ -41704 -13527 -25846 -32808 -46422 -50291 -30578 -32927 -22890 -20825 -48218 -37796 -19516 -20974
9243b0974j1261O507j7961j187K0511K640L771J2765l1525R222j5127K5072k4409
$$ -20974 -32235 -25728 -43689 -44876 -24365 -21725 -17954 -5189 -36714 -27492 -42619 -17547 -41956
9230d1956K367K5544l1008J6262K551K8593j0564m8522K6323M269J5552k4485
$$ -41956 -39589 -14045 -45053 -28791 -26240 2353 -8211 -56733 -30410 -26141 -10589 -35074
9218c5074J7352p49k7475L6159j2658L4449l6275K2216j7547k204K1250j9215
$$ -35074 -17722 -18471 -45946 -9787 -22445 12004 -24271 -2055 -19602 -21806 -556 -19771
9206a9771J407K286K6606k1521j0229K5767K119J0227k4245l746L6985j8179J1551
$$ -19771 -18364 -16078 10528 -10993 -21222 4545 6664 16891 -7354 -11100 25885 7706 19257
9193A9257n320P144j7266R997O510r310K5594l0067J3300J8600j8262K4370O027
$$ 19257 13937 21081 3815 13812 20322 11012 36606 6539 19839 38439 20177 44547 50574
9180E0574k6897L649M48L720Q093r569J7961J1778j3308j10J1387j3676J3959
$$ 50574 23677 27326 27774 31494 39587 30018 47979 59757 46449 46339 57726 44050 58009
9167E8009p435j0119K8966p352J4621k7730M0322r508j0513q107R870o589K3379
$$ 58009 50574 40455 69421 62069 76690 48960 89282 79774 69261 61154 71024 64435 87814
9154H7814K8790l9988K3794r310K8449o440j4690K6830r013K1134K1528l1456
$$ 87814 116604 76616 100410 91100 119549 113109 98419 125249 116236 137370 158898 127442
9142A27442Q44K3860P542o925J7960j3335K9375j4126K9420k1825L1115r017K4717
$$ 127442 128286 152146 159688 152763 170723 157388 186763 172637 202057 180232 211347 202330 227047
9129B27047k1224J1833K1456J6978p538K3408M398K1971l447J5936R066L5244
$$ 227047 205823 217656 239112 256090 248552 271960 276358 298329 294882 310818 319884 355128
9117C55128j7099M6872J0635L889K2512L1672K2068M0572K7118O017J7263N0294
$$ 355128 338029 384901 395536 399425 421937 453609 475677 516249 543367 549384 566647 616941
9105F16941J5425M5538O6638M5108N8538K8388P5091L6972J00204O2136P7243
$$ 616941 632366 677904 744542 789650 848188 876576 951667 988639 1088843 1150979 1228222
9094A228222J04370R9095J19607J12011J46398J22376J78137J86493J47771J91949
$$ 1228222 1332592 1431687 1551294 1663305 1809703 1932079 2110216 2296709 2444480 2636429
9084B636429K04121J86028J78929K04550R9628J46945Q6201L9230L7063n0509
$$ 2636429 2840550 3026578 3205507 3410057 3509685 3656630 3742831 3782061 3819124 3768615
9074C768615o3675j00049j20002j62875j42822j76148j85481j90857j37018j83832
$$ 3768615 3704940 3604891 3484889 3322014 3179192 3003044 2817563 2626706 2489688 2305856
9064B305856j63433j65601j21796j16370j49212r3494j05538q8140p8591q0259
$$ 2305856 2142423 1976822 1855026 1738656 1589444 1495950 1390412 1302272 1223681 1143422
9054A143422p2554o8948n4656p6950m6904l4648l9737m6167n6299J8o0610j6963
$$ 1143422 1070868 1001920 947264 870314 823410 788762 749025 702858 646559 646577 585967 569004
9042E69004k2428k7303k4157j0850k7257j1926l1974k7692O04J1166l3026m9616
$$ 569004 546576 519273 495116 484266 457009 445083 413109 385417 386021 397187 364161 314545
9030C14545j123M019N311k271n6731M931J1564l3709N221l3421O833q533j1990
$$ 314545 313422 317441 322752 320481 263750 268681 280245 246536 251757 218336 225169 216636 204646
9017B04646m569k452j3220j7216n159J7407k6163R991j9160j0167J176r515l751
$$ 204646 200077 197625 184405 167189 162030 179437 153274 163265 144105 133938 135114 125599 121848
9004A21848J0717j0464l0137R639K046j4212P288j4713J0326m8313L0555K9490
$$ 121848 132565 122101 91964 101603 103649 89437 96725 82012 92338 44025 74580 104070
8992A04070k6268M557j7318Q627k4609k026J2419k5347K7463k632k1357k116k144
$$ 104070 77802 82359 65041 73668 49059 47033 59452 34105 61568 58936 37579 35463 33319
8979C3319j2116m767K1107j8940K5057P624l4186Q441j7101J9392j0069j99j4516
$$ 33319 21203 16436 37543 18603 43660 51284 17098 25539 8438 27830 17761 17562 3046
8966C046K2356j889p239J086k5323K6138k5349K1443j7707K873J0526j9505j4488
$$ 3046 25402 23513 16274 17360 -7963 18175 -7174 14269 -3438 -565 9961 -9544 -24032
8953b4032J043Q255n417j1880J9125O869Q783Q417k7747J2511q751j6751o288
$$ -24032 -22989 -14734 -20151 -32031 -12906 -6037 2746 11163 -16584 -4073 -12824 -29575 -35863
8940c5863K1010J3885k504k6890O692R093o699k894n880M533N293j799j1765J6056
$$ -35863 -14853 -968 -3472 -30362 -23670 -14577 -21276 -24170 -30050 -25517 -20224 -22023 -33788 -17732
8926a7732k0627L7230q988j1466m802j0733Q081m167k2365L0043J0669j0162j7622
$$ -17732 -38359 -1129 -10117 -21583 -26385 -37118 -29037 -33204 -55569 -25526 -14857 -25019 -42641
8913d2641q527N496l964J25J7551j1727k899j0689L7297k8585K5549n961Q824
$$ -42641 -51168 -45672 -49636 -49511 -31960 -43687 -46586 -57275 -19978 -48563 -23014 -28975 -20151
8900b0151j8930K656k733M016k7602J7858J3974m5458K6809N173J5121k6990K4091
$$ -20151 -39081 -36425 -39158 -35142 -62744 -44886 -30912 -76370 -49561 -44388 -29267 -56257 -32166
8887c2166k0092m969K7175j9333Q955P219r105r688N87j4158O351R511j3375M754
$$ -32166 -52258 -57227 -30052 -49385 -40430 -33211 -42316 -52004 -51417 -65575 -59224 -49713 -63088 -58334
8873e8334L0100j762k9159J1453Q65R823q414j9307K4485jm003k786J0410l3176
$$ -58334 -28234 -29996 -59155 -47702 -46837 -37014 -45428 -64735 -40250 -40251 -44254 -47040 -36630 -69806
8859f9806J5736J3490k5190K6552n299q488J0425M366R246j8696K57j9115K6785
$$ -69806 -54070 -40580 -65770 -39218 -44517 -53005 -42580 -38214 -28968 -47664 -47407 -66522 -39737
8846c9737k8511k4455N6555q743K3890l8321N451j4257J1359K161K174j0566K9484
$$ -39737 -68248 -92703 -36148 -44891 -21001 -59322 -53871 -68128 -56769 -54608 -52434 -63000 -33516
8833c3516l2793J4136n149P612j9631J2943J582R988l104o080o495k636j5466
$$ -33516 -66309 -52173 -57322 -49710 -69341 -56398 -54816 -44828 -47932 -54012 -60507 -63143 -78609
8820g8609K4069M205o293L011j8648K2845j7668J361L01l096L3350j0443k2116
$$ -78609 -54540 -50335 -56628 -53617 -72265 -49420 -67088 -65727 -65426 -68522 -35172 -45615 -67731
8807f7731O81Q828J2252m390J0162m0222O015K0273K197j1216K6235j7408L060
$$ -67731 -67050 -58222 -45970 -50360 -40198 -80420 -74405 -54132 -51935 -63151 -36916 -54324 -51264
8794e1264j9927J1086K5210j2479j2419M64J1238l0651P4093q5472J1231N855
$$ -51264 -71191 -60105 -34895 -47374 -59793 -59329 -48091 -78742 -4649 -90121 -78890 -73035
8782g3035P365r092P639K1471l6590P541J3345j7717j0184J3940L368J2475J5269
$$ -73035 -65670 -74762 -67123 -45652 -82242 -74701 -61356 -79073 -89257 -75317 -71949 -59474 -44205
8769d4205p797j4276R594j3558Q126j2333J8292k0681J1890j8678L4444l1825
$$ -44205 -52002 -66278 -56684 -70242 -62116 -74449 -56157 -76838 -64948 -83626 -49182 -81007
8757h1007M3159j8689M297k529J3535l7276J9943p859J0409p862L695R684J3769
$$ -81007 -37848 -56537 -52240 -54769 -41234 -78510 -58567 -66426 -56017 -63879 -60184 -50500 -36731
8744c6731k0449M183j4275L0323k5089p643P391K1153l9900K0068K4900l1950
$$ -36731 -57180 -52997 -67272 -36949 -62038 -69681 -62290 -41137 -81037 -60969 -36069 -68019
8732f8019J2229M099q456j600j1383K5538j1440J5101l1237J2350K83L361L141
$$ -68019 -55790 -51691 -60147 -61747 -73130 -47592 -59032 -43931 -75168 -62818 -62535 -59174 -56033
8719e6033q68J1968k0417J8676j3040j167R791l669j0888L2945j7100m677J0469
$$ -56033 -56901 -44933 -65350 -46674 -59714 -60881 -51090 -54759 -65647 -32702 -49802 -54479 -44010
8706d4010J6061l3905k365O848o167O021J4357j2845J2793m822r537K5045k0072
$$ -44010 -27949 -61854 -64219 -57371 -63538 -57517 -43160 -56005 -43212 -48034 -57571 -32526 -52598
8693e2598j7095K1171M989j2871J237p066Q390j2972K0140k125k2463P230p698
$$ -52598 -69693 -48522 -43533 -56404 -55167 -62233 -53843 -66815 -46675 -48800 -71263 -64033 -71731
8680g1731J7767j2680N171O174j7962M724L0003j6766O220l0582L3073k9777L1811
$$ -71731 -53964 -66644 -61473 -55299 -73261 -68537 -38534 -55300 -49080 -79662 -46589 -76366 -44555
8667d4555P173k9613M670k619J5695j1533p976r386Q702Q435J4179j5362j971
$$ -44555 -37382 -66995 -62325 -64944 -49249 -60782 -68758 -78144 -69442 -61007 -46828 -62190 -64161
8654f4161L300K3826m0859K6152j9549J7703K0655k2504K915J0156k9899K6152
$$ -64161 -60861 -37035 -77894 -51742 -71291 -53588 -32933 -55437 -52522 -42366 -72265 -46113
8642d6113j6974k4592K6554M008L464K01p644K7877k3057j3986K1872J931l474
$$ -46113 -63087 -87679 -61125 -57117 -53653 -53452 -61096 -33219 -56276 -70262 -48390 -46459 -49933
8629d9933m969K64K322J019J654p191k286P80J084k7018L0083j9035K2699k0744
$$ -49933 -54902 -54638 -52316 -51297 -49643 -56834 -59120 -58340 -57256 -84274 -54191 -73226 -50527 -71271
8615g1271m663P506J8663Q563j5275m314J5090M010k4154L1925m985M160L979
$$ -71271 -75934 -68428 -49765 -41202 -56477 -60791 -45701 -41691 -65845 -33920 -38905 -34745 -30766
8602c0766m2650J8527J4784l4696L2708o246M704j6804K0155L479n812j4668M317
$$ -30766 -73416 -54889 -40105 -74801 -42093 -48339 -43635 -60439 -40284 -36805 -42617 -57285 -52968
8589e2968M473j6255K1994j6753R074J5955k4088J3890J020J9843m0158q22J3430
$$ -52968 -48495 -64750 -42756 -59509 -50435 -34480 -58568 -44678 -43658 -23815 -63973 -64795 -51365
8576e1365J8468k2428k702o545M1760p034l7668J3232O887N915k0826K5518k1969
$$ -51365 -32897 -55325 -58027 -64572 -22812 -29846 -67514 -54282 -47395 -41480 -62306 -36788 -58757
8563e8757K7234j3949L3344j3063j6022p030J7010m607k0179J2728J8306j0936
$$ -58757 -31523 -45472 -12128 -25191 -41213 -48243 -31233 -35840 -56019 -43291 -24985 -35921
8551c5921j4323J6192M293p740L52K7786j1146k0545J1407k5402l675j5778J18457
$$ -35921 -50244 -34052 -29759 -37499 -37147 -9361 -20507 -41052 -29645 -55047 -58722 -74500 43957
8538D3957K781m1132O210J6777q180o773L1086k0572Q413J7071l3543L1053m04
$$ 43957 46738 5606 11816 28593 20413 13640 44726 24154 32567 49638 16095 47148 46744
8525D6744K8076j3877m858o716o01R440j3364o483k159J8849j044k5123K0508
$$ 46744 74820 60943 56085 49369 48768 58208 44844 38361 36202 55051 54007 28884 49392
8512D9392P758l345L8125o810J5684J0747O307J3706r226L622J6477j6523r316
$$ 49392 57150 53805 91930 85120 100804 111551 117858 131564 122338 125960 142437 125914 116598
8499A16598l342j8327o169m370j8452m165j6553J5794j7385j0853R539J5870k2449
$$ 116598 113256 94929 88760 84390 65938 61773 45220 61014 43629 32776 42315 58185 35736
8486C5736J9865N67q722l4157K3146n78J0633m467L156r934j5883K9765l7508
$$ 35736 55601 56168 47446 13289 36435 35857 46490 42023 45179 35245 19362 49127 11619
8473A1619K863m043j919j2629M57K0804k9243J6188k2564L575J8770l3511p294
$$ 11619 14482 10439 8520 -4109 -3652 17152 -12091 4097 -18467 -14892 3878 -29633 -36927
8460c6927J7444O770j7799l467Q319O687o759L824K6554l3029O903j9406l322
$$ -36927 -19483 -12713 -30512 -33979 -25660 -18973 -25732 -21908 4646 -28383 -21480 -40886 -44208
8447d4208n103J7339R73K406P815Q978j9846J2857k1085k1087N2311Q705l2344
$$ -44208 -49311 -31972 -30999 -28593 -20778 -11800 -31646 -18789 -39874 -60961 -8650 55 -32289
8434c2289M159J7963r889K3244o541k1200M2680k5228J9193j9716J3241j133J6970
$$ -32289 -28130 -10167 -20056 3188 -3353 -24553 18127 -7101 12092 -7624 5617 4484 21454
8421B1454k4760n285K9061j6723J9499k5090l590J0277l2201L5269j3260J5063
$$ 21454 -3306 -8591 20470 3747 23246 -1844 -5434 4843 -27358 7911 -5349 9714
8409I714K74R032K762j075J3223o170J7491k9954J8116J411r513k5851L6903l0061
$$ 9714 9988 19020 21782 20707 33930 27760 45251 15297 33413 34824 25311 -540 36363 6302
8395F302o617J3025k122J588j5809j664K7006j5873q207n580j254O925R921j9967
$$ 6302 -315 12710 10588 12176 -3633 -5297 21709 5836 -2371 -7951 -9205 -2280 7641 -12326
8381a2326N626J4273k6710L3609l3083J0539J1767q080j8798J7060j2743j2799
$$ -12326 -6700 7573 -19137 14472 -18611 -8072 3695 -4385 -23183 -6123 -18866 -31665
8369c1665J1270R976j896k0343N169p559N640p915j1497K4864k5758J8854l2805
$$ -31665 -20395 -10419 -12315 -32658 -27489 -35048 -29408 -37323 -48820 -23956 -49714 -30860 -63665
8356f3665K4652R312r600O641r048R903k4409K2584m434J3420K5197n7222L8087
$$ -63665 -39013 -29701 -39301 -32660 -41708 -31805 -56214 -33630 -38064 -24644 553 -56669 -18582
8343a8582n530j4109k691n484N430j8374R087m941J8054J0841k6964L2418k2611
$$ -18582 -24112 -38221 -40912 -46396 -40966 -59340 -50253 -55194 -37140 -26299 -53263 -20845 -43456
8330d3456J1043l49p441K815P415p833R92K594j1777m072k648K9097k0768r95
$$ -43456 -32413 -32762 -40203 -37388 -29973 -37806 -36814 -34220 -45997 -50069 -52717 -23620 -44388 -45383
8316d5383N814j0264l930M12j0870L1253K482j511k430p612j609K0025k5377J1796
$$ -45383 -39569 -49833 -53763 -53351 -64221 -32968 -30486 -31997 -34427 -42039 -43648 -23623 -49000 -37204
8302c7204r212j204K6850j9036Q53L3987k3941L93J478k7124K5505j9862N042
$$ -37204 -46416 -47620 -20770 -39806 -38953 -4966 -28907 -28514 -27036 -54160 -28655 -48517 -43475
8289d3475L096j8169K6958O869N30j4392M63j9094K9270Q522k5068Q504q006N157
$$ -43475 -40379 -58548 -31590 -24721 -24191 -38583 -38120 -57214 -27944 -19422 -44490 -35986 -43992 -38835
8275c8835m530N589K8183j1386j3172J5362k1580M861k666J0113l9912K7870Q105
$$ -38835 -43365 -37776 -9593 -20979 -34151 -18789 -40369 -35508 -38174 -28061 -67973 -40103 -31998
8262c1998l932P393l9054K2948J8929J8470l3467J9591L416k2604J649L978k1621
$$ -31998 -35930 -28537 -67591 -44643 -25714 -7244 -40711 -21120 -17704 -40308 -38659 -34681 -56302
8249e6302L0086L0381l0951J5713m0958M2696m2846K1998p999J7097j4573O154
$$ -56302 -26216 4165 -26786 -11073 -52031 -9335 -52181 -30183 -38182 -21085 -35658 -29504
8237b9504j2983J3402K288R97j8896J9726j6204k9521K6593J4221j1322K1199
$$ -29504 -42487 -29085 -26797 -25800 -44696 -24970 -41174 -70695 -44102 -29881 -41203 -20004
8225b0004k6507K741j0732K3525Q689l6746L2482r485j2413N0250k8592n302J8878
$$ -20004 -46511 -43770 -54502 -30977 -22288 -59034 -26552 -36037 -48450 1800 -26792 -32094 -13216
8212a3216k8289J4619m959J2801k5082m022O570l643o793R426k878k158N125m616
$$ -13216 -41505 -26886 -31845 -19044 -44126 -48148 -41578 -45221 -52014 -42588 -45466 -47624 -42499 -47115
8198d7115K2084O898r235n4350N0802K6023m7027R4648m2619l9487p19J3922R750
$$ -47115 -25031 -18133 -27368 -81718 -30916 -4893 -51920 42728 109 -39378 -40097 -26175 -16425
8185a6425M852k8968Q837N801Q17j0220k2336J5049J7999j4155k5205K3987j61
$$ -16425 -11573 -40541 -31704 -25903 -25086 -35306 -57642 -42593 -24594 -38749 -63954 -39967 -40128
8172d0128P802K006L776k2992K4039J6036j8060q452J1900M933j400J2160j6306
$$ -40128 -32326 -30320 -26544 -49536 -25497 -9461 -27521 -35973 -24073 -19140 -20540 -8380 -24686
8159b4686l1445K0633R884j0898m893K0494m469J4156k9912Q769J2407J8790j0346
$$ -24686 -56131 -35498 -25614 -36512 -41405 -20911 -25380 -11224 -41136 -32367 -19960 -1170 -11516
8146a1516j6180j5079J3095J4952J5491r856q858p309O748l75J244l343K44O855
$$ -11516 -27696 -42775 -29680 -14728 763 -9093 -17951 -25260 -18512 -18887 -17643 -20986 -20742 -13887
8132a3887k3517O352R877J0573k2608J2715j488J6579k6907K1421k0796K038N518
$$ -13887 -37404 -31052 -21175 -10602 -33210 -20495 -21983 -5404 -32311 -10890 -31686 -29648 -24130
8119b4130L787K5993k7542J9675m1281O254L5796k0123k615j4375J4411L0519
$$ -24130 -20343 5650 -21892 -2217 -43498 -37244 -1448 -21571 -24186 -38561 -24150 6369
8107F369j3871r546j3352O98M509J074O381l719j5702K4332j4444L1759l1135
$$ 6369 -7502 -17048 -30400 -29702 -25193 -24119 -17738 -21457 -37159 -12827 -27271 4488 -26647
8094b6647J502J7457J090p665p820r394J6947j0410Q233L282j6324J3101l1898
$$ -26647 -25145 -7688 -6598 -14263 -22083 -31477 -14530 -24940 -16707 -13425 -29749 -16648 -48546
8081d8546L8173k491j9820J4621j0325m144Q733n744L186j0658j744K4993j2887
$$ -48546 -10373 -12864 -32684 -18063 -28388 -32532 -23799 -29543 -26357 -37015 -38759 -13766 -26653
8068b6653K5311k7645J4846j0528l75j193J4905m2701L2043j1k0529K8379q991
$$ -26653 -1342 -28987 -14141 -24669 -25044 -26237 -11332 -54033 -21990 -22001 -42530 -14151 -23142
8055b3142N560j2261J4467m0986L2873j3875N687J1769k0820K0250k6782L9320
$$ -23142 -17582 -29843 -15376 -56362 -23489 -37364 -31677 -19908 -40728 -20478 -47260 -7940
8043g940j3490n653O219l874j7888M409J7301K475K1898j9154n911J4791j8420
$$ -7940 -21430 -27083 -20864 -24738 -42626 -38217 -20916 -18441 3457 -15697 -21608 -6817 -25237
8030b5237K646k879N672l4111J9702J2485k441r049O40j476J5374M562l896j7591
$$ -25237 -22591 -25470 -19798 -53909 -34207 -21722 -24163 -33212 -32572 -34048 -18674 -14112 -18008 -35599
8016c5599q314J6059O826J948O443j5879J819J5989k2666J9834j0102J8913r971
$$ -35599 -43913 -27854 -21028 -19080 -12637 -28516 -26697 -10708 -33374 -13540 -23642 -4729 -14700
8003a4700j1595J7440l188k2253J0451j649J7327l2763L2919l0076J7986k266
$$ -14700 -26295 -8855 -12043 -34296 -23845 -25494 -8167 -40930 -8011 -38087 -20101 -22367
7991b2367P122q543k336J302j0925J9617J6857k3035j2335J3937j4538J0248q50
$$ -22367 -15245 -23788 -26124 -24822 -35747 -16130 727 -22308 -34643 -20706 -35244 -24996 -25846
7978b5846k3617J3999L894J0055r347J7795Q490j5792J2359m358o825k056L860
$$ -25846 -49463 -35464 -31570 -21515 -30862 -13067 -4577 -20369 -8010 -12368 -19193 -21249 -17389
7965a7389o050k7337L7486O659j9298P88L288n015J3834k9923O943k2708M6779
$$ -17389 -23439 -50776 -13290 -6631 -25929 -25141 -21853 -26868 -13034 -42957 -36014 -58722 -11943
7952a1943j3213p894O011J2074r453J2241k130j7118j461N092K0494r532J5306
$$ -11943 -25156 -33050 -27039 -14965 -24418 -12177 -14307 -31425 -32886 -27794 -7300 -16832 -1526
7939a526L029k8428J8799O42j6734K684K2700j1780o503J0010k2273K9688n1434
$$ -1526 1503 -26925 -8126 -7484 -24218 -21534 1166 -10614 -17117 -7107 -29380 308 -51126
7926e1126P0632k2954l6884J6283r844L6888k5977R809r044J488Q177m095k0703
$$ -51126 19506 -3448 -40332 -24049 -33893 2995 -22982 -13173 -22217 -20729 -12552 -16647 -37350
7913c7350L0301R170j9779q844J1668j5901K598K2514m717K530k0637M1833k4427
$$ -37350 -7049 2121 -17658 -26502 -14834 -30735 -28137 -5623 -10340 -7810 -28447 13386 -11041
7900a1041r068n926j5728K5953n877L359J037J4198p133Q195p519k5206K5582
$$ -11041 -20109 -26035 -41763 -15810 -21687 -18328 -17291 -3093 -10226 -2031 -9550 -34756 -9174
7887i174q571K1986k8685L8719j0700k0676m907L628L0299q803M386j6834j6720
$$ -9174 -17745 4241 -24444 14275 3575 -17101 -22008 -18380 11919 3116 7502 -9332 -26052
7874b6052L39J0963n935J1906M882j147J0768k5045O9j64K0133j828o176o661
$$ -26052 -25713 -14750 -20685 -8779 -3897 -5044 5724 -19321 -19252 -19416 717 -1111 -7287 -13948
7860a3948J6798k4834O728J1963j4184q56N465Q765k3892L4171k6323J1243j1517
$$ -13948 2850 -21984 -15256 -3293 -17477 -18333 -12868 -4103 -27995 6176 -20147 -8904 -20421
7847b0421j283k6906K52482k69310M6063L527j005J1965n820J2579k090j5894
$$ -20421 -21704 -48610 203872 -65438 -19375 -15848 -16853 -4888 -10708 1871 -219 -16113
7835a6113J0325K40k3412M580Q035J4264L805o642n669k2120J3983k412Q38J2289
$$ -16113 -5788 -5548 -28960 -24380 -16345 -2081 1724 -4918 -10587 -32707 -18724 -21136 -20298 -8009
7821h009j161m039Q959j4374J7890k1543K1597k2221J8978K746J2145k0345K9889
$$ -8009 -9170 -13209 -4250 -18624 -734 -22277 -680 -22901 -3923 -1177 10968 -9377 20512
7808B0512o2607L2127J4728j8373p973K3638j7502J0682M308n17q854j3535R864
$$ 20512 -42095 -9968 4760 -13613 -21586 2052 -15450 -4768 -460 -977 -9831 -23366 -13502
7795a3502R702k6307J0596J9382k1584Q853J8600j2382p515K0122m4835L1980
$$ -13502 -3800 -30107 -19511 -129 -21713 -12860 5740 -6642 -14157 5965 -38870 -6890
7783f890K1103m607p890q117r391l743K8936l2521j220L05k1476L7167l003L958
$$ -6890 14213 9606 1716 -6401 -15792 -19535 9401 -23120 -24340 -24035 -45511 -8344 -11347 -7389
7769g389J0526q693j1564J0424K7885l7070L346l2095K7205J583R104q566M846
$$ -7389 3137 -5556 -17120 -6696 21189 -15881 -12535 -44630 -17425 -15842 -6738 -15304 -10458
7756a0458J4484k414k1786k278j3952J6657J0398L173J2690k4087J3003k0317
$$ -10458 4026 1612 -20174 -22452 -36404 -19747 -9349 -6176 6514 -17573 -4570 -24887
7744b4887O186M152r840J7468J3196j0730K0193j9649j947o752k6432K5325L313
$$ -24887 -18701 -14549 -24389 -6921 6275 -4455 15738 -3911 -5858 -12610 -39042 -13717 -10404
7731a0404o626J3032o58k600J2676j2105r43J9788k6255l698L226p136K2964M84
$$ -10404 -17030 -3998 -4656 -7256 5420 -6685 -7628 12160 -14095 -17793 -14567 -21703 1261 1745
7717A745K18j7407J2944q845N412j571Q278P68j7500m97j0195J0731K0577j8472
$$ 1745 1963 -15444 -2500 -11345 -5933 -7504 774 1542 -15958 -16455 -26650 -15919 4658 -13814
7703a3814J5014k2281K1580j1432O202j2700N21k083Q542k642J1660o480p331
$$ -13814 1200 -21081 499 -10933 -4731 -17431 -16910 -18993 -10451 -13093 -1433 -7913 -15244
7690a5244n293l815J8909j4056O120Q28m626J3493k617K521J0350j4097q287N420
$$ -15244 -20537 -24352 -5443 -19499 -13379 -12551 -17177 -3684 -6301 -3780 6570 -7527 -15814 -10394
7676a0394m82O628J3533k9803P497R547J7667k9420L241O958j7529K5137l4533
$$ -10394 -10876 -4248 9285 -20518 -13021 -3474 14193 -15227 -11986 -5028 -22557 2580 -31953
7663c1953N505L1905k630l488j80p071j8088L9614j4295P854L177J1553k3747
$$ -31953 -26448 5457 2827 -661 -841 -7912 -26000 13614 -681 7173 10350 21903 -1844
7650a844l9782L6462r2K518o524k5073L8126j0306p739K3782q770j4156r834J3506
$$ -1844 -41626 -5164 -5256 -2738 -9262 -34335 3791 -6515 -14254 9528 758 -13398 -23232 -9726
7636i726j518p305L1501j8570K585P33J2413k551k0413j7699o958K6038P116r112
$$ -9726 -11244 -18549 12952 -5618 -3033 -2300 10113 7562 -12851 -30550 -37508 -11470 -4354 -13466
7622a3466M959N562j9819L903R26K1159j2170J1146j2786m209J1158K2676p189
$$ -13466 -8507 -2945 -22764 -18861 -17935 3224 -8946 2200 -10586 -14795 -3637 19039 11850
7609A1850k144k6804n499n710N3906k5119J8348p621J1851k1799R025m1858M5013
$$ 11850 9706 -17098 -22597 -28307 25599 480 18828 11207 23058 1259 10284 -31574 13439
7596A3439j6213J5657j1260j7318K6891k5881K1514j1774N257j0268L5057k3554
$$ 13439 -2774 12883 1623 -15695 11196 -14685 6829 -4945 312 -9956 25101 1547
7584A547p48j1672j218K452K1373l275j617j0530P670k0061K8611J5874l4203
$$ 1547 799 -10873 -12091 -9639 11734 8459 6842 -3688 3982 -16079 12532 28406 -5797
7571e797M266n41r413K1175l0389O436J8167j5105J8724Q243l960k3096J4284
$$ -5797 -1531 -2072 -11485 9690 -20699 -14263 3904 -11201 7523 15766 11806 -11290 2994
7558B994k1173M224K2165k0911K9880j8984J241P551J1526m819j5295M340k6725
$$ 2994 -18179 -13955 8210 -12701 17179 -1805 -564 6987 18513 13694 -1601 2739 -23986
7545b3986K4221O028J123j1011j0858q491L5656l0838K9384j2712p652k3602K0502
$$ -23986 235 6263 7386 -3625 -14483 -22974 12682 -18156 11228 -1484 -9136 -32738 -12236
7532a2236J8323k0888Q588R756K778M42q064K98K1912k6194p187l862J2586j1349
$$ -12236 6087 -14801 -6213 3543 6321 6763 -1301 -1003 20909 -5285 -12472 -16334 -3748 -15097
7518a5097J9644J4751k4322L5855j7547K64r452J0048R794k613k0618P46J3389
$$ -15097 4547 19298 -5024 30831 13284 13548 4096 14144 23938 21325 707 1453 14842
7505A4842J416o910j1124K443k5193M2739l0434p630M2800q738O329j7390q19
$$ 14842 16258 9348 -1776 667 -24526 18213 -12221 -19851 22949 14211 20540 3150 2331
7492B331N643J5126n59Q353m2780J3900L3921j9938j7680L802J1380j9459J6303
$$ 2331 7974 23100 22541 30894 -11886 2014 35935 15997 -1683 2119 13499 -5960 10343
7479A0343O695N83k469q975o876K5847j0686J652p131N155n158n080J7016k724
$$ 10343 17038 17621 15152 6177 -699 25148 14462 16114 8983 14138 8980 3900 20916 18192
7465A8192k1235K3140k5298K7630k0290K3461r781J2734j7559k989J1034k1737
$$ 18192 -3043 20097 -5201 22429 2139 25600 15819 28553 10994 8005 19039 -2698
7453b698K3012K278k9652L0827k6072L0415p557r958M314r874m167J6334k2529
$$ -2698 20314 22592 -7060 23767 -2305 28110 20553 10595 14909 5035 868 17202 -5327
7440e327L4095k0467R79m918L727L798K1073k4095J753k278K3954k3150j1960
$$ -5327 28768 8301 9280 4362 8089 11887 32960 8865 10618 8340 32294 9144 -2816
7427b816Q182k33O422J183J1593p262l226j5760M368K4483k9742O52J5835K89
$$ -2816 5366 5133 11555 12738 24331 17069 13843 -1917 2451 26934 -2808 -2156 13679 13968
7413A3968o096N048j2498J0151j0280J9006r892Q719j789R411j8369m706K5352
$$ 13968 7872 12920 422 10573 293 19299 9407 18126 16337 25748 7379 2673 28025
7400B8025j9432P296R046j0329J0868q161k1678J6900J5416k5350K099Q159o242
$$ 28025 8593 15889 24935 14606 25474 17313 -4365 12535 27951 2601 4700 12859 6617
7387F617N123J9575J529o798L635j0028j572l615J2698j315l2276J4072L151N593
$$ 6617 11740 31315 32844 26046 29681 19653 18081 14466 27164 25849 -6427 7645 10796 16389
7373A6389R793p081j188j4532K547k692K0050j23j5815J1916p959J8267N334k6912
$$ 16389 26182 19101 17913 3381 5928 3236 23286 23163 7348 19264 11305 29572 34906 7994
7359G994K500n966Q464J0045j8418K106J8728o075J9543k4007r435Q702n427K5699
$$ 7994 10494 4528 12992 23037 4619 6725 25453 19378 38921 14914 5479 14181 8754 34453
7345C4453k7332n098n043J0084P482O382k042j5442J3501R500j4788K1990k0018
$$ 34453 7121 2023 -3020 7064 14546 20928 18886 3444 16945 26445 11657 33647 13629
7332A3629o469K250k2093K5217M202k914l699L6527j6851k1483J2781R012j860
$$ 13629 7160 9410 -12683 12534 16736 13822 10123 46650 29799 8316 21097 30109 28249
7319B8249r700L145q54j5638J9596k6610M9345j6483p190L259j9067J6836P168
$$ 28249 18549 21694 20840 5202 24798 -1812 47533 31050 23860 27119 8052 24888 32056
7306C2056N459l077J1694k5702j389J8190j5245Q788j283J064j1334P673j6742
$$ 32056 37515 34438 46132 20430 19041 37231 21986 30774 29491 30555 19221 26894 10152
7293A0152k866K5926O279j0499L71j8439J7022K0808r053j080j6510J5122j7500
$$ 10152 7286 33212 39491 28992 29363 10924 27946 48754 39701 38621 22111 37233 19733
7280A9733k5775N0522k0558N030j5092J1799J0185q263K964j3691K3985P414j2205
$$ 19733 -6042 44480 23922 28952 13860 25659 35844 27581 30545 16854 40839 48253 36048
7267C6048j6729J4526M172k0336Q147J2569r199j2124P808R860K1888k4327j8395
$$ 36048 19319 33845 38017 17681 25828 38397 29198 17074 24882 34742 56630 32303 13908
7254A3908K9117L330j5429l589J3547j4125o007L865L2984j5543k0141J9902k8931
$$ 13908 43025 46355 30926 27337 40884 26759 20752 24617 57601 42058 21917 41819 12888
7241A2888J6211N041J3498k8767K2753J1110j5765R339N106j3889j5283L8513
$$ 12888 29099 34140 47638 18871 41624 52734 36969 46308 51414 37525 22242 60755
7229F0755k3945M258J78j7434j3666L1475J8021k2318R907k2274J9713j2638N681
$$ 60755 36810 41068 41246 23812 10146 41621 59642 37324 47231 24957 44670 32032 37713
7216C7713j5617O042L048K532O121j9168K2918o124r878R978O660k3561K15p696
$$ 37713 22096 28138 31186 33718 39839 20671 43589 37465 27587 37565 44225 20664 20879 13183
7202A3183R243J3692N071j1162M0260k0277J1425l5615J3631o844Q069k5303L4820
$$ 13183 22426 36118 41189 30027 70287 50010 61435 25820 39451 32607 40676 15373 50193
7189E0193k0891p553J8830p336J7579K002p545j4382L3694k2137j9467K5760q065
$$ 50193 29302 21749 40579 33243 50822 52824 45279 30897 64591 42454 22987 48747 40682
7176D0682k921O359j0179J2652J9855k8721m623m286o611J7327N356j3594R958
$$ 40682 37761 44120 33941 46593 66448 37727 33104 28818 22207 39534 44890 31296 41254
7163D1254q226J0483r614R348j4065K0390O103p614k8579L912K3860J0032k9114
$$ 41254 33028 43511 33897 43245 29180 49570 55673 48059 19480 23392 47252 57284 28170
7150B8170j422K5548k2754P175Q524n056J442K3558j6551J0392k3614R570l377
$$ 28170 26748 52296 29542 36717 45241 40185 41627 65185 48634 59026 35412 44982 41605
7137D1605K0946o962j2958Q26Q912o774p864k002j1202L7847k7083K1105R420
$$ 41605 62551 55589 42631 43457 52369 45595 37731 35729 24527 62374 35291 56396 65816
7124F5816j1630N699j1013M0K596L0598q724l742n248j1455K5490j4701j6327
$$ 65816 54186 59885 48872 48912 51508 82106 73382 69640 64392 52937 78427 63726 47399
7111D7399J2231k4903L0552l689q755P133j0189J3234J4356k3666k4777L2132
$$ 47399 59630 34727 65279 61590 52835 59968 49779 63013 77369 53703 28926 61058
7099F1058O324j507j4047K4611k4208q386J6559O824o390J8889j7806K6261j6270
$$ 61058 67382 65875 51828 76439 52231 43845 60404 67228 60838 79727 61921 88182 71912
7086G1912K6640j1819n981m06o207J1356n580k2886L7549m825O505m3513K3442
$$ 71912 98552 86733 80752 80346 74139 85495 79915 57029 94578 89753 96258 52745 76187
7073G6187J519k0788N092p489K0495k3086J6456j3908J3974J164j79q705l737
$$ 76187 77706 56918 62010 54521 75016 51930 68386 54478 68452 69616 69437 60732 56995
7060E6995K4944K2229l5051L1922l3443N74k3J9939k8806M0417k0856r214M653
$$ 56995 81939 104168 69117 101039 67596 68170 68147 88086 59280 99697 78841 69627 74280
7047G4280m489Q078n81j309L211k767j8377L1869K899n478p019J8439J275K50
$$ 74280 69791 77869 77288 75979 79190 76423 58046 89915 92814 87336 80317 98756 100031 100281
7033A00281k7379K6722k951j1307M598j8011K165j7367K9076J956J3890j6114
$$ 100281 72902 99624 96673 85366 89964 71953 74118 56751 85827 87783 101673 85559
7021H5559M41K702j3020J3679j5330J1050j195R129r630L014j3236K1722O834
$$ 85559 86000 88702 75682 89361 74031 85081 83886 93015 83385 86399 73163 94885 101719
7008A01719j1788o109k355m212K640Q105K6427l5639K0655R366k2241R673j6796
$$ 101719 89931 83822 81467 77255 79895 88000 114427 78788 99443 108809 86568 96241 79445
6995G9445J3043o660J7357k7776J0583j0913K0674K4105k0316j2189N122r661
$$ 79445 92488 85828 103185 75409 85992 75079 95753 119858 99542 87353 92475 82814
6983H2814K0023M29j5367Q474J9179j5065J871l543K9019j7218J5831J8888k1575
$$ 82814 102837 103266 87899 96373 115552 100487 102358 98815 127834 110616 126447 145335 123760
6970A23760k1951P745q750P370r93J6715n56j2577J1288j5401R106n807j435J0859
$$ 123760 101809 109554 100804 108174 107181 123896 123340 110763 122051 106650 115756 109949 108514 119373
6956A19373K9391k293l7048J0593J7729j2804O762K6258k5849J4966j6548J0591
$$ 119373 148764 146471 109423 120016 137745 124941 131703 157961 132112 147078 130530 141121
6944A41121K3770l647Q705l6479K9298j038m001n55J2414J0573Q640J7836j939
$$ 141121 164891 161244 169949 133470 162768 161730 157729 157174 169588 180161 188801 206637 204698
6931B04698L692L8376Q366q769K8840O8966N646R57J9296K5954k1770L784Q93
$$ 204698 208390 246766 255132 246363 275203 344169 349815 350772 370068 396022 374252 378036 378929
6918C78929m230q499p497k5998r059L8712o319J31M7517J3225K8924J6237M2452
$$ 378929 374699 366200 358703 332705 323646 362358 356039 356170 403687 416912 445836 462073 504525
6905E04525K9634L7845M7571k5336o197j4102m692l7667n0252l8447j5042j8741
$$ 504525 534159 572004 619575 594239 588042 573940 569248 531581 481329 442882 427840 409099
6893D09099l0268q440j4225n332J2794m797M238J6442K2601J1400Q638l731j9497
$$ 409099 378831 370391 356166 350834 363628 358831 363069 379511 402112 413512 422150 418419 398922
6880C98922k442l7467j7379j265l4832n853l0987r152k843n2725K6649q724J5929
$$ 398922 396480 359013 341634 340369 305537 299684 268697 259545 256702 203977 230626 221902 237831
6867B37831k4812k3521O515J1369j9042q962k0310K0566J568j554j6099J1197
$$ 237831 213019 189498 196013 207382 188340 179378 159068 179634 181202 179648 163549 174746
6855A74746l8270L4982k3918K1828J3635K770l1931J0415K7175l9209j101J1304
$$ 174746 136476 171458 147540 169368 183003 185773 153842 164257 191432 152223 151122 162426
6843A62426K084Q025J447O6l5404K8716j870M406J0706k1452m254J8317j7028
$$ 162426 164510 172535 173982 174048 138644 167360 165490 169896 180602 159150 154896 173213 156185
6830A56185k20M0455j4401l425k1058J3660p919J5992r78l802J4678k5955K826
$$ 156185 155965 196420 182019 178594 157536 171196 163277 179269 178291 174489 189167 163212 166038
6817A66038O863l353J7772j5657N088o715n28O77j659Q238j541M671j0735J4891
$$ 166038 172901 169548 187320 171663 176751 170036 169508 170185 168526 176764 175223 179894 169159 184050
6803A84050L431L307M022O932o942j3140J7628P885K6682l0243J2717J8332j9287
$$ 184050 187481 190788 194810 201742 194800 181660 199288 207173 233855 203612 216329 234661 215374
6790B15374K4840k3362K3534q069j1521K2568J2121M3965l844l456J5063M653
$$ 215374 240214 216852 240386 232317 220796 243364 255485 299450 295606 292150 307213 311866
6778C11866j1464k168J4609q080M00k3533j5584O819p061j9709L792n249q149
$$ 311866 300402 298234 312843 304763 305163 281630 266046 272865 265804 246095 249887 244638 236489
6765B36489j567J5123q673J5135L2189k935q134K9092K574L5642N2852k8403O5257
$$ 236489 234922 250045 241372 256507 288696 285761 277627 306719 309293 344935 397787 369384 434641
6752D34641K4663q279O250J4639J3307k5358j7831j0829l1629p137j9818P624
$$ 434641 459304 451025 457275 471914 485221 459863 442032 431203 399574 392437 372619 380243
6740C80243k8914q217k8926j0441o439K3619k1051q960Q536m398j792j1260K7029
$$ 380243 351329 343112 314186 303745 297306 320925 299874 290914 299450 295052 293260 282000 309029
6727C09029p171J6658J220N289L11L8407J8926p207R783j5035J0384J8193m2906
$$ 309029 301858 318516 319736 325025 325336 363743 382669 375462 385245 370210 380594 398787 355881
6714C55881J1863k6313j7150m304j1647l231l58J675j3825l219p57J3309l3323
$$ 355881 367744 341431 324281 319977 308330 305099 304741 306416 292591 289372 288615 301924 268601
6701B68601J5448j0453j601R995K34j9753P080J679o435K034Q671k1498M582j680
$$ 268601 284049 273596 271995 281990 282224 262471 269551 271230 264795 266829 275500 254002 258584 256904
6687B56904K5435L373j6581Q936n534o498K0866r682M704q357r595O52J0409L58
$$ 256904 282339 285712 269131 278067 272533 266035 286901 277219 281923 273566 263971 264623 275032 275390
6673B75390q497J5945J0517j3124R576r086j4548K8616p310j8370L2234J0248
$$ 275390 266893 282838 293355 280231 289807 280721 266173 294789 287479 269109 301343 311591
6661C11591k3759J1589j3209J0107k683O630N059l0801L9823k0168R233j4280
$$ 311591 287832 299421 286212 296319 293636 300266 305325 274524 314347 294179 303412 289132
6649B89132K2763n4008L6061k15M127J6996l3552K6187j9026K4969m100K793M165
$$ 289132 311895 257887 293948 293733 297860 314856 281304 307491 288465 313434 309334 312127 316292
6636C16292j2548N273J1032r038K0256j8943J4135Q228j784J2346k4188J9406
$$ 316292 303744 309017 320049 311011 331267 312324 326459 334687 332903 345249 321061 340467
6624C40467O09K51J9066l3322K4079n096R964K675j6166J1299Q067K1360n1258
$$ 340467 341076 341327 360393 327071 351150 346054 356018 358693 342527 353826 361893 383253 331995
6611C31995K2150J5575J037J2790l048m237J6747l7626J0762L1999J046j9075
$$ 331995 354145 369720 370757 383547 380499 376262 393009 355383 366145 398144 399190 380115
6599C80115M747L998R051j2799O571k8017L2501J0156j6005j0680K2669L388l932
$$ 380115 384862 388860 397911 385112 391683 363666 396167 406323 390318 379638 402307 405695 401763
6586D01763O913n038M52N80J9847J0963l238J2646l0454l986J3675l190j458J4814
$$ 401763 408676 403638 404090 404670 424517 435480 432242 444888 414434 410448 424123 420933 419475 434289
6572D34289l21j0851K1489j3178l704J3830k604M079J7275j3249L0719k1198J1757
$$ 434289 433968 423117 444606 431428 427724 441554 438950 443029 460304 447055 477774 456576 468333
6559D68333j8806L0593j4136J4783R898j2797J6945j2170k584M814J5705j9032
$$ 468333 449527 480120 465984 480767 490665 477868 494813 482643 480059 484873 500578 481546
6547D81546n477K0988J4156J4540k3260L7339q827j6317K7917J3562l519J3578
$$ 481546 476069 497057 511213 525753 502493 539832 531005 514688 542605 556167 552648 566226
6535E66226j6225K1143M79K4157q357J6114J8172K814K8282N413J3807j9649K9925
$$ 566226 550001 571144 571623 595780 587423 603537 621709 624523 652805 658218 672025 652376 682301
6522F82301l9924J3304L314J0423J2016k5579L7400l1722k142R144N916J0900
$$ 682301 642377 655681 658995 669418 681434 655855 693255 661533 659391 668535 674451 685351
6510F85351l54J3999K4674J2942J7637M1346K9476j3711L6509q158k4866K2971
$$ 685351 684997 698996 723670 736612 754249 795595 825071 811360 847869 839711 814845 837816
6498H37816j0442k6836j8530l5407J8313J6142r86k8311R385J2199j7307J4075
$$ 837816 827374 800538 782008 746601 764914 781056 780070 751759 761144 773343 756036 770111
6486G70111R003L3695J4281m966o445K0469K4793j8688K4957j6934J3193k0381
$$ 770111 779114 812809 827090 822124 815679 836148 860941 842253 867210 850276 863469 843088
6474H43088J3682j955k938K9741l0378M061Q030o669J6095p605J1955M760l280
$$ 843088 856770 854815 851877 881618 851240 855301 863331 856662 872757 865152 877107 881867 878587
6461H78587P743O364K0027p460O906l027J0515j2421O615J6381J1132J2789J6255
$$ 878587 886330 892694 912721 905261 912167 909140 919655 907234 913849 930230 941362 954151 970406
6448I70406L1812J00L06K3568q09J8666j5007J9728l230M430P742m0250K3228
$$ 970406 1002218 1002318 1002624 1026192 1025383 1044049 1029042 1048770 1045540 1049970 1057712 1017462 1040690
6435A040690j196K2219l0900L2412O005j1827J4919J1852j523K8581N318J4083
$$ 1040690 1039494 1061713 1030813 1063225 1069230 1057403 1072322 1084174 1082651 1111232 1116550 1130633
6423A130633M927L8595l2498K4727p977K4287k634J2323j3324K3678J6653m62
$$ 1130633 1135560 1174155 1141657 1166384 1158407 1182694 1180060 1192383 1179059 1202737 1219390 1218928
6411A218928j712K8025k9852L8768j3897J9954l568M1920j2929K3631j5215K6314
$$ 1218928 1217216 1245241 1215389 1254157 1240260 1260214 1256646 1298566 1285637 1309268 1294053 1320367
6399A320367L190K8768r76N67J7686J4091o14K6375K9855M971M529R03K1134j0050
$$ 1320367 1323557 1352325 1351349 1351916 1369602 1383693 1383079 1409454 1439309 1444280 1448809 1449712 1470846 1460796
6385A460796M0146J211J4424M4861p091K4949k6878L4640K4970j1051J9647q580
$$ 1460796 1500942 1502153 1516577 1561438 1554347 1579296 1552418 1587058 1612028 1600977 1620624 1612044
6373A612044M5837M442J072K287J5543J0433O764K2713p208K4130J0655K6009
$$ 1612044 1657881 1662323 1663395 1665682 1681225 1691658 1698422 1721135 1713927 1738057 1748712 1774721
6361A774721J730j3020J9606K5180J9054K74R894K3767J5774J1846K4835q900
$$ 1774721 1776451 1763431 1783037 1808217 1827271 1827545 1837439 1861206 1876980 1888826 1913661 1904761
6349A904761J4703M3511j3098J7591J8165J5679J5371L2829K0745L4068M424P518
$$ 1904761 1919464 1962975 1949877 1967468 1985633 2001312 2016683 2049512 2070257 2104325 2108749 2116267
6337B116267J2283N3992L253K1487K2021K1079J1261M1764L536J8903M0731L2719
$$ 2116267 2128550 2182542 2185795 2207282 2229303 2250382 2261643 2303407 2306943 2325846 2366577 2399296
6325B399296L4849N409N284K8490L8552K4111K3787K6449L7049L3472L1917o301
$$ 2399296 2434145 2439554 2444838 2473328 2511880 2535991 2559778 2586227 2623276 2656748 2688665 2682364
6313B682364M1666K4751L0394O9632J0417K9477J8827P3742q871M1875L1562L3399
$$ 2682364 2724030 2748781 2779175 2848807 2859224 2888701 2907528 2981270 2972399 3014274 3045836 3079235
6301C079235K5187M3981O0375K6068N6076J6626O2152K2791O0437L6643J9410
$$ 3079235 3104422 3148403 3208778 3234846 3290922 3307548 3369700 3392491 3452928 3489571 3508981
6290C508981N6519L3314L4497M6303M2689M6261K0250O7532L0422O9349L2029
$$ 3508981 3565500 3598814 3633311 3679614 3722303 3768564 3788814 3856346 3886768 3956117 3988146
6279C988146P7371J5693M6056P1142M0055L0930N5812O8045P6720J5846R1187
$$ 3988146 4065517 4081210 4127266 4198408 4238463 4269393 4325205 4393250 4469970 4485816 4577003
6268D577003M3144N4831N0973P8793O6882O7563O8518Q1430N0604P1785P8634
$$ 4577003 4620147 4674978 4725951 4804744 4871626 4939189 5007707 5089137 5139741 5211526 5290160
6257E290160O9517O2486Q3848P7220P6345Q2178Q1149J07436J06070O1578Q6100
$$ 5290160 5359677 5422163 5506011 5583231 5659576 5741754 5822903 5930339 6036409 6097987 6184087
6246F184087J03283J01236J03459J12411R1094P0052J54925J15010O2636J60796
$$ 6184087 6287370 6388606 6492065 6604476 6695570 6765622 6920547 7035557 7098193 7258989
6236G258989J10581R7431J44085J22171J14983J28524J24386J24022J52258J11056
$$ 7258989 7369570 7467001 7611086 7733257 7848240 7976764 8101150 8225172 8377430 8488486
6226H488486J49883J51270J26124J32117J67972J43493J40985J48230J52341J86366
$$ 8488486 8638369 8789639 8915763 9047880 9215852 9359345 9500330 9648560 9800901 9987267
6216I987267J63260J64089J78549J65597J76417J87483J70674K03504J80928K04347
$$ 9987267 10150527 10314616 10493165 10658762 10835179 11022662 11193336 11396840 11577768 11782115
6206A1782115J77889K11814K12824K17997K16995K13387K14646K18723K59430
$$ 11782115 11960004 12171818 12384642 12602639 12819634 13033021 13247667 13466390 13725820
6197A3725820K30811K47712K63645K58638K52116K68637L05303K77375K97419
$$ 13725820 13956631 14204343 14467988 14726626 14978742 15247379 15552682 15830057 16127476
6188A6127476L24034L18978L45790L32812L46614L73867L83501L80503M20540
$$ 16127476 16451510 16770488 17116278 17449090 17795704 18169571 18553072 18933575 19354115
6179A9354115L93760M40209M12404N14218M48355M78625N20380N35991N38719
$$ 19354115 19747875 20188084 20600488 21114706 21563061 22041686 22562066 23098057 23636776
6170B3636776N72276N69566N81382O34471O50239O34542P16384P19652P45485
$$ 23636776 24209052 24778618 25360000 25994471 26644710 27279252 27995636 28715288 29460773
6161B9460773P74382Q42885Q64940R03627R30528R82840J024148J112058J156486
$$ 29460773 30235155 31078040 31942980 32846607 33777135 34759975 35784123 36896181 38052667
6152C8052667J233337J281480J344356J442704J481762J573396J691164J760578
$$ 38052667 39286004 40567484 41911840 43354544 44836306 46409702 48100866 49861444
6144D9861444J895205J969239K098087K245625K354148K526485K692127K863349
$$ 49861444 51756649 53725888 55823975 58069600 60423748 62950233 65642360 68505709
6136F8505709L092926L274783L548846L811632M089454M440019M767359N170984
$$ 68505709 71598635 74873418 78422264 82233896 86323350 90763369 95530728 100701712
6128A00701712N593119O073833O554054P148165P729734Q406552R084424R843952
$$ 100701712 106294831 112368664 118922718 126070883 133800617 142207169 151291593 161135545
6120A61135545J0631389J1436848J2312816J3148438J3928506J4689426J5307386
$$ 161135545 171766934 183203782 195516598 208665036 222593542 237282968 252590354
6113B52590354J5717838J5917693J5754777J5180418J4121280J2548496J0506531
$$ 252590354 268308192 284225885 299980662 315161080 329282360 341830856 352337387
6106C52337387P976895N111354J997707j301331m378193p349879r901337j2040125
$$ 352337387 360314282 365425636 367423343 366122012 361743819 354393940 344492603 332452478
6098C32452478j3667481j4797015j5445857j5677048j5533141j5108467j4569075
$$ 332452478 318784997 303987982 288542125 272865077 257331936 242223469 227654394
6091B27654394j3795204j3005720j2180092j1301519j0520197r720799q965366
$$ 227654394 213859190 200853470 188673378 177371859 166851662 157130863 148165497
6084A48165497q315698p671281p061367o533950o034727n585651n146282m764239
$$ 148165497 139849799 132178518 125117151 118583201 112548474 106962823 101816541 97052302
6076I7052302m448101m140167l835429l553912l378295l113241k943351k787681
$$ 97052302 92604201 88464034 84628605 81074693 77696398 74583157 71639806 68852125
6068F8852125k631011k426631k302732k186326k073325j969974j869691j758879
$$ 68852125 66221114 63794483 61491751 59305425 57232100 55262126 53392435 51633556
6060E1633556j670383j603589j549744j484630j387057j325428j317544j234396
$$ 51633556 49963173 48359584 46809840 45325210 43938153 42612725 41295181 40060785
6052D0060785j193602j130993j083221j064013r78639r98915q78802q93884q55885
$$ 40060785 38867183 37736190 36652969 35588956 34610317 33611402 32732600 31838716 30982831
6043C0982831q20167p63095q07637o92294p31926p05688o64591o51182o46083
$$ 30982831 30162664 29399569 28591932 27899638 27167712 26462024 25797433 25146251 24500168
6034B4500168n86634o05282n45070n26050n13491n15018m40140m74010m69032
$$ 24500168 23913534 23308252 22763182 22237132 21723641 21208623 20768483 20294473 19825441
6025A9825441m18110l96576m24805l58580l71633m19145l75596l70193l55447
$$ 19825441 19407331 19010755 18585950 18227370 17855737 17436592 17060996 16690803 16335356
6016A6335356l59054l31034l43952l47353l10509k85890l07729l05353k78541
$$ 16335356 15976302 15645268 15301316 14953963 14643454 14357564 14049835 13744482 13465941
6007A3465941k63034k24761k67222k48952k35050j93181k41991k26075k43305
$$ 13465941 13202907 12978146 12710924 12461972 12226922 12033741 11791750 11565675 11322370
5998A1322370j98551k09861j98060k13024k10306j82292k08921j58609k22381
$$ 11322370 11123819 10913958 10715898 10502874 10292568 10110276 9901355 9742746 9520365
5989I520365j30831k19940j34338j82893j43860j82757j46312j54940j37308j75786
$$ 9520365 9389534 9169594 9035256 8852363 8708503 8525746 8379434 8224494 8087186 7911400
5979G911400j09385j23012j47284j10720j43863j07811j24110j06773j21503j19863
$$ 7911400 7802015 7679003 7531719 7420999 7277136 7169325 7045215 6938442 6816939 6697076
5969F697076q0323j42198q8724r2223q7291j26754p7542q0722j07024p8493j00530
$$ 6697076 6616753 6474555 6385831 6293608 6206317 6079563 6002021 5921299 5814275 5735782 5635252
5958E635252p9755q3802p6968j10360o6551j08414o3876p7768o5698o6760p9813
$$ 5635252 5555497 5471695 5394727 5284367 5217816 5109402 5045526 4967758 4902060 4835300 4755487
5947D755487p2877n5782o2606n8249o3573n7883n4900o2086m3279n8452r7364
$$ 4755487 4682610 4626828 4564222 4505973 4442400 4384517 4329617 4267531 4224252 4165800 4068436
5936D068436l4623p2483q3527n9887k8469r2836o8780m0936m6260n8633m5641
$$ 4068436 4033813 3961330 3877803 3817916 3789447 3696611 3627831 3586895 3540635 3482002 3436361
5925C436361m3867n3645l4349m7617m1216k8525l4685l2675n544j01367m9410
$$ 3436361 3392494 3338849 3304500 3256883 3215667 3187142 3152457 3119782 3114238 3012871 2963461
5914B963461k1065n6088l5179l2749p0511l9105m2401j0265o0293k4735o2387
$$ 2963461 2942396 2886308 2851129 2818380 2747869 2708764 2666363 2656098 2595805 2571070 2508683
5903B508683k3100k4125k1470m0644l0730j7846n0791J7209n7218k8071k9203
$$ 2508683 2485583 2461458 2439988 2399344 2368614 2350768 2299977 2317186 2259968 2231897 2202694
5892B202694r01m4348k8553j7694k5591m0966j7853m4467j1263j3744l3090l2407
$$ 2202694 2201793 2157445 2128892 2111198 2085607 2044641 2026788 1982321 1971058 1957314 1924224 1891817
5880A891817K075l1912k5363r852j1172j3975l850n2211j6587j6608j0608m2388
$$ 1891817 1893892 1861980 1836617 1826765 1815593 1801618 1797768 1745557 1728970 1712362 1701754 1659366
5868A659366r626l0901k3035p304j2198m8162p214j813k8371r283q950j0626k6528
$$ 1659366 1649740 1618839 1595804 1588500 1576302 1528140 1520926 1519113 1490742 1481459 1472509 1461883 1435355
5855A435355k77k3484k3222j391k9613r288k5890j2294m6381j5915L232l0978
$$ 1435355 1435078 1411594 1388372 1386981 1357368 1348080 1322190 1309896 1263515 1247600 1250832 1219854
5843A219854j1363o1040K0877k2099k9369J0623m9923R302j0459j4752p748L968
$$ 1219854 1208491 1147451 1168328 1146229 1116860 1127483 1077560 1086862 1076403 1061651 1053903 1057871
5831A057871M219k3818l0698J9173j4489k5674O367K163k3311l4075k823o502
$$ 1057871 1062090 1038272 1007574 1026747 1012258 986584 992951 995114 971803 937728 934905 928403
5819I28403K2288m280k8927K9930m0791k4199K906P324k7000K324r147J8010j6914
$$ 928403 950691 946411 917484 947414 906623 882424 885330 892654 865654 867978 858831 876841 859927
5806H59927l6547p800K2786k148j4140L453k8433J3660k1811J3097j8956J683
$$ 859927 823380 815580 838366 836218 822078 825531 797098 810758 788947 802044 783088 784771
5794G84771j4696Q820J2565j5774j2599J655k0549J5217q900m335j9858J034N9
$$ 784771 770075 778895 791460 775686 763087 764742 744193 759410 750510 746175 726317 727351 727410
5781G27410k528N457k2787n539J912M798l500j7170K3745k0442k1996L6166k7560
$$ 727410 724882 730339 707552 702013 703925 708723 705223 688053 711798 691356 669360 705526 677966
5768F77966L57R83j9909K3934j1449J0402l374N251k1436q994P235j8411J5269
$$ 677966 678323 679306 659397 683331 671882 682284 678910 684161 662725 653731 660966 642555 657824
5755F57824K1762l0556J993l297q79J3231j6197j54m731k6441L4450O09k576K0846
$$ 657824 679586 649030 651023 647726 646847 660078 643881 643727 638996 612555 647005 647614 645038 665884
5741F65884r687r907l0J1045J6578o640K461j3736k314J1550k764R2L899J0686
$$ 665884 656197 646290 646260 657305 673883 667243 669704 655968 653654 665204 662440 662532 666431 677117
5727F77117j1088K701J1829q578J7284j8925l328K1767M728p591N435Q203J2303
$$ 677117 666029 668730 680559 671981 689265 670340 667012 688779 693507 685916 691351 699554 711857
5714G11857O563L755J004L3152L053k0234N357K0496n473K6307M1462N579K759
$$ 711857 718420 722175 723179 756331 759384 739150 744507 765003 759530 785837 827299 832878 835637
5701H35637r280O1079K9186P995N8697L3117J6930P7593M9655L2001P8411O1760
$$ 835637 826357 887436 916622 924617 983314 1016431 1033361 1110954 1160609 1192610 1271021 1332781
5689A332781Q0490O8401Q3332O7238Q7165M9857P3965M2595l574L1640j0218j6076
$$ 1332781 1413271 1481672 1565004 1632242 1719407 1769264 1843229 1885824 1882250 1913890 1903672 1887596
5677A887596r947n6619r103j2627l6530j5770k1959J2253J3229P057L8968J6071
$$ 1887596 1877649 1821030 1811927 1799300 1762770 1747000 1725041 1737294 1750523 1757580 1796548 1812619
5665A812619O6433Q7941M4200Q1213J13674J29654J03831J43525J25520J24112
$$ 1812619 1879052 1966993 2011193 2092406 2206080 2335734 2439565 2583090 2708610 2832722
5655B832722J16011Q5942Q3592L3829K5660p913o2380m0797j02105r8775j10577
$$ 2832722 2948733 3034675 3118267 3152096 3177756 3169843 3107463 3066666 2964561 2865786 2755209
5644B755209r5338j28739j26148r1559p2589p5623m7708n9361l5916k1709Q380
$$ 2755209 2659871 2531132 2404984 2313425 2240836 2165213 2117505 2058144 2022228 2000519 2008899
5633B008899j4298K9980O722M6983K8829O5503K1869O9494K3886L6437J6529J5640
$$ 2008899 1994601 2024581 2031303 2078286 2107115 2172618 2194487 2263981 2287867 2324304 2340833 2356473
5621B356473L390n3785r284m6211p9442r8909m5239j19721m9159q8932o7690p4239
$$ 2356473 2359863 2306078 2296794 2250583 2171141 2072232 2026993 1907272 1858113 1769181 1701491 1627252
5609A627252n0866q2048j2449n4954o0999j7384o752k5152j1125R29J1155n3568
$$ 1627252 1576386 1494338 1481889 1426935 1365936 1348552 1341800 1316648 1305523 1306452 1317607 1264039
5597A264039M0686K780J4675J9530j2254M6405L1273K3260L7199P1528M2104J5517
$$ 1264039 1304725 1307505 1322180 1341710 1329456 1375861 1407134 1430394 1467593 1539121 1581225 1596742
5585A596742Q6694N5951N8434M7490Q8452K0125P7805L8623K9165J3370L0452
$$ 1596742 1683436 1739387 1797821 1845311 1933763 1953888 2031693 2070316 2099481 2112851 2143303
5574B143303K7411J8801J8323l265M0592J7934N9890N1159O0825Q0470R0153P3861
$$ 2143303 2170714 2189515 2207838 2204573 2245165 2263099 2322989 2374148 2434973 2515443 2605596 2679457
5562B679457J02897R7743Q7475J01001R3155R3624J12208J20778Q3632P5834R3430
$$ 2679457 2782354 2880097 2967572 3068573 3161728 3255352 3367560 3488338 3571970 3647804 3741234
5551C741234Q5439P4808M4460O081M8692j9481m7836l6026p9974l8642k4638L2
$$ 3741234 3826673 3901481 3945941 3952022 4000714 3981233 3933397 3897371 3817397 3778755 3754117 3754149
5539C754149J1440L6001L2424J02610R9163J36568J12949J22120J60362J26523
$$ 3754149 3765589 3801590 3834014 3936624 4035787 4172355 4285304 4407424 4567786 4694309
5529D694309R3416Q5991R4112L0701K4605M0194k0026j7642k318m315k4753j3238
$$ 4694309 4787725 4873716 4967828 4998529 5023134 5063328 5043302 5025660 5023342 5019027 4994274 4981036
5517D981036k2334q305L8357J9307M5145O7148Q0415J23566J54967J67208J84641
$$ 4981036 4958702 4950397 4988754 5008061 5053206 5120354 5200769 5324335 5479302 5646510 5831151
5506E831151J79186J95289J92360K01609J53462J44165J35492P7962M1373N4830
$$ 5831151 6010337 6205626 6397986 6599595 6753057 6897222 7032714 7110676 7152049 7206879
5496G206879p432Pj7877l6029q3281j3963q8841r915j2567J2443K1387L9367J06678
$$ 7206879 7199447 7199454 7181577 7145548 7062267 7048304 6959463 6949548 6936981 6949424 6970811 7010178 7116856
5483G116856J14756J06920J86878J62700K01504J92754J57393J43005J26704Q1045
$$ 7116856 7231612 7338532 7525410 7688110 7889614 8082368 8239761 8382766 8509470 8590515
5473H590515K070n6694r3812j37900j86190k10575k52018k40306k50836k31206
$$ 8590515 8592585 8535891 8442079 8304179 8117989 7907414 7655396 7415090 7164254 6933048
5463F933048k28126k34361k25537j51148j96296j50019j60557j13520j18239m8123
$$ 6933048 6704922 6470561 6245024 6093876 5897580 5747561 5587004 5473484 5355245 5307122
5453E307122r4052n0861m8501n3037o3979k6684l5968r4613q0572j22995j37026
$$ 5307122 5213070 5162209 5113708 5060671 4996692 4970008 4934040 4839427 4758855 4635860 4498834
5442D498834j43332j78452j86214j67571j56283j79820j97935j35557j55223j34767
$$ 4498834 4355502 4177050 3990836 3823265 3666982 3487162 3289227 3153670 2998447 2863680
5432B863680j26250j47307o9529j01212j24630n4187j06605k6598q5945o0155
$$ 2863680 2737430 2590123 2520594 2419382 2294752 2240565 2133960 2107362 2021417 1961262
5422A961262l8597m0124m8055j9280n318l8807O948m9j6546p822p351K7365r627
$$ 1961262 1922665 1882541 1834486 1815206 1809888 1771081 1778029 1777980 1761434 1753612 1746261 1773626 1763999
5409A763999M7986m0000J3458L5262K7064l3746K7937K0235J9286P695Q098L9828
$$ 1763999 1811985 1771985 1785443 1820705 1847769 1814023 1841960 1862195 1881481 1889176 1897274 1937102
5397A937102m40L1056L4545Q173M6964J9295J9980L7469N8450N4573N7696N1353
$$ 1937102 1936662 1967718 2002263 2010436 2057400 2076695 2096675 2134144 2192594 2247167 2304863 2356216
5385B356216N7962M4050L6218M6070L4613J5169p5K7545k5676k2468k1501j3809
$$ 2356216 2414178 2458228 2494446 2540516 2575129 2590298 2590223 2617768 2592092 2569624 2548123 2534314
5373B534314o6904l1286k9183o9021k5878n8956k8286k5080n2830j8595k6811
$$ 2534314 2467410 2436124 2406941 2337920 2312042 2253086 2224800 2199720 2146890 2128295 2101484
5362B101484n2974K8731p3223k5117k8015j5511k6217m0153j9368l3014k7002
$$ 2101484 2048510 2077241 2004018 1978901 1950886 1935375 1909158 1869005 1849637 1816623 1789621
5351A789621l3335m1588l3335l6784l5834j7463m3191k5413q840J469p921j1694
$$ 1789621 1756286 1714698 1681363 1644579 1608745 1591282 1548091 1522678 1513838 1515307 1507386 1495692
5339A495692L216Q94j4573n747N8089n630P30L4616K1955L7487K9745J7467O9609
$$ 1495692 1498908 1499802 1485229 1479482 1537571 1531941 1532671 1567287 1589242 1626729 1656474 1673941 1743550
5326A743550Q2735N3575J04068J30867J95939K45173L63483M50164N15461M54377
$$ 1743550 1826285 1879860 1983928 2114795 2310734 2555907 2919390 3369554 3885015 4339392
5316D339392M38153M16710L58269M81885O23192P42260O97299N22820L72201K30405
$$ 4339392 4777545 5194255 5552524 6034409 6657601 7399861 8097160 8619980 8992181 9222586
5306I222586K50015M29694O00095O38030L73965R8390j44582l26926l17556j78936
$$ 9222586 9472601 9902295 10502390 11140420 11514385 11612775 11468193 11141267 10823711 10644775
5296A0644775j63950j96984l95574n30798o31630o01680n50509m62725m83645
$$ 10644775 10480825 10283841 9888267 9357469 8725839 8124159 7573650 7110925 6627280
5287F627280m81766n47312n32563m88742n06063m57173m55181l62683k95923k54479
$$ 6627280 6145514 5598202 5065639 4576897 4070834 3613661 3158480 2795797 2499874 2245395
5277B245395k04086j64923r6092j32596n7516n0441o7221q172r5426k0873l2540
$$ 2245395 2041309 1876386 1780294 1647698 1590182 1539741 1472520 1464348 1368922 1348049 1315509
5266A315509L92o2558o899m0414j2886k9550k7489r905M186j7875j8734q139q974
$$ 1315509 1315901 1253343 1246444 1206030 1193144 1163594 1136105 1126200 1130386 1112511 1093777 1085638 1076664
5253A076664k0295N2419l8670K5228k1966L3148j3536p33J1294j3297l738O833
$$ 1076664 1056369 1108788 1070118 1095346 1073380 1106528 1092992 1092259 1103553 1090256 1086518 1093351
5241A093351k956J3323k0082J392J8282r224J6104j769J8420L7101m927N5213
$$ 1093351 1090395 1103718 1083636 1085028 1103310 1094086 1110190 1108421 1126841 1163942 1159015 1214228
5229A214228K6241L862M8470L2293O4010N0946M4500L6350Q5687L9206J01696
$$ 1214228 1240469 1244331 1292801 1325094 1389104 1440050 1484550 1520900 1606587 1645793 1747489
5218A747489L9193N7522N3071P0930M0914O2754K6191P3220N0963O2808N1406
$$ 1747489 1786682 1844204 1897275 1968205 2009119 2071873 2098064 2171284 2222247 2285055 2336461
5207B336461P2654N1314O8364N2977O7079O2093O3689O2471R5514O6660P8906
$$ 2336461 2409115 2460429 2528793 2581770 2648849 2710942 2774631 2837102 2932616 2999276 3078182
5196C078182K6994P6700L9980J4312j2409L476r4327k3020o5642q5897q6212r9276
$$ 3078182 3105176 3181876 3221856 3236168 3223759 3227235 3132908 3109888 3044246 2958349 2872137 2772861
5184B772861p6788o2448q3174p1232o4718r8773n9819p3145n0021m3870p1680
$$ 2772861 2696073 2633625 2550451 2479219 2414501 2315728 2255909 2182764 2132743 2088873 2017193
5173B017193m2423m2076n4873p0933n0694m8767l1246r9438l1882j10370p7303
$$ 2017193 1974770 1932694 1877821 1806888 1756194 1707427 1676181 1576743 1544861 1434491 1357188
5162A357188l8147q9925p1129m6675k5990j09233j0296r3944k0300l5354k2102
$$ 1357188 1319041 1229116 1157987 1111312 1085322 976089 965793 871849 851549 816195 794093
5151G94093m3447o1986n677l6229l6555P390n2814m192k2929l4447k5601J7277
$$ 794093 750646 688660 682983 646754 610199 617589 564775 560583 537654 503207 477606 494883
5139D94883j9114k5299O632k4565l719l3443N342J848m287k4725j1251J1092p064
$$ 494883 475769 450470 457102 432537 428818 395375 400717 402565 398278 373553 362302 373394 366330
5126C66330Q375k9940L101m289j7479k058o222j5621O827m80q784Q024j2387N011
$$ 366330 374705 344765 347866 343577 326098 324040 317818 302197 309024 308544 299760 307784 295397 300408
5112C00408O875j8709P666j984O002k6333N794r19M471J12K2066k2235j2020K4360
$$ 300408 307283 288574 296240 294256 300258 273925 279719 278800 283271 283383 305449 283214 271194 295554
5098B95554l2641K5318k497J9185p181J2773j019M55K8515m392m657K1294J9785
$$ 295554 262913 288231 285734 304919 297738 310511 309492 309947 338462 334070 329413 350707 370492
5085C70492Q194n783K1723K2301j81L2212J5770L4939L4849L1012J7910L9119
$$ 370492 378686 372903 394626 416927 416746 448958 464728 499667 534516 565528 583438 622557
5073F22557J7413O6030J4210K5202K4034Q723p979l267O686O500K7710k4900K2094
$$ 622557 639970 706000 720210 745412 769446 778169 770190 766923 773609 780109 807819 782919 805013
5060H05013J8906k4293L9035J3610L8218K3184M0632K9421N9680M4928N3161P4749
$$ 805013 823919 799626 838661 852271 890489 913673 954305 983726 1043406 1088334 1141495 1216244
5048A216244P2164P8254K7123J17133O7347M5658N2850M8840J1492J7842L9760
$$ 1216244 1288408 1366662 1393785 1510918 1578265 1623923 1676773 1725613 1737105 1754947 1794707
5037A794707k393o676m9446k4383m7123O895k3334j9887j4734l960o010N958j553
$$ 1794707 1792314 1785638 1736192 1711809 1664686 1671581 1648247 1628360 1613626 1609666 1603656 1609614 1608061
5024A608061N0490J1612N8207M6436L8361Q1906N5162O6139M8297N4558N7486
$$ 1608061 1658551 1670163 1728370 1774806 1813167 1895073 1950235 2016374 2064671 2119229 2176715
5013B176715L5829L9192J2819l046o4279n287l9168o0050o0776o0754r2394p2568
$$ 2176715 2212544 2251736 2264555 2261509 2197230 2191943 2152775 2092725 2031949 1971195 1878801 1806233
5001A806233l7463p9336m1762l9564l3585k9587r967j411j8344J9533j5562N0927
$$ 1806233 1768770 1689434 1647672 1608108 1574523 1544936 1534969 1533558 1515214 1534747 1519185 1570112
4989A570112J8812L2240J2164J7935J7630L3413j6454K763m1429k7198l7045n2381
$$ 1570112 1588924 1621164 1633328 1651263 1668893 1702306 1685852 1688615 1647186 1619988 1582943 1530562
4977A530562l5932p3475k0252o8629p0307l6602k7659n4326p192k5966n0517K507
$$ 1530562 1494630 1421155 1400903 1332274 1261967 1225365 1197706 1143380 1136188 1110222 1059705 1062212
4965A062212k7999l558l206P364j5251J0341j4935M6696K416J7384O341M277L0651
$$ 1062212 1034213 1030655 1027449 1034813 1019562 1029903 1014968 1061664 1064080 1081464 1087805 1092082 1122733
4952A122733R110n2006M792q188R070l8986o583k0922r198k5192J6258p308Q140
$$ 1122733 1131843 1079837 1084629 1076441 1085511 1046525 1039942 1019020 1009822 984630 1000888 993580 1001720
4939A001720J4366j4803L0596M0049o616N8960P5581M137R2842O3838N9832O5582
$$ 1001720 1016086 1001283 1031879 1071928 1065312 1124272 1199853 1203990 1296832 1360670 1420502 1486084
4927A486084O2698M6732R0522J22560J38170J52745J11953R1715k1287n0341j19789
$$ 1486084 1548782 1595514 1686036 1808596 1946766 2099511 2211464 2303179 2281892 2231551 2111762
4916B111762q5338j27021p4146r8055p6443o3475n8459L1807L640J3796N1941
$$ 2111762 2026424 1899403 1825257 1727202 1650759 1587284 1528825 1560632 1564272 1578068 1630009
4905A630009N7593Q7569J28940R4262Q4164N7526O2712J0110P785J428j3026m6622
$$ 1630009 1687602 1775171 1904111 1998373 2082537 2140063 2202775 2212885 2220670 2222098 2209072 2162450
4893B162450l0310p1206p9134m2311p3228n9335n8036l5944n4100n2190n348n2802
$$ 2162450 2132140 2060934 1981800 1939489 1866261 1806926 1748890 1712946 1658846 1606656 1601308 1548506
4881A548506j2641k5731J134J985k0700J4308l369K5618N1748L0438J9219L5044
$$ 1548506 1535865 1510134 1511268 1513253 1492553 1506861 1503492 1529110 1580858 1611296 1630515 1665559
4869A665559K2439L8659k3042j040j2759m5773n4404m1423l0000q2089m6821n3551
$$ 1665559 1687998 1726657 1703615 1702575 1689816 1644043 1589639 1548216 1518216 1436127 1389306 1335755
4857A335755n5997o694m7357l8109k8404k9681R30l0982j9884k5304K4226j1861
$$ 1335755 1279758 1273064 1225707 1187598 1159194 1129513 1130443 1099461 1079577 1054273 1078499 1066638
4845A066638j2782L945J5218J698J2440K0795K1450J538r5m0844K7866j6263K2686
$$ 1066638 1053856 1057801 1073019 1074717 1087157 1107952 1129402 1130940 1130845 1090001 1117867 1101604 1124290
4832A124290j7821K4779K21M9927K4550L2489O0380Q4716J63349L08026M21755
$$ 1124290 1106469 1131248 1131469 1181396 1205946 1238435 1298815 1383531 1546880 1854906 2276661
4821B276661O46576O69453M72898J78675n5441k57724l56969l79131m31258l91378
$$ 2276661 2923237 3592690 4065588 4244263 4188822 3931098 3574129 3194998 2763740 2372362
4811B372362l47363k92144k28843j32120q8009p0490m6788o1144O967j6910j9272
$$ 2372362 2024999 1732855 1504012 1371892 1283883 1213393 1166605 1105461 1112428 1095518 1076246
4800A076246j3238K7622j6317J5615N476K4490k292K9685l384L6509M9928K6909
$$ 1076246 1063008 1090630 1074313 1089928 1095404 1119894 1117602 1147287 1143903 1180412 1230340 1257249
4788A257249M3322K1611L2178K0084N8625O3453m069L7331M8681P6912O043L1849
$$ 1257249 1300571 1322182 1354360 1374444 1433069 1496522 1492453 1529784 1578465 1655377 1661420 1693269
4776A693269Q3834K2766O6482P6947N8203Q5019P8568J12623J08553Q4290J58542
$$ 1693269 1777103 1799869 1866351 1943298 2001501 2086520 2165088 2277711 2386264 2470554 2629096
4765B629096J52461J29899J66115J69086J99437K17301K15390K14471J98498K07136
$$ 2629096 2781557 2911456 3077571 3246657 3446094 3663395 3878785 4093256 4291754 4498890
4755D498890K21021K13659J99853K01249K16221K04914K48801K04185K37000K46586
$$ 4498890 4719911 4933570 5133423 5334672 5550893 5755807 6004608 6208793 6445793 6692379
4745F692379K56996J98894K55858K51466K31106K53466K42524K21614K47910K26093
$$ 6692379 6949375 7148269 7404127 7655593 7886699 8140165 8382689 8604303 8852213 9078306
4735I078306K17394J58880J65579R2078P6286M2210k8350q5682j07973j25816
$$ 9078306 9295700 9454580 9620159 9712237 9788523 9830733 9802383 9716701 9608728 9482912
4725I482912j63242j66665j76607j93871j92391j86694k01892j85386j91132j99278
$$ 9482912 9319670 9153005 8976398 8782527 8590136 8403442 8201550 8016164 7825032 7625754
4715G625754k34125j59938k01149j92295j80944k08524k18510j90858j95541j97491
$$ 7625754 7391629 7231691 7030542 6838247 6657303 6448779 6230269 6039411 5843870 5646379
4705E646379k04918j71573j88022j85538j83652j92364j50209j67370j63454j25749
$$ 5646379 5441461 5269888 5081866 4896328 4712676 4520312 4370103 4202733 4039279 3913530
4695C913530j40132j32755j19611j10832p9569j27493o6140r8728o7521q2332
$$ 3913530 3773398 3640643 3521032 3410200 3330631 3203138 3136998 3038270 2970749 2888417
4685B888417m7871q6262r6719p6822o6551p5304r2672o2838r5578p8396m5697
$$ 2888417 2840546 2754284 2657565 2580743 2514192 2438888 2346216 2283378 2187800 2109404 2063707
4674B063707m6115n1888p3456o1200k3723n7899k6540l7477n2794l4456n0746
$$ 2063707 2017592 1965704 1892248 1831048 1807325 1749426 1722886 1685409 1632615 1598159 1547413
4663A547413n7723k7565n6368l8619n0089m9030o2518l3095k6683m8136l0560
$$ 1547413 1489690 1462125 1405757 1367138 1317049 1268019 1205501 1172406 1145723 1097587 1067027
4652A067027l8178l8743l2461l3035j1056l9614j2842k1288j2453k8597l3550
$$ 1067027 1028849 990106 957645 924610 913554 873940 861098 839810 827357 798760 765210
4641G65210Q010k1501l4479q525k3430k1792l1592K359j3902l6258j9150j0221
$$ 765210 773220 751719 717240 708715 685285 663493 631901 634260 620358 584100 564950 554729
4629E54729j7646j5405J676j1243l3237l5582J8865l3885J8286l1322l1304J3783
$$ 554729 537083 521678 523354 512111 478874 443292 462157 428272 446558 415236 383932 397715
4617C97715j7095O465j0509l9519L525J2369l0512m437K2069m6030J1193l3658
$$ 397715 380620 387085 376576 337057 340582 352951 322439 318002 340071 294041 305234 271576
4605B71576K3958m0993M6751m0039r708j5947J6501l6940L851q190Q577j7710
$$ 271576 295534 254541 301292 261253 251545 235598 252099 215159 219010 210820 219397 201687
4593B01687l5426L9061r99l0997l0053K8216j3164L899k8788J2694o488m526k6012
$$ 201687 166261 205322 204323 173326 143273 171489 158325 162224 133436 146130 139642 135116 109104
4580A09104L0497n41j0278M768q810j7091K8858k1403j5745J5245Q11j7938o065
$$ 109104 139601 139060 128782 133550 124740 107649 136507 115104 99359 114604 115415 97477 91412
4567I1412J252K2902k0784P526J4987k1947j1373J6217j5966o39j054K842j4399
$$ 91412 92664 115566 94782 102308 117295 95348 83975 100192 84226 83587 82533 85375 70976
4554G0976M443k8438K8830l3073K0846m56k4621J8412l92J1259j8473J0371n761
$$ 70976 75419 46981 75811 42738 63584 63128 38507 56919 56527 67786 49313 59684 53923
4541E3923o1J9640j3118J6877J732o025l3917J4097K5302l7677K4164j6321J2236
$$ 53923 53862 73502 60384 77261 78993 72968 39051 53148 78450 40773 64937 48616 60852
4528F0852k0604J0737k0930J1467o434K6177k5547r019J680K4131k9078L7053
$$ 60852 40248 50985 30055 41522 35088 61265 35718 26699 28379 52510 23432 60485
4516F0485j0870r445p849J5730J1154j8752J697j2881k08L1022k2511M580O241
$$ 60485 49615 40170 32321 48051 59205 40453 42150 29269 29061 60083 37572 42152 48393
4503D8393o559j8393M1440m3152K2103J331j3575j7379K0793l136l797R659J6574
$$ 48393 41834 23441 64881 21729 43832 45163 31588 14209 35002 31866 28069 37728 54302
4490E4302p039j6974L569O262r271j073J6244m1974N2764n091m113n170j0665
$$ 54302 47263 30289 33858 40120 30849 29776 46020 4046 56810 51719 47606 42436 31771
4477C1771j5947P428j2340n201L8911l088k1799p201J0165J8850j6755J4568r842
$$ 31771 15824 23252 10912 5711 44622 41534 19735 12534 22699 41549 24794 39362 29520
4464B9520m293j2074J3384n403l009Q637j5272K0418k5845k0163o742M6552j1962
$$ 29520 25227 13153 26537 21134 18125 26762 11490 31908 6063 -14100 -20842 25710 13748
4451A3748m4913M7348j7797O012J0478L563K644j5999l4258K5106K3184j5817
$$ 13748 -31165 16183 -1614 4398 14876 18439 21083 5084 -29174 -4068 19116 3299
4439C299N322J3654k6673Q44J0495p197K3660q685k7911M5243k1734j1609l0628
$$ 3299 8621 22275 -4398 -3554 6941 -256 23404 14719 -13192 32051 10317 -1292 -31920
4426c1920K3298m674q106J5871r421J8191j7886n779J6238j0806K2614j3802J5852
$$ -31920 -8622 -13296 -21402 -5531 -14952 3239 -14647 -20426 -4188 -14994 7620 -6182 9670
4413I670k2148Q259j8209K0531Q709j1451J5727M766J883l6013K5769j6364Q515
$$ 9670 -12478 -4219 -22428 -1897 6812 -4639 11088 15854 17737 -18276 7493 -8871 -356
4400c56J339p728J856j5863K2726J5207Q312l4513O872k4688K4538l121r373N317
$$ -356 983 -6745 -4889 -20752 1974 17181 25493 -9020 -2148 -26836 -2298 -5419 -14792 -9475
4386i475M297k844J5435M008k5637K6814p039K578q976P671k1673K2153O398j6976
$$ -9475 -5178 -8022 7413 11421 -14216 12598 5559 8137 -839 6832 -14841 7312 13710 -3266
4372c266J6408J8952k4455j5068J3011K4042q079k5784L0836L487j8324K1649
$$ -3266 13142 32094 7639 -7429 5582 29624 21545 -4239 26597 30084 11760 33409
4360C3409K768r030L618j7919L3791l5988K9420j1616n349M4980k845j3892l0691
$$ 33409 36177 27147 30765 12846 46637 10649 40069 28453 23104 68084 65239 51347 20656
4347B0656L8371j3675n008K6789j6866O643M191r491L8540p000o770J984j3638
$$ 20656 59027 45352 40344 67133 50267 56910 61101 51610 90150 83150 76380 78364 64726
4334F4726L2623r704J1238n081J4742n256j9579L6435O551k9058J3140j679J9308
$$ 64726 97349 87645 98883 93802 108544 103288 83709 120144 126695 97637 110777 109098 128406
4321A28406J2531l75j2296L3816j2528J0106J0341R341R74J6984J5230K2200l1626
$$ 128406 140937 140562 128266 162082 149554 159660 170001 179342 180316 197300 212530 234730 203104
4308B03104J0660O876J3389j1332K9197L160l315Q277L3106m927K1154K307M1611
$$ 203104 213764 220640 234029 222697 251894 255054 251739 260016 293122 288195 309349 311656 353267
4295C53267N701L1698J7502L1023K5253J1518J7988L9808M2538K3464L1887O4963
$$ 353267 358968 390666 408168 439191 464444 475962 493950 533758 576296 599760 631647 696610
4283F96610M7470M9548L4114Q9002M0167O9184L2136k4787j3599m6210n5167m7322
$$ 696610 744080 793628 827742 916744 956911 1026095 1058231 1033444 1019845 973635 918468 871146
4271H71146j03980o1857q5890n6936p8213m2397m6535k1096m5548k2206l8382
$$ 871146 767166 705309 619419 562483 484270 441873 395338 374242 328694 306488 268106
4260B68106p484r156k899k8644o335J1395k4411J4753m1984J5350l178l7551L6692
$$ 268106 260622 251466 248567 219923 213588 224983 200572 215325 173341 188691 185513 147962 184654
4247A84654j739r50m939r033j1256j811j2957K019j7693J4849N414J1414k8128
$$ 184654 182915 181965 177026 167993 156737 154926 141969 143988 126295 141144 146558 157972 129844
4234A29844o927J2232k0841k2031K143M943J3011j1944J4962k3809L513P565q210
$$ 129844 122917 135149 114308 92277 94420 99363 112374 100430 115392 91583 95096 102661 94451
4221I4451J0576k1190K5368j114q18N1173R569J6624N88k2355l2439L5011m2971
$$ 94451 105027 83837 109205 108091 107273 158446 168015 184639 185227 162872 130433 165444 122473
4208A22473l164l9750J6907m4720K6677j9183j6459q1Q162J2043p960l0516J2383
$$ 122473 119309 79559 96466 51746 78423 59240 42781 42700 50862 62905 54945 24429 36812
4195C6812k806n401R097L923J0986j4878k8982J6323K5331J5311l0495j231K734
$$ 36812 34006 28605 37702 41625 52611 37733 8751 25074 50405 65716 35221 33990 36724
4182C6724p714j6385O40Q535j6128K0118Q267j0934j5705J0078p773j659J0098
$$ 36724 29010 12625 13265 21800 5672 25790 34057 23123 7418 17496 9723 8064 18162
4169A8162q626j6709J5717N160L740K136N577M304P801k385q996q122l617N136
$$ 18162 9536 -7173 8544 13704 17444 19580 25157 29461 37262 34877 25881 17759 14142 19278
4155A9278L000J3035j7090q496J65J6369k6764J8385R339q162O042k8155M999
$$ 19278 22278 35313 18223 9727 9892 26261 -503 17882 27221 19059 25101 -3054 1945
4142A945J0390j1762q033J8548k4257K2802r542J2810m889n976K919k3689K7384
$$ 1945 12335 573 -7460 11088 -13169 9633 91 12901 8012 2036 4955 -18734 8650
4129H650n622k746Q426l2001K5377l065j3105j210j6032L2116j848q894M342J009
$$ 8650 3028 282 8708 -23293 2084 -981 -14086 -15296 -31328 788 -1060 -9954 -5612 -4603
4115d603J0269j4088k6306L4160l7465J8542N31j7201K6152j9666M41l099K1095
$$ -4603 5666 -8422 -34728 -568 -38033 -19491 -18960 -36161 -10009 -29675 -29234 -32333 -11238
4102a1238l3098J0345J3594j4750R973k2664J9313J023P504J6445l4019K9239
$$ -11238 -44336 -33991 -20397 -35147 -25174 -47838 -28525 -27502 -19998 -3553 -37572 -8333
4090h333l5297K7555j2738k109j433J7040k8198J2795j2591J4627r922J2194j8054
$$ -8333 -43630 -16075 -28813 -30922 -32355 -15315 -43513 -30718 -43309 -28682 -38604 -26410 -44464
4077d4464J4561n93J0012n679j0359j4517k5490K4566O487J6524o509p348J0194
$$ -44464 -29903 -30496 -20484 -26163 -36522 -51039 -76529 -51963 -45476 -28952 -35461 -42809 -32615
4064c2615j7086J0943j319Q123L630J2529q290q476J9772l1841J1090n989o633
$$ -32615 -49701 -38758 -40077 -31954 -28324 -15795 -24085 -32561 -12789 -44630 -33540 -39529 -46162
4051d6162K4418j8963K4243j6892L137J6250j6102j2568J4529J0905p285j3150
$$ -46162 -21744 -40707 -16464 -33356 -30219 -13969 -30071 -42639 -28110 -17205 -24490 -37640
4039c7640N53J672J4172k861j3178Q110O352K588K3794j4323K807M291L661O251
$$ -37640 -37087 -35415 -21243 -24104 -37282 -29172 -22820 -20232 3562 -10761 -7954 -3663 -2 6249
4025F249o078K1449M78N532j2858J1821r646K3708o892m866R771r326p071J7873
$$ 6249 171 21620 22098 27630 14772 26593 16947 40655 33763 28897 38668 29342 22271 40144
4011D0144l4997K9574J1302q566M134q211N343j5165Q433K1625M443N432j2261
$$ 40144 5147 34721 46023 37457 41591 33380 38723 23558 31991 53616 58059 63491 51230
3998E1230M4893j3626n613J1427K1004Q61P406j7618p317K2248j8461K3071m1666
$$ 51230 96123 82497 76884 88311 109315 110176 117582 99964 92647 114895 96434 119505 77839
3985G7839j6469J335q333J479j0976o412O454p56P816r670J2120j9877J8122L952
$$ 77839 61370 62705 54372 55851 44875 38463 44917 44161 51977 42307 54427 34550 52672 56624
3971E6624N904O620L196K1651J2645J7322l1599K7565q133q757j0451p081j5402
$$ 56624 62528 69148 72344 93995 106640 123962 92363 119928 111795 103038 92587 85506 70104
3958G0104j8905M440J3917M572l7051o234J974j0035j7198J4481J3348m7972O0207
$$ 70104 51199 55639 69556 74128 37077 30843 32817 22782 5584 20065 33413 -14559 45648
3945D5648k6380m494Q106j4998J9285Q621p225o451j6505k1908J935N577j3982
$$ 45648 19268 14774 22880 7882 27167 35788 28563 22112 5607 -16301 -14366 -8789 -22771
3932b2771J8055m087J6929k0790j3982L4688k1931r527p204J0851k287r714K0161
$$ -22771 -4716 -8803 8126 -12664 -26646 8042 -13889 -23416 -30620 -19769 -22056 -31770 -11609
3919a1609k0592P041j2644j0759J0168K4041j6759j5892R427j1511J0057p786
$$ -11609 -32201 -25160 -37804 -48563 -38395 -14354 -31113 -47005 -37578 -49089 -39032 -46818
3907d6818J385O628L720k0403k003p614N188N383K7557k5288p550K6728l3953
$$ -46818 -45433 -38805 -35085 -55488 -57491 -65105 -59917 -54534 -26977 -52265 -59815 -33087 -67040
3894f7040R918j4735K0367J6710k7189j7838L8241l4308M3756k6604N118J8268
$$ -67040 -57122 -71857 -51490 -34780 -61969 -79807 -41566 -75874 -32118 -58722 -53604 -35336
3882c5336j6215k256j951J1474J832j8821k1772L801j267J2267O142k2936K0781
$$ -35336 -51551 -53807 -55758 -44284 -42452 -61273 -83045 -79244 -80511 -68244 -62102 -85038 -64257
3869f4257k9270K5989N322r696o61k4j1332M5053m2296L2459k961k7838J8966
$$ -64257 -93527 -67538 -62216 -71912 -72573 -72597 -83929 -38876 -81172 -48713 -51674 -79512 -60546
3856f0546j0534k803n727P334L811K1558m5865K0564j276K353o319Q391j1831
$$ -60546 -71080 -73883 -79610 -72276 -68465 -46907 -92772 -72208 -73484 -71131 -77450 -69059 -80890
3843h0890k871J691K3716j2754J198j489m173J5200m0040K8259n812j0246J1899
$$ -80890 -83761 -82070 -58354 -71108 -69910 -71399 -75572 -60372 -100412 -72153 -77965 -88211 -76312
3830g6312k2754o254K1434J6530q640j0151K3555j1908O476j1296j2948K0572
$$ -76312 -99066 -105320 -83886 -67356 -75996 -86147 -62592 -74500 -68024 -79320 -92268 -71696
3818g1696n050J4084k441l661j8777J9699k0384J5744l1931K9668p354O763j1793
$$ -71696 -76746 -62662 -65103 -68764 -87541 -67842 -88226 -72482 -104413 -74745 -82099 -75336 -87129
3805h7129K7340l0010M730k753K9623k5782k347L9880n0716O90j504J4000l837
$$ -87129 -59789 -89799 -85069 -87822 -58199 -83981 -86328 -46448 -97164 -96474 -97978 -83978 -87815
3792h7815N440j3983k119k738j329n813K2143K175j6883K5079m2638M0288l533
$$ -87815 -82375 -96358 -98477 -101215 -102544 -108357 -86214 -84039 -100922 -75843 -118481 -78193 -81726
3779h1726M800k608J0047k3126l401j0562J3327J1486l174l1634L4187n42o32
$$ -81726 -76926 -79534 -69487 -92613 -96014 -106576 -93249 -81763 -84937 -116571 -82384 -82926 -83558
3766h3558O517k0336K1042J3817k8302j5287J1905k1160L7376L494q431J9422
$$ -83558 -77041 -97377 -76335 -62518 -90820 -106107 -94202 -115362 -77986 -74492 -82923 -63501
3754f3501k2026k1933M442J2369J5248p902J4141j3453k1824J7526J3844N206
$$ -63501 -85527 -107460 -103018 -90649 -75401 -83303 -69162 -82615 -104439 -86913 -73069 -67863
3742f7863q817k7825K7403o834j6456L464O278J5889j8002J707j9027m94L2750
$$ -67863 -76680 -104505 -77102 -83936 -100392 -96928 -90650 -74761 -92763 -91056 -110083 -110577 -77827
3729g7827l6597L5735j7497m905K6953j4078p026j5615L241M321P359J5577j7161
$$ -77827 -114424 -78689 -96186 -101091 -74138 -88216 -95242 -110857 -107616 -103295 -95936 -80359 -97520
3716i7520J4979l164j1670K4001J135j6004J021j0463J6809k9267J4076q310j0267
$$ -97520 -82541 -85705 -97375 -73374 -72239 -88243 -87222 -97685 -80876 -110143 -96067 -104377 -114644
3703a14644K7703Q931k1351J5220j0336J4765n599m772n464J3788k0461J8150
$$ -114644 -86941 -78010 -99361 -84141 -94477 -79712 -85311 -90083 -95547 -81759 -102220 -84070
3691h4070m212L60m246n481L0317k4106Q58O567k3177K5141o438p499P659n886
$$ -84070 -88282 -87922 -92168 -97649 -67332 -91438 -90580 -84013 -107190 -82049 -88487 -95986 -88327 -94213
3677i4213M679k0430K5599J6307k7935j0728K3859m635N960J911j0511j5709K2997
$$ -94213 -89534 -109964 -84365 -68058 -95993 -106721 -82862 -87497 -81537 -79626 -90137 -105846 -82849
3664h2849J3485j0312j0618J0415j0746n061O677j78n058k2214J7601n165O695
$$ -82849 -69364 -79676 -90294 -79879 -90625 -95686 -89009 -89187 -94245 -116459 -98858 -104023 -97328
3651i7328N105j4390r885P704J2588J1906j1972J0148l2758K8642m0224N6241
$$ -97328 -92223 -106613 -116498 -108794 -96206 -84300 -96272 -86124 -118882 -90240 -130464 -74223
3639g4223k3275r476K2520q018O138L099r575R602j8788J7843o239j503k0597
$$ -74223 -97498 -106974 -84454 -92472 -86334 -83235 -92810 -83208 -101996 -84153 -90392 -91895 -112492
3626a12492L497R290O094J0045l2548K8222j0266L98j0732L9684j4976o389k0710
$$ -112492 -108995 -99705 -93611 -83566 -116114 -87892 -98158 -97760 -108492 -68808 -83784 -90173 -110883
3613a10883K0582M808j5796R561m535M316N945J1236j3815J0331n0311M7023n106
$$ -110883 -90301 -85493 -101289 -91728 -96263 -91947 -86002 -74766 -88581 -78250 -128561 -81538 -86644
3600h6644o330j7410O537j0270K7978q418j5671j4899L9971K867q699m52K6586
$$ -86644 -92974 -110384 -103847 -114117 -86139 -94557 -110228 -125127 -85156 -82289 -90988 -91440 -64854
3587f4854k9447j4239J4376p615J8907k1735j881J4391j0458J0073q608K1207
$$ -64854 -94301 -108540 -94164 -101779 -82872 -104607 -106488 -92097 -102555 -92482 -101090 -79883
3575g9883k3249J0621j5134J3856P011j4322L388J3613K884k4783N950L225k23
$$ -79883 -103132 -92511 -107645 -93789 -86778 -101100 -97712 -84099 -81215 -105998 -100048 -96823 -97046
3562i7046J1231j430j7908J7518j1776K1267j939k8311L244j06K4953k8498J6371
$$ -97046 -85815 -87245 -105153 -87635 -99411 -78144 -80083 -108394 -105150 -105256 -80303 -108801 -92430
3549i2430q56n725L032Q423j0688j2353J53K332O884Q825j6189J8875k0105M152
$$ -92430 -93286 -99011 -95979 -87556 -98244 -110597 -110444 -108112 -101228 -92403 -108592 -89717 -109822 -105670
3535a05670L492Q423r847M972j6642K3384J4774k7916j1624J7845J1912L896j6611
$$ -105670 -102178 -93755 -103602 -98630 -115272 -91888 -77114 -105030 -116654 -98809 -86897 -83001 -99612
3522i9612P981j715m307K8780l5683P563K206m370L575k4428M2979m013j0710
$$ -99612 -91631 -93346 -97653 -68873 -104556 -96993 -94787 -99157 -95582 -120010 -77031 -81044 -91754
3509i1754j3192M1852m3424J7796j2052J2732k3383K6629j6607P027k2808J7027
$$ -91754 -104946 -63094 -106518 -88722 -100774 -88042 -111425 -84796 -101403 -94376 -117184 -100157
3497a00157j3409N772J4633O197k854j592J1943j8985p300O850l397j0840K2562
$$ -100157 -113566 -107794 -93161 -86964 -89818 -91410 -79467 -98452 -105752 -98902 -102299 -113139 -90577
3484i0577n567r762J7125j0816k4654J2942K4720j3884n165K3508N19R558k5883
$$ -90577 -96144 -105906 -88781 -99597 -124251 -111309 -86589 -100473 -105638 -82130 -81611 -72053 -97936
3471i7936K7607k2067k573L888j63m617l405N950n255j4576L6802k1606J2988
$$ -97936 -70329 -92396 -94969 -91081 -91244 -95861 -99266 -93316 -98571 -113147 -76345 -97951 -84963
3458h4963j900j9339J5961R938j2752M290j2754l052J0536J5152k3088r941J8571
$$ -84963 -86863 -106202 -90241 -80303 -93055 -88765 -101519 -104571 -94035 -78883 -101971 -111912 -93341
3445i3341J235p020J4659n829R447m2349R538J7728q791K0561j3447o71K2924
$$ -93341 -92106 -99126 -84467 -90296 -80849 -123198 -113660 -95932 -104723 -84162 -97609 -98280 -75356
3432g5356k1575K4587j6374j5205Q947j539j647K2931l5100K7590k1103J2353
$$ -75356 -96931 -72344 -88718 -103923 -94976 -96515 -98162 -75231 -110331 -82741 -103844 -91491
3420i1491K2323k4988l725k681l1552L7563L060l563o807j4017K4181k9278p249
$$ -91491 -69168 -94156 -97881 -100562 -132114 -94551 -91491 -95054 -101861 -115878 -91697 -120975 -128224
3407a28224K5790J7123q947j5288K1562J000k9074K0237K3074L5k8582J1551k2566
$$ -128224 -102434 -85311 -94258 -109546 -87984 -86984 -116058 -95821 -72747 -72712 -101294 -89743 -112309
3394a12309J3298R27Q864K1912l3634R635j5978P724m0271N4535N800p238q035
$$ -112309 -99011 -98084 -89220 -67308 -100942 -91307 -107285 -99561 -139832 -85297 -79497 -86735 -94770
3381i4770n449N570j1828J1961J004m022o138J0225l235p219J5211k3648J5286
$$ -94770 -100219 -94649 -106477 -94516 -93512 -97534 -103672 -93447 -96682 -103901 -88690 -112338 -97052
3368i7052j3689m078J7514j159J4235n077j4517J8403j0915n722J6891j4340J6553
$$ -97052 -110741 -114819 -97305 -98464 -84229 -89306 -103823 -85420 -96335 -102057 -85166 -99506 -82953
3355h2953m003j5118J29M124J6999p798J1625k0955P006l4679L0986K535J5916
$$ -82953 -86956 -102074 -101945 -97821 -80822 -88620 -76995 -97950 -90944 -125623 -94637 -92102 -76186
3342g6186l3982L9114k9686J2700j9546Q648Q198M183n422R938l8079J8365L7938
$$ -76186 -110168 -71054 -100740 -88040 -107586 -98938 -90740 -86557 -91979 -82041 -120120 -101755 -63817
3329f3817l0932r099J0290j1781L796K235N003K0939p491j6581m612R134q635
$$ -63817 -94749 -103848 -93558 -105339 -101543 -99308 -94305 -73366 -80857 -97438 -102050 -92916 -101551
3316a01551L9784l1717J1007j0456J6016j0447r366M326L468l534K5632k6402
$$ -101551 -61767 -93484 -82477 -92933 -76917 -87364 -96730 -92404 -88936 -92470 -66838 -93240
3304i3240J2088K821j2867o392p33J3769j413j8112J3940k067N408r861K245k806
$$ -93240 -81152 -78331 -91198 -97590 -98323 -84554 -85967 -104079 -90139 -92206 -86798 -96659 -94414 -97220
3290i7220k1358K9255M790k3788L0529j1504k1074l619K7508r860J5516k0915
$$ -97220 -118578 -89323 -84533 -108321 -77792 -89296 -110370 -113989 -86481 -96341 -80825 -101740
3278a01740O19L5252m4190K9368j3663n352J6304q236J9494j8283J5005j3053
$$ -101740 -101121 -65869 -110059 -80691 -94354 -99706 -83402 -91638 -72144 -90427 -75422 -88475
3266h8475L3086k3838M7041l6383N728j4849P585l3167K8330j2253j7419J1041
$$ -88475 -55389 -79227 -32186 -68569 -62841 -77690 -70105 -103272 -74942 -87195 -104614 -93573
3254i3573J3829q481j4606N013K678N051k0102J1880o147Q292m040J1419k2883
$$ -93573 -79744 -88225 -102831 -97818 -95140 -90089 -110191 -98311 -104458 -96166 -100206 -88787 -111670
3241a11670Q199L4008L812q932n29l7370q691J5602l106L2388n3008K5691Q313
$$ -111670 -103471 -69463 -65651 -74583 -75112 -112482 -121173 -105571 -108677 -76289 -129297 -103606 -95293
3228i5293J1808p851l450k109J1657k3160J0563J7398l2765K9184p801J7709l1133
$$ -95293 -83485 -91336 -94786 -96895 -85238 -108398 -97835 -80437 -113202 -84018 -91819 -74110 -105243
3215a05243J9639l676J4781j829k7493K2071o373L49j6968L845j829J7936l0975
$$ -105243 -85604 -89280 -74499 -76328 -103821 -81750 -88123 -87774 -104742 -100897 -102726 -84790 -115765
3202a15765J194J3936J3623O682j5190J5121j9107j0538J0184Q94rO199j133J4738
$$ -115765 -114571 -100635 -87012 -80330 -95520 -80399 -99506 -110044 -99860 -98966 -98975 -92776 -93909 -79171
3188g9171j1334j3738j1589L3681j7946J2457r127J7804j9008j5952K3759j029
$$ -79171 -90505 -104243 -115832 -82151 -100097 -87640 -96767 -78963 -97971 -113923 -90164 -91193
3176i1193k5365J8940m401M024K968q536Q589J7783k9757J4517k1594J8579J788
$$ -91193 -116558 -97618 -102019 -97995 -95027 -103563 -94974 -77191 -106948 -92431 -114025 -95446 -93658
3163i3658L632m824K2123j9890n378K238j579j7429K1492k0452p946L7920j2391
$$ -93658 -90026 -94850 -72727 -92617 -97995 -95757 -97336 -114765 -93273 -113725 -121671 -83751 -96142
3150i6142j625J5316m246k2797K6944k6543J5880J0205p951j7606n13M242Q472
$$ -96142 -97767 -82451 -86697 -109494 -82550 -109093 -93213 -83008 -90959 -108565 -109078 -104836 -96364
3137i6364K561n905R117K2300j9302j7221K39J1008j8662J8147j2344K4878J348
$$ -96364 -93803 -99708 -90591 -68291 -87593 -104814 -104575 -93567 -112229 -94082 -106426 -81548 -80200
3124h0200L160j061l478k3757J6444j2644P953L727j197J0424l0012M153l405
$$ -80200 -77040 -78101 -81579 -105336 -88892 -101536 -93583 -89856 -91053 -80629 -110641 -106488 -109893
3111a09893K1848k7432L798K8472R26p408R701j4607J363J0445j6021o511K5568
$$ -109893 -88045 -115477 -111679 -83207 -82281 -89689 -79988 -94595 -93232 -82787 -98808 -105319 -79751
3098g9751k0357J4661j6722O220Q313m982r878m984J9073p71q308J3394j289p191
$$ -79751 -100108 -85447 -102169 -95949 -87636 -92618 -102496 -107480 -88407 -89178 -97486 -84092 -85381 -92572
3084i2572q006R214J9955k5410M694J3Q18j503j5780K5254k0428J0503J3465m523
$$ -92572 -100578 -91364 -71409 -96819 -92125 -92112 -91294 -92797 -108577 -83323 -103751 -93248 -79783 -84306
3070h4306j4332r241K0807j6538L35K3095r255k4562J2826j17P396j5667K0656
$$ -84306 -98638 -107879 -87072 -103610 -103275 -80180 -89435 -113997 -101171 -101288 -93892 -109559 -88903
3057h8903k648N64J1526J218j7374q80O715N261m1570M2209R4k4351J7915N267
$$ -88903 -91551 -90987 -79461 -78243 -95617 -96497 -89782 -84521 -126091 -83882 -83788 -108139 -90224 -84957
3043h4957k4847K045K0283p573J8758l9233L6285q685L0358k8971l524R842J7
$$ -84957 -109804 -107759 -87476 -95049 -76291 -115524 -79239 -87924 -57566 -86537 -90061 -80219 -80202
3030h0202j494j2722N92P472n753k0565J9032J2554q714Q787o429k6676J3510
$$ -80202 -81696 -94418 -93826 -86354 -92107 -112672 -93640 -81086 -89800 -81013 -87442 -114118 -100608
3017a00608K033j194L0082m2081K9230m156j3349Q025Q679o263K3715l5664l624
$$ -100608 -98575 -99769 -69687 -111768 -82538 -86694 -100043 -92018 -83339 -89602 -65887 -101551 -105175
3004a05175L670l597M404J6202k380j2169L736J0999j2661K775K0141l0295K8650
$$ -105175 -101505 -105102 -100698 -84496 -86876 -99045 -95309 -84310 -96971 -94196 -74055 -104350 -75700
2991g5700j4922p236j3229K3238p645l4351N8103l8168K434J5181j6361K6987
$$ -75700 -90622 -97858 -111087 -87849 -95494 -129845 -71742 -109910 -107476 -92295 -108656 -81669
2979h1669K48n390l184J7557l5487J587P544O364j601j2157J6772k0903J9016
$$ -81669 -81421 -86811 -89995 -72438 -107925 -106338 -98794 -92430 -94031 -106188 -89416 -110319 -91303
2966i1303j1374l823l659q977J9057J5219n763J5547j7199r598j3181K9275R87
$$ -91303 -102677 -106500 -110159 -119136 -100079 -84860 -90623 -75076 -92275 -101873 -115054 -85779 -84792
2953h4792j5758L176L1855n1888J5571J5874o231k4366J9125P409j6511J3414
$$ -84792 -100550 -97374 -65519 -117407 -101836 -85962 -92193 -116559 -97434 -90025 -106536 -93122
2941i3122n784j5762K856J4744j649p969J6482m821J1749N346l0434J1362O243
$$ -93122 -98906 -114668 -111812 -97068 -98717 -106686 -90204 -95025 -83276 -77930 -108364 -97002 -90759
2928i0759j747L052j7978J1158K1238j3090L893j9471J7512j8829j866J3013J5387
$$ -90759 -92506 -89454 -107432 -96274 -75036 -88126 -84233 -103704 -86192 -105021 -106887 -93874 -78487
2915g8487Q470j8947n313k1383J5465L315j0881J8473j9873N986j045r468K4847
$$ -78487 -70017 -88964 -94277 -115660 -100195 -96880 -107761 -89288 -109161 -103175 -104220 -113688 -88841
2902h8841k2402K2726R462J590l5635J9013K7355l6493j2389J4538M442j3250
$$ -88841 -111243 -88517 -79055 -77465 -113100 -94087 -66732 -103225 -115614 -101076 -96634 -109884
2890a09884J9526J406k986o34K8324k8943J0176j0015J2778j0956j8080K3477
$$ -109884 -90358 -88952 -91938 -92572 -64248 -93191 -83015 -93030 -80252 -91208 -109288 -85811
2878h5811o215m748q331M392j8919J1966L516J0983J705l051j6221J5210R978
$$ -85811 -92026 -96774 -105105 -100713 -119632 -107666 -104150 -93167 -91462 -94513 -110734 -95524 -85546
2865h5546m913l0873L0049J940n624J3248j1766j2258k952J8424j0978Q830p405
$$ -85546 -90459 -121332 -91283 -89343 -94967 -81719 -93485 -105743 -108695 -90271 -101249 -92419 -99824
2852i9824J7765p977j2154R440J1937j5473Q739m598j8143J5748O220k3982J2122
$$ -99824 -82059 -90036 -102190 -92750 -80813 -96286 -87547 -92145 -110288 -94540 -88320 -112302 -100180
2839a00180J0395M410k905J0290j1579j1999M661k709K0348j3669o212j0883J1152
$$ -100180 -89785 -85375 -88280 -77990 -89569 -101568 -96907 -99616 -79268 -92937 -99149 -110032 -98880
2826i8880K9301l5243J5899J972j0287R154r246P775N313K393j7398j398L3458
$$ -98880 -69579 -104822 -88923 -86951 -97238 -88084 -97330 -89555 -84242 -81849 -99247 -100645 -67187
2813f7187j9097q303K6179m4985J8135J1043P286j6122j3852K7873j2914J3520
$$ -67187 -86284 -94587 -68408 -113393 -95258 -84215 -76929 -93051 -106903 -79030 -91944 -78424
2801g8424j9122n030R391j374q395k002K063L382J2052J467K543m3148K6807q589
$$ -78424 -97546 -102576 -93185 -94559 -102954 -104956 -102893 -99511 -87459 -85992 -83449 -126597 -99790 -108379
2787a08379J4981m693J1460r927j5358M804Q036J3053K777k2565K883J9980l5468
$$ -108379 -93398 -98091 -86631 -96558 -111916 -107112 -99076 -86023 -83246 -105811 -102928 -82948 -118416
2774a18416j1067L5533j7490J4050P218j0881p294K0301q942r931K0132m736j7607
$$ -118416 -129483 -93950 -111440 -97390 -90172 -101053 -108347 -88046 -96988 -106919 -86787 -91523 -109130
2761a09130J5279k2206J6089j6225L0914j0387j2790K0615j2826K392j687J2899
$$ -109130 -93851 -116057 -99968 -116193 -85279 -95666 -108456 -87841 -100667 -98275 -99962 -87063
2749h7063O671n427l584k210M504j7069q582J0142J5207K1400k8967O544N005
$$ -87063 -80392 -85819 -89403 -91613 -87109 -104178 -112760 -102618 -87411 -66011 -94978 -88434 -83429
2736h3429j8118j96L333j1456J890j1810N1071m1868J8392k430j5320J2390j2338
$$ -83429 -101547 -101743 -98410 -109866 -107976 -119786 -68715 -110583 -92191 -94621 -109941 -97551 -109889
$$ [...]
##END NTUPLES=NMR SPECTRUM
##END=
