##TITLE=abcd
##JCAMPDX= 6.0         $$ Bruker NMR JCAMP-DX V2.0
##DATA TYPE= NMR SPECTRUM
##DATA CLASS= NTUPLES
##ORIGIN= UXNMR, Bruker Analytische Messtechnik GmbH
##OWNER= root
$$ XWIN-NMR		Version 3.5
$$ Sat Aug  1 15:26:53 2026 Russian Standard Time (UT+4h)  servis@DPX200
##.OBSERVE FREQUENCY= 200.131235884673
##.OBSERVE NUCLEUS= ^1H
##.ACQUISITION MODE= SIMULTANEOUS
##.ACQUISITION SCHEME= undefined
##.AVERAGES= 32
##.DIGITISER RES= 18
##SPECTROMETER/DATA SYSTEM= spect
##.PULSE SEQUENCE= zg
##.SOLVENT NAME= CDCl3
##.SHIFT REFERENCE= (INTERNAL, CDCl3, 0, 16.4885)
##AUDIT TRAIL= $$ (NUMBER, WHEN, WHO, WHERE, WHAT)
$$ ##TITLE= Audit trail, XWIN-NMR		Version 3.5
$$ ##JCAMPDX= 5.01
$$ ##ORIGIN= Bruker BioSpin GmbH
$$ ##OWNER= servis
$$ F:\spectra/data/av/nmr/H1/1/pdata/1/auditp.txt
$$ ##AUDIT TRAIL=  $$ (NUMBER, WHEN, WHO, WHERE, WHAT)
(   1,<2026-08-01 15:16:55.54 +0400>,<servis>,<DPX200>,
      <created by zg, POWCHK disabled, PULCHK disabled
       configuration hash MD5:
       00 E9 B6 7A A2 85 ED C7 34 08 36 98 17 FE 4E 26
       data hash MD5: 32K
       74 28 27 7B E4 6D CB 5D 42 5F DB 06 BD D4 48 19>)
(   2,<2026-08-01 15:26:15.65 +0400>,<servis>,<DPX200>,
      <Start of raw data processing
       efp BC_mod = 2 LB = 0.05 FT_mod = 6 PKNL = 1 PHC0 = -416.9518 PHC1 = 3.101563 SI = 16K 
       data hash MD5: 16K
       76 7B 32 0F 3E 3E 90 5F 13 45 CF 04 C9 D9 45 10>)
(   3,<2026-08-01 15:26:27.28 +0400>,<servis>,<DPX200>,
      <pk PHC0 = 3 PHC1 = 0 
       data hash MD5: 16K
       BE 64 5A 62 92 22 E0 52 1C E0 A3 F0 76 AD 7E F7>)
$$ ##END=
$$ 
$$ hash MD5
$$ BF EF 9C 26 9C A6 E9 A0 40 04 61 99 F9 1F F1 DA
##$RELAX= 
##$RELAX= 
##$RELAX= 
##$RELAX= 
##$RELAX= 
##$RELAX= 
##$RELAX= 
##$RELAX= 
$$ Bruker specific parameters
$$ --------------------------
##$DU= <F:\spectra>
##$EXPNO= 1
##$NAME= <H1>
##$PROCNO= 1
##$TYPE= <nmr>
##$USER= <av>
##$AMP= (0..31)
100 100 100 100 100 100 100 100 100 100 100 100 100 100 100 100 100 100 
100 100 100 100 100 100 100 100 100 100 100 100 100 100 
##$AQSEQ= 0
##$AQ_mod= 1
##$AUNM= <au_zg>
##$AUTOPOS= <>
##$BF1= 200.13
##$BF2= 200.13
##$BF3= 200.13
##$BF4= 200.13
##$BF5= 500.13
##$BF6= 500.13
##$BF7= 500.13
##$BF8= 500.13
##$BYTORDA= 1
##$CFDGTYP= 0
##$CFRGTYP= 5
##$CHEMSTR= <none>
##$CNST= (0..31)
1 1 145 1 1 1 1 1 1 1 1 1 1 1 1 1 1 1 1 1 1 1 1 1 1 1 1 1 1 1 1 1 
##$CPDPRG= <>
##$CPDPRG1= <>
##$CPDPRG2= <>
##$CPDPRG3= <>
##$CPDPRG4= <mlev>
##$CPDPRG5= <mlev>
##$CPDPRG6= <mlev>
##$CPDPRG7= <mlev>
##$CPDPRG8= <mlev>
##$CPDPRGB= <>
##$CPDPRGT= <>
##$D= (0..31)
0 2 0 0 0 0 0 0 0 0.06 0 0 0 0 0 0 0.0002 0 0 0 0 0 0 0 0 0 0 0 0 0 0 
0 
##$DATE= 1785583015
##$DBL= (0..7)
120 120 120 120 120 120 120 120 
##$DBP= (0..7)
150 150 150 150 150 150 150 150 
##$DBP07= 0
##$DBPNAM0= <>
##$DBPNAM1= <>
##$DBPNAM2= <>
##$DBPNAM3= <>
##$DBPNAM4= <>
##$DBPNAM5= <>
##$DBPNAM6= <>
##$DBPNAM7= <>
##$DBPOAL= (0..7)
0.5 0.5 0.5 0.5 0.5 0.5 0.5 0.5 
##$DBPOFFS= (0..7)
0 0 0 0 0 0 0 0 
##$DE= 6
##$DECBNUC= <off>
##$DECIM= 32
$$ [...]
##$SUBNAM4= <"">
##$SUBNAM5= <"">
##$SUBNAM6= <"">
##$SUBNAM7= <"">
##$SUBNAM8= <"">
##$SUBNAM9= <"">
##$SW= 20.6817932712277
##$SWIBOX= (0..15)
0 0 3 0 0 0 0 0 0 0 0 0 0 0 0 0 
##$SW_h= 4139.07284768212
##$TD= 32768
##$TD0= 1
##$TE= 0
##$TE2= 300
##$TE3= 300
##$TEG= 300
##$TL= (0..7)
0 120 120 120 120 120 120 120 
##$TP= (0..7)
150 150 150 150 150 150 150 150 
##$TP07= 0
##$TPNAME0= <>
##$TPNAME1= <>
##$TPNAME2= <>
##$TPNAME3= <>
##$TPNAME4= <>
##$TPNAME5= <>
##$TPNAME6= <>
##$TPNAME7= <>
##$TPOAL= (0..7)
0.5 0.5 0.5 0.5 0.5 0.5 0.5 0.5 
##$TPOFFS= (0..7)
0 0 0 0 0 0 0 0 
##$TUNHIN= 0
##$TUNHOUT= 0
##$TUNXOUT= 0
##$USERA1= <user>
##$USERA2= <user>
##$USERA3= <user>
##$USERA4= <user>
##$USERA5= <user>
##$V9= 5
##$VALIST= <valist>
##$VCLIST= <CCCCCCCCCCCCCCC>
##$VD= 0
##$VDLIST= <DDDDDDDDDDDDDDD>
##$VPLIST= <PPPPPPPPPPPPPPP>
##$VTLIST= <TTTTTTTTTTTTTTT>
##$WBST= 1024
##$WBSW= 30
##$XGAIN= (0..3)
0 0 0 0 
##$XL= 0
##$YL= 0
##$YMAX_a= 640750
##$YMIN_a= -1264291
##$ZGOPTNS= <>
##$ZL1= 120
##$ZL2= 120
##$ZL3= 120
##$ZL4= 120
##$ABSF1= 0
##$ABSF2= 0
##$ABSG= 0
##$ABSL= 0
##$ALPHA= 0
##$AQORDER= 0
##$ASSFAC= 0
##$ASSFACI= 0
##$ASSFACX= 0
##$ASSWID= 0
##$AUNMP= <proc_1d>
##$AZFE= 0.1
##$AZFW= 0.1
##$BCFW= 0
##$BC_mod= 2
##$BYTORDP= 0
##$COROFFS= 0
##$CY= 18.4799938201904
##$DATMOD= 1
##$DC= 0
##$DFILT= <>
##$DTYPP= 0
##$F1P= 9.9274215381318
##$F2P= -0.165520771350173
##$FCOR= 1
##$FTSIZE= 16384
##$FT_mod= 6
##$GAMMA= 0
##$GB= 0
##$INTBC= 1
##$INTSCL= 4.127829e-11
##$ISEN= 128
##$LB= 0.05
##$LEV0= 0
##$LPBIN= 0
##$MAXI= 10000
##$MC2= 0
##$MEAN= 0
##$ME_mod= 0
##$MI= 50
##$NCOEF= 0
##$NC_proc= -5
##$NLEV= 6
##$NOISF1= 3.799351
##$NOISF2= 2.8
##$NSP= 0
##$NTH_PI= 0
##$NZP= 0
##$OFFSET= 16.48848
##$PC= 4
##$PHC0= -413.9518
##$PHC1= 3.101563
##$PH_mod= 1
##$PKNL= yes
##$PPARMOD= 0
##$PSCAL= 4
##$PSIGN= 0
##$REVERSE= no
##$SF= 200.130005582386
##$SI= 16384
##$SIGF1= 3
##$SIGF2= 2
##$SINO= 400
##$SIOLD= 16384
##$SREGLST= <1H.CDCl3>
##$SSB= 0
##$STSI= 16384
##$STSR= 0
##$SW_p= 4139.07284768211
##$SYMM= 0
##$S_DEV= 0
##$TDeff= 32768
##$TDoff= 0
##$TI= <>
##$TILT= no
##$TM1= 0
##$TM2= 0
##$TOPLEV= 0
##$USERP1= <user>
##$USERP2= <user>
##$USERP3= <user>
##$USERP4= <user>
##$USERP5= <user>
##$WDW= 1
##$XDIM= 16384
##$YMAX_p= 340783373
##$YMIN_p= -824528
$$ End of Bruker specific parameters
$$ ---------------------------------
##NTUPLES= NMR SPECTRUM
##VAR_NAME=  FREQUENCY,     SPECTRUM/REAL,   SPECTRUM/IMAG
##SYMBOL=    X,             R,               I
##VAR_TYPE=  INDEPENDENT,   DEPENDENT,       DEPENDENT
##VAR_FORM=  AFFN,          ASDF,            ASDF
##VAR_DIM=   16384,         16384,           16384
##UNITS=     HZ,            ARBITRARY UNITS, ARBITRARY UNITS
##FACTOR=    0.252644378177508, 1,           1
##FIRST=     3299.83951724647, 0,            0
##LAST=      -839.233330435636, 0,           0
##MIN=       -839.233330435636, -824528,     0
##MAX=       3299.83951724647, 340783373,    0
$$ Real data points
##PAGE= N=1
##DATA TABLE= (X++(R..R)), XYDATA
$$ [...]
9096C787200P16388N45707M87234L50072L06134M39200Q98354K883710N078571
$$ 3787200 4503588 5049295 5536529 5886601 6192735 6631935 7530289 10413999 15492570
9087A5492570M591869K592017J33664j218086l159662k613669k936594k749660
$$ 15492570 20084439 22676456 22810120 21592034 18432372 15818703 12882109 10132449
9079A0132449k118381j793716j539876r11515n44325k13919m53284k49311k65815
$$ 10132449 8014068 6220352 4680476 3768961 3224636 3010717 2557433 2308122 2042307
9070B042307j44282J8793k53534R645k26886J5652q0538r1008N1701r1232k7104
$$ 2042307 1898025 1916818 1663284 1672929 1446043 1461695 1381157 1290149 1341850 1250618 1223514
9059A223514J7294j23286J5825n0777n9343j91532N2771j76437J93135p3068j05804
$$ 1223514 1240808 1117522 1133347 1082570 1023227 831695 884466 708029 901164 828096 722292
9048G22292n9716M7061J10017k03284Q4928o2762P8462j72867n315J5714O8472
$$ 722292 662576 709637 819654 616370 701298 638536 716998 544131 538816 554530 623002
9037F23002j6483o8113j1165m5603J5179n7194L1746j00375J4465K3747j05802
$$ 623002 606519 538406 527241 481638 496817 439623 471369 370994 385459 409206 303404
9026C03404o2818P2543N750K4383n7375p85r3856R578L3939q9282l620R4452j50290
$$ 303404 240586 313129 318879 343262 285887 285102 191246 200824 234763 145481 141861 236313 86023
9013H6023J00752K2048N4866p9385Q8270r4315K0928q5136J0355J1710j8441R4710
$$ 86023 186775 208823 263689 184304 272574 178259 199187 114051 124406 136116 117675 212385
9001B12385j28021j16867P1938j04204O3439Q5741p3642N403j7691P048m6654
$$ 212385 84364 -32503 39435 -64769 -1330 84411 10769 16172 -1519 5529 -41125
8990d1125J32466j08179n5821L2406J02513n9507l990J6793R2386j54230k7632
$$ -41125 91341 -16838 -72659 -40253 62260 2753 -1237 15556 107942 -46288 -73920
8979g3920k391J67554o2529k37130J16932L1947k7367M457O260q8944Q6958Q3245
$$ -73920 -76311 91243 28714 -208416 -91484 -59537 -86904 -82447 -76187 -165131 -78173 5072
8967E072j28280J14021n9994K530J01368j06211M2900J213R866K4140p930q1046
$$ 5072 -123208 -9187 -69181 -66651 34717 -71494 -28594 -27381 -17515 6625 -1305 -82351
8955h2351Q3368k6813K4566N9785r5329m5202K9232R4290r0595P5419j44197L7822
$$ -82351 1017 -25796 -1230 58555 -36774 -81976 -52744 41546 -49049 26370 -117827 -80005
8943h0005J24299q4483L1717O353R221p8420J1028J29983q9561n6970Q9121k7951
$$ -80005 44294 -40189 -8472 -2119 7102 -71318 -60290 69693 -19868 -76838 12283 -15668
8931a5668P1931r5667k6846r309N9936n7097N8586p8621Q3470N836n8995n5643
$$ -15668 56263 -39404 -66250 -75559 -15623 -72720 -14134 -92755 -9285 -3449 -62444 -118087
8919a18087J51503j00152K1694q5258L4188J15232M9267j22366K3890J48360j03773
$$ -118087 33416 -66736 -45042 -130300 -96112 19120 68387 -53979 -30089 118271 14498
8908A4498m8693O3117m0062k0362N7695l0147j1832J7844n4553P6546K8813k9830
$$ 14498 -34195 28922 -11140 -31502 26193 -3954 -15786 2058 -52495 24051 52864 23034
8896B3034n8779R5407l3775L7426j18177M7609J18759K6798n7137K0848q3874
$$ 23034 -35745 59662 25887 63313 -54864 -7255 111504 138302 81165 102013 18139
8885A8139Q0701o1834M3491j6448P8517j3881o3446Q8292q6490l2246p371J48142
$$ 18139 98840 37006 80497 64049 142566 128685 65239 153531 67041 34795 27424 175566
8873A75566l3843j1021R3958l0124k22707J76112Q7404j6885j08039J51593k4743
$$ 175566 141723 130702 224660 194536 -28171 147941 235345 218460 110421 262014 237271
8862B37271R269Q1021k2644o4908k8654Q9475J6570k9787R4808M7629k7728J06569
$$ 237271 246540 327561 304917 240009 211355 300830 317400 287613 382421 430050 402322 508891
8850E08891q3561J8631l8426R7474n2651J2611R9850L813j03325K386J09194m4563
$$ 508891 425330 443961 405535 503009 450358 462969 562819 566632 463307 465693 574887 530324
8838E30324P2921O2294l9251N404J89705l0603K0452j3019p0704R3215q119J06706
$$ 530324 603245 665539 626288 631692 821397 790794 811246 798227 727523 820738 812619 919325
8826I19325M0748j6865K6340R1963N9667K3218j8347o488J46680K3382Q705P8701
$$ 919325 960073 943208 969548 1061511 1121178 1144396 1126049 1119561 1266241 1289623 1298328 1377029
8814A377029J18284Q830J62664J13456k1424J46314J91517O3135N9296K75241
$$ 1377029 1495313 1504143 1666807 1780263 1758839 1905153 2096670 2159805 2219101 2494342
8804B494342N6568L57478J04641K04428J86237L26638L11167K65602M94244L45627
$$ 2494342 2550910 2908388 3013029 3217457 3403694 3730332 4041499 4307101 4801345 5146972
8794E146972M95889M40316O09817M42420N07129M97111L70286M68004K32742M179
$$ 5146972 5642861 6083177 6692994 7135414 7642543 8139654 8509940 8977944 9210686 9214865
8784I214865J1055O7262o5861q439M6142k6212J0432j2904K68325J24482L60365
$$ 9214865 9225920 9293182 9227321 9218882 9265024 9238812 9249244 9236340 9504665 9629147 9989512
8773I989512M28749M82466P07246P19204Q22639Q24450Q86234P75928N76711N50745
$$ 9989512 10418261 10900727 11607973 12327177 13149816 13974266 14860500 15636428 16213139 16763884
8763A6763884P7441r6127j53565m95388p85680p16658p91274q64135p32011o03750
$$ 16763884 16841325 16745198 16591633 16096245 15310565 14593907 13802633 12938498 12206487 11602737
8753A1602737o21998n43094k71397k76685k94119j25898J1245l3877J58889J1605
$$ 11602737 10980739 10437645 10166248 9889563 9595444 9469546 9480791 9446914 9605803 9617408
8743I617408J59014m813Q0982q8231j25898k56822l01508m34046n15120m62295
$$ 9617408 9776422 9771609 9852591 9764360 9638462 9381640 9080132 8646086 8130966 7668671
8733G668671n76743m66911n34671m78653m16222l59888m67684j46830l86618k68012
$$ 7668671 7091928 6625017 6090346 5611693 5195471 4835583 4367899 4221069 3834451 3566439
8723C566439k72132j42930k34008j96165o4965k35330j29401n7217m7887j43091
$$ 3566439 3294307 3151377 2917369 2721204 2656239 2420909 2291508 2234291 2186404 2043313
8713B043313j22495j33289J4401j53245J1922q6258j41076Q385o3397j64535Q4893
$$ 2043313 1920818 1787529 1801930 1648685 1660607 1574349 1433273 1441658 1378261 1213726 1298619
8702A298619q0134j27125n5263P5165k736l3718j8675r9791p3271m0445J77480
$$ 1298619 1218485 1091360 1036097 1111262 1108526 1074808 1056133 956342 883071 842626 1020106
8691A020106j60203m2441M565k5577m5290m0503n3941Q9094n0770j29412N482
$$ 1020106 859903 817462 822027 796450 751160 710657 656716 745810 695040 565628 571110
8680E71110o8391J88111j08831n4416P1880r094q9570J6327K5083K055O2862O139
$$ 571110 502719 690830 581999 527583 599463 590369 500799 517126 542209 544264 607126 613265
8668F13265r1832N9817p023j9352j51978Q595k9836M2762J9261k9734q6721J01065
$$ 613265 521433 581250 574227 554875 402897 411492 381656 424418 443679 413945 327224 428289
8656D28289q1794o8709Q2583p9996P6517k068Q8817j42925L4701K7906K363j24695
$$ 428289 346495 277786 360369 280373 356890 354822 443639 300714 335415 363321 365684 240989
8644B40989R0269L1211p6719P6601L9231j40501R9214m9555K4147q0722J31472
$$ 240989 331258 362469 285750 362351 401582 261081 360295 310740 334887 254165 385637
8633C85637j54505L2898R1086p3483K5886O2974l0345j54465J59654l9443K9140
$$ 385637 231132 264030 355116 281633 307519 370493 340148 185683 345337 305894 335034
8622C35034j00176J642N3507O4740j38204m0190K7551M8520m6122K1022Q011j46536
$$ 335034 234858 236500 290007 354747 216543 176353 203904 252424 206302 227324 235335 88799
8610H8799J86312q2049J07198q7000Q133P9468R3772k31284N2297k6866o2985
$$ 88799 275111 193062 300260 213260 221393 300861 394633 163349 215646 188780 125795
8599A25795p006M4648R0571r3664j3252O7139l1827O6584k5932p4787K2832p2765
$$ 125795 118789 163437 254008 160344 147092 214231 182404 248988 223056 148269 171101 98336
8587I8336q802K5705L7379L8156K633o7464P5245q7457k6520J14684K8702j11718
$$ 98336 89534 115239 152618 190774 193407 125943 201188 113731 87211 201895 230597 118879
8575A18879o1403j5661Q8108p0038o20p4982R7362O2638K8723p8417r7051J66757
$$ 118879 57476 41815 129923 59885 59265 -15717 81645 144283 173006 94589 -2462 164295
8563A64295o9706m9480j5930J2933J14936l4703n8904J2115r816m7833M5436o6091
$$ 164295 94589 45109 29179 42112 157048 122345 63441 75556 65740 17907 63343 -2748
8551b748k6504L8573O9283r6409J7459q0134P4228K4253N2012j69094P1993j2709
$$ -2748 -29252 9321 78604 -17805 -346 -80480 -6252 18001 70013 -99081 -27088 -39797
8539c9797J44860r3187j6481R954j7889J4520j5198o1720J62127J72539k46755
$$ -39797 105063 11876 -4605 5349 -12540 1980 -13218 -74938 87189 259728 12973
8528A2973K9963k2891k6848j50534J09360j6556o5188M9911k109m8470m0101L9825
$$ 12973 42936 20045 -6803 -157337 -47977 -64533 -129721 -79810 -81919 -130389 -170490 -130665
8516a30665n7701k5698K2241N0432j2754j1945O8960j16385J15659K3077n4992
$$ -130665 -188366 -214064 -191823 -141391 -154145 -166090 -97130 -213515 -97856 -74779 -129771
8505a29771n6539L5426M4169j58753J58702M9269p7843l8623n392P240m5897J65856
$$ -129771 -186310 -150884 -106715 -265468 -106766 -57497 -135340 -173963 -179355 -172115 -218012 -52156
8493e2156j50736P406N0205o2316l3052N4984L9922j10295M9793K1915n4620M0162
$$ -52156 -202892 -195486 -145281 -207597 -240649 -185665 -145743 -256038 -206245 -184330 -238950 -198788
8481a98788k0684l3509K7534L425L3700K2498k4836k4350K4909L3029N393j68669
$$ -198788 -219472 -252981 -225447 -222022 -188322 -165824 -190660 -215010 -190101 -157072 -151679 -320348
8469c20348J32685L6429m0950j7875j01263P9398j4997N3522J5413r0920J24693
$$ -320348 -187663 -151234 -192184 -210059 -311322 -231924 -246921 -193399 -177986 -268906 -144213
8458a44213k3837l485l181O432m399M0540M1901m3060j45083K1285O2258j16819
$$ -144213 -168050 -171535 -174716 -168284 -172683 -132143 -90242 -133302 -278385 -257100 -194842 -311661
8446c11661J21959o622P1267j28127N9203Q2090K9552q1620P586p1040j550P7476
$$ -311661 -189702 -196324 -125057 -253184 -193981 -111891 -82339 -163959 -156373 -227413 -228963 -151487
8434a51487o5735P9596k4363m6841M1237N810R1221o8316K2901k5421k6164k9251
$$ -151487 -217222 -137626 -161989 -208830 -167593 -161783 -70562 -138878 -115977 -141398 -167562 -196813
8422a96813Q1850j6279j33164R4441J755k2081p1088O4791k692Q0072p0969J3738
$$ -196813 -114963 -131242 -264406 -169965 -168210 -190291 -261379 -196588 -199280 -119208 -190177 -176439
8410a76439o1878M1178M863o1942J19482j45735J18216M6053J1209q6350O9753
$$ -176439 -238317 -197139 -192276 -254218 -134736 -280471 -162255 -116202 -104993 -191343 -121590
8399a21590K0225m0442m5991L3574n1006P8228m4185K8933J6547n510O7410r7951
$$ -121590 -101365 -141807 -187798 -154224 -205230 -127002 -171187 -142254 -125707 -131217 -63807 -161758
8387a61758J19279p66j09189M4464k3156N4861o7287J14313l9344J05871l3279
$$ -161758 -42479 -43245 -152434 -107970 -131126 -76265 -143552 -29239 -68583 37288 4009
8376D009J07840j40398K2793j23765N9116j150J3764j686M5122r2007P5499n3166
$$ 4009 111849 -28549 -5756 -129521 -70405 -71555 -57791 -59477 -14355 -106362 -30863 -84029
8364h4029P6534O6131k8786k8012L3696P2737o4985J20913j06842P1664m7327
$$ -84029 -7495 58636 29850 1838 35534 108271 43286 164199 57357 129021 81694
8353H1694J27330o7747n2290r723J73552k5161p6560R9945l7769L5060R2285j5827
$$ 81694 209024 141277 88987 79264 252816 227655 151095 251040 213271 248331 340616 324789
8341C24789N9297J0429P4938O5129J03931o0092K55345L0960M2103L7171J07521
$$ 324789 384086 394515 469453 534582 638513 578421 833766 864726 906829 944000 1051521
8330A051521J76841l8898Q7245M7035O6080J19687L3898J21436j47322J0269P6826
$$ 1051521 1228362 1189464 1276709 1323744 1389824 1509511 1543409 1664845 1517523 1527792 1604618
8319A604618M0899l9424k738K1703M6787P0535M2830L5591O3145R7427O6163J28926
$$ 1604618 1645517 1606093 1603355 1625058 1671845 1742380 1785210 1820801 1883946 1981373 2047536 2176462
8307B176462K35290N0413J29727P2384r420M7549M8240M9858m984q9610r1168
$$ 2176462 2411752 2462165 2591892 2664276 2654856 2702405 2750645 2800503 2795519 2705909 2614741
8296B614741j30217j44196q3049l2712p0806q8958q9659J3287p3494r9430l3961
$$ 2614741 2484524 2340328 2257279 2224567 2153761 2064803 1975144 1988431 1914937 1815507 1781546
8285A781546p1916R0620r7798Q8474r4946J01204j19221j9377m1504P3872r1033
$$ 1781546 1709630 1800250 1702452 1790926 1695980 1797184 1677963 1658586 1617082 1690954 1599921
8274A599921j14651n2890j01849k62834N0471K2808j50723p3692o2283r7947l5871
$$ 1599921 1485270 1432380 1330531 1067697 1118168 1140976 990253 916561 854278 756331 720460
8263G20460p5441q8168J02684r2667k8893l3734j97208J43156o4353n2482N5594
$$ 720460 645019 556851 659535 566868 537975 504241 307033 450189 385836 333354 388948
8252C88948r6297N4647n9685n7956n8818J15560P0349k63085p2654J12416j1975
$$ 388948 292651 347298 287613 229657 170839 286399 356748 93663 21009 133425 121450
8241A21450L9348N046k3658O0087n4587p4986j22377J02747o453o183n7105l8794
$$ 121450 160798 165844 142186 202273 147686 72700 -49677 53070 46617 40434 -16671 -55465
8229e5465M2093J01709o4246K2275l0683L6309j13547L9879q7190N5114P1762
$$ -55465 -13372 88337 24091 46366 15683 51992 -61555 -21676 -108866 -53752 18010
8218A8010r5510O7935j06589J89638r4579J4919m3571O7183m2657L0023n8697
$$ 18010 -77500 -9565 -116154 73484 -21095 -6176 -49747 17436 -25221 4802 -53895
8207e3895o8903O8422O6737N7650j32616j52653P9298P6657j39214J91766P6579
$$ -53895 -122798 -54376 12361 70011 -62605 -215258 -135960 -59303 -198517 -6751 69828
8196F9828j65128o5121r9415K33256J230077j079043k04109Q6475k16852K93385
$$ 69828 -95300 -160421 -259836 -26580 1203497 124454 -79655 6820 -210032 83353
8186H3353j92984j3747j590Q7865j7581l2496k4390L428J6830j02648k4587O0527
$$ 83353 -109631 -123378 -124968 -37103 -54684 -87180 -111570 -108142 -91312 -193960 -218547 -158020
8174a58020Q8429q994m7608P493M8392K5453m2419p8430N0738k9233L3972j81901
$$ -158020 -69591 -78585 -126193 -118700 -70308 -44855 -87274 -165704 -114966 -144199 -110227 -292128
8162b92128K69003j01090q0948N6074p5911Q7135q5183k072N9051J9488r1118
$$ -292128 -23125 -124215 -205163 -149089 -225000 -137865 -223048 -225120 -166069 -146581 -237699
8151b37699M5470J8060l5434J14326K7741j62886J08453o4767n4572P1582l4430
$$ -237699 -192229 -174169 -209603 -95277 -67536 -230422 -121969 -186736 -241308 -169726 -204156
8140b04156J20666j76323M6059R2189j26892N845L6578R8266j05177n9396P6942
$$ -204156 -83490 -259813 -213754 -121565 -248457 -242612 -206034 -107768 -212945 -272341 -195399
8129a95399l3034j3057m9017k6349N9594J13205j63155J1547k2020R8202q9983
$$ -195399 -228433 -241490 -290507 -316856 -257262 -144057 -307212 -295665 -317685 -219483 -309466
8118c09466K2094N649k5244O0737l1483p2657R5983k5395N845R6285j63661L8587
$$ -309466 -287372 -281723 -306967 -246230 -277713 -350370 -254387 -279782 -273937 -177652 -341313 -302726
8106c02726k8485N6519P0514j70440L8911J27980q7835r9420J17088m037n5618
$$ -302726 -331211 -274692 -204178 -374618 -335707 -207727 -295562 -394982 -277894 -281931 -337549
8095c37549J04974r0259O7205M586M365R860j4661k0511m1444Q86j54870R9674
$$ -337549 -232575 -322834 -255629 -251043 -246678 -236818 -251479 -271990 -313434 -312548 -467418 -367744
8083c67744J86836O3519k56852P3159O342J1941n7342J7857N6125p5677Q6241
$$ -367744 -180908 -117389 -374241 -301082 -294740 -282799 -340141 -322284 -266159 -341836 -255595
8072b55595P735p0775R7544K0741J4388j03730K2484k3515J6632o7942q717o0121
$$ -255595 -247860 -318635 -221091 -200350 -185962 -289692 -267208 -290723 -274091 -342033 -350750 -410871
8060d10871J38645l2439j14777N4910K7958J03574j2902l4078m9357k2259K7298
$$ -410871 -272226 -304665 -419442 -364532 -336574 -233000 -245902 -279980 -329337 -351596 -324298
8049c24298J15516j51119R1735J1181P1108J0718L123j16809J13314n2773p0848
$$ -324298 -208782 -359901 -268166 -256985 -185877 -175159 -172036 -288845 -175531 -228304 -299152
8038b99152Q3344r8268R5718j51875J05650l8329Q7916j23786o3314J18693P1476
$$ -299152 -215808 -314076 -218358 -370233 -264583 -302912 -214996 -338782 -402096 -283403 -211927
8027b11927r4360j5319L2050J3406J1067j02818K6604K1406J2638L5747k1087
$$ -211927 -306287 -321606 -289556 -276150 -265083 -367901 -341297 -319891 -307253 -271506 -292593
8016b92593p821n6376M1344J4664P0614k1405o5155j1804q0819P5797o4545J43982
$$ -292593 -300414 -356790 -315446 -300782 -230168 -251573 -316728 -328532 -409351 -333554 -398099 -254117
8004b54117o366k9522m6826k3269N1148M3869k6595M6104j03419K6113n3902l6317
$$ -254117 -260483 -290005 -336831 -360100 -308952 -265083 -291678 -245574 -348993 -322880 -376782 -413099
7992d13099l5618J34252j3279l9729m1698N0526k9024J55123q9881m6724J04446
$$ -413099 -448717 -314465 -327744 -367473 -409171 -358645 -387669 -232546 -322427 -369151 -264705
7981b64705p9556R0900k3417l9017P3566l6741o2436J3296Q336J4960M2925r4660
$$ -264705 -344261 -253361 -276778 -315795 -242229 -278970 -341406 -328110 -319774 -304814 -261889 -356549
7969c56549N9923K2195p1385J1150N9680M0315r8486L3440Q8850j23601l3j5225
$$ -356549 -296626 -274431 -345816 -334666 -274986 -234671 -333157 -299717 -210867 -334468 -334501 -349726
7957c49726p969K4304Q9992j1438J749m5068j2065Q619P3515p1955K1525K9454
$$ -349726 -357695 -333391 -243399 -254837 -253088 -298156 -310221 -301602 -228087 -300042 -278517 -249063
7945b49063k4467o3887L2433K1937M7904j2640o9154o5966N8864N9041k6256K4066
$$ -249063 -273530 -337417 -304984 -283047 -235143 -247783 -316937 -382903 -324039 -264998 -291254 -267188
7933b67188k937J447J25135j93787N0580P4888o9825J874j8364k6788l1363J6917
$$ -267188 -270125 -268678 -143543 -337330 -286750 -211862 -281687 -279813 -298177 -324965 -356328 -339411
7921c39411O6223k8382K88N8891m7897O7772j70184J33518j8068l326q1138Q2421
$$ -339411 -273188 -301570 -301282 -242391 -290288 -222516 -392700 -259182 -277250 -280576 -361714 -279293
7909b79293q055p2382J35532j60687J10844p2725J18625o2749r4313J43645n0090
$$ -279293 -287348 -359730 -224198 -384885 -274041 -346766 -228141 -290890 -385203 -241558 -291648
7898b91648J1150P2791j4363p5304L3468j53025J31532j3072L2588N0488j2491
$$ -291648 -280498 -207707 -222070 -297374 -263906 -416931 -285399 -298471 -265883 -215395 -227886
7887b27886n2638m1484P9390O5938p4281j05591J19518r1719p234K4790N6597
$$ -227886 -280524 -322008 -242618 -176680 -250961 -356552 -237034 -328753 -335987 -311197 -254600
7876b54600Q4896l8972j510l1299J9002l8889n072J611R2068j41970M3014q548
$$ -254600 -169704 -208676 -210186 -241485 -222483 -261372 -266444 -264833 -172765 -314735 -271721 -280269
7864b80269p0957J49778p6548J99838k83666K6017J33953p4519o1356Q6464m35142
$$ -280269 -351226 -201448 -277996 -78158 -361824 -335807 -201854 -276373 -337729 -251265 -686407
7853f86407N32658o2698k9771N8620j26402P0013J9835k6196J09720q4630k205
$$ -686407 -153749 -216447 -246218 -187598 -314000 -243987 -224152 -250348 -140628 -225258 -227463
7842b27463J18514j56087Q6697p1425N6047j6473q660k1250O3691l9721N017M5852
$$ -227463 -108949 -265036 -178339 -249764 -193717 -210190 -218850 -240100 -176409 -216130 -211113 -165261
7830a65261j0663m9834o0148O9896L3154N6275j14432n7253J09736q9258K8341
$$ -165261 -175924 -225758 -285906 -216010 -182856 -126581 -241013 -298266 -188530 -277788 -249447
7819b49447j4698k4744j11096J41591L0548p8213L3151j284k7826R2626r099l3008
$$ -249447 -264145 -288889 -399985 -258394 -227846 -306059 -272908 -274192 -302018 -209392 -218491 -251499
7807b51499O038j5730N8600j46894P1867M6827m2929M1050Q8946q5305m806k0560
$$ -251499 -245461 -261191 -202591 -349485 -277618 -230791 -273720 -232670 -143724 -229029 -233835 -254395
7795b54395j33233J16181m3467K8107r5433P2030N3950k984M9109l6598m4623
$$ -254395 -387628 -271447 -314914 -286807 -382240 -310210 -256260 -259244 -210135 -246733 -291356
7784b91356k7530J04311j34691P2505q3810P7397j5690k0644l0979J01017m8189
$$ -291356 -318886 -214575 -349266 -276761 -360571 -283174 -298864 -319508 -350487 -249470 -297659
7773b97659l5931O0821j05136R5825k1194o4971J15026O7836j70594J64173j17209
$$ -297659 -333590 -272769 -377905 -282080 -303274 -368245 -253219 -185383 -355977 -191804 -309013
7762c09013l7958Q4332Q3932j5871m3777m2398L024N5611j8516J8116p9711n565
$$ -309013 -346971 -262639 -178707 -194578 -238355 -280753 -277729 -222118 -240634 -222518 -302229 -307794
7750c07794j2295K5007R1955j8857J43696j76366k0972N9014J7411l4676o6471
$$ -307794 -320089 -295082 -203127 -221984 -78288 -254654 -275626 -216612 -199201 -233877 -300348
7739c00348O6679M066m6980J2417l3428l6939J79322q4265J9620o1712p7935J01917
$$ -300348 -233669 -229603 -276583 -264166 -297594 -334533 -155211 -239476 -219856 -281568 -359503 -257586
7727b57586K2177k4746J13545k7775k9798j2993R374l6371k1312J66722j77160
$$ -257586 -235409 -260155 -146610 -174385 -204183 -217176 -207802 -244173 -265485 -98763 -275923
7716b75923m113O0128l5764J4453J44600j54356o833N7043Q821p2099N4398q9143
$$ -275923 -280036 -219908 -255672 -241219 -96619 -250975 -257808 -200765 -191944 -264043 -209645 -298788
7704b98788K5292O1133j6762O0639o0965n010j9123l4355O7208q9261r726N8051
$$ -298788 -273496 -212363 -229125 -168486 -229451 -234461 -253584 -287939 -220731 -309992 -319718 -261667
7692b61667L8654m9822M7428M8521j7157j4966n0445P1858l6042n8205M4621M3476
$$ -261667 -223013 -272835 -225407 -176886 -194043 -209009 -259454 -187596 -223638 -281843 -237222 -193746
7680a93746N5677n8644m1725J34874M542k6105n4906m9603R5345Q657l7437K0479
$$ -193746 -138069 -196713 -238438 -103564 -99022 -125127 -180033 -229636 -134291 -125634 -163071 -142592
7668a42592r6252R8917j34232L6487M8337L857j20897O8430L5206p5084L9819
$$ -142592 -238844 -139927 -274159 -237672 -189335 -185478 -306375 -237945 -202739 -277823 -238004
7657b38004l9354n9111J11749j3713J3118p1343K2999O2973m1664J5523J9530
$$ -238004 -277358 -336469 -224720 -238433 -225315 -296658 -273659 -210686 -252350 -236827 -217297
7646b17297J8636M3068n9611n2902P3653K2523k8072M5610p3577M7671n353J6271
$$ -217297 -198661 -155593 -215204 -268106 -194453 -171930 -200002 -154392 -227969 -180298 -185651 -169380
7634a69380o3014m8158K4294k6684O5431M9950o5720M0881L6950l5134m7975R6062
$$ -169380 -232394 -280552 -256258 -282942 -217511 -167561 -233281 -192400 -155450 -190584 -238559 -142497
7622a42497q2960J7566j13608J65402k231R0132j11871l9767M5300m6388J03362
$$ -142497 -225457 -207891 -321499 -156097 -158328 -68196 -180067 -219834 -174534 -220922 -117560
7611a17560j24024M9534m6116N4733n6156J8009j3954O3606N2945p6603M3520
$$ -117560 -241584 -192050 -238166 -183433 -239589 -221580 -235534 -171928 -118983 -195586 -152066
7600a52066k495n7447N1436j11121K2594R0092m9387N1548o3160o200J5128q1954
$$ -152066 -154561 -212008 -160572 -271693 -249099 -159007 -208394 -156846 -220006 -226206 -211078 -293032
7588b93032L8954L6077q8475R4950L095n3882N2388R0245q3858L0281l2520N8191
$$ -293032 -254078 -218001 -306476 -211526 -208431 -262313 -209925 -119680 -203538 -173257 -205777 -147586
7576a47586L0819O345j05189L0649k5348J78502Q8964j35115j4730j0754j575
$$ -147586 -116767 -110422 -215611 -184962 -210310 -31808 57156 -77959 -92689 -103443 -105018
7565a05018j70754J61563O7474m2311l5039L9271p2808O417P007P6603q7808K01318
$$ -105018 -275772 -114209 -46735 -89046 -124085 -84814 -157622 -151205 -144198 -67595 -155403 45915
7553D5915j93587m7390J14745n101p5951J52118j31609O3942J0315p8470O0365
$$ 45915 -147672 -195062 -80317 -85418 -161369 -9251 -140860 -76918 -66603 -145073 -84708
7542h4708L1589J19223o2366j6092q9829L5750J5710L6878m8107m7904K8525M9362
$$ -84708 -53119 66104 3738 -12354 -102183 -66433 -50723 -13845 -61952 -109856 -81331 -31969
7530c1969o7794J8983n2873O6866n0904M8912q8635L017O0878K2411q8032J29436
$$ -31969 -99763 -80780 -133653 -66787 -117691 -68779 -157414 -154397 -93519 -71108 -159140 -29704
7518b9704j0810j46987O9807J08832j28383j23964P6301J04982p9920p4227J46012
$$ -29704 -40514 -187501 -117694 -8862 -137245 -261209 -184908 -79926 -159846 -234073 -88061
7507h8061L3869j13043Q2008l0187O1211j15644K5409l6194J54082p7937k630
$$ -88061 -54192 -167235 -85227 -115414 -54203 -169847 -144438 -180632 -26550 -104487 -107117
7496a07117K1710P0282p2485J02803k0464p0490k4159N8129j19114P1954O2217
$$ -107117 -85407 -15125 -87610 15193 -5271 -75761 -99920 -41791 -160905 -88951 -26734
7485b6734o0474j6929J7273R4596j23946Q1210m5881m0582l6545J29803j18221
$$ -26734 -87208 -104137 -86864 7732 -116214 -35004 -80885 -121467 -158012 -28209 -146430
7474a46430q4558K50022j13524P474j42L133j6860R0617Q0803j47594O2281q8849
$$ -146430 -230988 19034 -94490 -87016 -87158 -84025 -100885 -10268 70535 -77059 -14778 -103627
7462a03627R9391l8993j35276J30520j5761N5891n4653l3149j2419J27032q7047
$$ -103627 -4236 -43229 -178505 -47985 -63746 -7855 -62508 -95657 -108076 18956 -68091
7451f8091l476L8766p2496J35359j91739J55466p1810J03086P1704j86502J5621
$$ -68091 -71567 -32801 -105297 30062 -161677 -6211 -78021 25065 96769 -89733 -74112
7440g4112J55846j2414m9147k11j2022J132L6761r0292K2253J64337R489j64414
$$ -74112 81734 69320 20173 19962 7940 9072 45833 -44459 -22206 142131 151620 -12794
7428a2794k07N2052r0588K8567R5357r6426m0449N6072P7419j63344R3887O7719
$$ -12794 -13001 39051 -51537 -22970 72387 -24039 -64488 -8416 69003 -94341 -454 67265
7416F7265m2961R4936n2993N6261j52116L4030O4128M5028n8414P3590r5856L2974
$$ 67265 24304 119240 66247 122508 -29608 4422 68550 113578 55164 128754 32898 65872
7404F5872J2799m8277L7632L8179n0853o805J00221n6689M2876p1637K0194O9795
$$ 65872 78671 30394 68026 106205 55352 48547 148768 92079 134955 63318 83512 153307
7392A53307q7586j06294J1781O4911o9954J16807m1153J18941j00082K8000N0260
$$ 153307 65721 -40573 -28792 36119 -33835 82972 41819 160760 60678 88678 138938
7381A38938N3596j10402j1453L2016j02082K8779l0996R1843N0829k8850J183
$$ 138938 192534 82132 70679 102695 613 29392 -1604 90239 141068 112218 113401
7370A13401J9569o6438L1093o3477P4551J03759j42737J9578J3055O1244k6745
$$ 113401 132970 66532 97625 34148 108699 212458 69721 89299 102354 163598 136853
7359A36853l6058K0190n7355L2622j1342L6299l9899R7233n3556M3418l6913R4546
$$ 136853 100795 120985 63630 96252 84910 121209 81310 178543 124987 168405 131492 226038
7347B26038q1230L9949K0347n2109J07775k2235N0512j87225J42601L4500j40443
$$ 226038 144808 184757 205104 152995 260770 238535 289047 101822 244423 278923 138480
7336A38480J61011l2201r8541K7772Q0997m3447J03634m8288k8971J121O3043
$$ 138480 299491 267290 168749 196521 277518 234071 337705 289417 260446 261567 324610
7325C24610K5399N0589j93158J23301j09616Q4402L5955Q6524k2091j14537L9555
$$ 324610 350009 400598 207440 330741 221125 305527 341482 428006 405915 291378 330933
7314C30933K0997m8917J1922K5223L3522J4167j36076Q1094J1676P614k0982L7808
$$ 330933 351930 303013 314935 340158 373680 387847 251771 332865 344541 352155 331173 368981
7302C68981q3426K2963J01550l6049K774J33192J4285j81764N0200L709p8903
$$ 368981 285555 308518 410068 374019 376793 509985 524270 342506 392706 396415 317512
7291C17512N5136R157N1929L6844o6909R9898o4908K4572n7608Q9077k06002J26901
$$ 317512 372648 381805 433734 470578 403669 503567 438659 463231 405623 494700 288698 415599
7279D15599O931J13247p5413J637O1101K2317N0349M1559l7665Q7168n0575j3204
$$ 415599 422530 535777 460364 462001 523102 545419 595768 637327 599662 686830 636255 623051
7267F23051J67355n0936N6025M3239L05m3366N0353K33m6664K393n9325m7823
$$ 623051 790406 739470 795495 838734 839039 795673 846026 846259 799595 801988 742663 694840
7255F94840J23707j6365m249k7641j3830Q6665j25989Q2735j0990K7775L494k429
$$ 694840 818547 802182 797933 770292 756462 843127 717138 799873 788883 816658 820152 817723
7243H17723j09637J57373j24445J31720r2659J62857M7384l0018l7030J06899
$$ 817723 708086 865459 741014 872734 780075 942932 990316 960298 923268 1030167
7233A030167p0122N1975L506k374M3549K6490M9437r8337J73666L2277N8599q0500
$$ 1030167 960045 1012020 1015526 1013152 1056701 1083191 1132628 1034291 1207957 1240234 1298833 1218333
7221A218333P5633p6918Q1369K4042J0531j4967R1402P283K5397m2151J08894
$$ 1218333 1293966 1217048 1298417 1322459 1332990 1318023 1409425 1416708 1442105 1399954 1508848
7210A508848O8514k8911j3601j7341Q0447p0738n777j7289K65847l9932Q3310
$$ 1508848 1577362 1548451 1534850 1517509 1597956 1527218 1521441 1504152 1769999 1730067 1813377
7199A813377j1010J21300q0753J91224N4464j77261R6802J41557O5245L0515L8385
$$ 1813377 1802367 1923667 1842914 2034138 2088602 1911341 2008143 2149700 2214945 2245460 2283845
7188B283845J18442L8812r7912Q4662r6830J44758P1401k5206L4035q894P9614
$$ 2283845 2402287 2441099 2343187 2427849 2331019 2475777 2547178 2521972 2556007 2547113 2626727
7177B626727J00200j27955K82933m7896Q1669K4896J13318J4717J34074R137M946
$$ 2626727 2726927 2598972 2881905 2834009 2915678 2940574 3053892 3068609 3202683 3211820 3216766
7166C216766J9723J44163L355N8329J16622J3928J80646p871m3381J30315K8228
$$ 3216766 3236489 3380652 3384007 3442336 3558958 3572886 3753532 3745661 3702280 3832595 3860823
7155C860823J78227Q2059K59150k0759J02834J56773P3189l612J94413K05903
$$ 3860823 4039050 4121109 4380259 4359500 4462334 4619107 4692296 4688684 4883097 5089000
7145E089000L8362P2492J87613K10182J49592K83419Q322K68525J55236K14690
$$ 5089000 5127362 5199854 5387467 5597649 5747241 6030660 6038982 6307507 6462743 6677433
7135F677433K29696J66586L53268J71792K81544J82253K99646L00532L57808K60757
$$ 6677433 6907129 7073715 7426983 7598775 7880319 8062572 8362218 8662750 9020558 9281315
7125I281315L97416M01096M59726M41213M04116O82625N52015N89536O66873P16926
$$ 9281315 9678731 10079827 10539553 10980766 11384882 12067507 12619522 13209058 13875931 14592857
7115A4592857Q57617Q45526J048009R50950J221640J340447J378760J531284J853383
$$ 14592857 15450474 16296000 17344009 18294959 19516599 20857046 22235806 23767090 25620473
7106B5620473J946889K229440K445392K540258L200298L398044L738494M002646
$$ 25620473 27567362 29796802 32242194 34782452 37982750 41380794 45119288 49121934
7098D9121934M681115M972481N373351N695040N647868N423155N328843M272437
$$ 49121934 53803049 58775530 64148881 69843921 75491789 80914944 86243787 90516224
7090I0516224L335129J696763O21988j113581k710390l619457m637336n077577
$$ 90516224 93851353 95548116 96170104 95056523 92346133 88726676 84089340 79011763
7082G9011763n502995n459631n421185m984099m571710m397355l828640l290923
$$ 79011763 73508768 68049137 62627952 57643853 53072143 48674788 44846148 41555225
7074D1555225l155761k766581k433282k350529j811391j886224j446585j643216
$$ 41555225 38399464 35632883 33199601 30849072 29037681 27151457 25704872 24061656
7066B4061656j145760j090662j199872j033864p31641r03936o54665o93916o44397
$$ 24061656 22915896 21825234 20625362 19591498 18859857 17955921 17301256 16607340 15962943
7057A5962943o51054m06781n35023l58989o74559k64583m07859k91512m16785
$$ 15962943 15311889 14905108 14370085 14011096 13336537 13071954 12664095 12372583 11955798
7048A1955798k94266k65664r8717l41198k87364j60974k63115k03093k05811p5326
$$ 11955798 11661532 11395868 11297151 10955953 10668589 10507615 10244500 10041407 9835596 9760270
7038I760270k78231m6479l50607j3163j61411j03580j01205j32851p1393p6493
$$ 9760270 9482039 9435560 9084953 9071790 8910379 8806799 8705594 8572743 8501350 8424857
7028H424857n6360k15924m2750j02618j8110n515j53103K9056j07926M1125j36194
$$ 8424857 8368497 8152573 8109823 8007205 7989095 7983580 7830477 7859533 7751607 7792732 7656538
7017G656538M4213q1084j60054j7008J00210J3592j27342J76139k23884J22234
$$ 7656538 7700751 7619667 7459613 7442605 7542815 7556407 7429065 7605204 7381320 7503554
7007G503554k995O138P598K07194j73557K547Q2607M4939R612k6402P6143O5408
$$ 7503554 7500559 7506697 7514295 7721489 7547932 7550479 7633086 7678025 7687637 7661235 7737378 7802786
6995G802786Q9169K8552J04692Q6312K2422R2251O6770J71206J26450J46307j5489
$$ 7802786 7891955 7920507 8025199 8111511 8133933 8226184 8292954 8464160 8590610 8736917 8721428
6984H721428O9639K60708P9464O3600M6174J15957J04238K87965j00782J34430
$$ 8721428 8791067 9051775 9131239 9194839 9241013 9356970 9461208 9749173 9648391 9782821
6974I782821J75985J36175J45609J70150K50228J17973L60487J44586K76047K32127
$$ 9782821 9958806 10094981 10240590 10410740 10660968 10778941 11139428 11284014 11560061 11792188
6964A1792188K84045K17928L62358K66947L67033L65616M79320L17694K38723
$$ 11792188 12076233 12294161 12656519 12923466 13290499 13656115 14135435 14453129 14691852
6955A4691852K98461J42545Q8458J61757J25326J45540L04184J23707N34828K21708
$$ 14691852 14990313 15132858 15221316 15383073 15508399 15653939 15958123 16081830 16616658 16838366
6945A6838366M76538M13048M22383M98683O01636O50320Q05769P44832P69050
$$ 16838366 17314904 17727952 18150335 18649018 19250654 19900974 20706743 21451575 22220625
6936B2220625N51259M77978L09518N01229L45830L41397N31585M61237O87052
$$ 22220625 22771884 23249862 23559380 24060609 24406439 24747836 25279421 25740658 26427710
6927B6427710O40303P98827Q79798J072733J081612J412740J486362J907277K086229
$$ 26427710 27068013 27866840 28746638 29819371 30900983 32313723 33800085 35707362 37793591
6918C7793591K348891K944904K965843L050315K807061K388407J627920J097173
$$ 37793591 40142482 43087386 46053229 49103544 51910605 54299012 55926932 57024105
6910E7024105M57725J16804j67097l27671l85570r5798Q8613L39166O82988J294254
$$ 57024105 57481830 57598634 57431537 57103866 56718296 56622498 56711111 57050277 57733265 59027519
6900E9027519J568714K194434K843971L651448M389084M616521M893948M049267
$$ 59027519 60596233 62790667 65634638 69286086 73675170 78291691 83185639 87234906
6892H7234906L023475J457085n1605j805662k380317l292001l549389l464927
$$ 87234906 90258381 91715466 91663861 89858199 87477882 84185881 80636492 77171565
6884G7171565l167781k809263k350993j485130j327185o51076l37090J94846M91974
$$ 77171565 74003784 71194521 68843528 67358398 66031213 65380137 65043047 65237893 65729867
6875F5729867J062178J004869J034441N85448m9484r64536j668594k235230k833706
$$ 65729867 66792045 67796914 68831355 69416803 69367319 68402783 66734189 64498959 61665253
6866F1665253l014574k958372k848248k702946k342360k184444j783195j433756
$$ 61665253 58650679 55692307 52844059 50141113 47798753 45614309 43831114 42397358
6858D2397358j310976j000993p23659n98976p98697p55064q61458q00583j084084
$$ 42397358 41086382 40085389 39361730 38762754 37964057 37208993 36347535 35546952 34462868
6849C4462868p84201j114147p74675p94616n45833n31649m32490l67756l44916
$$ 34462868 33678667 32564520 31789845 30995229 30449396 29917747 29485257 29117501 28772585
6840B8772585k28134M1918J72827L89329N13698N57374N79964J85646j54988p40212
$$ 28772585 28544451 28586369 28759196 29148525 29662223 30219597 30799561 30985207 30830219 30090007
6830C0090007j029168j136491j439841j379636j328316j243732j137326q97907
$$ 30090007 29060839 27924348 26484507 25104871 23776555 22532823 21395497 20497590
6822B0497590p02465o67800m40050k09601k62547J2820P2755M38129M44646M23085
$$ 20497590 19795125 19127325 18687275 18477674 18215127 18227947 18300702 18738831 19183477 19606562
6812A9606562J43902j18908l09395n82053q46835q94937q81645q34284o83077
$$ 19606562 19750464 19631556 19322161 18740108 17893273 16998336 16116691 15282407 14599330
6803A4599330o59370n98322l93058l28260m62060m05989l86622l83652l06456
$$ 14599330 13939960 13341638 12948580 12620320 12158260 11752271 11365649 10981997 10675541
6794A0675541l75774l96752k16838j60522j77529k17664k00468j7438O7016N8740
$$ 10675541 10299767 9903015 9686177 9525655 9348126 9130462 8929994 8912556 8979572 9038312
6784I038312q7350j40607k89413k0509k17404k95975k29907r5007j30615j65253
$$ 9038312 8950962 8810355 8520942 8500433 8283029 7987054 7757147 7662140 7531525 7366272
6774G366272j97176j01868l1695j67286q7134j29861o3011r9851j14193p7894
$$ 7366272 7169096 7067228 7035533 6868247 6781113 6651252 6588241 6488390 6374197 6296303
6764F296303p8130j03899q7138L0433n9108P0901K03772q7607J70280j03514n7739
$$ 6296303 6218173 6114274 6027136 6057569 5998461 6069362 6273134 6185527 6355807 6252293 6194554
6753F194554M9560J76553m6450J16947J01070L1265o8776k9269m0920k33553k11783
$$ 6194554 6244114 6420667 6374217 6491164 6592234 6623499 6554723 6525454 6484534 6250981 6039198
6742F039198n7684k68660j60431k01182j05973k32779k8714m4766K4254j73780
$$ 6039198 5981514 5712854 5552423 5351241 5245268 5012489 4983775 4939009 4963263 4789483
6732D789483Q4982j53785L911N1158J3025j06708J54057j55725L4470l3750K9909
$$ 4789483 4874465 4720680 4724591 4775749 4788774 4682066 4836123 4680398 4714868 4681118 4711027
6721D711027o6540K13046K52897J91944L67794M59739L79029L91178J83369J08376
$$ 4711027 4644487 4857533 5110430 5302374 5670168 6129907 6508936 6900114 7083483 7191859
6711G191859l09237l16588k24958m11509l74289l22333l27286k87186k89753j53763
$$ 7191859 6882622 6566034 6341076 5929567 5555278 5232945 4905659 4618473 4328720 4174957
6701D174957j56687k0329n2332j32236J640J27335j99167j2093J20857Q8733n5296
$$ 4174957 4018270 3997941 3945609 3813373 3815013 3942348 3743181 3731088 3851945 3940678 3885382
6690C885382R4771K70706K47914J41395J44044O1678Q4281J60832J06416R8732
$$ 3885382 3980153 4250859 4498773 4640168 4784212 4845890 4930171 5091003 5197419 5296151
6680E296151J06476j8861p0384k04974l25028q5718k56809k63235k31777j33580
$$ 5296151 5402627 5383766 5313382 5108408 4783380 4697662 4440853 4177618 3945841 3812261
6670C812261j64136K0783k9774L7381l9103L4769n869K29825L12440O17444N46611
$$ 3812261 3648125 3668908 3639134 3676515 3637412 3672181 3666312 3896137 4208577 4826021 5372632
6659E372632M91429J38661j0308l45162m72194l12785m27215l23155k31393l04316
$$ 5372632 5864061 6002722 5992414 5647252 5175058 4862273 4435058 4111903 3880510 3576194
6649C576194l09155k5364m2780j76760Q711Q0056L0218K16624J20775R7057n1981
$$ 3576194 3267039 3241675 3198895 3022135 3030846 3110902 3141120 3357744 3478519 3575576 3523595
6638C523595P9385O0319k8961J42740K56265M69712Q28816M49025K03569p4795
$$ 3523595 3602980 3663299 3634338 3777078 4033343 4503055 5331871 5780896 5984465 5909670
6628E909670l23116k73847n51786l89437l95816k77359k49695j46238k86551K0673
$$ 5909670 5586554 5312707 4760921 4371484 3975668 3698309 3448614 3302376 3015825 3036498
6618C036498k3928o8096k9347O1152R1412P3224N5187P7487N7273N0205J0755
$$ 3036498 3012570 2944474 2915127 2976279 3067691 3140915 3196102 3273589 3330862 3381067 3391822
6607C391822j17181Q4815K11659J03349J93470M3434q6914j64097j33182q8441
$$ 3391822 3274641 3359456 3571115 3674464 3867934 3911368 3824454 3660357 3527175 3438734
6597C438734j46063j37553j23892p0407o3861J2799j09474J2644j18032l3336
$$ 3438734 3292671 3155118 3031226 2960819 2896958 2909757 2800283 2812927 2694895 2661559
6587B661559m6135Q7168N7501j05351R0010N179l4304j25178k886m9148j3151
$$ 2661559 2615424 2702592 2760093 2654742 2744752 2749931 2715627 2590449 2587563 2538415 2525264
6576B525264K263n0892j15202L8385j05392M4423k2500j78771J54325j27805Q339
$$ 2525264 2527527 2476635 2361433 2399818 2294426 2338849 2316349 2137578 2291903 2164098 2172437
6565B172437J7685O5948j06207j00947M340r878o3994P929p9364k8349L369q8620
$$ 2172437 2190122 2256070 2149863 2048916 2053256 2043378 1979384 1987313 1907949 1879600 1882969 1794349
6553A794349J5589l6551j02722P2748k23805Q3232k4864p1297m330J0471P852
$$ 1794349 1809938 1773387 1670665 1743413 1519608 1602840 1577976 1506679 1502349 1512820 1520672
6542A520672p1065k5168q2770J15395j23356M0472k9571l653l1196J9285j09688
$$ 1520672 1449607 1424439 1341669 1457064 1333708 1374180 1344609 1340956 1309760 1329045 1219357
6531A219357J17434Q662q746k161j35295R427P810n044j33630j1606R0418o9916
$$ 1219357 1336791 1345453 1336707 1334546 1199251 1208678 1216488 1211444 1077814 1066208 1156626 1086710
6519A086710K459J9188O6143j45755J49352r1434p4265P0485j3797l2272p0587
$$ 1086710 1089169 1108357 1174500 1028745 1178097 1086663 1012398 1082883 1069086 1036814 966227
6508I66227R9248q681j03915J00469j05457L3724k1661R9547j91108R3298M2493
$$ 966227 1065475 1056794 952879 1053348 947891 981615 959954 1059501 868393 961691 1004184
6497A004184k8065j27037m0877J2904l2679K1632O8148r8888P9600l172J3905
$$ 1004184 976119 849082 808205 821109 788430 810062 878210 779322 858922 855750 869655
6486H69655L3368q1330O3720K9259l9474j39458J42665n8857K3506M2595r4227
$$ 869655 903023 821693 885413 914672 875198 735740 878405 819548 843054 885649 791422
6475G91422O6203o726m9021L4854K2365j17055Q147O204n0285K5660p4752M0116
$$ 791422 857625 850899 801878 836732 859097 742042 750189 756393 706108 731768 657016 697132
6463F97132M2665o840j06656P5082J21060k37125J07264R3803m5441j502L6056
$$ 697132 739797 732957 626301 701383 822443 585318 692582 786385 740944 739442 775498
6452G75498k2063m4043J04525n8398N6970j00429R9434q3369l9808Q6063l579
$$ 775498 753435 709392 813917 755519 812489 712060 811494 728125 688317 774380 770801
6441G70801K9942j45255J23173n9200M5371r6043J5184k313L189J17621n1758
$$ 770801 800743 655488 778661 719461 764832 668789 683973 681660 684849 802470 750712
6430G50712o2918M8130m08Q2354j25468J63609o8122L5457n1353l0947M049O2089
$$ 750712 687794 735924 735516 817870 692402 856011 787889 823346 771993 741046 745095 807184
6418H07184m2530M3529N66o1807Q7861O2333j38414l800J06198j3380K7617n0788
$$ 807184 764654 808183 808749 746942 834803 897136 758722 754922 861120 847740 875357 824569
6406H24569J06722n2647K30878l1854j0588k6019k1178l0321O9108m688N1093
$$ 824569 931291 878644 1109522 1077668 1067080 1041061 1019883 989562 1058670 1053982 1105075
6395A105075n2623K1120j93990R2537j2287J10485M8476j9089N2535O5249r2942
$$ 1105075 1052452 1073572 879582 972119 959832 1070317 1118793 1099704 1152239 1217488 1124546
6384A124546l6459K6807m2460p6899J34267q8002O4009j33627K21293n1594m9785
$$ 1124546 1088087 1114894 1072434 995535 1129802 1041800 1105809 972182 1193475 1141881 1092096
6373A092096M1469l0548L1095J77142p5717q412N383P880N6005K5008P3472p2326
$$ 1092096 1133565 1103017 1134112 1311254 1235537 1227125 1232508 1240388 1296393 1321401 1394873 1322547
6361A322547O7834L9975j10342J52384n9445j1745j11375O7743J19579q3463P5240
$$ 1322547 1390381 1430356 1320014 1472398 1412953 1401208 1289833 1357576 1477155 1393692 1468932
6350A468932M6252q9775J47829m5843R964M8491P4259p121O7780l9403J24989
$$ 1468932 1515184 1425409 1573238 1527395 1537359 1585850 1660109 1652988 1720768 1681365 1806354
6339A806354L7480Q2202J96844r093M7878J31065M1743J26818J79127K06258K21390
$$ 1806354 1843834 1926036 2122880 2113787 2161665 2292730 2334473 2461291 2640418 2846676 3068066
6328C068066K71984L61819M97746O09408L76096M29868L28871L40149K30648J34329
$$ 3068066 3340050 3701869 4199615 4809023 5185119 5614987 5943858 6284007 6514655 6648984
6318F648984j22715l21874l21034l80657o34151l07246m17281p8910l33636o5007
$$ 6648984 6526269 6204395 5883361 5502704 4868553 4561307 4144026 4065116 3731480 3666473
6308C666473J03427p0097J99194L1375P7054J01638Q0888n5737P4566N5721P535
$$ 3666473 3769900 3699803 3898997 3930372 4007426 4109064 4189952 4134215 4208781 4264502 4272037
6297D272037m4451K03204J95007J67171K16012K77396K13368L83820M20397K36988
$$ 4272037 4227586 4430790 4625797 4792968 5008980 5286376 5499744 5883564 6303961 6540949
6287F540949L44455R4056K18453j11412m8770k78110p9375o7235j89647j47751
$$ 6540949 6885404 6979460 7197913 7086501 7037731 6759621 6680246 6613011 6423364 6275613
6277F275613R878P0239j44275O8293K11858Q4148J28348J54129J88706N4881M3298
$$ 6275613 6285491 6355730 6211455 6279748 6491606 6575754 6704102 6858231 7046937 7101818 7145116
6266G145116o496M3352m1597K41343J17696J68786N37713L55757L41914K49704
$$ 7145116 7138620 7181972 7140375 7381718 7499414 7668200 8205913 8561670 8903584 9153288
6256I153288K66213J84315P015j67224j84074j68571j87592l27624k27302J07780
$$ 9153288 9419501 9603816 9610831 9443607 9259533 9090962 8903370 8575746 8348444 8456224
6246H456224k58112M7427K9219K34994L10501L14087L68916J72777M06804K74569
$$ 8456224 8198112 8245539 8274758 8509752 8820253 9134340 9503256 9676033 10082837 10357406
6236A0357406K9406K22165k6533j05582l7912k83n2769j54077o0289j03648j09601
$$ 10357406 10386812 10608977 10582444 10476862 10438950 10438667 10385898 10231821 10171532 10067884 9958283
6225I958283k81091k31091l58432j25370l42090k53476l87775r2984j54914p8211
$$ 9958283 9677192 9446101 9087669 8962299 8620209 8366733 7978958 7885974 7731060 7652849
6215G652849j33438m0617n7857L1998k582j35077J53682L5800p3671n5041K64015
$$ 7652849 7519411 7478794 7420937 7452935 7450353 7315276 7468958 7504758 7431087 7376046 7640061
6204G640061J33048K56390K13960K66581M52949N74962P00931N41921P06859N69144
$$ 7640061 7773109 8029499 8243459 8510040 8962989 9537951 10238882 10780803 11487662 12056806
6194A2056806L67687l5033j04510l80042j48490k49795k65469l12879j51240k24316
$$ 12056806 12424493 12389460 12284950 11904908 11756418 11506623 11241154 10928275 10777035 10552719
6184A0552719j40143r9447p9618j91415N4655Q544L1797j51877P7047r2956J26848
$$ 10552719 10412576 10313129 10233511 10042096 10096751 10105295 10137092 9985215 10062262 9969306 10096154
6173A0096154J46765N93362L50213N51624M37738L48082K96957j1561j60305l12780
$$ 10096154 10242919 10836281 11186494 11738118 12175856 12523938 12820895 12809334 12649029 12336249
6163A2336249l84582l61243l71111l51388l24632j81159k55006j21939j19526
$$ 12336249 11951667 11590424 11219313 10867925 10543293 10362134 10107128 9985189 9865663
6154I865663n1228K00860R6288J53569K17548J97612P5923J2686J02518Q7378
$$ 9865663 9814435 10015295 10111583 10265152 10482700 10680312 10756235 10768921 10871439 10958817
6144A0958817K54332K50584L18386J81133M92067O08355M06101P96657P84431
$$ 10958817 11213149 11463733 11782119 11963252 12455319 13063674 13469775 14266432 15050863
6135A5050863J023927J027860R08227Q29093Q16000O51835O05668J63548J39349
$$ 15050863 16074790 17102650 18010877 18839970 19655970 20307805 20913473 21077021 21216370
6126B1216370O3061j50206j94806q4371j12931J74626K17569M32800O77896J111860
$$ 21216370 21279431 21129225 20934419 20850048 20737117 20911743 21129312 21562112 22240008 23351868
6116B3351868J388519J557453J832283J922580J831218J842784J436835J150257
$$ 23351868 24740387 26297840 28130123 30052703 31883921 33726705 35163540 36313797
6108C6313797O90847L28754j50840n96323p79495r72110r59175j102317j006025
$$ 36313797 37004644 37333398 37182558 36586235 35806740 34834630 33875455 32773138 31767113
6099C1767113r16709n12988k33452J1004L71393P00225Q61997R71014J137559
$$ 31767113 30850404 30337416 30103964 30114968 30486361 31186586 32048583 33019597 34157156
6090C4157156J041473Q39002Q23940M83894J02269l52389n21754r67780j283776
$$ 34157156 35198629 36037631 36861571 37345465 37447734 37095345 36573591 35605811 34322035
6081C4322035j350905j542066j378801j349524j288432j146836o50529o01358
$$ 34322035 32971130 31429064 30050263 28700739 27412307 26265471 25614942 25013584
6073B5013584m17050j64126J15707J45739L17524K52080L50225N42073K75816
$$ 25013584 24596534 24432408 24548115 24693854 25011378 25263458 25613683 26155756 26431572
6064B6431572K20898J49454Q6419J36641K88036K93984N62835O80060R23240J131939
$$ 26431572 26652470 26801924 26888343 27024984 27313020 27607004 28169839 28849899 29773139 30905078
6054C0905078J344241J833549K307365L037759L972471N415987P249639J0202257
$$ 30905078 32249319 34082868 36390233 39427992 43400463 48816450 56066089 66268346
6046F6268346J6581657L3043799O5266747P7313103N9892229K2417492q662467
$$ 66268346 82850003 115893802 181160549 258473652 318365881 340783373 332120906
6039C32120906k7804993m2123105m0367178m2978860l6733865k9990189k5257030
$$ 332120906 304315913 262192808 221825630 178846770 142112905 112122716 86865686
6032H6865686j9497360j1908144p279391n546420m603598l651704k737254j889983
$$ 86865686 67368326 55460182 48180791 42634371 38030773 34379069 31641815 29751832
6024B9751832j554728j103156r36401p26034n70014n22802o29573o39906o80966
$$ 29751832 28197104 27093948 26157547 25431513 24861499 24338697 23709124 23069218 22388252
6015B2388252p73279p50267q54681r37055r80718q43079p26140o62679q28902
$$ 22388252 21614973 20864706 20010025 19072970 18092252 17249173 16523033 15860354 15031452
6006A5031452l38460n77714m25194n49043j92588l67771k31593l67082k16147
$$ 15031452 14692992 14115278 13690084 13141041 12948453 12580682 12349089 11982007 11765860
5997A1765860k72106j92683k81531k92174k50021l46545k11182k80968m09378
$$ 11765860 11493754 11301071 11019540 10727366 10477345 10130800 9919618 9638650 9229272
5988I229272j75609m36165j97910k84383m14334j63249l02437j37471k93463j84478
$$ 9229272 9053663 8617498 8419588 8135205 7720871 7557622 7255185 7117714 6824251 6639773
5978F639773l29171L6843k27202q3000l02122n8481m8507j46686q0338j12243
$$ 6639773 6310602 6347445 6120243 6037243 5735121 5676640 5628133 5481447 5401109 5288866
5968E288866q6616L9001r3944q1994m6997l81j20975j10240m7280k2634l3417
$$ 5288866 5202250 5241251 5147307 5065313 5018316 5017935 4896960 4786720 4739440 4716806 4683389
5957D683389k7879p0028j0556q3829q1671k9601j69347k8732j01008k18329K0859
$$ 4683389 4655510 4585482 4574926 4491097 4409426 4379825 4210478 4181746 4080738 3862409 3883268
5946C883268o586j00530o3701L02j57548M6368j00972m6959m9168j8224j5895
$$ 3883268 3876682 3776152 3712451 3712753 3555205 3601573 3500601 3453642 3404474 3386250 3370355
5935C370355J32259O3968P7740n248K7141L40644K86312L5702J94773O4918j85362
$$ 3370355 3502614 3566582 3644322 3639074 3666215 4006859 4293171 4328873 4523646 4588564 4403202
5924D403202j52111j99630k76973j26720j39839r9456j90439j10410p0441j43552
$$ 4403202 4251091 4051461 3774488 3647768 3507929 3408473 3218034 3107624 3037183 2893631
5914B893631k2574j64172N401Q8651p1352m0235N4620L0062J29050l6125J76457
$$ 2893631 2871057 2706885 2712286 2800937 2729585 2689350 2743970 2774032 2903082 2866957 3043414
5903C043414J92139J06023L78993K02566J15208L3746k3795j25638k32885r5064
$$ 3043414 3235553 3341576 3720569 3923135 4038343 4072089 4048294 3922656 3689771 3594707
5893C594707j46882j03256j19050k07659R0686J4297j32427k3832m2680l5988
$$ 3594707 3447825 3344569 3225519 3017860 3108546 3122843 2990416 2966584 2923904 2887916
5883B887916n4226k29761J20049j28884N0944M4322M4275n4264K62738O3512M5107
$$ 2887916 2833690 2603929 2723978 2595094 2646038 2690360 2734635 2680371 2943109 3006621 3051728
5872C051728J57157m2462J11048p3735n2972p4032J7831n2728n873o4946J46142
$$ 3051728 3208885 3166423 3277471 3203736 3150764 3076732 3094563 3041835 3035962 2971016 3117158
5861C117158r851l2196L1610N9071j22038n8115J11529l2694j10783J71478j13458
$$ 3117158 3107307 3075111 3106721 3165792 3043754 2985639 3097168 3064474 2953691 3125169 3011711
5850C011711j11731N7700q2689R711K3053o9754j43617N4129N3373m6818p7639
$$ 3011711 2899980 2957680 2874991 2884702 2907755 2838001 2694384 2748513 2801886 2755068 2677429
5839B677429j9116P5930n848J15753r5927M6525J70169p9907N0237J0543l6087
$$ 2677429 2658313 2734243 2728395 2844148 2748221 2794746 2964915 2885008 2935245 2945788 2909701
5828B909701K1407J9078j09372M8588Q8177l6201l1580j27313J45445k2253R415
$$ 2909701 2931108 2950186 2840814 2889402 2977579 2941378 2909798 2782485 2927930 2905677 2915092
5817B915092K8551O3699p1169J39379m434J52116j02117M2566l8202n410m052
$$ 2915092 2943643 3007342 2936173 3075552 3071118 3223234 3121117 3163683 3125481 3120071 3116019
5806C116019o8110n452J12166p9165r7146Q906P555k1389K03087r4517M2799R3398
$$ 3116019 3047909 3042457 3154623 3075458 2978312 2987218 2994773 2973384 3176471 3081954 3124753 3218151
5794C218151q4330M7257K08031J7583N2027O2741J55313J92281J38930J43855
$$ 3218151 3133821 3181078 3389109 3406692 3458719 3521460 3676773 3869054 4007984 4151839
5784D151839L3401J26429J25665j3430k817l325Q0405m8839j9546m638K8919j33552
$$ 4151839 4185240 4311669 4437334 4423904 4421087 4417762 4498167 4449328 4429782 4425144 4454063 4320511
5772D320511L6921K8569K8740m5358J12100p00J86135J44693L20273M39911M53931
$$ 4320511 4357432 4386001 4414741 4369383 4481483 4480783 4666918 4811611 5131884 5571795 6025726
5761F025726K08587L7766L1866o9778n5885q3041l44k2861Q4292P1051K15462
$$ 6025726 6234313 6272079 6303945 6234167 6178282 6095241 6094897 6072036 6156328 6227379 6442841
5750F442841m4527J21001J35060l7764P6064K1448q1686Q5031n3229m181r8913
$$ 6442841 6398314 6519315 6654375 6616611 6692675 6714123 6632437 6717468 6664239 6660058 6561145
5739F561145P1089Q030r8821P3024M6594J23543q4666J84164J04231K47306J87885
$$ 6561145 6632234 6640264 6541443 6614467 6661061 6784604 6699938 6884102 6988333 7235639 7423524
5728G423524J75944K95345K90546K36291M13407K83287M89770M88366L19953L19266
$$ 7423524 7599468 7894813 8185359 8421650 8835057 9118344 9608114 10096480 10416433 10735699
5718A0735699J44745M53926J57682K99866K74304K42592J63697K32372J18951
$$ 10735699 10880444 11334370 11492052 11791918 12066222 12308814 12472511 12704883 12823834
5709A2823834Q1021K5672o2979n5511m8725r8134j33154L3035j54073m8926O2866
$$ 12823834 12904855 12930527 12867548 12812037 12763312 12665178 12532024 12565059 12410986 12362060 12424926
5698A2424926J10429J60037K04081J75660K65577K24076L06716L44410L15940
$$ 12424926 12535355 12695392 12899473 13075133 13340710 13564786 13871502 14215912 14531852
5689A4531852L69624M35590N28759N94245O19637P94840P67510N94498P80720
$$ 14531852 14901476 15337066 15865825 16460070 17079707 17874547 18642057 19236555 20017275
5680B0017275N49797L73496K64367o4395k01041l24911m70856l84699n52022l89810
$$ 20017275 20567072 20940568 21204935 21140540 20939499 20614588 20143732 19759033 19207011 18817201
5670A8817201l16516m18445j55487o4262N0683J71121L03941K21417M01534M61637
$$ 18817201 18500685 18082240 17926753 17862491 17913174 18084295 18388236 18609653 19011187 19472824
5660A9472824P43720N30212Q31326Q10073J053594J070842J058049J384313J283153
$$ 19472824 20216544 20746756 21578082 22388155 23441749 24512591 25570640 26954953 28238106
5651B8238106J321036J264132J293437J228155J068639J127776J290983J500334
$$ 28238106 29559142 30823274 32116711 33344866 34413505 35541281 36832264 38332598
5643C8332598J748566K182664K503914K806414L263387L070793L193835K527164
$$ 38332598 40081164 42263828 44767742 47574156 50837543 53908336 57102171 59629335
5635E9629335K078943J217002M92440l52533p10688j198197j385105j103946j116622
$$ 59629335 61708278 62925280 63417720 63065187 62354499 61156302 59771197 58667251 57550629
5626E7550629p72799n38692r6098J33220M52460N66821P80843J050777J202145
$$ 57550629 56777830 56239138 56143040 56276260 56728720 57295541 58076384 59127161 60329306
5617F0329306J603517J998840K548028L373662M233716M961788O074647O824418
$$ 60329306 61932823 63931663 66479691 69853353 74087069 79048857 85123504 91947922
5609I1947922P305698P235920O953199O230339M822406L157182J508715l90775
$$ 91947922 99253620 106489540 113442739 119673078 124495484 127652666 129161381 128770606
5601A28770606j821815l137598m087773m664768m680906m510424m080518l640111
$$ 128770606 126948791 123811193 119723420 115058652 110377746 105867322 101786804 98146693
5593I8146693k978008k403110j943335j434789j054973n91580j17406K55285P87288
$$ 98146693 95168685 92765575 90822240 89387451 88332478 87740898 87623492 87878777 88666065
5584H8666065J570964K175338L090381L956937M921632N684032O307666O444288
$$ 88666065 90237029 92412367 95502748 99459685 104381317 110065349 116373015 122817303
5576A22817303O119019N402874M000774K357058N36981j042103k517680l680192
$$ 122817303 128936322 134339196 138339970 140697028 141234009 140191906 137674226 133994034
5568A33994034m399489m526417m779661m338084m187584l478856l083643k596321
$$ 133994034 129594545 125068128 120288467 115950383 111762799 108283943 105200300 102603979
5560A02603979k372176j861075j588806j224176j032717p22341k18594K21156
$$ 102603979 100231803 98370728 96781922 95557746 94525029 93802688 93584094 93805250
5552I3805250N48248J220285J896785K349021K680064L516462L417002L781356
$$ 93805250 94353498 95573783 97470568 99819589 102499653 106016115 109433117 113214473
5544A13214473L514725L449942K946168K476418J895477J437367J150628N79320
$$ 113214473 116729198 120179140 123125308 125601726 127497203 128934570 130085198 130664518
5536A30664518L89466J72187o833k17321l61687o81135n73166p09545n83169o27496
$$ 130664518 131053984 131226171 131219338 131002017 130640330 129959195 129386029 128676484 128093315 127465819
5526A27465819l73116J5759L00733Q46717J413378K001656K738627L296770L759444
$$ 127465819 127092703 127108462 127409195 128255912 129669290 131670946 134409573 137706343 141465787
5517A41465787M290361M191873L818496L298135K468840J518130N21647m21263
$$ 141465787 145756148 149948021 153766517 157064652 159533492 161051622 161573269 161152006
5509A61152006j136944j979962k492416k918032l270430l546283l552881l636990
$$ 161152006 160015062 158035100 155542684 152624652 149354222 145807939 142255058 138618068
5501A38618068l517158l417775l159685k858666k639725k120739j788943j370247
$$ 138618068 135100910 131683135 128523450 125664784 123025059 120904320 119115377 117745130
5493A17745130j093463o34737m63138j90518q4629J3257K5259j2422j55153j77514
$$ 117745130 116651667 116016930 115553792 115363274 115278645 115291902 115317161 115304739 115149586 114972072
5483A14972072l36953n00016o12128r98536j330354j853344k428267k990483l519822
$$ 114972072 114635119 114135103 113522975 112524439 111194085 109340741 106912474 103921991 100402169
5474A00402169m074616m311423m524986m280604m084175l911327l405309k778743
$$ 100402169 96327553 92016130 87491144 83210540 79126365 75215038 71809729 69030986
5466F9030986k258151j877546j376025r38557m34106n4093L66213O39294J329235
$$ 69030986 66772835 64895289 63519264 62580707 62146601 62092508 62458721 63098015 64427250
5457F4427250J788582K255655K761002L457754L685590L933645L823110L221281
$$ 64427250 66215832 68471487 71232489 74690243 78375833 82309478 86132588 89353869
5449H9353869K335423J584669M71009j027710j887454k859200l657832l917953
$$ 89353869 91689292 93273961 93744970 92717260 90829806 87970606 84312774 80394821
5441H0394821m151124m217391l843386l638889l203766k805531k406231k093324
$$ 80394821 76243697 72026306 68182920 64544031 61340265 58534734 56128503 54035179
5433E4035179j661958j314339j076870r11405k20895J42731O27611R86171J685160
$$ 54035179 52373221 51058882 49982012 49070607 48849712 48992443 49620054 50606225 52291385
5424E2291385K320357K530009K641482K841786K343700J741247R30657q8234j120256
$$ 52291385 54611742 57141751 59783233 62625019 64968719 66709966 67640623 67552389 66432133
5415F6432133j940554k604201l207569l406228l308090l284697k949543k624407
$$ 66432133 64491579 61887378 58679809 55273581 51965491 48680794 45731251 43106844
5407D3106844k350414j982693j462969j332154j052188o52958n43536m05117k10170
$$ 43106844 40756430 38773737 37310768 35978614 34926426 34273468 33729932 33324815 33114645
5398C3114645K0660q0340J38512J70721K50172M17299J60594L23175J34091J31354
$$ 33114645 33135305 33054965 33193477 33364198 33614370 34031669 34192263 34515438 34649529 34780883
5388C4780883J28978j27571m5960k38542l96309l37301n17880k91143n19970l97412
$$ 34780883 34909861 34782290 34736330 34497788 34101479 33764178 33246298 32955155 32435185 32037773
5378C2037773m31861o20482m47443k42666l31076n02555k57091m07182m06866
$$ 32037773 31605912 30985430 30537987 30295321 29964245 29461690 29204599 28797417 28390551
5369B8390551k85265l41539l95424n03186m87390m63699n47917n47890n20279
$$ 28390551 28105286 27763747 27368323 26865137 26377747 25914048 25366131 24818241 24297962
5360B4297962n07607n77059m95109n78467l77650m73430l85386k86419k26644
$$ 24297962 23790355 23213296 22718187 22139720 21762070 21288640 20903254 20616835 20390191
5351B0390191l68126j93486o1689l29188l1704j34060j31237j8848O5175K3713
$$ 20390191 20022065 19828579 19766890 19437702 19405998 19271938 19140701 19121853 19187028 19210741
5341A9210741J22730J9456K23291K37373L41922K93981L46501N88015M73301O40541
$$ 19210741 19333471 19352927 19576218 19813591 20155513 20449494 20795995 21384010 21857311 22497852
5331B2497852O61182Q12812Q29999P38155O87257Q06940P78118O07412N76507
$$ 22497852 23159034 23971846 24801845 25540000 26227257 27034197 27812315 28419727 28996234
5322B8996234N39700M95721L28711M83742K99413K43084L03289K87743M85257
$$ 28996234 29535934 30031655 30360366 30844108 31143521 31386605 31689894 31977637 32462894
5313C2462894L42291N37510P74824P40939Q50398R47014J135917J150501J277042
$$ 32462894 32805185 33342695 34117519 34858458 35708856 36655870 37791787 38942288 40219330
5304D0219330J180546J132675J052254R05256O07902M19181K48939j78908j92832
$$ 40219330 41399876 42532551 43584805 44490061 45097963 45517144 45766083 45587175 45394343
5295D5394343m92674o98464q25894p70042q27222r18567p16332p00401n99725
$$ 45394343 44901669 44203205 43377311 42607269 41780047 40861480 40145148 39444747 38845022
5286C8845022o94692o51316l52026m20223m49561l32594m52426m04047m62298
$$ 38845022 38150330 37499014 37146988 36726765 36277204 35944610 35492184 35088137 34625839
5277C4625839o45625o19960p09332p83526r40093p81147r14076r61911j022088
$$ 34625839 33980214 33360254 32650922 31867396 30927303 30146156 29232080 28270169 27248081
5268B7248081r89271p66846q75882o98747q02859o51523n85157n00717l00670
$$ 27248081 26258810 25491964 24616082 23917335 23114476 22462953 21877796 21377079 21076409
5259B1076409n84670l57307k92943k17026j43487j05766j22632J05679j7765L03327
$$ 21076409 20491739 20134432 19841489 19624463 19480976 19375210 19252578 19358257 19340492 19643819
5249A9643819L33875L42299M79136P17802N71735Q84104J108652J190087J320634
$$ 19643819 19977694 20319993 20799129 21516931 22088666 22972770 24081422 25271509 26592143
5240B6592143J513560J663162J655707J528803J742344J460172J649572J292992
$$ 26592143 28105703 29768865 31424572 32953375 34695719 36155891 37805463 39098455
5232C9098455J259032J094009Q93252J025231O93775Q31898P26756P69999Q94842
$$ 39098455 40357487 41451496 42344748 43369979 44063754 44895652 45622408 46392407 47287249
5223D7287249J177476J225639J430126J630692J948210J994523K183412K237506
$$ 47287249 48464725 49690364 51120490 52751182 54699392 56693915 58877327 61114833
5215F1114833K194914K222776J856393J323969J063662L78700j50952r51956j345218
$$ 61114833 63309747 65532523 67388916 68712885 69776547 70155247 70004295 69052339 67707121
5206F7707121j876154k117232k560189k523917k678180k426351k317671k043418
$$ 67707121 65830967 63713735 61153546 58629629 55951449 53525098 51207427 49164009
5198D9164009j842736j704053j153602r54784o65937n44847k19737j58693p4096
$$ 49164009 47321273 45617220 44463618 43508834 42842897 42298050 42078313 41919620 41845524
5189D1845524k59585m17590l61083r80673j020567j273973j532402j737454j982419
$$ 41845524 41585939 41168349 40807266 39826593 38806026 37532053 35999651 34262197 32279778
5180C2279778j940699j912736j912387j861386j608103j530103j361727j227572
$$ 32279778 30339079 28426343 26513956 24652570 23044467 21514364 20152637 18925065
5172A8925065j279427r82907r65878p08121q35019n12880o51512m87404l64532
$$ 18925065 17645638 16662731 15696853 14988732 14153713 13640833 12989321 12501917 12137385
5163A2137385l25117k65813l65347k61745l87509l81968m16107k72364m55541
$$ 12137385 11812268 11546455 11181108 10919363 10531854 10149886 9733779 9461415 9005874
5154I005874j48885j59520j87325k19958j76667l04648m2912j94034j03149j57378
$$ 9005874 8856989 8697469 8510144 8290186 8113519 7808871 7765959 7571925 7468776 7311398
5144G311398j64120M807k86999l7374j53132j16709j65453o6648o7064j27008
$$ 7311398 7147278 7152085 6865086 6827712 6674580 6557871 6392418 6325770 6258706 6131698
5134F131698j98917o7304N6347q474j24954j48459l9403N85j52702j6761j1434
$$ 6131698 5932781 5865477 5921824 5913350 5788396 5639937 5600534 5601119 5448417 5431656 5420222
5123E420222j08798J18055r0381n1205m6034J19820m5009p6056n5238j00794R8229
$$ 5420222 5311424 5429479 5339098 5287893 5241859 5361679 5316670 5240614 5185376 5084582 5182811
5112E182811L8818k01545o541J5572j11930P9495j59440J29870o2137O7802j13675
$$ 5182811 5221629 5020084 5013543 5029115 4917185 4996680 4837240 4967110 4904973 4972775 4859100
5101D859100P0617j2755J16103n2209J06512n6120J05078J60229j408Q877Q8014
$$ 4859100 4929717 4916962 5033065 4980856 5087368 5031248 5136326 5296555 5295147 5304024 5392038
5090E392038P9888J19716J44260l316J17010J02723M3477K34320K10719L1740
$$ 5392038 5471926 5591642 5735902 5732586 5849596 5952319 5995796 6230116 6440835 6472575
5080F472575K16408p9456l3809J03283J49901o5690m4255L22k118R2695J6157
$$ 6472575 6688983 6609527 6575718 6679001 6828902 6763212 6718957 6719279 6717161 6809856 6826013
5069F826013N6067J19737K34903O3180J39725K66428K87011L16724L42046L34211
$$ 6826013 6882080 7001817 7236720 7299900 7439625 7706053 7993064 8309788 8651834 8986045
5059H986045M28759N79879N63392P36262Q51709R91255J090162J064650J069791
$$ 8986045 9414804 9994683 10558075 11294337 12146046 13137301 14227463 15292113 16361904
5050A6361904J337778J203462J170999J137680Q16812M66794J34157j02739n41335
$$ 16361904 17699682 18903144 20074143 21211823 22028635 22495429 22629586 22526847 21985512
5041B1985512n45830p95611q28573n51098n65239k88307j07448J53331J33023
$$ 21985512 21439682 20644071 19815498 19264400 18699161 18410854 18303406 18456737 18589760
5032A8589760M88460M20069N56678O88647R21580J168762J337471K096674K086370
$$ 18589760 19078220 19498289 20054967 20743614 21665194 22833956 24171427 26268101 28354471
5023B8354471K495692K768397K846376K848668K490481K802001K486698K097091
$$ 28354471 30850163 33618560 36464936 39313604 41804085 44606086 47092784 49189875
5015D9189875J531062O80391k45933j192288j994293k541635k471888k489265
$$ 49189875 50720937 51401328 51155395 49963107 47968814 45427179 42955291 40466026
5007D0466026k045304j978197j393404j308622q33495n99481m01051L3448K52126
$$ 40466026 38420722 36442525 35049121 33740499 32907004 32307523 31906472 31939920 32192046
4998C2192046N68012J047791J394202J846456K333242K767029K827195L097904
$$ 32192046 32760058 33807849 35202051 37048507 39381749 42148778 44975973 48073877
4990D8073877L340277L289709L111255K809232K165365J424135L00182p10609
$$ 48073877 51414154 54703863 57815118 60624350 62789715 64213850 64514032 63803423
4982F3803423j896722k875200l319227l399898l349277l259381k726089k391365
$$ 63803423 61906701 59031501 55712274 52312376 48963099 45703718 42977629 40586264
4974D0586264j972122j519762j244703r61651m93914m56532j71074M4020M58472
$$ 40586264 38614142 37094380 35849677 34888026 34394112 33937580 33766506 33810526 34268998
4965C4268998P09286Q84197J558495J839710K305480K469983K425087K158628
$$ 34268998 34978284 35862481 37420976 39260686 41566166 44036149 46461236 48619864
4957D8619864J889525J225353N85001p5093n93563j044119j526920j637239j525895
$$ 48619864 50509389 51734742 52319743 52244650 51651087 50606968 49080048 47442809 45916914
4948D5916914j628383j395248j377896j311658j072746j251831j244613j169880
$$ 45916914 44288531 42893283 41515387 40203729 39130983 37879152 36634539 35464659
4940C5464659r92602r12518p36613n19229k33311J11348L09610M81479Q63581
$$ 35464659 34472057 33559539 32822926 32303697 32070386 32181734 32491344 32972823 33836404
4931C3836404R84188J210356J354431J519012J358826J350463J292426J008122
$$ 33836404 34820592 36030948 37385379 38904391 40263217 41613680 42906106 43914228
4923D3914228Q92643P94482P10840P28301O67248N84121K76640j0900l42144p86842
$$ 43914228 44806871 45601353 46312193 47040494 47707742 48291863 48568503 48557603 48215459 47428617
4913D7428617r17262j144860j328421j368404j320944j258155r32631n90394l55286
$$ 47428617 46511355 45366495 44038074 42669670 41348726 40090571 39157940 38567546 38212260
4904C8212260l55311J39132J01200L57744O54125N55193P12358P56023P24157
$$ 38212260 37856949 37996081 38097281 38455025 39109150 39664343 40376701 41132724 41856881
4895D1856881P64972Q73925J030802R06271Q73840P56963O87381N02371J88341
$$ 41856881 42621853 43495778 44526580 45432851 46306691 47063654 47751035 48253406 48441747
4886D8441747L0583k57214n33851q25558j134787j296588j382407j531362j539168
$$ 48441747 48472330 48215116 47681265 46855707 45720920 44424332 43041925 41510563 39971395
4877C9971395j632021j280970j113802j127550p16687o72304k84209k94173j56138
$$ 39971395 38339374 37058404 35944602 34817052 34100365 33428061 33143852 32849679 32693541
4868C2693541j17198k0549J67408o8815R9098M8789K82397K94129K64055J92713
$$ 32693541 32576343 32555794 32723202 32654387 32753485 32802274 33084671 33378800 33642855 33835568
4858C3835568O9744N8857l94117l83659n86504q98388j118516r72893j048252
$$ 33835568 33905312 33964169 33570052 33186393 32599889 31701501 30582985 29610092 28561840
4849B8561840j063657j119561r98823q24298q95094o73794n58735m99728n22323
$$ 28561840 27498183 26378622 25379799 24555501 23660407 22986613 22427878 21928150 21405827
4840B1405827l17688l68854j50246j27630j79233r9672N0329n7784k2723J32923
$$ 21405827 21088139 20719285 20569039 20441409 20262176 20162504 20212833 20155049 20132326 20265249
4830B0265249J62719K00684j5817J63290L08052P6879Q3836l2673J15976K21094
$$ 20265249 20427968 20628652 20612835 20776125 21084177 21161056 21244892 21212219 21328195 21549289
4820B1549289J58415P5369J68723M18021L32603L54136O05738L35382N23414N24996
$$ 21549289 21707704 21783073 21951796 22369817 22702420 23056556 23662294 23997676 24521090 25046086
4810B5046086O07818M41618M79400O35536O18014N29968O46655N52016P85584
$$ 25046086 25653904 26095522 26574922 27210458 27828472 28358440 29005095 29557111 30342695
4801C0342695P57731N76918N09516O08917M00692N75237N43897O49865P71680
$$ 30342695 31100426 31677344 32186860 32795777 33196469 33771706 34315603 34965468 35737148
4792C5737148Q66558J019248J055802J275295J339227J235601J294099J528692
$$ 35737148 36603706 37622954 38678756 39954051 41293278 42528879 43822978 45351670
4784D5351670J485732J531701J744949K011200K202980K356880K484852K415058
$$ 45351670 46837402 48369103 50114052 52125252 54328232 56685112 59169964 61585022
4776F1585022K217207K228984J959351J889882J703303J768929J732232J945489
$$ 61585022 63802229 66031213 67990564 69880446 71583749 73352678 75084910 77030399
4768G7030399K211386K256106K738964L418780M130056M565978N222255M981065
$$ 77030399 79241785 81497891 84236855 87655635 91785691 96351669 101573924 106554989
4760A06554989M269529L356203K533275J604999J544531J585022J920652K271130
$$ 106554989 110824518 114180721 116713996 118318995 119863526 121448548 123369200 125640330
4752A25640330K367786K793660K546002K335490K096289J648611R74017L42464
$$ 125640330 128008116 130801776 133347778 135683268 137779557 139428168 140402185 140744649
4744A40744649l43407j106406j620916k156882k300617k263036j698369j156588
$$ 140744649 140401242 139294836 137673920 135517038 133216421 130953385 129255016 128098428
4736A28098428q61679r13395j619049k253207l104385l309049l577309l530649
$$ 128098428 127236749 126323354 124704305 122451098 119346713 116037664 112460355 108929706
4728A08929706l334302k739509k238213k055416j654833j527525j364145j294894
$$ 108929706 105595404 102855895 100617682 98562266 96907433 95379908 94015763 92720869
4720I2720869r54857j089557j120120j359362j445020j642762j512776j537667
$$ 92720869 91766012 90676455 89556335 88196973 86751953 85109191 83596415 82058748
4712H2058748j237137j150572r00810p79369o57674n46493n55318l91728j41280
$$ 82058748 80821611 79671039 78770229 77990860 77333186 76786693 76231375 75839647 75698367
4703G5698367j39814P6856J98433M69056N66008Q71640R00272R03139J099900
$$ 75698367 75558553 75635409 75833842 76302898 76868906 77740546 78640818 79543957 80643857
4694H0643857R76361P96596O00725M73237L28788Q0691j01353m8565k33716j96554
$$ 80643857 81620218 82416814 83017539 83490776 83819564 83900255 83798902 83750337 83516621 83320067
4684H3320067l77281l49077j12781k52313j67814o2005K09164L93843L26698O39379
$$ 83320067 82942786 82593709 82480928 82228615 82060801 81998796 82207960 82601803 82928501 83567880
4674H3567880O10324N79642M54324M22236L49447j3952j33889m15654o85940q47015
$$ 83567880 84178204 84757846 85212170 85634406 85983853 85969901 85836012 85420358 84734418 83887403
4664H3887403j130542j355390j321562j518993j440644j464212j397556j207217
$$ 83887403 82756861 81401471 80079909 78560916 77120272 75656060 74258504 73051287
4656G3051287j122328j082784r65722o94266p21762o33551n51661l27378m25541
$$ 73051287 71928959 70846175 69880453 69186187 68464425 67830874 67279213 66951835 66526294
4647F6526294m29778m33097n10671n64485p48937j001367r83896j301525j282511
$$ 66526294 66096516 65663419 65152748 64588263 63839326 62837959 61854063 60552538 59270027
4638E9270027j625524j704457j838862j707145j974330j849988j696030j547956
$$ 59270027 57644503 55940046 54101184 52394039 50419709 48569721 46873691 45325735
4630D5325735j424172j264865j076651j099219r29661p62585q22908n90581o96072
$$ 45325735 43901563 42636698 41560047 40460828 39531167 38768582 37945674 37355093 36659021
4621C6659021p66551n65811n29397o29276m66861o03245m99524n43954o97045
$$ 36659021 35892470 35326659 34797262 34167986 33701125 33097880 32598356 32054402 31357357
4612C1357357q00487o91897j013083q29770q18193r11611o80586q37761q00790
$$ 31357357 30556870 29864973 28851890 28022120 27203927 26292316 25611730 24773969 23973179
4603B3973179o79350o75936p21403n35357o37615n95712l65453o23375n23548
$$ 23973179 23293829 22617893 21896490 21361133 20723518 20127806 19762353 19138978 18615430
4594A8615430m58948l90158l86269l33149m45036l42736m05486m53327m33541
$$ 18615430 18156482 17766324 17380055 17046906 16601870 16259134 15853648 15400321 14966780
4585A4966780n00575l54778m36525l50719m34244k87583l44846m08090l48549
$$ 14966780 14466205 14111427 13674902 13324183 12889939 12602356 12257510 11849420 11500871
4576A1500871k82891l12399k64014l42863k37248m38339k29119l52583k65580
$$ 11500871 11217980 10905581 10641567 10298704 10061456 9623117 9393998 9041415 8775835
4567H775835k47310j60242k44684k32182j48442k76136r5496j73657j58417j68943
$$ 8775835 8528525 8368283 8123599 7891417 7742975 7466839 7371343 7197686 7039269 6870326
4557F870326p8431l17229j14124j17304j00570j09596j06211j41979k13529m0782
$$ 6870326 6791895 6474666 6360542 6243238 6142668 6033072 5926861 5784882 5571353 5530571
4547E530571j32275j43806j4466p58k30987p9277l1510j7286k02777O096j08804
$$ 5530571 5398296 5254490 5240024 5239266 5008279 4929002 4897492 4880206 4677429 4683525 4574721
4536D574721p9890o563p6679o0822k9201K815o8255l26j39260m0337O9038p0899
$$ 4574721 4494831 4488268 4411589 4350767 4321566 4324381 4256126 4255800 4116540 4076203 4145241 4074342
4524D074342l5826q1816n913p8659j30346M4914m4350Q8627j94383m203P67J5561
$$ 4074342 4038516 3956700 3950787 3872128 3741782 3786696 3742346 3830973 3636590 3632387 3633154 3648715
4512C648715j37363K6995O5080j73132M2305n8877n2265n6964k7354O1881m1732
$$ 3648715 3511352 3538347 3603427 3430295 3472600 3413723 3361458 3304494 3277140 3339021 3297289
4501C297289l7949r0856K2498K0314o6315o4947L3956K4983j49323K6649J4058
$$ 3297289 3259340 3168484 3190982 3211296 3144981 3080034 3113990 3138973 2989650 3016299 3030357
4490C030357m62j05901m230J9080M2748j23436j7336J151j78555N8859K9179K6428
$$ 3030357 3029895 2923994 2919764 2938844 2981592 2858156 2840820 2841971 2663416 2722275 2751454 2777882
4478B777882r2482P0472j13524J73057q6618k8716p1233L1500n3666j45356Q4693
$$ 2777882 2685400 2755872 2642348 2815405 2728787 2700071 2628838 2660338 2606672 2461316 2546009
4467B546009J8910j3478L8326M9417q5293J686l1945l9558K5971o6722O6931r7442
$$ 2546009 2564919 2551441 2589767 2639184 2553891 2555577 2523632 2484074 2510045 2443323 2510254 2412812
4455B412812m0283M9547m6375p561n3050O6809q7256J83498l3510j69915J1129
$$ 2412812 2372529 2422076 2375701 2368140 2315090 2381899 2294643 2478141 2444631 2274716 2285845
4444B285845J55270j2680j30331O6153j10839J05992M5585o7665J075J21625q8726
$$ 2285845 2441115 2428435 2298104 2364257 2253418 2359410 2404995 2337330 2338405 2460030 2371304
4433B371304J0822L557J4004R3613K1569J36056K20821O4566M9461L967O4638
$$ 2371304 2382126 2385683 2399687 2493300 2514869 2650925 2871746 2936312 2985773 2989740 3054378
4422C054378k11049j33664n7792j03911j03870k6900O299n850M2325j46298J00909
$$ 3054378 2843329 2709665 2651873 2547962 2444092 2417192 2423491 2417641 2459966 2313668 2414577
4411B414577q6879J89891p1634Q2918k4463P1985j15894J04377K496O4625J47934
$$ 2414577 2327698 2517589 2445955 2528873 2504410 2576395 2460501 2564878 2567374 2631999 2779933
4400B779933K91387M75076K29270Q3063O8144R9346l87080j96611n8887j98005
$$ 2779933 3071320 3546396 3775666 3858729 3926873 4026219 3639139 3442528 3383641 3185636
4390C185636j86709p1644l1674P8545o3996J52320j12426K48947L6107k0847K04059
$$ 3185636 2998927 2927283 2895609 2974154 2910158 3062478 2950052 3198999 3235106 3214259 3418318
4379C418318K26623K57784P00404P24480O28592M30780p8348J14459k72953j11844
$$ 3418318 3644941 3902725 4603129 5327609 5956201 6386981 6308633 6423092 6150139 6038295
4369F038295m01489k98612m25451j78427l67874j37724j49532j24657J0614j0070
$$ 6038295 5636806 5338194 4912743 4734316 4366442 4228718 4079186 3954529 3965143 3955073
4359C955073m1941J21656Q5068r6973J38176J60484J58373K29774L28000N87099
$$ 3955073 3913132 4034788 4119856 4022883 4161059 4321543 4479916 4709690 5037690 5624789
4349E624789J108670J604451J377600J017980P2973l27048n11542r51688p33541
$$ 5624789 6733459 8337910 9715510 10733490 10806463 10479415 9967873 9016185 8282644
4340H282644p79815p11654m64549m24427k31496k12069J504r7260M8522m5482
$$ 8282644 7502829 6791175 6326626 5902199 5670703 5458634 5460138 5362878 5411400 5365918
4330E365918O1942K0558J55682k242K19883J90544J24125L44392L08017N97252
$$ 5365918 5427860 5448418 5604100 5601858 5821741 6012285 6136410 6480802 6788819 7386071
4320G386071Q53113Q30758N99395K91301M7689j32289j24949j42763M0524K29859
$$ 7386071 8239184 9069942 9669337 9960638 10008327 9876038 9751089 9608326 9648850 9878709
4310I878709K76477M02335N71593P73011Q84433J109215O46537O45761K92869
$$ 9878709 10155186 10557521 11129114 11902125 12786558 13895773 14542310 15188071 15480940
4301A5480940k73987n13665o67833q15451q26260p85684q79329o21037p30486
$$ 15480940 15206953 14693288 14025455 13210004 12383744 11598060 10718731 10097694 9367208
4292I367208m67938n45787l30564n48827l12062k48793k75545j96526j44767P541
$$ 9367208 8899270 8353483 8022919 7474092 7162030 6913237 6637692 6441166 6296399 6303940
4282F303940j97906j49637j25602j55278P818j11449l4026l7525k0060J06130
$$ 6303940 6106034 5956397 5830795 5675517 5683335 5571886 5537860 5500335 5480275 5586405
4272E586405K01062R3604p1175J03060K3599j59303n5616P8069k20472j10790
$$ 5586405 5787467 5881071 5809896 5912956 5936555 5777252 5721636 5799705 5579233 5468443
4262E468443k24863K7526k38280o5922k2548j7009q4425j29610J52916O8020p1607
$$ 5468443 5243580 5271106 5032826 4966904 4944356 4927347 4842922 4713312 4866228 4934248 4862641
4251D862641q2479L3348R6253O8410j443K65463O7772L12590L34204N0859L3959
$$ 4862641 4780162 4813510 4909763 4978173 4976730 5242193 5309965 5622555 5956759 6007618 6041577
4240F041577l719j26723r0625j92988p5057n9883j12500K8239K4609J78177K96130
$$ 6041577 6037858 5911135 5820510 5627522 5552465 5492582 5380082 5408321 5432930 5611107 5907237
4229E907237P5993J17138n7683j76918j20653j71803N6788j99728j31458j9946
$$ 5907237 5983230 6100368 6042685 5865767 5745114 5573311 5630099 5430371 5298913 5278967
4219E278967k13272j00169J8959o6373O909k4253n5572J7617j23908Q5931P2830
$$ 5278967 5065695 4965526 4984485 4918112 4925021 4900768 4845196 4862813 4738905 4824836 4897666
4208D897666j2119P543J44508K2859M35549M10309O89433L47995J24026n1645
$$ 4897666 4885547 4893090 5037598 5060457 5496006 5906315 6595748 6943743 7067769 7016124
4198G016124j67101k88672l98129l28144k47400m00313l79279j56507l56790k94034
$$ 7016124 6849023 6560351 6162222 5834078 5586678 5186365 4807086 4650579 4293789 3999755
4188C999755k82441o8046j24373j46609j4079o4538q0172R1702p5571K7979L0939
$$ 3999755 3717314 3649268 3524895 3378286 3364207 3299669 3219497 3311199 3235628 3263607 3294546
4177C294546k0026J01390K19010K28677J55965O5587m2072p5966k69201q8280
$$ 3294546 3274520 3375910 3594920 3823597 3979562 4045149 4003077 3927111 3657910 3569630
4167C569630j65157k62710j76005j36629o435j90183j93946r5457l0727j67060
$$ 3569630 3404473 3141763 2965758 2829129 2822694 2632511 2438565 2343108 2312381 2145321
4157B145321j2007j51072k6533j554J14294j46134k7130r8307o4742l9201j39396
$$ 2145321 2133314 1982242 1955709 1954155 2068449 1922315 1895185 1796878 1732136 1692935 1553539
4146A553539o1554q89k4232n8711J0856R9879r8551l1616k9774j27461j1838K1547
$$ 1553539 1491985 1491096 1466864 1408153 1419009 1518888 1420337 1388721 1358947 1231486 1219648 1241195
4134A241195R9469k7142o77n5307P1445j20462P4377J0160j9989q7216J07282
$$ 1241195 1340664 1313522 1312845 1257538 1328983 1208521 1282898 1293058 1273069 1185853 1293135
4123A293135j45834L5672M5758q4255P397o6852m1002K4838n2972J18573p7725
$$ 1293135 1147301 1182973 1228731 1144476 1151873 1085021 1044019 1068857 1015885 1134458 1056733
4112A056733j5700j4728n0031m0634n5592J68880j61417N2553J2909l1125L232
$$ 1056733 1041033 1026305 976274 935640 880048 1048928 887511 940064 952973 921848 925080
4101I25080J14225o88o9401K4295p862l3897N6970j451j1992l8362o1980J21862
$$ 925080 1039305 1038617 969216 993511 985649 951752 1008722 1007271 995279 956917 894937 1016799
4089A016799p9883r5661l3575R7121L0145j09024J13235K7558o1131M3619K0667
$$ 1016799 936916 841255 807680 904801 934946 825922 939157 966715 905584 949203 969870
4078I69870j9131m8038m1593J52536j38638L7715J1313J08588j902p2137L9174
$$ 969870 950739 902701 861108 1013644 875006 912721 924034 1032622 1030720 958583 997757
4067I97757M0860l7721N5043j54940O4396N2092j2970m4167K0085o8563Q1948
$$ 997757 1038617 1000896 1055939 900999 965395 1017487 1004517 960350 980435 911872 993820
4056I93820m9012J02464o5378J20083j33405P9049q3427J39686n3971J08008J9383
$$ 993820 944808 1047272 981894 1101977 968572 1047621 964194 1103880 1049909 1157917 1177300
4045A177300j26204J39075O7580k9456p4271P9259O3422N9690r0331Q1237J00831
$$ 1177300 1051096 1190171 1257751 1228295 1154024 1233283 1296705 1356395 1266064 1347301 1448132
4034A448132m645L5983L714L9463K7087J11936j2493M8504m0172m5283m6898R1437
$$ 1448132 1443487 1479470 1483184 1522647 1549734 1661670 1649177 1697681 1657509 1612226 1565328 1656765
4022A656765Q3855r0683j0368M7438p7008K18375o6629J1205k5731J82452Q4856
$$ 1656765 1740620 1649937 1639569 1687007 1609999 1828374 1761745 1772950 1747219 1929671 2014527
4011B014527L3128M8640Q3283J57833J71038M1422Q9201N6117r5282r2613L2844
$$ 2014527 2047655 2096295 2179578 2337411 2508449 2549871 2639072 2695189 2599907 2507294 2540138
4000B540138j49401r7705j29701r4045k3433j10014N6986l2943Q1733J9207l6699
$$ 2540138 2390737 2293032 2163331 2069286 2045853 1935839 1992825 1959882 2041615 2060822 2024123
3989B024123L4581K9118l6705J18136Q531P5348J33753q9713P938l3862N837j03719
$$ 2024123 2058704 2087822 2051117 2169253 2177784 2253132 2386885 2297172 2305110 2271248 2277085 2173366
3977B173366m1453m1779l8762J184j54213j03295k5588p7770o1919m7508Q4301
$$ 2173366 2131913 2090134 2051372 2052556 1898343 1795048 1769460 1691690 1629771 1582263 1666564
3966A666564n5997l0741j6293j670J9563j73226M1172q6148Q2539k4406j89966
$$ 1666564 1610567 1579826 1563533 1561863 1581426 1408200 1449372 1363224 1445763 1421357 1231391
3955A231391m961o2560j5094o4504n2426r8123N1909k8481p6377O771p2645l8076
$$ 1231391 1226430 1163870 1148776 1084272 1031846 933723 985632 957151 880774 887545 814900 776824
3943G76824n6713L4259j0441p1471J6764L9516Q4361k35821N2016K6411l2903
$$ 776824 720111 754370 743929 672458 689222 728738 813099 577278 629294 655705 622802
3932F22802P9617q9207m4397N203m047q3240M9866n7078m1721p2672L4723J58681
$$ 622802 702419 613212 568815 574018 569971 486731 536597 479519 437798 365126 399849 558530
3920E58530j47741P3346M579n6839q5936N3077p0107J16274r1786r17N3858o8760
$$ 558530 410789 484135 488714 431875 345939 399016 328909 445183 353397 352480 406338 337578
3908C37578l378Q3490J4218K5242k50091J09662J5764k2411J2184r4719J66659
$$ 337578 334200 417690 431908 457150 207059 316721 332485 310074 322258 227539 394198
3897C94198o5033n3699j6862k6124L9371o0520J03912o8747k6803J8620K9331
$$ 394198 329165 275466 258604 232480 271851 211331 315243 246496 219693 238313 267644
3886B67644L1438j26418J72994j25793J7771j26029P875M3681K7139j1291j02476
$$ 267644 299082 172664 345658 219865 237636 111607 119482 163163 190302 179011 76535
3875G6535K1008O7998L214j6440L3383K8955O659j15995N864J879Q1845q7021
$$ 76535 97543 165541 168755 152315 185698 214653 221312 105317 111181 113060 194905 107884
3863A07884J00914o0142k3827j7646k6460L0264j5319M5346n5961L3462k6215
$$ 107884 208798 148656 124829 107183 80723 110987 95668 141014 85053 118515 92300
3852I2300K7617O8308n2853r9503J31733j7517o1765j8616N4595k7135Q3163o2102
$$ 92300 119917 188225 135372 35869 167602 150085 88320 69704 124299 97164 180327 118225
3840A18225j7266o0065N8275o4449O8717j3134J174q7523O697J35744j36844M6416
$$ 118225 100959 40894 99169 34720 103437 90303 91477 3954 10651 146395 9551 55967
3828E5967n6424R3245l6872J5959k6586Q8374o4895l4421L9496m0935J13697j73091
$$ 55967 -457 92788 55916 71875 45289 133663 68768 34347 73843 32908 146605 -26486
3816b6486J8421p4028J54410n0125p271l1125J02430n0307p9385n886L6244R4521
$$ -26486 -8065 -82093 72317 22192 14921 -16204 86226 35919 -43466 -49352 -13108 81413
3804H1413q9381J4q5218O0175o2186J32175r441J2804n9246l240R8439q8665J1163
$$ 81413 -7968 -7954 -93172 -32997 -95183 36992 27551 40355 -18891 -22131 76308 -12357 -1194
3791a194Q603N3862M9320o5050m6657k7417P3023r2922L7518k6606J8353L1685
$$ -1194 7409 61271 110591 45541 -1116 -28533 44490 -48432 -10914 -37520 -19167 12518
3779A2518n0189M3057p4915P159J2840o0549N55R5436l3419L2575M3567j61114
$$ 12518 -37671 5386 -69529 -62370 -49530 -110079 -109524 -14088 -47507 -14932 28635 -132479
3767a32479L8821q0002N4959P2411L5109K1421P1743p1200p0938Q9034j23821
$$ -132479 -93658 -173660 -118701 -46290 -11181 10240 81983 10783 -60155 28879 -94942
3756i4942R9865O486l4332k3422j1331M1463n2143M7332n1098J17958j52128K9814
$$ -94942 4923 11409 -22923 -46345 -57676 -16213 -68356 -21024 -72122 45836 -106292 -76478
3744g6478p247O025J893N6321n8537j4505K8578N9229j91002J06891K6973N5388
$$ -76478 -83725 -77700 -75807 -19486 -78023 -92528 -63950 -4721 -195723 -88832 -61859 -6471
3732f471r947N366l0996J11542N6380j68906M7779m1884L1112p8863J48781j40335
$$ -6471 -16418 -11052 -42048 69494 125874 -43032 4747 -37137 -6025 -84888 63893 -76442
3720g6442J03575J0846l2723j44365J12796j7022k8494K0647m1887M1170r15J4367
$$ -76442 27133 37979 5256 -139109 -26313 -43335 -71829 -51182 -93069 -51899 -52814 -38447
3708c8447o6187J31721M4459j04886p6664N4682L3802K1610L4702r5120m4341
$$ -38447 -104634 27087 71546 -33340 -110004 -55322 -21520 90 34792 -60328 -104669
3697a04669k6270M7702M2152j13414J88723j29803J94107r9089R8071q3071j1775
$$ -104669 -130939 -83237 -41085 -154499 34224 -95579 98528 -561 97510 14439 2664
3686B664q8983j0731L6249M7717k1512j98899P5736L3099M2825q3193M9364p861
$$ 2664 -86319 -97050 -60801 -13084 -34596 -233495 -157759 -124660 -81835 -165028 -115664 -123525
3674a23525j8423j0893O0549m3641N9945o1432j4967Q9488j05171J29214O1853
$$ -123525 -141948 -152841 -92292 -135933 -75988 -137420 -152387 -62899 -168070 -38856 22997
3663B2997j49520L7715m0545n1939J03208j02080K0187J01812l9795k8837j7811
$$ 22997 -126523 -88808 -129353 -181292 -78084 -180164 -159977 -58165 -97960 -126797 -144608
3652a44608P8331R703o4812R5183j54544O5828L0428M6162l4343r0694J66216
$$ -144608 -66277 -56574 -121386 -26203 -180747 -114919 -84491 -38329 -72672 -163366 2850
3641B850j24285J75577k21338N1999m5J78612j59151j8730M2995J39638j51959
$$ 2850 -121435 54142 -167196 -115197 -115242 63370 -95781 -114511 -71516 68122 -83837
3630h3837l3417q8644Q6956R790L9107j34557J62195l6522J9116J5200j7776p5583
$$ -83837 -117254 -205898 -118942 -109152 -70045 -204602 -42407 -78929 -59813 -44613 -62389 -137972
3618a37972R2366p0278p9773J03394p374n0531J23259j30867l5726J27825m6064
$$ -137972 -45606 -115884 -195657 -92263 -99637 -150168 -26909 -157776 -193502 -65677 -111741
3607a11741M5689r3311k2318J9664k5223J49272m4075L5829j4357m2919j5746
$$ -111741 -66052 -159363 -181681 -162017 -187240 -37968 -82043 -46214 -60571 -103490 -119236
3596a19236P1925o5738m3194l673q400M5160O2155n8645K7275r8832J04992K0624
$$ -119236 -47311 -113049 -156243 -159916 -168316 -123156 -61001 -119646 -92371 -191203 -86211 -65587
3584f5587j26072J1358K3095o5335K13602m3295m1834m8461J27913j45126M6303
$$ -65587 -191659 -180301 -157206 -222541 -8939 -52234 -94068 -142529 -14616 -159742 -113439
3573a13439l8219O8001j6997j01077J15225r9322M7971o8087J36396l3686o0034
$$ -113439 -151658 -83657 -100654 -201731 -86506 -185828 -137857 -205944 -69548 -103234 -163268
3562a63268J82588j45202k2665O2484L425l9175O2533j5677K4702m0528j1818
$$ -163268 19320 -125882 -148547 -86063 -82638 -121813 -59280 -74957 -50255 -90783 -102601
3551a02601j13781O6663P4641q2343Q9352r9228r9099J37028J06766j58154M9886
$$ -102601 -216382 -149719 -75078 -157421 -68069 -167297 -266396 -129368 -22602 -180756 -130870
3540a30870Q3887j04931M1035n5155J2664K3493N9730j6456r7036N7459J08171
$$ -130870 -46983 -151914 -110879 -166034 -153370 -129877 -70147 -86603 -183639 -126180 -18009
3529a8009q5175o1633J0228m1453M5785k8157J06836j34801J38768p0131J606
$$ -18009 -103184 -164817 -154589 -196042 -150257 -178414 -71578 -206379 -67611 -137742 -136136
3518a36136L579o9931k9254J61816m7083J6716n5655J91083k15611k2887J9972
$$ -136136 -132557 -202488 -231742 -69926 -117009 -100293 -155948 35135 -180476 -203363 -183391
3507a83391J58941m0980K2489p8600J2965l7139P3342j57080O8006K6932n4208
$$ -183391 -24450 -65430 -42941 -121541 -108576 -145715 -72373 -229453 -161447 -134515 -188723
3496a88723K9601m3567R6068m4133K2795K7300o7338P2908L4785j9929j34592
$$ -188723 -159122 -202689 -106621 -150754 -127959 -100659 -167997 -95089 -60304 -80233 -214825
3485b14825K8302N2308Q428l1202R9744o7658Q910K9397q0623k9504L9376N2453
$$ -214825 -186523 -134215 -125787 -156989 -57245 -124903 -115993 -86596 -167219 -196723 -157347 -104894
3473a04894m5168R2038j01794q1568J28699L6670o9950n193K3190M6093n2740
$$ -104894 -150062 -58024 -159818 -241386 -112687 -76017 -145967 -151160 -127970 -81877 -134617
3462a34617K7237o2074K4120J0767P2662j19412J63754j32834N5905L4032m5261
$$ -134617 -107380 -169454 -145334 -134567 -61905 -181317 -17563 -150397 -94492 -60460 -105721
3451a05721o1306J61298q5054n6118Q6588k589P8093j58759O4174P982L3889q6781
$$ -105721 -167027 -5729 -90783 -146901 -60313 -62902 15191 -143568 -79394 -71412 -37523 -124304
3439a24304J8618l2717M9499N7970j03058J5330N5201m8497L2521j2587j0764
$$ -124304 -105686 -138403 -88904 -30934 -133992 -118662 -63461 -111958 -79437 -92024 -102788
3428a02788k8539N9702K7781p732j3378j20366Q3761m9249Q7814J9032k7468k6929
$$ -102788 -131327 -71625 -43844 -51576 -64954 -185320 -101559 -150808 -62994 -43962 -71430 -98359
3416i8359O0422j67061J06122q5422J58312j27375n1008M429J64275j07675K1889
$$ -98359 -37937 -204998 -98876 -184298 -25986 -153361 -204369 -199940 -35665 -143340 -121451
3405a21451L1186O4415n9034K0588p4931P3563J643l9225J240O4526j37666J20047
$$ -121451 -90265 -25850 -84884 -64296 -139227 -65664 -64021 -103246 -102006 -37480 -175146 -55099
3393e5099N2986j13378M2709k1967L037P5287o5204L2767J06050M2599o1405q5323
$$ -55099 -2113 -115491 -72782 -94749 -91712 -16425 -81629 -48862 57188 99787 38382 -46941
3381d6941J26508m1058O0881J3999J2468J52218q532K348J36071K14576L91389
$$ -46941 79567 38509 99390 113389 125857 278075 269543 271891 407962 622538 1013927
3370A013927M27134J76086J42420k53683N001k58878k40791k55540j32299j44897
$$ 1013927 1441061 1617147 1759567 1505884 1510885 1252007 1011216 755676 623377 478480
3360D78480k75460K1406j67132P8999l3197K770l1733m9804N4418m4316j36776
$$ 478480 203020 224426 57294 136293 103096 105866 74133 24329 78747 34431 -102345
3349a02345J20974n6520L2636O3562j46121L1103N220j9955p649q8098J75381
$$ -102345 18629 -37891 -5255 58307 -87814 -56711 -51491 -71446 -79095 -167193 8188
3338H188r2989m2690P5747L9480n192j36561R6320n0653N5912q3013R3978R690
$$ 8188 -84801 -127491 -51744 -12264 -17456 -154017 -57697 -108350 -52438 -135451 -41473 -31783
3326c1783M0861j06465J91825j77357J44896l5052L0154K1204q604N2813K5352
$$ -31783 9078 -97387 94438 -82919 61977 26925 57079 78283 69679 122492 147844
3315A47844O7246k6231J64576O3610M82506L08333N88851J2850K5118j57872k66742
$$ 147844 215090 188859 353435 417045 899551 1207884 1796735 1809585 1834703 1676831 1410089
3304A410089l45540j37112l59690j08466j87751j54646o025N2967J8548k06582
$$ 1410089 1064549 927437 567747 459281 271530 116884 110859 163826 182374 -24208
3294b4208O4735K7552m5923j18673L7465k9648N7576L1671k5522m261N90m2369
$$ -24208 40527 68079 22156 -96517 -59052 -88700 -31124 547 -24975 -29236 -28646 -71015
3282g1015l4846L888O7696j03584M4879J531n0592N0196O720j7773k8581K5067
$$ -71015 -105861 -101973 -34277 -137861 -92982 -91451 -142043 -91847 -85127 -102900 -131481 -106414
3270a06414O4920j01211o993P099o5828J81355p3304p2433o9304J12952N911N7636
$$ -106414 -41494 -142705 -149698 -142599 -208427 -27072 -100376 -172809 -242113 -129161 -123250 -65614
3258f5614j3033r0685Q8198p994j2712n7679M8056j21966P2808M3060r274q8719
$$ -65614 -78647 -169332 -81134 -89128 -101840 -159519 -111463 -233429 -160621 -117561 -126835 -215554
3246b15554J31248K8229m5095r2034N9242j8530P2155L6451r9061j2662j3658
$$ -215554 -84306 -56077 -101172 -193206 -133964 -152494 -80339 -43888 -142949 -155611 -169269
3235a69269P214k7462L7089J629L8384l0596l3180O2495k7570m2780K1709j11309
$$ -169269 -162055 -189517 -152428 -150799 -112415 -143011 -176191 -113696 -141266 -184046 -162337 -273646
3223b73646O9580J5955j8751l4651K4099J7609P0803q9037K4698n5978R0595l897
$$ -273646 -204066 -188111 -206862 -241513 -217414 -199805 -129002 -218039 -193341 -249319 -158724 -162621
3211a62621K0025Q9327j15881M5351K3996o5085l6270o307L5434J8048o0989r741
$$ -162621 -142596 -53269 -169150 -123799 -99803 -164888 -201158 -207465 -172031 -153983 -214972 -224713
3199b24713L3605l068P7830j5616n1967L309p3193J52038k5793k9578O4828q14
$$ -224713 -191108 -194176 -116346 -131962 -183929 -180620 -253813 -101775 -127568 -157146 -92318 -93132
3187i3132q4945q7310P7001L7221j6151L3029l9017N9737O5438r3592R5184O268
$$ -93132 -178077 -265387 -188386 -151165 -167316 -134287 -173304 -113567 -48129 -141721 -46537 -40269
$$ [...]
##END NTUPLES=NMR SPECTRUM
##END=
