##TITLE=abcd
##JCAMPDX= 6.0         $$ Bruker NMR JCAMP-DX V2.0
##DATA TYPE= NMR SPECTRUM
##DATA CLASS= NTUPLES
##ORIGIN= UXNMR, Bruker Analytische Messtechnik GmbH
##OWNER= root
$$ XWIN-NMR		Version 3.5
$$ Fri Jul 24 17:37:04 2026 Russian Standard Time (UT+4h)  servis@DPX200
##.OBSERVE FREQUENCY= 200.131235884673
##.OBSERVE NUCLEUS= ^1H
##.ACQUISITION MODE= SIMULTANEOUS
##.ACQUISITION SCHEME= undefined
##.AVERAGES= 32
##.DIGITISER RES= 18
##SPECTROMETER/DATA SYSTEM= spect
##.PULSE SEQUENCE= zg
##.SOLVENT NAME= CDCl3
##.SHIFT REFERENCE= (INTERNAL, CDCl3, 0, 16.4885)
##AUDIT TRAIL= $$ (NUMBER, WHEN, WHO, WHERE, WHAT)
$$ ##TITLE= Audit trail, XWIN-NMR		Version 3.5
$$ ##JCAMPDX= 5.01
$$ ##ORIGIN= Bruker BioSpin GmbH
$$ ##OWNER= servis
$$ F:\spectra/data/av/nmr/H1/1/pdata/1/auditp.txt
$$ ##AUDIT TRAIL=  $$ (NUMBER, WHEN, WHO, WHERE, WHAT)
(   1,<2026-07-24 17:35:59.31 +0400>,<servis>,<DPX200>,
      <created by zg, POWCHK disabled, PULCHK disabled
       configuration hash MD5:
       00 E9 B6 7A A2 85 ED C7 34 08 36 98 17 FE 4E 26
       data hash MD5: 32K
       26 28 F4 9E 52 D4 52 EC 74 55 71 CF B6 C7 84 C0>)
(   2,<2026-07-24 17:36:25.96 +0400>,<servis>,<DPX200>,
      <Start of raw data processing
       efp BC_mod = 2 LB = 0.05 FT_mod = 6 PKNL = 1 PHC0 = -416.9321 PHC1 = 3.101563 SI = 16K 
       data hash MD5: 16K
       2C 22 32 14 4B DB 0F 2D 90 76 80 27 BD 87 C1 23>)
$$ ##END=
$$ 
$$ hash MD5
$$ 17 09 EB C6 9C FE 2D FE CA 87 BB 28 C0 C0 8E 68
##$RELAX= 
##$RELAX= 
##$RELAX= 
##$RELAX= 
##$RELAX= 
##$RELAX= 
##$RELAX= 
##$RELAX= 
$$ Bruker specific parameters
$$ --------------------------
##$DU= <F:\spectra>
##$EXPNO= 1
##$NAME= <H1>
##$PROCNO= 1
##$TYPE= <nmr>
##$USER= <av>
##$AMP= (0..31)
100 100 100 100 100 100 100 100 100 100 100 100 100 100 100 100 100 100 
100 100 100 100 100 100 100 100 100 100 100 100 100 100 
##$AQSEQ= 0
##$AQ_mod= 1
##$AUNM= <au_zg>
##$AUTOPOS= <>
##$BF1= 200.13
##$BF2= 200.13
##$BF3= 200.13
##$BF4= 200.13
##$BF5= 500.13
##$BF6= 500.13
##$BF7= 500.13
##$BF8= 500.13
##$BYTORDA= 1
##$CFDGTYP= 0
##$CFRGTYP= 5
##$CHEMSTR= <none>
##$CNST= (0..31)
1 1 145 1 1 1 1 1 1 1 1 1 1 1 1 1 1 1 1 1 1 1 1 1 1 1 1 1 1 1 1 1 
##$CPDPRG= <>
##$CPDPRG1= <>
##$CPDPRG2= <>
##$CPDPRG3= <>
##$CPDPRG4= <mlev>
##$CPDPRG5= <mlev>
##$CPDPRG6= <mlev>
##$CPDPRG7= <mlev>
##$CPDPRG8= <mlev>
##$CPDPRGB= <>
##$CPDPRGT= <>
##$D= (0..31)
0 2 0 0 0 0 0 0 0 0.06 0 0 0 0 0 0 0.0002 0 0 0 0 0 0 0 0 0 0 0 0 0 0 
0 
##$DATE= 1784900158
##$DBL= (0..7)
120 120 120 120 120 120 120 120 
##$DBP= (0..7)
150 150 150 150 150 150 150 150 
##$DBP07= 0
##$DBPNAM0= <>
##$DBPNAM1= <>
##$DBPNAM2= <>
##$DBPNAM3= <>
##$DBPNAM4= <>
##$DBPNAM5= <>
##$DBPNAM6= <>
##$DBPNAM7= <>
##$DBPOAL= (0..7)
0.5 0.5 0.5 0.5 0.5 0.5 0.5 0.5 
##$DBPOFFS= (0..7)
0 0 0 0 0 0 0 0 
##$DE= 6
##$DECBNUC= <off>
##$DECIM= 32
##$DECNUC= <off>
##$DECSTAT= 4
##$DIGMOD= 1
##$DIGTYP= 9
##$DL= (0..7)
0 120 120 120 120 120 120 120 
##$DP= (0..7)
150 150 150 150 150 150 150 150 
##$DP07= 0
##$DPNAME0= <>
$$ [...]
##$SUBNAM4= <"">
##$SUBNAM5= <"">
##$SUBNAM6= <"">
##$SUBNAM7= <"">
##$SUBNAM8= <"">
##$SUBNAM9= <"">
##$SW= 20.6817932712277
##$SWIBOX= (0..15)
0 0 3 0 0 0 0 0 0 0 0 0 0 0 0 0 
##$SW_h= 4139.07284768212
##$TD= 32768
##$TD0= 1
##$TE= 0
##$TE2= 300
##$TE3= 300
##$TEG= 300
##$TL= (0..7)
0 120 120 120 120 120 120 120 
##$TP= (0..7)
150 150 150 150 150 150 150 150 
##$TP07= 0
##$TPNAME0= <>
##$TPNAME1= <>
##$TPNAME2= <>
##$TPNAME3= <>
##$TPNAME4= <>
##$TPNAME5= <>
##$TPNAME6= <>
##$TPNAME7= <>
##$TPOAL= (0..7)
0.5 0.5 0.5 0.5 0.5 0.5 0.5 0.5 
##$TPOFFS= (0..7)
0 0 0 0 0 0 0 0 
##$TUNHIN= 0
##$TUNHOUT= 0
##$TUNXOUT= 0
##$USERA1= <user>
##$USERA2= <user>
##$USERA3= <user>
##$USERA4= <user>
##$USERA5= <user>
##$V9= 5
##$VALIST= <valist>
##$VCLIST= <CCCCCCCCCCCCCCC>
##$VD= 0
##$VDLIST= <DDDDDDDDDDDDDDD>
##$VPLIST= <PPPPPPPPPPPPPPP>
##$VTLIST= <TTTTTTTTTTTTTTT>
##$WBST= 1024
##$WBSW= 30
##$XGAIN= (0..3)
0 0 0 0 
##$XL= 0
##$YL= 0
##$YMAX_a= 257654
##$YMIN_a= -488620
##$ZGOPTNS= <>
##$ZL1= 120
##$ZL2= 120
##$ZL3= 120
##$ZL4= 120
##$ABSF1= 0
##$ABSF2= 0
##$ABSG= 0
##$ABSL= 0
##$ALPHA= 0
##$AQORDER= 0
##$ASSFAC= 0
##$ASSFACI= 0
##$ASSFACX= 0
##$ASSWID= 0
##$AUNMP= <proc_1d>
##$AZFE= 0.1
##$AZFW= 0.1
##$BCFW= 0
##$BC_mod= 2
##$BYTORDP= 0
##$COROFFS= 0
##$CY= 18.4799938201904
##$DATMOD= 1
##$DC= 0
##$DFILT= <>
##$DTYPP= 0
##$F1P= 9.9274215381318
##$F2P= -0.165520771350173
##$FCOR= 1
##$FTSIZE= 16384
##$FT_mod= 6
##$GAMMA= 0
##$GB= 0
##$INTBC= 1
##$INTSCL= 4.127829e-11
##$ISEN= 128
##$LB= 0.05
##$LEV0= 0
##$LPBIN= 0
##$MAXI= 10000
##$MC2= 0
##$MEAN= 0
##$ME_mod= 0
##$MI= 50
##$NCOEF= 0
##$NC_proc= -7
##$NLEV= 6
##$NOISF1= 3.799351
##$NOISF2= 2.8
##$NSP= 0
##$NTH_PI= 0
##$NZP= 0
##$OFFSET= 16.48848
##$PC= 4
##$PHC0= -416.9321
##$PHC1= 3.101563
##$PH_mod= 1
##$PKNL= yes
##$PPARMOD= 0
##$PSCAL= 4
##$PSIGN= 0
##$REVERSE= no
##$SF= 200.130005582386
##$SI= 16384
##$SIGF1= 3
##$SIGF2= 2
##$SINO= 400
##$SIOLD= 16384
##$SREGLST= <1H.CDCl3>
##$SSB= 0
##$STSI= 16384
##$STSR= 0
##$SW_p= 4139.07284768211
##$SYMM= 0
##$S_DEV= 0
##$TDeff= 32768
##$TDoff= 0
##$TI= <>
##$TILT= no
##$TM1= 0
##$TM2= 0
##$TOPLEV= 0
##$USERP1= <user>
##$USERP2= <user>
##$USERP3= <user>
##$USERP4= <user>
##$USERP5= <user>
##$WDW= 1
##$XDIM= 16384
##$YMAX_p= 476964699
##$YMIN_p= -1614648
$$ End of Bruker specific parameters
$$ ---------------------------------
##NTUPLES= NMR SPECTRUM
##VAR_NAME=  FREQUENCY,     SPECTRUM/REAL,   SPECTRUM/IMAG
##SYMBOL=    X,             R,               I
##VAR_TYPE=  INDEPENDENT,   DEPENDENT,       DEPENDENT
##VAR_FORM=  AFFN,          ASDF,            ASDF
##VAR_DIM=   16384,         16384,           16384
##UNITS=     HZ,            ARBITRARY UNITS, ARBITRARY UNITS
##FACTOR=    0.252644378177508, 1,           1
##FIRST=     3299.83951724647, 0,            0
##LAST=      -839.233330435636, 0,           0
##MIN=       -839.233330435636, -1614648,    0
##MAX=       3299.83951724647, 476964699,    0
$$ Real data points
##PAGE= N=1
##DATA TABLE= (X++(R..R)), XYDATA
$$ [...]
14313 21345 -257583 317840 -71076 -326394 14564 -273654 202906 20366 31509 147367
14303 147367 542793 625510 -170731 -63857 -5259 122618 -398064 -142820 85304 149709
14293 149709 -327812 -334892 113952 -6218 -356001 -17185 -478707 -16888 91332 -221260
14283 -221260 -204644 105991 38493 91748 246242 -58045 -70634 -321607 102360 153348
14273 153348 -145714 -331790 83181 15154 158774 126652 -337926 154300 267694 87191
14263 87191 -179080 -34035 -309807 -10000 -155936 -7310 31580 -28275 -194215 41181
14253 41181 228660 -73624 282555 -14077 95222 -35455 -158449 180436 -204301 -316470
14243 -316470 -261404 -12142 -131124 66103 250029 -28726 -6449 136272 -17012 266736
14233 266736 -40698 178551 -255094 -100140 -513902 -103113 331349 -212207 -55676 -202637
14223 -202637 235254 105129 13758 97435 -39764 -146746 -2327 435241 -367720 72037
14213 72037 -400234 -348684 -85540 -49530 203326 488003 -165351 188037 -99427 49879
14203 49879 -478623 -95936 86240 -151505 211780 82972 -63701 33738 162739 95538
14193 95538 735 113962 -71694 -212932 154174 45663 40581 -63644 -127015 -83831 -122579
14182 -122579 -75813 115879 -135642 79374 183098 -95385 -43803 124036 68915 -4039
14172 -4039 32550 318308 141455 6509 17336 412188 -86013 237432 301418 40382
14162 40382 144809 234175 80818 -151815 -73792 -302570 155732 195481 -214016 89459
14152 89459 207080 -172073 311693 -199632 -76243 77613 181351 -23543 -1505 -224505
14142 -224505 10450 22153 231529 45964 -203988 -33314 142579 522438 36179 -320840
14132 -320840 92219 154772 -454421 -38555 432660 93856 -105990 117664 -161725 129328
14122 129328 -77089 -94203 38605 268663 -60587 -243934 75752 167663 217530 -55942
14112 -55942 192502 121225 -5475 -279371 -63217 10812 177456 -290765 -266646 259951
14102 259951 -153451 -24953 627268 -190558 319418 -194353 5480 34007 95325 -200179
14092 -200179 73940 -40385 -184895 -203254 9868 -29487 -39113 -284772 -307552 -436488
14082 -436488 63212 -80261 -444090 -39334 -216891 538432 213805 287596 -18172 49981
14072 49981 -306086 -32453 82784 44994 -45896 -85379 117815 -69078 -29571 -474653
14062 -474653 -387783 -134585 207226 57823 -298860 189334 -296244 363455 -34163 -71145
14052 -71145 264197 5861 222123 -39729 -46071 -81177 -97852 121427 -127640 -48184 192968
14041 192968 -287407 -142299 -101804 336273 127063 15828 -405218 -451182 380677 450596
14031 450596 15031 207921 33509 52406 45134 -241269 92819 -421485 -279766 152233
14021 152233 -353810 71912 -385051 -107618 10263 -407681 -1415 38123 -111832 -172930
14011 -172930 22580 102374 -579 -153367 -333568 356372 -123834 -184618 -133716 -53945
14001 -53945 -373019 -56432 1972 183948 154481 -676817 -164241 -172966 -249527 -43286 -89412
13990 -89412 -193040 9104 -368657 -342589 -224637 -309783 111115 326946 -83933 27086
13980 27086 -33158 325960 158925 239963 4965 -123500 -42525 -16318 -138729 -290418
13970 -290418 145344 58794 -234520 -61480 -603321 -348134 -43605 -44115 15831 84077 231783
13959 231783 143107 -324234 116587 326546 241896 138430 -172704 173696 -136912 -48940
13949 -48940 51628 -57450 -285955 -76896 -25137 -160809 -191055 -57219 111978 127121
13939 127121 332306 154407 146208 148035 327293 99152 35660 112374 336714 -206572 510517
13928 510517 149639 412599 -217979 -205266 -349984 -245725 65443 -60289 -455261 166648
13918 166648 53226 333093 -216063 59495 -188929 114767 101331 261794 352382 -306814
13908 -306814 125814 7741 -123712 -74873 -197696 -37970 -251164 -7998 11157 68807
13898 68807 -17338 350677 214812 48446 -235280 -50480 19781 -336353 -49701 542972
13888 542972 -52808 -106567 -170852 205596 -42779 368988 89512 -239209 -269313 -30373
13878 -30373 274169 211489 -157303 -487359 -465801 209218 56732 -246414 -8649 -156671
13868 -156671 -357959 -234801 -162713 116522 -36174 -268446 -17250 -151719 -77422 109948
13858 109948 97439 -500388 286014 -4364 -56394 -655950 -241495 101110 259160 -147090
13848 -147090 310974 -92064 198164 -337420 -54722 171148 23203 -371715 -59492 -461435
13838 -461435 63890 -80127 279 -103292 -178680 -315999 -347258 94521 -55713 156716
13828 156716 -542028 -33199 -647928 -199146 -253896 -23057 -545990 -43293 -356523 -189864
13818 -189864 32498 -120161 -159823 -187453 350252 85466 278573 46431 86011 -244954
13808 -244954 136615 243832 160999 234975 232138 -313566 98335 -84897 39855 125388
13798 125388 61443 -203131 280375 45621 -153665 -87912 207537 165154 -589090 -130992
13788 -130992 248661 103958 -103788 -250117 -160313 -66049 265870 100476 -212914 -369974
13778 -369974 147726 102839 136005 -195037 10702 102 172178 -205677 100846 -468717
13768 -468717 71617 -29162 -103288 30272 133235 -264879 -278448 -192372 -385127 64441
13758 64441 -36885 -133080 362240 104184 -190166 32583 -115325 -213673 -216866 -176370 181174
13747 181174 -42326 287136 23293 117248 45974 35909 -179409 134373 -388111 117347
13737 117347 -11573 -220946 -3468 -181678 10568 -178291 -409457 -229442 172504 10683
13727 10683 -252369 135406 -122523 149180 -199832 -51648 9737 24142 -50687 -5407
13717 -5407 -149348 -174331 63267 175701 144104 -135599 91654 251286 -319657 -63851
13707 -63851 -378070 65334 -609029 -611168 -352434 -227970 -10796 -275628 -23071 -558677
13697 -558677 -22794 -52669 242069 122234 -2088 64065 175405 297533 -61259 -152382
13687 -152382 445604 240147 123062 -333729 -254092 227169 -202041 315215 -223690 -286031
13677 -286031 108289 -334644 -22216 206881 299022 -34229 90148 38694 62726 304010
13667 304010 36577 166184 -483 101614 -567815 -335708 200331 -133872 -23503 -307903
13657 -307903 -365750 -433892 -207288 -272422 232225 -24334 198739 -6083 -308193 -16882
13647 -16882 82207 -168231 -29774 -502389 -149082 256628 -216959 231468 -103010 -143955
13637 -143955 -151953 -350338 -219145 193010 78562 -12744 -125281 -244779 -265797 133386
13627 133386 283335 109253 233382 -333851 -115517 -252693 381371 -244874 54224 -60353
13617 -60353 -248657 -260361 -364147 -149177 -117053 -33467 -135687 -148352 -286463 -110227
13607 -110227 45465 -229128 -172471 -286649 -327289 -1788 -239338 341835 -70232 -345446
13597 -345446 79865 -45619 332967 173201 -240385 -106136 -221174 -128315 73843 -169470
13587 -169470 -478727 -34827 -109319 102015 -23810 -59818 33852 -190505 -338190 -265528
13577 -265528 43741 36337 397385 71265 -107098 159242 148781 31688 -135678 214469
13567 214469 -17699 33537 -199293 -34486 398988 75231 170712 31404 -96429 6106
13557 6106 -109559 68620 35096 -127443 -41079 18356 62472 -108801 -87427 49295 -73779
13546 -73779 133980 96104 238731 113167 123024 -446187 -288683 -284983 -180028 132174 -56867
13535 -56867 62239 -208941 -62009 -21877 -332475 -48802 -19372 -158214 -183046 -307473
13525 -307473 -456666 -41369 132270 -27352 171226 108147 -184723 86745 82410 20408
13515 20408 17564 -192710 -96590 -183976 197901 -81915 374060 323651 464272 184389 -123592
13504 -123592 191622 -117536 389148 344363 117106 312725 -116233 -222812 -77638 555590
13494 555590 174144 16213 -15587 375990 163521 159731 -93335 84079 170704 243079
13484 243079 -26762 -248406 13277 -73195 -39708 408245 -42293 -108255 -127093 274281
13474 274281 -44648 -240740 -141799 -199057 -26009 -80337 183528 286696 -81551 215159
13464 215159 231354 -128396 54477 166579 394515 -376898 -175424 -442850 -42956 -117790
13454 -117790 -669876 187486 151448 -130843 -26863 71406 -252022 -133618 -155904 97531
13444 97531 13157 554288 -14380 222164 -21030 153396 -303205 -77585 -179533 -108256
13434 -108256 -561756 160656 58399 -74324 -12289 -70781 148103 -93080 -87003 -224682
13424 -224682 -273520 637446 146253 -539012 -275358 -66159 -194735 -188100 259266 -79907
13414 -79907 -41520 141509 -123033 168017 -447749 -24938 -387949 199142 -54040 -262995
13404 -262995 -200529 214511 -314304 -37334 -156527 188877 -306171 -208238 -54828 -313643
13394 -313643 -86021 99667 110739 69491 216200 171083 -61140 -367365 -87227 42090
13384 42090 -48849 21830 28844 141752 167041 431736 4935 315525 74987 -155713 -422582
13373 -422582 -155143 -143995 -135491 -207372 -39020 -213480 -316918 14483 -100333 -122250
13363 -122250 -125102 164011 -219188 -424650 -551774 -624324 -15018 206580 -174469 -45638
13353 -45638 27462 -148121 351037 200564 150589 143574 325440 7466 250386 -158012
13343 -158012 -170211 219847 -4356 -209008 -252081 -320825 -23842 118783 168405 -514490
13333 -514490 179016 260705 -523887 98077 -125879 68495 -26288 135667 -56787 1518
13323 1518 193102 -378609 -144725 230751 49736 289974 -80958 -379353 -36175 319802
13313 319802 27355 -207240 376876 289711 300832 265192 223593 30650 226341 68488
13303 68488 212183 -32935 -403609 -387320 -305645 -220208 -436133 152425 -179953 97701
13293 97701 176340 -11167 -164092 -128365 18778 -385477 -131358 -151235 -442333 -251663
13283 -251663 -26569 23160 -62430 183372 225030 180206 120356 235233 -63949 -254312
13273 -254312 -227634 -144345 -10611 374309 382803 -159574 -124452 -181142 -336726 -97067 -84055
13262 -84055 230728 54414 132526 -312281 -16749 -73366 41871 -431782 -126481 -209374
13252 -209374 -161800 10600 -142106 -105754 -138811 21814 23729 -31284 204977 61037 -175492
13241 -175492 -76701 -393940 257157 215181 -34807 144340 138677 28415 455596 -39177
13231 -39177 -98482 1324 -579718 84555 304496 -254678 281826 -185738 -278081 -81980
13221 -81980 -225408 232502 -256420 244199 278754 -199608 -144938 -212606 -106698 -191091
13211 -191091 -51558 -235518 -142873 -60783 127886 6365 108247 -130092 -316508 -47092
13201 -47092 249747 233132 -414876 61241 618366 10381 -128753 -203827 246974 -8008
13191 -8008 25372 18407 -316413 -287481 -442851 238197 12017 -99329 -147120 154224 -181336
13180 -181336 -125577 223137 113170 -221260 -32627 124783 -78844 -62269 302921 36860
13170 36860 181132 15045 -66527 146989 -179480 215004 -366813 8069 -93938 76462
13160 76462 -220171 -241953 109919 -22749 343564 -180240 -214317 2583 -137431 -136540 -289735
13149 -289735 -137176 205101 231278 -91155 -176515 -149746 -426407 190524 -157692 -70666
13139 -70666 349994 80866 -183668 225514 -253618 13558 -180917 -177847 -438474 -472445
13129 -472445 80234 -38833 -51841 155571 215996 -6129 -221814 94056 187561 79864
13119 79864 -103593 -297884 -233125 -304103 33449 -89938 -452096 252599 91964 48456
13109 48456 -141188 -171577 -382990 132894 119545 -37740 192752 258284 -137350 196720
13099 196720 145001 255131 107891 -316692 -67117 -210165 -468267 409349 -439185 -544322
13089 -544322 417831 -80167 280762 -56144 -191560 -197184 83916 169179 -71846 -131801
13079 -131801 190930 425416 -128964 267105 -169065 -128205 161649 90525 175468 -269282
13069 -269282 32514 10959 -130459 -468871 -39090 -307095 -16272 -85639 -184574 321945
13059 321945 -79479 17832 -188670 -23322 -173525 -2907 460687 207614 -481830 -25281
13049 -25281 -2664 196922 -64496 -192542 -25843 111328 128466 25406 -88264 -19306
13039 -19306 301323 -42609 24906 -43443 27600 13664 179348 233942 410814 -181134 -124780
13028 -124780 -41096 194623 90964 -112311 -10443 -159553 -324585 -144904 168621 124369
13018 124369 114675 38831 274680 219858 -47539 -73401 392971 226465 73552 -57427
13008 -57427 -35594 215702 428373 51941 -421078 -225386 -59937 -110072 51437 342600
12998 342600 -446149 87068 -92099 46549 -37912 -152345 5589 57263 -158730 155193
12988 155193 -73568 151356 -17017 -45448 -120331 181115 142667 183036 -553349 -123380
12978 -123380 -380646 203607 43670 140377 271084 149383 267749 -214327 222876 24296
12968 24296 42639 436866 -153551 54097 -140457 -50721 355789 -48571 70665 255561
12958 255561 123648 -53088 86238 110222 -253339 -145529 129197 -326223 110338 -13669
12948 -13669 -52243 -121509 -105293 91652 374063 -17240 163687 -154389 -1917 170703
12938 170703 88010 140270 64040 -165292 46573 134335 -52963 -376937 -78551 -21588
12928 -21588 -272468 -235555 -22840 -74284 187372 -81537 -30846 355444 107427 117908
12918 117908 -37732 -175861 -150713 -26043 30034 -2385 126217 140277 -12628 -51358
12908 -51358 23701 -131782 123737 -270257 45910 140344 -429363 65416 156313 150281 8748
12897 8748 -190930 93407 -153770 159066 19992 60831 -326878 -435074 -43326 49583
12887 49583 317864 187121 262774 -105215 -23360 190448 -79143 148379 -518287 -184039
12877 -184039 444756 267087 84129 -273253 -257948 173766 181382 -55423 228594 -216792
12867 -216792 11085 -99550 -127911 -88973 -95651 -173650 -140469 -65443 -293840 90080 -25571
12856 -25571 -402357 40148 265963 128858 319016 -225588 125796 -344838 124256 349380
12846 349380 386954 -224649 69815 -306197 44561 14763 -31158 -16520 258258 -21926
12836 -21926 -221923 166477 -279602 -50273 -122914 156366 153795 567034 47454 130194
12826 130194 111706 15632 154306 -146747 182362 -35626 100702 277265 380812 112752
12816 112752 -63795 47285 214178 477420 332033 261166 73069 -444925 -338869 -218277
12806 -218277 47021 206274 300264 211587 -106974 79779 -48936 -360381 397070 -274932
12796 -274932 404019 186578 23959 149193 -234249 -128629 304884 15442 140570 115663
12786 115663 65608 16609 18654 69396 166565 -34987 6019 -88415 417886 -233832 -103832
12775 -103832 189911 -78027 -144459 -405228 400668 -397382 49509 171062 167457 -171256
12765 -171256 -22236 -225037 -273944 131946 -137795 303832 61665 323559 -47966 34523
12755 34523 -34581 229728 -234987 -47598 191401 272654 234886 -387493 123409 -303118
12745 -303118 -42245 239280 -495537 160560 133658 -174890 245888 106531 -131767 -24190
12735 -24190 -133611 -205428 -51159 -58010 78737 23248 189732 152730 415926 -327111 419955
12724 419955 290952 21530 137892 -409334 -10815 388759 -127084 268698 87667 32344
12714 32344 -15942 -88030 81398 211674 108680 -67773 -19107 120240 -195823 -216570
12704 -216570 138422 99834 -263645 -186419 85180 -413573 187850 -181672 72252 226164
12694 226164 89470 -125664 94218 221918 -50817 -224107 -356659 -297979 311483 300560
12684 300560 14346 26927 468965 70715 -93105 -46062 -118980 335865 392547 46864
12674 46864 -447393 204199 -73987 -52724 -125311 -85032 -95017 212214 -85159 261407 -177042
12663 -177042 421627 -148930 640598 287945 138704 -74145 -51546 303135 -63156 128163
12653 128163 83286 555237 -163049 -63260 195111 20704 152521 -216537 -89936 106262
12643 106262 178817 178138 338562 380846 -359176 316019 -272295 604244 325827 68656
12633 68656 311513 322351 116146 151765 557228 137568 17805 -7972 44493 159138
12623 159138 295501 401566 446102 172858 318216 154188 236244 274606 -112100 -347501
12613 -347501 55211 202376 600011 148344 371191 320697 170227 -40742 128376 388250
12603 388250 97861 78287 -116944 244852 160973 -439418 333219 -434104 10443 -19074
12593 -19074 131638 255058 286162 -133071 121947 78484 148977 -70030 -164082 368374
12583 368374 -5597 187294 102459 -549552 376489 -107397 60250 -22080 238338 463868
12573 463868 185549 41399 -232363 38357 300364 -300479 -190872 343854 146286 160862
12563 160862 429604 146438 291379 227395 -10528 9824 -323784 -127719 60812 -89643
12553 -89643 7720 -350543 177111 -165046 362355 -152011 269630 26098 390810 -199649
12543 -199649 245372 -82344 58753 126259 -122715 86873 479309 -61809 359210 273867
12533 273867 154817 242740 -25015 43809 208197 -248996 283636 -115087 148079 -113917
12523 -113917 120612 -208512 300027 139403 5677 381813 12265 -163505 403305 221523
12513 221523 35420 140749 217490 -381693 -82628 338147 121077 -9850 291881 -1027
12503 -1027 -30125 253386 -237624 -139133 249183 145295 -172307 510514 184160 225843
12493 225843 231095 -136017 412673 310316 27970 410186 -66566 -61351 -82730 -19164 390063
12482 390063 250602 -104619 -159684 -106079 298611 55465 14426 -296114 -51848 227090
12472 227090 144809 190205 259447 498661 103037 68177 498456 -17525 -134277 192226
12462 192226 -259727 462319 219638 486047 117844 212652 189658 239026 40098 -182915
12452 -182915 -193954 444396 -175218 165114 43427 -138000 38442 552252 263512 -158664
12442 -158664 672303 4069 489510 150304 -43600 264192 247970 174265 47587 67107
12432 67107 142235 170049 43567 316825 -429509 466123 -24123 218803 96322 -196726
12422 -196726 214298 76691 247671 -295353 -147572 -85707 -56786 451454 -229500 -95950
12412 -95950 241 -177663 -17652 81295 123313 424806 237953 -21653 470835 152732
12402 152732 834472 -341159 -288835 197107 432845 -70584 245894 310400 270798 444296
12392 444296 231694 167382 56854 -293647 158673 1898 -119681 96101 -58475 172887
12382 172887 282704 78717 245670 163630 101285 128081 201680 -79387 409496 294468
12372 294468 293844 97310 409246 173301 263985 416675 481027 80218 445316 144466
12362 144466 140651 -11291 15271 279518 -348973 95548 59432 145002 23805 216998
12352 216998 -19041 409068 -175766 -63233 100010 221179 169888 410736 312123 142067
12342 142067 -41140 368103 224790 -6909 157977 240067 204160 25487 464176 20440
12332 20440 202477 568388 267152 215590 258245 -190673 266461 323841 -193271 129800
12322 129800 -171323 3333 2465 116991 -69265 399734 184730 379842 255853 58531
12312 58531 198867 141342 -72032 104197 207539 12095 306838 18954 42569 -61274
12302 -61274 294996 -15305 659727 513937 207493 477845 -154136 -221072 53222 -75642
12292 -75642 65795 -101439 -76794 340899 212790 225871 -55886 16345 343987 213947
12282 213947 107378 121514 -181448 143217 48889 -17903 -297319 -14243 -101466 70452
12272 70452 530071 679598 107064 -270029 631923 -24503 -9337 205586 271948 181845
12262 181845 -51622 -254746 543317 196919 105695 105606 78092 48782 -151494 -26432 34446
12251 34446 -106217 395172 107174 626622 632024 -57644 123493 128976 59568 196704 225196
12240 225196 391732 -85067 -130223 103944 -48063 458980 382565 68161 -212567 -76735
12230 -76735 491782 -193851 -69101 166239 -280577 88318 88182 87712 96464 464191 -30987
12219 -30987 253814 469778 103659 320254 301062 122309 370545 13234 287802 121972
12209 121972 428275 313766 80923 225473 94696 -44111 92773 184174 109276 293439
12199 293439 23275 131131 444288 398272 43591 344859 503636 450497 227068 202034
12189 202034 373258 94814 -1682 415926 269348 7414 66643 -163517 287499 145990
12179 145990 322818 362805 201696 -91670 66312 262407 596768 404752 206368 -90929
12169 -90929 257274 323593 252831 -109721 -153379 -111754 -98377 -10393 528509 35448 -169900
12158 -169900 204477 83776 -80473 7361 253715 452625 160242 104501 1827 470786
12148 470786 236913 599633 -28276 564222 236130 281822 230967 -131603 -1674 234436
12138 234436 257658 436773 119396 404203 284834 284418 549035 -212362 -767 -61955
12128 -61955 340833 371516 380738 75303 175402 -42954 219828 -59811 337493 -44695
12118 -44695 96270 194961 59878 564553 173198 386069 76640 125426 753830 372844
12108 372844 -441831 245802 -211469 332071 74774 156787 150549 419172 445485 305224
12098 305224 117850 558785 185316 145923 347865 317706 285998 494310 211845 267975
12088 267975 54520 447021 146401 321993 35007 271867 -141377 849782 -220994
12079 -220994 -34055 -81145 333761 401563 123320 245282 12804 325689 256442 365948
12069 365948 256934 212452 493611 566387 -128345 100150 12040 -68281 261732 467083
12059 467083 145769 185099 269088 265626 234863 37135 247550 143713 547155 180208
12049 180208 556226 576174 384723 356485 207505 148019 225159 447262 217162 299930
12039 299930 506871 12809 459530 395836 365132 173879 76426 528673 427383 513102
12029 513102 287184 456200 335365 339834 287104 411869 290874 427619 95323 257409
12019 257409 266400 486057 695795 -95457 235072 -198441 51020 345445 491161 222516
12009 222516 556236 342816 494567 146450 209501 536103 98452 538778 523169 469138
11999 469138 528747 112896 -141030 424825 459765 350007 136989 300751 250323 882652
11989 882652 214131 703902 444705 -21619 558095 365133 198215 464789 201392 776071
11979 776071 60793 -191052 421991 -134074 397461 320698 281484 245353 493240 375013
11969 375013 179963 425284 247225 452933 110289 618372 632588 250387 328603 749879
11959 749879 331700 247987 567274 555991 629505 558924 19895 395248 308802 346193 245747
11948 245747 497477 513470 351078 583802 240470 359587 -21856 255634 -248307 332392
11938 332392 51619 -46659 24716 121172 57565 549015 472898 235817 -8801 -257571
11928 -257571 352401 393823 416913 172250 264500 467479 655120 211630 623676 379051
11918 379051 85788 810324 181532 577674 446421 517358 283148 589926 348453 783070
11908 783070 465428 657380 537063 594760 744816 629873 504290 728317 280543 257321
11898 257321 415237 349863 517419 452520 423822 675593 645371 604080 578392 635270 736428
11887 736428 738706 564335 573597 591778 123570 421911 575347 618001 983705 624409 560401
11876 560401 607693 255621 343697 668530 314677 830733 342461 708128 421834 430508
11866 430508 347416 577156 395408 686087 469095 222651 536319 455531 362780 923207
11856 923207 871270 519177 681008 529191 921784 772272 868759 719386 408528 651932
11846 651932 898453 829107 636040 894418 756860 730289 778697 465469 646155 886722
11836 886722 471709 828383 737159 862820 1000898 761488 991908 978284 851624 785879
11826 785879 598968 788161 725452 1004706 745778 1038188 1005816 942607 1034867 599521
11816 599521 1306176 644388 740496 812518 619764 915902 846014 949835 862170 1082741
11806 1082741 916150 1096826 992414 1054981 817888 601000 1065722 873106 1094508 1398647
11796 1398647 851685 968831 870835 1225947 1047354 1192618 1227537 1067431 1310407 1147771
11786 1147771 1730870 1028413 919226 1572848 1370003 1613903 1387283 1308804 1634949 1662085
11776 1662085 1076233 1186610 1560817 1362846 1603214 1679212 1346332 1688406 1310726 1899604
11766 1899604 1953902 1681349 1960831 1917026 1996047 2312139 1570738 1947998 1962978 2238606
11756 2238606 2444043 2045502 2497992 2735114 2329313 2582958 2515931 2900366 2825163 3068303
11746 3068303 2825536 3169526 3315361 3231212 3456870 3609157 3918613 4311778 4232478 4737715
11736 4737715 4512883 5469107 5616612 5847776 6232309 6716471 7259207 8063190 7660542
11727 7660542 9184353 9493804 10098946 11530041 12432695 13491239 14608719 15501287 16577006
11718 16577006 17789447 18812333 19434907 20208809 19928941 19810483 19480506 18573268 17692491
11709 17692491 17035884 15751398 14422068 13219148 12493995 11373357 10494857 9821369 8848077
11700 8848077 7976803 7414083 6755397 6569478 5882530 5564664 5253480 5259921 4491278 4220309
11690 4220309 4202292 3982637 3636874 3565767 3455625 3631288 3215261 3256974 2741594 2920629
11680 2920629 2862199 2707105 2623048 2330873 2660361 2326130 2408056 2431913 2242496 1842438
11670 1842438 2214233 1980389 2028596 2176965 1719215 1823277 1822750 1789515 1975948 2153320
11660 2153320 1515187 1691781 1472539 1281211 1748055 1485876 1162145 1593544 1180225
11651 1180225 1422689 1120340 913250 1326795 881589 552388 1114867 953879 782738
11642 782738 964417 951615 760398 1267339 1330566 930794 839369 695997 1287766 1056037
11632 1056037 957884 1113090 571434 974135 1033438 973118 969131 471476 1045309 983382
11622 983382 709170 570525 1030298 769209 757193 706771 778944 815886 760633 310702
11612 310702 137691 437857 829228 1139304 688991 1046198 343271 515457 553479 788512
11602 788512 640116 250857 512759 822540 288014 598750 803178 87888 800117 643284
11592 643284 733604 372457 755721 525664 510371 418179 451405 644509 594584 545445 974974
11581 974974 620802 644741 313957 335597 309135 -38540 404388 652881 420401 671436
11571 671436 592823 520526 756366 461313 394766 310171 163607 458934 180115 647252
11561 647252 258337 544244 621567 339325 550328 569855 -17807 282437 546668 477456
11551 477456 759642 44781 46644 630232 204997 685143 280788 359998 720464 298969
11541 298969 530386 449575 296687 630019 457708 482339 262579 338351 761100 344311
11531 344311 107658 595034 427633 663000 328988 511518 328870 190563 329928 544982
11521 544982 382620 493379 230813 384966 533876 425994 416860 183771 397921 186671
11511 186671 366160 563354 671327 752687 238529 190733 447338 259190 465863 -75793
11501 -75793 439384 379297 907133 646285 355211 502733 365097 279086 290832 369335
11491 369335 323792 259962 439158 309380 176344 298322 987300 501237 354011 465641
11481 465641 262822 549235 558140 661602 498633 665743 -163793 707024 680530 521703
11471 521703 639829 501839 172752 895414 534080 706900 588500 256063 437110 759081
11461 759081 83105 682120 746497 198444 802988 215366 961869 568699 609340 747385
11451 747385 103324 697759 539291 770787 494780 341577 404795 734063 327786 469637
11441 469637 764427 530325 77826 841452 358785 602631 576067 169359 988673 545522
11431 545522 717251 554862 320898 665291 626319 81969 654778 424941 315821 233836
11421 233836 1035436 717508 695179 774457 637165 571119 310801 391213 540876 458630
11411 458630 444109 689435 354793 442146 941604 504060 605418 720906 779614 634511
11401 634511 490727 658889 433747 470934 215743 661221 874672 536253 925147 494660
11391 494660 638558 798661 298297 529041 1153802 579432 323227 401800 69123 624770
11381 624770 1078962 489818 643638 495586 619234 763667 555483 922535 648392 29890
11371 29890 298210 578545 383963 487082 108247 575981 415125 430830 407799 509251
11361 509251 377817 353644 279079 510472 515315 352453 -39510 632560 266537 827424
11351 827424 748008 574108 837422 585213 648103 794239 610725 127371 621575 214894
11341 214894 547018 475596 887411 928658 498048 341159 805932 306189 731496 672915
11331 672915 227151 298330 841208 907580 1206474 518773 618259 806366 534333 497559
11321 497559 481553 379155 639881 652651 682507 121423 779982 534665 312555 892327
11311 892327 573582 708530 826731 635529 521734 632521 270063 663727 444811 1006605
11301 1006605 330481 861270 748936 668692 730495 1015307 624027 942050 863309 868406
11291 868406 732372 960892 895485 514144 1136236 989719 736116 1265199 958100 1101097
11281 1101097 857191 1107866 1649806 1351448 1119453 1153999 1287047 1109489 1338925 1278149
11271 1278149 1290473 1998337 2686437 3911253 4893432 7023366 8465233 8963054 8179324
11262 8179324 7442070 6428209 5075410 4004596 3443007 2742353 2141089 1641315 1851335
11253 1851335 1402307 946987 1172477 931975 828451 898343 691436 927221 875670 959860
11243 959860 637313 771569 922348 835278 758125 820801 760194 598864 879927 849072
11233 849072 972804 738940 754144 620850 869902 1081029 869967 936089 989613 704629
11223 704629 933669 602809 753016 951687 743656 895364 1006042 944700 1056952 566444
11213 566444 850952 583326 891362 597532 542322 603731 480700 633621 785772 778425
11203 778425 522489 904094 830490 594250 737810 839776 622218 640777 784630 629324
11193 629324 771384 643178 738179 635300 904534 732620 999948 503669 693331 770896
11183 770896 753745 811020 365371 274573 640510 344208 552521 855740 366474 773569
11173 773569 986773 304431 536199 460217 735687 560574 872950 486771 516790 648311
11163 648311 906426 1064386 616553 1134970 728917 742004 1075153 652221 1032523 731442
11153 731442 750755 626228 395263 1244171 745451 904795 763761 575713 964153 741816
11143 741816 659485 1098709 1024540 821886 618383 875814 729721 1026505 687279 803821
11133 803821 519131 595295 737816 964243 752959 767022 1177840 560012 561461 298663
11123 298663 833359 334619 678746 478951 507703 978626 578330 157155 577204 688517
11113 688517 547618 586170 864562 905813 895173 367521 604487 789904 578534 761720
11103 761720 1027961 470833 754811 622627 444980 721647 856188 571857 565963 686951
11093 686951 586369 484992 690149 1004863 570226 236253 741621 526595 653619 852426
11083 852426 221058 353702 639722 439352 766558 321946 467497 602455 784202 306513
11073 306513 341325 429336 546893 361051 230978 227963 606257 494166 618400 291368
11063 291368 637333 306933 777545 969606 325577 607476 460293 480411 578176 375748
11053 375748 737721 315485 429611 355425 603733 122458 587588 610976 547683 569412
11043 569412 401841 884918 669367 554696 610353 605145 250227 424037 276827 516148
11033 516148 510023 204851 578780 407310 508664 1016716 570221 595086 760962 119953
11023 119953 435273 510761 414933 830929 299114 608203 692325 428561 520959 364281
11013 364281 1025282 479927 441783 296591 177339 768826 739029 683522 557015 329944
11003 329944 533486 159155 564657 589194 576896 213496 499444 378698 327910 618517
10993 618517 706276 638923 713989 444737 861246 646781 628891 493480 869040 462969
10983 462969 479238 389701 623409 591019 639379 505896 158325 447050 535762 561694 218316
10972 218316 571176 570454 598427 581257 756128 570333 791952 401732 244632 390868
10962 390868 406067 1145098 447932 591729 493719 91763 499316 847450 438448 436699
10952 436699 569467 407985 135707 572131 326097 363024 876435 242755 94820 661627
10942 661627 202317 322527 398270 584421 625861 227287 677669 568950 630648 473358
10932 473358 571827 471401 389643 429641 383063 846979 406961 753316 495807 701477
10922 701477 629426 203040 820422 554870 231461 559389 680813 533049 812483 694176
10912 694176 737852 542926 533874 444087 332751 420982 992022 802958 612683 841940
10902 841940 488909 498466 204453 358751 647676 814618 275669 602103 531998 585268
10892 585268 585195 634578 811735 583067 729968 524641 397391 743157 347482 726808
10882 726808 329863 430034 379183 431609 450197 442530 471291 462805 635903 70383 450613
10871 450613 406703 494829 498538 586074 178734 424487 877526 737760 502842 658497
10861 658497 677798 468241 710473 735782 591745 622065 973611 451669 675578 147033
10851 147033 443752 338235 404320 329713 424285 702128 672644 700311 770230 159851 694799
10840 694799 472148 448070 235743 136600 705049 322507 460674 337671 681804 331569
10830 331569 640331 935257 559724 482959 709606 809966 359185 530742 506248 935867
10820 935867 665240 619562 552886 308835 538660 406896 601946 605088 802672 559596
10810 559596 646505 -10770 819606 485951 589987 286665 388092 451019 692621 540143
10800 540143 637804 806171 814132 692022 781698 594834 256055 809728 538620 754836
10790 754836 696035 505024 485954 433317 632459 550436 284941 581785 245059 192434
10780 192434 651567 591002 603895 498981 441796 664873 667080 722574 514650 421141 703971
10769 703971 622020 431514 943346 483083 541736 997557 705083 624019 585268 437379
10759 437379 618799 551060 673292 419135 587341 628605 706559 468774 482814 310744
10749 310744 714003 481236 537650 719982 666063 178314 552672 473951 962361 830466
10739 830466 609635 295520 672800 519300 602753 650684 502217 643023 570128 664822
10729 664822 1080963 347885 436745 982814 522980 762459 913913 743352 898754 546788
10719 546788 717389 524663 511712 753493 648239 434869 625049 598436 735541 1058609
10709 1058609 657248 718824 609576 354900 1015406 780157 568977 822973 798844 605528
10699 605528 378672 496963 883624 620537 185268 605082 295851 682895 585356 413870
10689 413870 520875 1043153 530587 871438 851218 457994 762616 442493 844702 205158
10679 205158 691386 835508 706760 547209 556523 723982 673125 609784 875704 386435
10669 386435 696681 584195 855722 816929 816604 992635 130453 616104 721439 678433
10659 678433 537086 879824 567617 1226553 775861 734011 690373 531176 732039 571572
10649 571572 749515 1208581 646972 307066 458915 362660 832411 610880 743332 841945
10639 841945 119837 557006 327832 767165 661995 274255 251015 533700 559506 418055
10629 418055 894109 360326 390704 623449 733039 432525 509434 691715 972505 927965
10619 927965 552297 665831 882986 737202 892490 762402 953720 640248 713574 923078
10609 923078 614194 518094 530936 803301 1145975 811286 33723 793794 784053 820574
10599 820574 719316 678827 355927 673834 889540 796576 1076719 689237 811466 447757
10589 447757 611584 877379 722322 441764 808454 416736 951585 698509 818385 799878
10579 799878 962146 828741 833108 399068 940355 960835 1027583 641623 967597 774663
10569 774663 702594 806144 287766 856338 781963 715807 1168245 579442 938338 637344
10559 637344 92657 623381 776038 860705 914784 534723 1000058 869715 1278666 963102
10549 963102 717125 514436 502473 340953 849154 819121 484420 589292 939193 805584
10539 805584 951198 870135 770926 296524 298594 635811 766273 637968 550673 891094
10529 891094 963293 1348332 555993 805988 876836 945688 619272 647331 567232 812018
10519 812018 813156 667082 772954 710419 941312 624733 714484 785887 1015517 1026375 805520
10508 805520 818914 533535 1006306 878905 692275 794283 689772 753247 908903 961799
10498 961799 836624 517118 944354 932113 639035 531370 721579 531099 558745 803070
10488 803070 906892 682363 975739 695348 779747 1030499 809738 883239 713963 1034206
10478 1034206 961797 762450 263694 1250180 868584 763273 737983 949087 759734 643420
10468 643420 517790 562295 852702 931546 475538 694161 635159 570898 425578 836227
10458 836227 977926 912984 612572 740603 460053 664763 1133760 819138 663532 608643
10448 608643 1071040 1084133 849380 468938 741003 1225822 758391 977066 570566 787667
10438 787667 603974 468563 619567 865524 548007 984859 1041018 571946 488140 758798
10428 758798 913016 934814 1135770 761694 963034 946641 1169990 831460 961018 905865
10418 905865 834116 729727 591037 839620 646781 606484 964685 526798 963415 304709
10408 304709 796620 804159 766203 1016902 665761 906274 771978 700806 701440 953186 398412
10397 398412 641467 889942 1088299 705145 848909 1112539 972237 1079859 941828 674697
10387 674697 772607 877825 1052159 1138455 793864 615993 969351 1111503 1110271 1179146
10377 1179146 1172252 791247 961631 925680 634002 646728 1164938 677011 505094 1089428
10367 1089428 830350 814317 774787 925671 815330 884288 728081 843892 504935 806735
10357 806735 1335718 1109236 1182424 776411 859036 1008930 819866 923417 1047472 705656
10347 705656 1092138 1045915 967535 866371 816013 629864 1092449 1057019 910140 1111450
10337 1111450 529694 1244941 734884 868893 877349 977628 768765 958018 988600 1140385
10327 1140385 850398 1022536 900438 1089166 726900 1189495 1029907 1147262 656363
10318 656363 1018025 797768 722635 990152 924411 762249 719913 1071850 927230 1006721
10308 1006721 1281756 930986 599486 1157188 1242552 1039154 636073 789801 977723 778989
10298 778989 652682 1335361 905426 1065720 661394 842934 944255 986797 1172496 727500
10288 727500 841450 1162553 859751 1097233 859692 826814 1225107 891721 799893 978681
10278 978681 911629 1014080 718526 961017 633390 830007 613348 754410 1145264 862064
10268 862064 1076767 706776 1098753 879203 773241 893091 982384 959022 941390 1235666
10258 1235666 698349 1183685 841907 783816 878627 1148497 1329371 783933 1251062 915166
10248 915166 863028 485359 1088129 953460 812355 1116889 674176 747339 890498 848338
10238 848338 1002685 1060058 1019150 939995 831708 1047593 1008266 987507 1120208 1372285
10228 1372285 812858 1123927 1786090 1353519 750207 962767 1112190 1190138 1070840 1228349
10218 1228349 983846 1031027 583360 950092 646749 944403 1346275 1052410 1245394 910097
10208 910097 493589 993643 1100608 952496 988469 941726 733925 1067725 785099 1100590
10198 1100590 1334833 1067182 1488643 1373791 1227751 1120251 1274617 981187 1451806
10189 1451806 1209340 1210624 1593505 1273028 1001201 1136963 998042 1027146 1327899 1032098
10179 1032098 1300260 598391 1257728 1129113 753269 1318716 1413638 1179382 1021288 970879
10169 970879 1190073 1191259 1003793 828963 1333294 1288140 1304250 1088600 1118072 1242973
10159 1242973 1282164 1136335 1101981 901115 1158907 960806 1073284 1092262 1455277 744191
10149 744191 981158 804132 921552 1447050 713477 1385905 990171 880977 1504379 1171169
10139 1171169 1113619 1111612 1248708 1346575 851181 1035115 1467192 1018664 1103011 1322672
10129 1322672 632424 1117183 925315 1000920 1236409 1150622 1218847 1011443 1265227 1342048
10119 1342048 1245488 941446 1155964 1376538 1206395 1163022 1160911 1535442 1429860 1072130
10109 1072130 1372813 1361682 1080560 1614145 1057275 1410958 1098227 1097589 1066985 973511
10099 973511 1091666 1453105 1670726 1358250 1080262 963785 1377960 1358644 1389399 1335478
10089 1335478 1054069 1228961 1323539 1259124 1559264 1166864 1153998 1047895 908576 900515
10079 900515 1478658 1287441 1138541 909041 1140396 1726491 1123740 1267556 919701 1426248
10069 1426248 1239674 1349722 1525019 1295756 1402610 1347342 1359406 1453121 1265479 1421737
10059 1421737 1117931 1058786 1630812 1695001 1580106 1575404 1576393 1459275 1446259 1512859 1691776
10048 1691776 1436667 1088006 1818292 1659368 1335521 1874790 1314880 1794849 1852162 1680224
10038 1680224 1900041 1713207 1584460 1638994 1732795 1459962 1820140 1585315 1545828 1744716
10028 1744716 1617837 1608873 1429708 1448389 1763759 1594053 1457603 1757719 1627356 1444500
10018 1444500 1526341 1332541 1736576 1554263 1631803 1936074 1536944 1644130 1559679 1837372
10008 1837372 1286775 1389166 1518411 1671064 1516186 1424763 1520383 1531956 1292755 1244453
9998 1244453 1734261 1930746 1410277 1932898 1847132 1661413 1425007 1298973 1498951 1905761
9988 1905761 1994769 1542015 1254728 1367339 1526419 1800733 1461692 1457134 1805927 1796023
9978 1796023 1697018 1522952 1577868 1686006 1717186 2101967 1829969 1997399 1640803 1540959
9968 1540959 1608267 1669643 1975262 1754174 1945204 2408139 1741467 2254296 1720286 2180198
9958 2180198 2058913 2175921 2140462 2147511 2366696 1932019 1720991 1857988 2318976 2135318
9948 2135318 2401908 2506868 2940807 2896076 2637955 2667284 2571358 2529557 2375853 2869319
9938 2869319 2646278 2700977 3030170 2967586 2715357 2644473 3099550 3138245 3130112 3028433 2759791
9927 2759791 3099014 2798413 2707622 3209385 2713448 2664432 2624862 2433670 2176944 2317501
9917 2317501 2187722 2155233 2331005 1831692 2121629 1671635 2000454 2199750 1858955 2510113
9907 2510113 2375701 1977831 2149836 1840888 2520421 2486970 2292883 2364271 2317582 1994573
9897 1994573 2328402 2257878 2563527 2771848 2978611 2840949 2792345 3122918 2615439 3021015
9887 3021015 3504430 3238754 3316690 3381247 3809047 3827234 3786806 3897016 3763814 3866813
9877 3866813 3515379 3917503 4309215 3866675 3960376 4126713 4355262 4395790 4796075 4326990
9867 4326990 4722757 4727056 5272389 5188605 5022922 5182813 5045437 4915345 5352101 4669873
9857 4669873 5099502 4854626 4979440 4538277 4489044 4808257 4937245 4666332 4927277 4819375
9847 4819375 5158002 4893202 4883160 4719810 5050563 4802748 5030182 5078538 4893504 5647930
9837 5647930 5942679 6238438 6673395 6728689 7125419 7303132 7760062 7473739 7489897 7535570
9827 7535570 7528153 7674734 7204437 7210371 7028783 6954864 6601389 6804731 6884520 6614804 6666909
9816 6666909 6393048 7064173 7131343 7406976 6922112 6661655 6869593 6579792 5894572 6107684
9806 6107684 5453902 5645750 5231170 5145226 4943900 4587007 4831676 4603400 4735800 4475460
9796 4475460 4042496 4546946 4596615 4115488 4103050 4386406 4514156 4447421 4755943 5024667
9786 5024667 5557840 5472403 5755886 5704785 6150302 6270877 6663589 7367486 7274851 7493700
9776 7493700 6991123 6861481 6472565 5903490 5703287 5406878 5104583 4698835 5115879 5007241
9766 5007241 4754744 4799534 4807614 4722266 4259398 4610280 4577643 4492012 4301752 4749973 4551597
9755 4551597 4942651 4888746 5127293 5126972 5224363 5681141 5419852 5635569 5610399 5631442 5798761
9744 5798761 5224762 5222650 5319324 5538539 5287601 5020806 5055662 4648922 4229037 4412518
9734 4412518 4051582 3800128 4120564 3849452 3565009 3600511 3839925 3744660 3684351 3883018
9724 3883018 3257060 3690506 3898288 3651938 3512032 3468566 3767155 3826608 3810903 3727456
9714 3727456 3392642 3919475 3629002 3615351 3253301 3803271 3480455 3592542 3290491 3268872
9704 3268872 3367748 3677452 3319861 3493100 3041389 3362160 3179516 3519176 3416598 3580356
9694 3580356 3252913 3042843 3303811 3312023 3022824 3507791 2963328 3425139 3499704 2713527
9684 2713527 3221564 3302920 3238689 2931795 3219651 3483671 3019324 2873851 3251674 3292259
9674 3292259 3243554 3325463 2555252 3285595 3144261 2835060 2861079 3009721 2946352 3012744
9664 3012744 2688288 2788679 2432330 2868418 2638780 2870722 2672253 2811254 2988537 2713461
9654 2713461 2565052 2379118 2773396 2696234 2509115 2688620 2463402 3102243 2820527 3108432
9644 3108432 2674438 3081715 3091875 2691013 2681260 3110757 2641503 2896189 2532933 2957927
9634 2957927 2805050 2704707 3018658 3102169 3159181 3063652 2924578 3050337 3328088 3384204
9624 3384204 3412000 3200770 3276209 3092314 3090909 3085029 3743090 3062895 3708998 3158106 3316690
9613 3316690 3131810 3395774 3165284 3456293 3447032 3457068 3607347 3628372 3225308 3634054
9603 3634054 3807709 4245357 3893346 3847724 4481889 4395079 4295502 4894340 5221639 5960161
9593 5960161 6116647 6199049 6798945 7018016 7762743 8343179 8133209 7992189 8084761 7542670
9583 7542670 6771806 6951015 6403273 5797804 5566085 5252677 4879576 4569756 4500356 4499645
9573 4499645 4177241 4686767 4825726 5159049 4975821 5054756 5451072 5203379 5804767 6534664
9563 6534664 7607427 8662720 8744422 8628692 8443445 8129168 8252626 8719012 8644618 8705291
9553 8705291 8116354 7641773 7412120 6304556 6053409 5523589 4677858 4589231 4325970 4277539
9543 4277539 4266888 4192920 4251480 3982148 3789040 4159900 4379803 4123410 4438301 3882893
9533 3882893 4228735 4243231 4154443 3812139 4018891 4073364 4344889 3963308 4195324 4314803
9523 4314803 4534599 4527025 4080617 4278344 4491962 4471160 4686279 4522215 4499157 4373654
9513 4373654 4400275 4374663 3946403 4112169 4452491 4255054 4299796 4057914 4264834 4531912
9503 4531912 4601294 4647910 5338704 4803710 5118456 5513836 5317968 5368235 5709385 5475747
9493 5475747 4997675 5678223 4997636 5286133 5442943 5255531 5035421 4687078 5123714 5271193
9483 5271193 4936684 5588220 5022484 5668510 4960290 5174060 5678660 5320861 5304219 5857682
9473 5857682 5485849 5641575 5904946 6212363 5537176 6016174 5927146 5870074 5853253 6289720
9463 6289720 6665184 6162118 6405945 6129124 6680828 6277859 6385500 6076199 6187074 6059642
9453 6059642 6209606 6011606 5827588 6155472 5763622 6011699 6082345 6276254 6364690 6160190
9443 6160190 5936452 6110239 6548561 6561064 6468698 6700375 6972651 7455977 7115509 7745470
9433 7745470 7633332 7491076 7607052 7147233 7220176 7363650 7346068 7263047 6745172 7112845
9423 7112845 6885923 7041191 7035424 7232186 7199715 6953906 6999547 7331620 7259005 7896610
9413 7896610 7924691 7734772 8160358 8063595 8340911 8443079 8667392 8406458 8095484 8487694
9403 8487694 8558246 8228388 7647899 8189267 8003113 7981312 8265743 8021076 8350613 8397630
9393 8397630 8280363 8232877 8420596 8540510 8682946 9154072 9544361 10184268 10666541 10992424
9383 10992424 10928271 11355031 10772455 10728574 10533971 10313916 9906562 10248521 9968613 10233713
9373 10233713 9631285 9701380 9971799 10134974 9995879 10123877 10808225 10992736 11562708 11968616
9363 11968616 12727457 12597309 13390220 13059182 13386985 14219318 14812214 15384239 15706095
9354 15706095 15963447 15524410 15843398 15957200 15935825 15867623 15579028 15600104 15001420 15219014
9344 15219014 15062995 15034709 15384496 15683247 16388917 16651632 17235940 17686929 18130976 18234810
9334 18234810 18416057 18754870 18850329 19310471 19688183 20051599 20450447 21299759 21675456 21962238
9324 21962238 21470410 21624553 20992852 20790355 20292118 19616364 19227946 19513629 19318366
9315 19318366 19016055 19259818 19397751 19341000 19694303 20267830 20574878 21136378 21543295 22175406
9305 22175406 22655208 22679259 23199344 22858491 23206741 23302437 23856004 23981454 24877917 24991709
9295 24991709 25539019 25728654 25446767 25254496 24471645 23826987 22973872 22790321 22250243
9286 22250243 22284810 21931367 21554364 21873971 21454514 21989974 22290939 22786332 23397277 24195370
9276 24195370 25079040 25431973 25670948 25629564 25859525 25894366 26058081 26580902 26456197 26690381
9266 26690381 26890399 27356149 27776912 28626292 29005072 29659620 29659533 30314899 30726510 31349147
9256 31349147 31446966 31955561 32723158 32995305 33356761 34457441 36046554 37880864 39441500
9247 39441500 41710757 43268640 44303577 45101421 46223465 46579684 47049979 47479467 48062918
9238 48062918 48757403 48801028 49802189 50242601 50543617 51226034 51755047 52129520 52391595
9229 52391595 52610435 53143958 54273377 55677088 57517994 60114083 62216199 63184941 64901892
9220 64901892 65406417 66399351 67742398 68848940 70388189 71260010 71656412 72417548 72597477
9211 72597477 72838252 73659254 74459154 75256206 75481184 75432531 75249589 75730748 76489385 78478388
9201 78478388 80922584 84064459 87146678 91759792 96384362 100675717 104704525 108684881
9193 108684881 111298735 113408827 114438299 114548507 113970828 113173263 112855136 112079730 111848079
9184 111848079 111003235 111092845 111414806 111049021 111255220 111230569 111886405 112483876 113559259
9175 113559259 115236955 117715871 120923338 125512712 131074747 138923161 148248074 161495770
9167 161495770 178106546 197427870 217971684 240197662 263580622 292245013 323374483
9160 323374483 354981546 386905514 417764946 446027392 467111367 476964699 473144410
9153 473144410 456815706 431095945 401953860 369919798 340146467 313009037 289369602
9146 289369602 268415822 249415427 235025292 222700095 213576889 205901781 199287170
9139 199287170 193149059 187045496 181280076 176472204 172214323 168409418 164954305 162372075
9131 162372075 161153353 158951569 158162667 157247178 156815347 156440472 156522261 156580671 158174037
9122 158174037 159031836 159382809 158662621 156410883 153858669 150675563 148451833 147707915 146984228
9113 146984228 146020598 143705587 139996951 135470581 129947407 124207755 118346910 113158449
9105 113158449 108314096 105117156 101959572 100269516 98954378 97978016 96675188 96576030
9097 96576030 96493937 97076564 97853795 99539829 102208422 106108910 111540855 119641837 138259687
9088 138259687 175411314 217736761 238297634 235914062 225192214 207286575 176037910
9081 176037910 152104945 129500149 113476781 100386158 89162189 81409280 77201062
9074 77201062 74381963 71497667 69927667 67910232 65875882 63690656 62175805 60580118
9066 60580118 58454435 56949013 55824435 54516725 53404954 52298914 51282088 50828037
9058 50828037 49571669 48920250 48407295 48428516 47475288 46856024 46022251 45384818 45082215
9049 45082215 44530277 43901307 43668549 42183998 41812559 40918005 40639922 39612835 38378534
9040 38378534 37950372 37547786 36535569 35684651 34621371 33973089 33547061 32552595 31927709
9031 31927709 31420162 30844535 30613660 30502304 30219673 29794011 29499402 29084280 29022204 28602180
9021 28602180 27895413 28093612 27388388 27115613 26979669 26483659 26088626 25580380 25540114 25108407
9011 25108407 24570700 24079643 23514695 23389353 22805293 22247878 21931561 21765224 21205144
9002 21205144 20764346 20408898 20178699 19796147 19731948 19452300 18909255 18632876 18252323 18074765
8992 18074765 17964729 17357526 16783432 16643935 16791438 16240090 16299075 15795338 15397960 15467185
8982 15467185 15014173 14721229 14688081 14019615 14361471 13812947 14140689 13725462 13487665 13340074
8972 13340074 13530031 12630174 12515135 12830640 12086162 11955636 11627312 11411791 11453357 10773169
8962 10773169 11017392 11067931 10754776 10698396 10534640 10029595 9971380 9763586 9874933 9951962
8952 9951962 9518146 9061021 9260293 9142326 8653020 8500268 8604499 8415394 8271162 8248031
8942 8248031 8105413 8550823 7685706 7895711 7616318 7507022 7783162 7445344 7395035 7123867
8932 7123867 7035113 6949158 6974015 6824441 7131023 6463434 6499478 6345039 6039335 5880733
8922 5880733 6111733 6479388 6124497 6047159 6210156 6160721 5836768 5675899 5710090 5840054
8912 5840054 5168072 5266202 5815273 5399267 5238803 5518716 5405981 4970991 4833647 5062679
8902 5062679 5195628 4803998 4635705 4851531 4635379 4514484 4674046 4428342 4941217 4549771
8892 4549771 4502050 4621059 4346288 4492805 4516448 4170295 4761085 4609033 4201876 4965115
8882 4965115 4098061 4362276 4406050 4087987 4320436 4739365 4102886 4475164 4436651 4017840
8872 4017840 4488938 4046668 4336143 4420983 4312301 4306231 4422582 4362425 4436502 4321284
8862 4321284 4262855 4676510 4513275 4367258 4365649 4067978 4357266 4414499 4586570 4428106
8852 4428106 4367308 4587193 4522559 4020174 4566344 4260411 4512561 4380484 4640582 4308781
8842 4308781 4482391 4689422 4280027 4320606 4183033 4561684 4337826 4453073 4651616 4307499
8832 4307499 4189174 4346527 4417834 4467418 4184162 4323699 4278417 4265939 4291030 4174117
8822 4174117 4740702 4675583 4260153 4612642 4417227 4384837 3973566 4250432 4242624 4337537
8812 4337537 4179931 4400370 4467453 4285326 4252164 4433571 4011409 4142064 3958186 4011315
8802 4011315 4022262 3912331 4096682 4115380 3633009 3886749 4012888 3779259 3789753 3916458
8792 3916458 3914786 3771526 3517256 4193907 3797347 3335340 3262710 3912092 3541688 4026329
8782 4026329 3943904 3591551 4076742 3880880 3259864 3773756 3660526 3483395 3687291 3455925
8772 3455925 3839812 3642628 3729700 3432781 3765746 3327863 3427532 3737040 3640261 3478364
8762 3478364 3744849 3622185 3345079 3942000 3882145 3521397 3383538 3673199 3669996 3625362
8752 3625362 3856503 3670628 3890922 3651909 3706535 4227474 3816123 3922381 3760027 3977054
8742 3977054 3759954 3827014 3788369 3798617 3945757 3813711 3765316 3849916 3614884 3698670 4090906
8731 4090906 3552267 3910689 4088455 4055848 3954512 3633100 3797164 3590458 3889926 3697049
8721 3697049 3911643 3532329 3752081 3762902 3759687 3661866 3699831 3965853 3790108 4064173
8711 4064173 4245161 4011313 3945873 4201624 4211623 4199663 4477711 4733796 5201705 5183583
8701 5183583 4782694 5036517 4788404 4690737 4755645 4982861 4567013 4000218 4240650 3917557
8691 3917557 4262995 4211921 4032994 3944394 4248771 3846392 3989903 3940129 3946637 4528405
8681 4528405 4217576 4162933 4022226 4180667 4201264 4142955 4005857 4199969 4268561 4616557
8671 4616557 4946891 4940657 4863743 4956139 5203682 4828613 4836717 4231681 4235754 4383750 4698136
8660 4698136 4294175 4183762 4083505 4295444 3950411 3960368 4375277 4055232 4063973 4179462
8650 4179462 4494922 4759493 4311240 4191851 4037325 4123254 4407688 4358909 4160306 3826133
8640 3826133 4278090 4413245 4679424 4526793 4251987 4480290 4494151 4046804 4855450 4228387
8630 4228387 4166978 4642067 4551310 4114007 4313653 4142820 4309929 4305599 4535730 4516732
8620 4516732 4064883 4121177 4431253 4612652 4446887 4419887 4948541 5050703 4747686 4366873
8610 4366873 4380666 4921678 4594292 4872913 4658167 4746059 4805672 4961664 4423332 4463317
8600 4463317 5195260 4860158 5238864 5044445 4861201 4682911 4938502 4692211 4968952 4814335
8590 4814335 4820935 4966892 4765178 4586284 5035524 4671902 4873404 4741536 4869510 5019145
8580 5019145 4947346 4545814 5225753 5071454 5298268 5123403 5065189 5189895 4996449 5237162
8570 5237162 5191009 4969893 5063227 5435250 5006361 5077771 5013891 5075511 5395948 5066780
8560 5066780 5117255 4817594 5332002 5283259 4866302 5272777 4961740 5348450 5419110 5656253
8550 5656253 5733019 5324268 5333400 5099949 5543774 5385079 5443735 5499790 5708226 5203812
8540 5203812 5669813 5484853 5316210 5577579 5220702 5222588 5360726 5811239 6100445 5593461
8530 5593461 5495780 5645240 5341023 5525316 5105514 5758254 5816530 5655255 5841428 5816741
8520 5816741 6180874 5845786 5909279 6023636 6004629 6273897 5958737 5830294 6280181 5914373
8510 5914373 5830052 5674744 5932578 5380549 5934659 6060416 5931354 6321172 5763925 5820605
8500 5820605 6104705 6208302 6375468 6273051 6316837 6487798 6173886 6246663 6161158 5986554
8490 5986554 6366695 6347526 6009305 6413562 6464595 5911838 6021146 6159951 5939652 6435545
8480 6435545 6262931 5822591 6718588 6199519 6134537 6488785 6360739 6253769 6412081 5988869
8470 5988869 6282207 6485059 6645121 6130326 6271449 6741459 6985557 6642848 6996895 7006317
8460 7006317 6464762 6931793 6370275 6915454 6587537 6297540 6744411 6541887 6392007 6190361
8450 6190361 6334030 6534598 6652945 6772956 6667740 6708514 6878673 6573653 6847958 6787348
8440 6787348 7021020 6990135 7102335 6971689 6371560 7000059 6813578 6698545 6940402 6799703
8430 6799703 6920912 6646236 6869365 7230517 6638079 6544301 7205272 7140774 6907037 7056431
8420 7056431 7010901 7231688 6861434 7283319 7132847 6847636 7287512 7066875 6852938 7030327
8410 7030327 7030099 7199428 7602775 7040143 7304521 7100189 6989507 7348415 7282194 7148271
8400 7148271 7371053 7160539 7141663 7551815 7416242 7327911 7516706 7334818 7519671 7731439
8390 7731439 7516018 7249914 7245942 7014338 7567990 6909124 7310084 7744485 7557099 7413326
8380 7413326 7587551 7480528 7448298 7630448 7864831 7478532 8044862 7517244 7511577 7529787
8370 7529787 7643303 7701464 7566055 7649799 7689759 7921120 7789046 7727949 8087256 7588509
8360 7588509 7543646 7879165 7715581 7680317 7850713 7333099 7737706 7486035 7559876 8047957
8350 8047957 7732284 7598117 7430393 7803080 7369987 8023126 7786797 7742243 7783903 7968469
8340 7968469 8223090 8074160 7908443 8004520 8064881 8320381 7910567 8346803 8078545 8060780
8330 8060780 7880322 7765376 8070449 7781075 8280523 8196522 7708362 7989119 8473929 8058734
8320 8058734 7852462 8057288 8006005 7999011 8080193 8043283 8085593 7811804 8056852 8618551 8533288
8309 8533288 8157722 8123618 8194710 8401875 8430310 8057620 8727157 8390818 8338756 8559328
8299 8559328 8376790 8518550 8672121 8734193 8746651 8528854 8736103 8666415 8405236 8690731
8289 8690731 8834345 8165638 8709163 8729284 8804365 8617131 8497962 8422517 9070373 8800820
8279 8800820 8936655 8751847 8718681 8710928 8733735 8725605 8990336 8598308 8476511 8713410 8790151
8268 8790151 8416119 8655038 8797883 8660288 8865692 8973601 9050386 8728496 8727823 8676548
8258 8676548 9034632 8498882 9108413 8453427 9011286 9017857 8728656 8990765 8939326 8919380
8248 8919380 9017560 9062347 8733669 8662005 9017101 9045522 8717760 9218491 8824040 8900336
8238 8900336 8829757 8799965 9085089 9015407 9061720 9306796 8710125 9347606 9210512 9105552
8228 9105552 8811111 9187960 9252954 9185969 9392326 9069290 9457740 8987868 9170101 9089727
8218 9089727 8874108 9145155 9469212 8561300 8866683 8840919 9091471 8939777 8958101 9091090
8208 9091090 9013685 9371364 9257485 9365296 9018849 8954461 9449294 8818612 9070781 8907811
8198 8907811 9141132 9239896 9208604 8868046 8743984 9274683 9891576 10017887 9866165 9827406
8188 9827406 9852257 9374869 9380502 9492087 9667048 9298180 9358556 9657862 9757880 9885041
8178 9885041 9479989 9242292 9628460 9649605 9571628 9821233 9695575 9865352 9688778 9866705
8168 9866705 9427314 10038516 9840489 9560408 9651864 9924774 10370550 10047236 10071406 10347450
8158 10347450 10263999 10510175 10012530 10264296 10247645 10223573 10625512 10406038 10440339 10747686
8148 10747686 10230585 10475834 10402691 10169711 10569045 10412659 10711463 10714371 10921754 10786234
8138 10786234 11197530 11033182 11286501 11065723 11525444 11379009 12090682 11683092 12213663
8129 12213663 11894222 12287361 12287760 13009988 13057705 13195319 13708622 13605567 14160547 14517534
8119 14517534 15139189 15284526 16202817 16642315 17380027 17928137 18604750 19710718 20284116
8110 20284116 21043258 22209297 23508797 24039925 25820416 26639773 27322103 27876659 27826241
8101 27826241 28088677 27312563 27277030 26620707 25348416 23886650 22819948 21860576 20869230
8092 20869230 19902159 18802308 18145234 17226076 16354375 15731491 15493378 14851876 14438667
8083 14438667 13785716 13705563 13192286 13057459 12658171 12127810 11629518 11971949 11425373 11553822
8073 11553822 11788636 11164029 11013684 11089972 11147362 11134718 10334213 10926975 9917896 9792804
8063 9792804 10222528 10376271 10112500 9772621 9606259 9240860 9507653 9526500 9521973 9551116
8053 9551116 9634217 9781699 9345789 9349867 9586248 9259727 9187384 9024052 9263956 9124466
8043 9124466 8809426 9281601 8929204 9278483 8913038 9038950 9112095 8781637 9035982 8707581
8033 8707581 8518732 8564124 8724696 8620383 8901338 8641300 8659885 8490768 8610558 8203105
8023 8203105 8331996 8294085 8158917 8389414 8351309 8720090 8178678 8198167 8259840 8041143
8013 8041143 8218426 8432866 8324406 7872076 8085984 8073861 7859888 8352204 8245989 8057242
8003 8057242 7901640 7900547 8239769 7692939 8162254 8062880 8245613 8025336 7786899 7910108
7993 7910108 7836587 7829752 7928923 7510338 7534468 7506238 7575510 7465042 7556083 7538784 7938661
7982 7938661 7363426 7666252 7409586 7838527 7461335 7672302 7691630 7349341 7431839 7336685
7972 7336685 7532081 7309557 7701533 7521212 7661898 7205101 7266338 7106920 7228450 7438393
7962 7438393 6863197 7189207 7068532 7495634 7111652 6874913 7538987 6970493 7036607 7275389
7952 7275389 7084504 7077536 6580713 7124399 7034038 7033611 6695558 6918460 7149606 6985312 6863251
7941 6863251 6773417 6661945 6735804 6998579 6904273 6813334 6915457 7325081 7090086 6827525
7931 6827525 6837442 6862998 6805187 6699557 6878300 7221891 6541431 6921557 6823158 6315459
7921 6315459 6630701 7068970 6979584 6977375 6767029 6639803 6292621 6686155 7062379 6629343
7911 6629343 6169239 6737077 6565138 6223126 6490675 6482730 6454469 6210920 6078496 6232972
7901 6232972 6147629 6578160 6568395 6626989 6336826 6576674 6499878 6396767 5907467 6225155
7891 6225155 6688850 6374427 6096363 6615922 6441073 6725415 6662260 5838197 6007120 5923453
7881 5923453 6084638 6365933 5959466 6135149 6146140 6218233 5873373 6053212 6137055 6154204
7871 6154204 6237267 5806034 6070968 6120499 6062537 5723487 5457735 6084698 6385462 5759295
7861 5759295 6163175 5693813 5320961 5713292 6201365 6158148 5732728 6328216 5653505 4519629
7851 4519629 5237364 5626524 5676570 5693684 5703252 5817642 5641593 5972797 5904553 5662305
7841 5662305 5520896 5633112 5864546 6030370 5580165 5496494 5818997 5382920 5371719 5623190
7831 5623190 5595021 5392085 5652836 5441433 5250587 5576902 5506513 5230636 5379427 5369298
7821 5369298 5540020 5296446 5213439 5120537 5030130 5283972 5444262 5667358 5580069 5205888
7811 5205888 5368425 5331786 5217978 5098582 5464989 5210886 5143568 5478121 5421865 5182255
7801 5182255 5024653 5313261 5292486 5237269 5211324 5339908 4798349 5281436 5137858 5175076
7791 5175076 5791223 5369659 5369560 5238115 5529720 5276740 4994219 5121183 4919685 5011456
7781 5011456 5008511 4741370 4918290 4943859 5008570 4908233 5229734 4972975 4780310 4955918
7771 4955918 4938418 4917409 5254719 4937315 4739417 4680601 5012689 4598745 4887453 4614858
7761 4614858 4260651 4822782 4831021 4643673 4468859 4788489 4173760 4773737 4556468 4933850
7751 4933850 4711126 4849336 4844828 4865949 5467705 4646577 4740577 4740318 4650781 4726977 4436645
7740 4436645 4413189 4681497 4746861 4665396 4388634 4377974 4672179 4729364 4554115 4691460
7730 4691460 4542595 4578921 4611857 4257802 4604659 3953365 4584715 4253335 4341492 4709633
7720 4709633 4583329 4489596 4579121 4199262 4617061 4374099 4649703 4326660 4455163 4282731
7710 4282731 4590889 4326799 4368934 4610254 4637385 4072181 4287248 4076246 4256643 4843432
7700 4843432 4448677 4686815 4477966 4219157 4114142 4093140 4295426 4560540 4409232 4516287
7690 4516287 4171845 4271596 4502729 3961348 3776417 4090023 4340241 4240162 4077882 4190485
7680 4190485 4088692 4438733 4125619 4085933 3800364 4559535 4118447 4155946 3775665 4123862
7670 4123862 4171741 3688130 4110155 3992286 3923072 3920177 3864920 4262586 4081803 4085944 4075200
7659 4075200 3986576 3958934 3516270 4086281 4009172 4132633 3802222 3643874 3946746 4450484
7649 4450484 3761964 3917610 4286796 3931107 3883426 3889178 3935232 4311794 3683905 3629161
7639 3629161 3987712 4083715 4227254 4315464 4454591 4679145 4035789 4371206 4095794 3964809
7629 3964809 3908368 4094442 3939534 4167658 3570695 3959296 3626785 3514474 3814118 3726324
7619 3726324 3949920 3598206 3777463 3733596 3454452 3849746 3622037 3941384 3405865 3893486
7609 3893486 3907659 3660222 3955371 3591193 3612137 4056735 3525154 3849349 4162131 4115636
7599 4115636 3507311 3789067 3986266 3883282 3901628 4006142 3595128 4038693 4329311 4229507
7589 4229507 4072821 4094947 3804627 4305273 4045270 4141626 4151090 4240435 3606978 3773302
7579 3773302 3670476 3702000 3540333 3556430 3973655 3704135 3668038 3625696 3693402 3565594
7569 3565594 3824042 3423831 3978582 3044773 3204606 4015698 3702653 3418179 3366300 3058695
7559 3058695 3520624 3871201 3456448 3554993 3610941 3209229 3627548 3861790 3507057 3296788
7549 3296788 3472106 3559985 3175251 3233873 3677683 3302617 3043530 3311374 3430449 3638334
7539 3638334 3488968 3485252 3331410 3290951 3055092 3611548 3236100 3262327 3360634 3402444 3365698
7528 3365698 3199950 3285893 3322770 3462037 3301697 3667028 3338677 3612564 3484961 3714689
7518 3714689 2995308 3309849 3125324 3204724 3055037 2608062 3578577 2852798 3332466 3072355
7508 3072355 2836062 3375656 3668987 3404823 3358836 3202234 3166626 3444927 3166077 3332636
7498 3332636 3213641 3370491 3202663 3235851 3195153 3222792 3018848 2990133 3108739 2917264
7488 2917264 3083389 3501272 3357745 3005897 2955745 2813674 3636591 3137633 3399150 2952741
7478 2952741 3065915 3465670 3286934 2667723 3258433 3227653 3377678 2978651 2727789 3289400
7468 3289400 2931853 3098513 2763857 2808463 3016120 3227455 2968254 2587240 2585726 2710591
7458 2710591 3283330 3245272 2815677 3028208 3078641 3337268 2853206 2357077 3139790 2546722
7448 2546722 3044317 3055375 2640841 2855880 3428534 3318374 3404502 3107031 3279891 3134174
7438 3134174 2786233 2858361 2919850 3014807 2961911 2888257 2919659 2872200 3209413 3271032 2804097
7427 2804097 3211219 3132448 3100684 3340063 3175644 3636792 3081746 3504658 3214137 3002259
7417 3002259 3469372 3604292 3539324 3472904 3545507 3773475 3504239 3330063 3442167 3292145
7407 3292145 3277913 3251227 3554521 3151491 3400150 3302748 3127408 3647541 3195382 3338360
7397 3338360 3215190 2814446 3310524 3138208 3626983 2903293 3537294 3286724 3133872 3693070
7387 3693070 4107885 3001348 3611223 3712762 3588709 3470200 3563201 3766871 4268886 4531600
7377 4531600 4413812 4937902 4905760 5923372 6449082 7139230 8216927 8072006 8508356
7368 8508356 8537978 8212546 7684819 7213549 6344079 5873393 5217887 5058320 4918715 4187715
7358 4187715 4142301 3686693 4011029 3571512 3989474 3633424 3341989 3264889 3214423 3419947
7348 3419947 3476912 3748955 3376338 3281256 3456559 3341885 3459676 3520616 2876180 3149962
7338 3149962 3451679 3237618 2916755 3313987 3374075 3222561 3119783 3135438 3296652 3360273
7328 3360273 3512661 2825444 3509300 3019493 3422855 2907177 3273198 3047204 3433056 3488383
7318 3488383 3141169 3403188 3565349 3126394 3179445 2912908 3334272 3011388 3043916 3193586
7308 3193586 3312388 3042222 3558340 3321317 2873954 3198259 3080780 3197006 3176671 2865908
7298 2865908 2952854 3172708 3167112 3029698 3424420 3035865 3037229 3301349 3077166 3079880 3000804
7287 3000804 3258491 3331018 3731425 3243251 3130705 3302646 3197840 3000219 3399417 3554200
7277 3554200 3211317 3249315 3122531 3161204 3261634 3145888 3084161 3301781 3512879 3298081
7267 3298081 3385513 3140439 3164238 3577746 3481664 3344987 3597295 3554645 3224709 3982703
7257 3982703 3388889 3415352 3561839 2881695 3745719 3592745 3142549 3329384 3551037 3376668
7247 3376668 3638586 3339883 3660087 3720212 3631553 3830791 4052029 4009276 3283734 4003929
7237 4003929 3770752 3985374 3807753 3812173 3473661 3537784 3694067 3458068 3724314 3822887
7227 3822887 3675405 3602570 3613976 3988790 4135022 4139340 4179165 3841667 4096181 4450770
7217 4450770 4862438 4801910 4183511 4236256 4726824 4153335 4132342 4347393 4337344 4277001
7207 4277001 4430059 4157903 4046372 4394798 4467148 4339951 4504867 4386104 4768894 4503216
7197 4503216 4803558 4696886 4682338 4736001 5097571 4994857 4922365 5240648 5429586 5375362
7187 5375362 5098388 5703435 5546503 5820600 6123075 6106990 5999043 6279908 6694639 6245376
7177 6245376 5758817 6052070 6310235 6552927 6185205 6268331 6370148 6519722 6527275 6115801
7167 6115801 6039718 5918229 6185383 6239905 5818557 5946676 6729929 6340182 6247582 6163914
7157 6163914 6000254 6075682 5919667 6257237 5916851 6025396 6108777 6038181 6155551 5861592
7147 5861592 6514567 6599597 6547810 6452126 6469432 6388736 6468033 6878478 6911439 6860446 7077477
7136 7077477 7105029 7199382 6827766 7017844 7226958 7175165 7111064 7729803 7459186 7954111
7126 7954111 8110223 7929056 8535959 8633570 8679869 9001117 9219200 9713407 10432767 10579275
7116 10579275 11488645 12478651 13694358 15479218 17226428 18316741 19960243 20562190 20915319
7107 20915319 20843458 19605772 19347070 18796600 18116007 17792556 17440502 17172829 17882479
7098 17882479 18102899 19042703 19804176 20824189 22650379 24616202 26177389 27658759 29229706
7089 29229706 30121529 30965239 30826567 30533267 29783586 28696867 28091839 27056710 26005200
7080 26005200 25942347 25550351 25769824 26076988 27085174 28661445 30850461 32702615 34971210
7071 34971210 37801795 39340102 41396288 42080407 42185038 41917722 41699845 40506734 40239704
7062 40239704 40436511 40829516 42736739 45502542 49254528 54306592 59946443 66356510
7054 66356510 72559246 77489241 81511048 83605193 83384358 81004610 76954474 71252461
7046 71252461 64665301 58801502 52030476 46577046 42142201 38038653 35143541 32500366
7038 32500366 30734229 29763838 28927889 29405649 29660450 29596755 29533089 28986356 28097936 26589164
7028 26589164 24982659 23207651 21179880 19334608 17681822 16743676 15276338 14507120
7020 14507120 13813151 12818379 12064103 12072160 11612927 10980210 10645239 10806270 10426521 10263377
7010 10263377 9968921 10089921 9715318 9834255 9584480 9639833 9448554 9666369 9666425 9722906
7000 9722906 9702160 10307101 10773496 10541761 10566421 10411146 10981504 10751224 10390565 10192083
6990 10192083 9760279 9619731 9144037 9317753 8974212 9058824 8850793 9088928 9353080 9555678
6980 9555678 10014257 10883961 11310142 12400153 12956283 14454090 14489450 14434666 14533269 13940470
6970 13940470 13298567 12910277 11589935 11175848 10002139 9715725 9338355 8755063 8657564
6961 8657564 8669225 8695185 8529646 8623180 8414226 8642392 8535462 8127958 7737988 7157709
6951 7157709 7220516 6756484 6161413 7118408 6214142 6628635 6308121 6312424 6573130 6906981
6941 6906981 6913958 7216060 7232658 6586326 6838342 6893563 6777314 7130397 6624799 5870586
6931 5870586 6586533 6032245 5623488 5586401 5641377 5773590 6041121 5909004 6021430 5812829
6921 5812829 5935010 6015121 5889626 6428141 6886222 6702038 6361311 6806864 6694286 6976165
6911 6976165 6748728 6463248 6527213 5803210 5982254 5839832 5876296 5808190 5898442 5848433
6901 5848433 5852929 5788714 6134117 6206045 6584651 7326125 7366587 7427716 7993643 7881501 7644616
6890 7644616 8167315 8039584 8473545 8216390 8523560 8836115 8895972 9247866 9614360 9921378
6880 9921378 9968139 9978531 10196729 9735453 8861847 9332576 8457766 7901021 8016655 7304524
6870 7304524 7159427 7082365 6659250 6614720 6511554 6778818 6453240 6288422 6322584 6132349
6860 6132349 5990090 6149573 5814278 5602386 5927439 5355222 5357718 5543902 5217142 5636171
6850 5636171 5899701 5676498 5986136 6282200 5929272 6092707 6568457 7295615 7838698 8582039
6840 8582039 8848010 10153268 10963240 11924065 12941203 13765297 14026069 14269098 13607058
6831 13607058 13301496 12343667 11455272 10109968 9506208 8244529 7938153 7279791 6441984
6822 6441984 6252897 6311111 6262323 5917531 5658107 5772688 5538253 5732001 5687432 5694425
6812 5694425 5689176 5812335 5433241 5719174 6133223 6221209 6762053 6698021 6876991 7180765
6802 7180765 7009221 6831679 6559007 6265018 6133874 6095284 6053685 5684689 5876077 5816542
6792 5816542 5858003 5402835 5493603 5494422 5531928 5524164 5762829 5711846 6025959 6046208 6040565 5779156
6780 5779156 5836080 6459915 6417038 6495509 6465430 6529841 6714633 6963962 7333373 6717340
6770 6717340 6549138 6805931 6492679 6228501 6668681 5764082 6103901 5764917 6204133 5593009
6760 5593009 6195075 6232701 5890026 5895160 6113615 6384259 6263624 6452336 6458559 6749015
6750 6749015 6658665 6685948 6337707 7607499 7371131 7443006 8135659 7907042 8356081 8563790
6740 8563790 8170601 8402177 9194549 8652833 9023127 9268211 9572207 9205273 9357235 9149983
6730 9149983 9787631 9964364 10195070 10934784 11632521 13032695 15545675 17679403 19027631
6721 19027631 19703340 19032840 18615413 17174982 16025853 15241328 14393478 13687549 13292774
6712 13292774 13541415 13459007 13770688 14181931 14711496 14698246 15452607 15543662 15773115 16676252
6702 16676252 17580058 17674455 19414092 20237022 22773777 27459732 34099349 41616673 45688852
6693 45688852 46808298 45990318 43140108 38460757 34612418 30454965 27539689 24666726
6685 24666726 22791088 21183103 20335120 19787114 19540440 19990407 19666364 20026836 20193562
6676 20193562 19931709 20026154 20507721 20747123 21635633 22780100 25120422 29072613 35468131
6667 35468131 42556693 47303308 48265770 46741152 44102515 38815032 34185020 29680674
6659 29680674 25656802 22511295 19826661 18176710 16704248 15755323 15143278 14462623 14372916
6650 14372916 14447666 14463122 14530411 14719982 14814998 14717414 14953430 15224385 15731793 17119818
6640 17119818 18530590 21101384 22426639 23642227 22995573 22928574 21563487 19691166 19436686
6631 19436686 19542986 19977867 21666451 23182523 23445218 23278892 22191936 21029011 19163399
6622 19163399 17480265 16846352 15185802 14383592 13835549 13204666 12919296 12560232 12363962
6613 12363962 12618711 12333962 12345197 12410921 12484628 12634593 12863080 13393648 14350106 15436555
6603 15436555 17717433 21988171 28779743 35005847 39433051 39822736 38764450 35179185
6595 35179185 30938730 26509547 22456563 20235862 17616958 15828735 14696940 13398048
6587 13398048 13753532 13260190 13519993 13349219 13714650 14059132 14345375 15026580 15101050 15771373
6577 15771373 16328965 17133310 18872433 22614456 28229784 35637705 40533128 42103482
6569 42103482 40743492 38030372 34103707 28946486 24978209 21734716 19134696 17689905
6561 17689905 15654471 15242345 14713309 14445402 14190736 14722091 15241104 15176062 15520016
6552 15520016 16144269 16704699 17475064 18552195 19759061 21220238 24049551 27766622 31726754
6543 31726754 36670427 40973777 45264537 50492612 56020312 60925794 65481720 69143444
6535 69143444 70837576 69268771 65574371 60823523 55248381 48957814 44142079 38827799
6527 38827799 34315438 30874172 27533692 25173162 23620064 21895560 20903787 20312655
6519 20312655 19648024 19772951 18737786 18216398 17968817 17483904 16853667 15956356 15748767
6510 15748767 14803595 14485798 14214538 14105717 13793806 13440601 13761194 13068035 12832835
6501 12832835 12692024 12347974 12701889 12492722 12447991 12397669 12281449 12068761 12256685 12194214
6491 12194214 12209297 12373600 12479083 12364951 12086156 12239926 12220149 12369192 12192078 12477628
6481 12477628 11716734 12647396 12431904 12626681 12455209 12085119 12051863 12089426 12434489 12486415
6471 12486415 12248332 12443229 12486874 12696626 13004660 13135052 13308273 13577682 13649508 14143332
6461 14143332 14729472 14598723 15022853 15523037 15896753 16663223 17892517 18783453 20219319
6452 20219319 21351817 21946224 22459181 22821314 23369291 24368070 24634346 26412601 27733789
6443 27733789 29603206 31629790 33255472 34978164 36035703 37117415 38372458 39723530
6435 39723530 40907083 42430300 43407395 43913358 44080785 43856625 42799820 41700717 40263866
6426 40263866 39036209 38622954 37822748 37525641 37534380 38166784 39012563 40610598 42148951
6417 42148951 44195918 45852550 47166546 48642441 49133941 49650397 48833105 48346849 47363199
6408 47363199 46246187 45022604 44159135 43492068 43440012 44189553 45496556 47602963 49703480
6399 49703480 50996306 53351469 55264874 57326735 58456052 60140321 61716036 62689178
6391 62689178 64231664 66180492 67909487 70015376 72885256 75823473 80445936 84920440
6383 84920440 90828876 98137128 105428620 113629399 121517958 128091659 133115623 137069034
6375 137069034 137316252 135149991 130888634 124838555 117052889 108738309 100283615 91864658
6367 91864658 83902826 76833075 70055558 64337388 59109968 54734970 51160465 47676020
6359 47676020 44299971 41844660 39105390 37202605 35306380 33276184 32303782 30814298
6351 30814298 29262311 28888208 27598164 27089525 26331744 24794715 24169526 23575829 22820848
6342 22820848 22214681 21898791 20963380 20309777 19812830 19618692 19543568 18665825 18620110 18174512
6332 18174512 17710437 17528464 17190763 17023789 16993231 16368041 16401312 17036816 15730370 15763234
6322 15763234 16011384 15309572 15702885 15650312 15186942 15204480 15217618 15044252 15435889 15148764
6312 15148764 15314357 14842339 15196770 15135369 15016094 15089778 15047965 14409304 14452259 14067817
6302 14067817 14546607 14027915 14259805 14341664 14258601 14061081 13667075 13554592 13594164 13416854
6292 13416854 13581777 13493603 13701679 13737997 13762538 13852806 13776876 14232307 14424803 14277921
6282 14277921 14528139 14379291 14208845 14202354 14230245 13664344 14122733 13693859 13720765 14282743
6272 14282743 14245694 14425269 14705431 15035143 15626393 16322671 17500990 18697830 19438630
6263 19438630 20133742 20157122 19960374 19627912 18644626 18267252 17891925 17189610 17391939 17323147
6253 17323147 17094656 17823062 17821449 17669510 17991331 18114686 19198313 20476686 21417367
6244 21417367 23939400 25370449 27411808 29190202 30707996 30665293 30681436 29383125 28576141
6235 28576141 26880915 25532938 25077246 24011247 23214749 23071455 23648608 23548469 24070919
6226 24070919 23586255 23664966 23562002 23074975 22796458 22085424 21156661 20865656 20227010 20056468
6216 20056468 19394962 19123866 19374071 19906906 20219358 20742906 20754476 20885441 20616373 19688844
6206 19688844 19112203 18782268 18510785 17643343 17804921 17760325 17964153 18092119 18191706 18720407
6196 18720407 18905954 19789430 19740620 20721376 20987899 21080085 20986918 20828449 20084614 19742881
6186 19742881 19288405 18954002 18643760 18790333 18356475 18444168 17465687 17227942 17022314 16539917
6176 16539917 15897348 15656178 15117487 15619569 15166050 15152732 15579772 15534696 15872560 15859483
6166 15859483 16058975 16032840 16125896 16206452 15977520 15846892 16118954 15637172 16303037 16056260
6156 16056260 16479005 15920323 16190529 15923305 16035940 16429856 16313729 16744035 16646791 16343621
6146 16343621 16393505 16161984 15736028 15828599 15401631 15455952 15718940 15158977 16672298 16716400
6136 16716400 17501430 18005514 18769093 19151171 20044519 19114786 19527567 19493158 19662228 19581647
6126 19581647 19121056 18676642 18589649 18047989 17586916 16941174 15906603 15835825 15644567 15408710
6116 15408710 15323221 15075098 14719141 15112610 14880458 15015247 14637094 14457173 14703921 14683830
6106 14683830 14668597 15147295 14747886 14528329 15067848 14702803 14829183 14734414 14534195 14996522
6096 14996522 14599029 14568623 15124674 14740314 14721034 15023986 14377740 14547266 14511733 15108897
6086 15108897 14868344 14510164 15149503 15118113 15119180 15211045 15390742 16035385 16278385 16786668
6076 16786668 17334174 18027464 18536694 19255849 19343885 19182891 19241057 19332913 19561894 19739950
6066 19739950 19971782 20020998 20101440 19986995 19954015 19326832 18825108 18553187 17864733 17856302
6056 17856302 16646176 16006319 16553869 16220916 15469430 15997349 15710539 16067732 16817412
6047 16817412 16731532 16325870 16509001 16422305 16472295 16469568 16845368 17231329 17408496 17686803
6037 17686803 18282270 17950427 18667184 18563867 18308992 18311625 17437618 17563151 17618605 16695785
6027 16695785 16289738 15685733 15508258 15492953 14738903 14504710 15406295 15058483 15048086 15290760
6017 15290760 15088632 15242004 15371801 15219496 15215615 15862883 16118194 16701332 16294674 16921665
6007 16921665 16707946 16491107 15933434 15808920 15336829 15305331 15808010 15166458 15289670 15258036
5997 15258036 15048852 14911895 14790694 15098666 15296974 14882723 15150578 15165595 15585586 15183433
5987 15183433 15514457 15851868 15668506 15313799 15615767 15412019 15380036 15468586 15169561 15448177
5977 15448177 15128399 15187555 15137379 15119250 15599322 15604854 15874965 15411942 15911894 15883131
5967 15883131 16054025 15821485 16075921 16117739 16498373 16541891 16576407 16913431 16797247 16848772
5957 16848772 16551553 16715811 16420189 16786035 16880901 16628317 16986401 16919287 17258219 17439740
5947 17439740 17432882 17874999 17791336 18214714 18218709 18260787 18392723 18844432 18309837 19013315
5937 19013315 19411528 19501407 20007069 20468180 20357432 21203340 22056128 22458730 23548254
5928 23548254 24207418 25066656 25616944 27052584 27763474 29086213 29648866 31113072 31581379
5919 31581379 32286731 32933718 33212990 33655911 33736672 34388636 33901132 33527130 33807068 33651315
5909 33651315 33945146 33652792 33948298 34290916 35274492 35675286 36496019 37822081 38611986
5900 38611986 40265536 42090956 44128834 45895362 48952989 51216183 53586835 56193314
5892 56193314 58793561 60774696 61997061 62774277 63507421 64060163 63178300 61807297 60394424
5883 60394424 59123852 58367343 57099431 56301336 55749223 55995757 56937749 58234624 59343496
5874 59343496 60993141 62381296 63445573 64282095 65386555 66522461 68320327 70430386
5866 70430386 73093381 76216031 79834907 82981191 86756609 89627244 91043535 92804740
5858 92804740 93897451 94063249 93623656 92858475 91021476 88933888 86321672 82915494 80133212
5849 80133212 76253266 73324658 70287510 67806968 65775301 63980102 62972600 62471024
5841 62471024 62560225 63045960 63913953 65554968 68189711 71459227 75620262 80441775 84765435
5832 84765435 89209006 92478780 95272785 96599968 97771491 98306993 96768017 93916661
5824 93916661 89870802 85757393 80410642 75669360 71371151 67774930 64411309 62013137
5816 62013137 59815824 58156055 56899270 56458410 55939579 55870902 56178044 56501252 57530832
5807 57530832 58425822 59553878 61775493 63114485 65997216 68188437 71484253 74982618
5799 74982618 79258913 83121770 85960262 87327793 87040370 86550776 85189731 83436058
5791 83436058 82404281 80741805 79213222 77853362 76510277 75466286 74315078 73869406
5783 73869406 73518941 72538868 72127248 72063051 71885612 72104215 72891502 73496841 74618349
5774 74618349 75288014 76601856 78462643 80397723 83064509 85447602 88157260 89929228
5766 89929228 91899159 94067463 95399038 96747527 98201779 100102731 100682485 101535006
5758 101535006 102059945 102637349 103046982 103553614 103601857 103718844 104075176 104144981 103870020 104119609
5748 104119609 104194697 104476830 104602145 104946865 104536636 104954150 105549276 106332153 106944955
5739 106944955 108015927 109581218 110552495 112375837 114309232 116622575 118430862 119702823
5731 119702823 121671836 123075752 124136074 125124489 125463570 125429353 125133938 124329917 123891903
5722 123891903 122383720 120867833 118944728 117710288 116301742 114783621 113509290 112405675
5714 112405675 111841568 111685998 111757878 111793915 112322238 113599817 115088959 116368080 118498024
5705 118498024 120147757 122157310 123944158 125960251 127307588 128116381 128847647 128985158
5697 128985158 129092063 128411748 127350338 126557480 125523135 124533753 123682571 123683699 123767876
5688 123767876 124450299 124987211 126154801 128082970 130009100 132377915 134511045 136884250
5680 136884250 138682133 141174801 143823442 145816579 147988502 150560981 152503496 154363563
5672 154363563 155641823 157062233 158258052 159081250 160586824 161044481 161439404 162037375 162325155
5663 162325155 162650215 163132781 163643210 163792713 165108245 165929329 166984721 168154326 169343716
5654 169343716 170253011 171608411 172435991 172235937 172254333 171265879 169259776 167451468 164664500
5645 164664500 161693968 158438796 155118020 151250266 148536546 144789567 141871696 139016716
5637 139016716 136898535 134019739 131368099 129092429 127143672 125441477 124795940 123176680
5629 123176680 122061057 121221612 120641294 120155549 119211798 118110751 117299980 116187120 114571666
5620 114571666 112588243 110407757 107477061 104910856 101828744 99012038 95654849 92987080
5612 92987080 90408807 87537425 85079916 82453138 81010507 79515013 77698158 76391743
5604 76391743 75143090 74376773 73437622 72910507 72409107 71729122 70861194 70181087 69596992
5595 69596992 68503510 67972109 66824795 65967695 64653850 63250391 62782988 61898231 60573774
5586 60573774 59897916 59722022 58956513 59317358 58755633 58216160 58081649 58637613 58605413 59188376
5576 59188376 59492997 60760515 61909391 63138304 64674255 66550135 68173193 69372218
5568 69372218 71116307 71411378 71754224 71547289 70566463 69475609 67419295 65593762 63788289
5559 63788289 62260068 60475950 58637514 57559918 56363440 55057222 54800056 54403304
5551 54403304 54461972 54662815 54936951 55879878 56726131 57822205 58889646 60594111 61401938
5542 61401938 62574613 63677208 64205925 64454525 64193430 63590420 63152201 61416011 60144239
5533 60144239 58144207 56414461 54673303 52952971 51565326 49606233 48237262 46859459
5525 46859459 45470150 44434390 43931101 42824009 42353176 42120346 41633120 40981279 41117370
5516 41117370 41208029 41658993 41623424 41884454 41658298 42077806 41760545 41044674 40667627 40055527
5506 40055527 38960870 38011780 36753259 35717042 34728534 33381597 32631454 32169726 31772475
5497 31772475 31574765 30684126 30526211 30210782 30494622 30487779 30546263 30664598 30559036 30910602
5487 30910602 31150623 31682825 31950436 32715368 33075550 33759707 34693013 35101637 35535194
5478 35535194 35523769 36580385 36144902 36408680 36476098 36272046 36718985 36565852 36764504 37210797
5468 37210797 37206391 37480303 38204759 38459375 38912238 39618484 40315424 41015459 41858852 42313618
5458 42313618 43385484 43847210 44637839 45142724 45464622 45462861 45772132 45617622 45088881 44339709
5448 44339709 44095614 42797698 42400626 41317852 40243134 39710941 39187097 38142145 37313535
5439 37313535 36871850 36113174 35150404 34675029 33897195 33369000 32365837 31845108 30899799
5430 30899799 29783301 29738713 28962164 27702464 27146954 26428361 25725832 25215721 24307266
5421 24307266 23830343 23162023 22798277 22581638 22459499 22095411 21877006 21818951 22270760 21831533
5411 21831533 21353644 21071432 20722872 20155055 19830849 19314438 18695304 18546443 18469586 18317541
5401 18317541 17923488 18074342 17742226 17759665 17968069 17880022 17885500 17918342 18224291 18165584
5391 18165584 18498673 18140273 18634382 18359752 18626322 18336599 18656828 17992397 18477398
5382 18477398 18588763 18511085 18583440 18538676 18296323 18578110 18689312 18475256 18629242 18168590
5372 18168590 18357699 18123311 18025712 17992636 17925436 17592469 17390252 17868990 17139557 17120830
5362 17120830 16717692 16777708 16901326 16696605 16335295 16638992 15992983 15854026 15602862 15604577
5352 15604577 15258800 15033785 15357525 15164552 14593522 14525744 14241859 14269679 13952820 14046430
5342 14046430 13967719 13572013 13474890 13570452 13383940 12943297 13118572 12974405 13023492 12929061
5332 12929061 12679636 13051159 12817643 12657975 12751157 12045894 12302940 12124482 12220968 11995077
5322 11995077 12071543 11997358 12116940 11923370 12003159 11966658 12228904 11989226 11970453 11857105
5312 11857105 11622639 11674017 11907479 11858263 11850740 11495887 11765698 11566150 12205071 11887427
5302 11887427 11898515 11399306 11777166 11697103 11474198 11787555 11599236 11671096 12014498 12708674
5292 12708674 12279313 12964418 13366985 13356393 13617217 14465628 14558691 15216131 14949984 15152561
5282 15152561 15112635 15460692 15956248 16333835 16199991 16315122 16474059 16775753 16584218 17027933
5272 17027933 17022349 17404829 17780741 17827140 18516112 19296802 19789301 20302074 20615077 21279481
5262 21279481 21351803 21094927 21503431 21663495 21113798 20936350 20092214 19486649 19079650 18195280
5252 18195280 17717512 17014981 16122327 15798846 15835723 15283546 15234117 14961829 14750146 14813726
5242 14813726 14893962 14318609 14509760 14831745 14204132 14491867 14660533 13983354 13803951 13234518
5232 13234518 12817074 12471928 11948618 11751508 11516404 10714856 10376039 10257514 9930370
5223 9930370 9620582 9194662 9348181 9129652 9232327 8985013 8438386 8350322 8703195 8499001
5213 8499001 8545009 7927097 8105269 8035409 8124751 7560314 7822909 8234138 7954418 7898850
5203 7898850 8056434 7870434 8354178 8411396 8640216 8877320 8784077 9152839 9450722 8548469
5193 8548469 8563751 8392071 8276630 8266852 8303927 8043920 8613572 8652438 8462183 8419792 8296116
5182 8296116 8831378 8941574 9037359 9182730 9430160 9310713 9649278 10133429 10184171 10468518
5172 10468518 10692839 11620016 11459482 12192002 12520459 12766492 12669561 12701109 12736338 12803958
5162 12803958 12863514 13299618 13242344 13545352 13399615 13666097 13764292 13925419 13618905 13762519
5152 13762519 13325207 13138501 13012881 13027124 13219547 13642244 13056174 13220778 13628474 13383622
5142 13383622 13776909 14168376 14479497 14982530 15006009 15490568 16010577 15839353 15764933 17013187
5132 17013187 16947308 17900444 18063343 18783814 19674152 19969395 20514110 21481218 21950074 22495297
5122 22495297 23261998 23141895 23999748 24312948 25093373 25503639 26209695 27096558 28047780
5113 28047780 28578579 29371396 30312471 30397611 31132601 31030692 31125497 31823362 31757269 31437052
5103 31437052 31735366 32225357 33075906 33561759 33647565 34379291 35246126 36270217 36846879
5094 36846879 37905369 38488156 40382488 41196071 42822371 44453838 45354378 46896109 47735421
5085 47735421 48868642 50456060 51170486 51963142 52618408 52894262 53195947 53409645 53015336
5076 53015336 52743872 52599507 52166504 51665701 51662145 51688339 52014339 52245018 52959357 53820813
5066 53820813 55080806 56435203 57978085 60662466 62724620 65253279 67682889 70320377
5058 70320377 72251638 74166571 75517872 76057358 76876533 76940255 76716327 76447346 74999404
5049 74999404 73728503 72142285 70667535 68573150 66979574 64342445 62702374 61152300
5041 61152300 59768670 59054913 58734930 58622452 59379443 60288788 61518036 62900970 65413156
5032 65413156 67537139 69821375 71885635 73650698 74783669 75854740 75336271 74373233
5024 74373233 72689461 70384950 67485689 65190163 61897310 59853386 57298888 54377576
5016 54377576 52270492 50305809 48595882 47104853 45785234 44125011 43691165 43216021
5008 43216021 42673503 42789429 43087620 43380031 43883919 44434534 45565441 46399464 47293589
4999 47293589 48537271 48428995 47857656 46872726 45115665 43185278 41273804 39048142 37320565
4990 37320565 35736739 33836328 32851935 30998433 30186671 29084529 27873656 26951867 26410006
4981 26410006 25776140 25400804 24945731 24354126 23754784 23909392 23823946 23720707 23800486 23860938
4971 23860938 24143551 23779234 24598420 23923382 24425232 24182766 23581290 23329953 23121061
4962 23121061 22754808 22342362 22170466 22377643 22817485 23247113 23729454 24175324 25042089
4953 25042089 25897631 26940603 28726844 31239126 35128266 42997445 60017861 91772448
4945 91772448 126005904 146612361 148346828 141800949 126963189 104628191 84187099
4938 84187099 66481744 52756445 41273255 32405487 26275449 23487637 21515515 20294973
4930 20294973 19306952 18082304 18002056 17289612 16663498 16014184 15851647 15678239 15195111
4921 15195111 15089559 14840824 14553079 14186091 13515704 13633464 13434616 13279262 12762973
4912 12762973 12861392 12696879 13100050 12764022 12477769 12712017 12840620 12717066 12726082 12691582
4902 12691582 12332095 12592095 12722493 12530287 12380843 12497105 12618901 12712446 12590030 12659637
4892 12659637 12428830 12179805 13085529 13100834 13167230 13046189 13102751 13299562 13142331 13071555
4882 13071555 13654347 13357570 13571239 13555364 13777502 14093662 14051206 14236041 14539828 14352563
4872 14352563 14610628 14676990 14841906 15273111 15663245 15640664 15585213 16327365 16693625 16919029
4862 16919029 16888110 17298386 17788302 17884113 18708247 18929006 19430243 19640654 20156804 20718575
4852 20718575 20740281 21426931 22435558 22079802 23277401 23831040 24205887 24973218 25787616
4843 25787616 26400940 27163017 27909723 28717668 29960727 30865215 31492381 32635101 33536412
4834 33536412 34648899 35475884 36643797 37764654 38776778 39677664 41128448 42023407 43228413
4825 43228413 44494530 45509863 46678662 48148630 49390610 50952392 52446420 54309198
4817 54309198 56266129 58609063 61068468 63399964 66274561 69223854 72188303 75654400
4809 75654400 78774572 81785211 84844792 87876503 90148651 92950274 95803267 97697824
4801 97697824 100923623 103208658 105966353 108890276 112318373 115108872 118244080 120556454
4793 120556454 122703873 124379757 126481069 128187299 130595232 133004028 136264228 139435209
4785 139435209 142614143 146351051 149221879 150930494 150915935 150176477 148361198 145570275
4777 145570275 142243062 138840752 135769715 132832340 130449529 128578913 126899562 125941665
4769 125941665 124306842 122604836 120524345 117214217 114328856 111462781 108849614 106056129
4761 106056129 103490567 101495603 99150027 97207828 95297841 93170206 90959730 88314398
4753 88314398 85251194 82521179 79298845 76635131 73895294 71776775 70005574 68012055
4745 68012055 66449946 64687662 63408974 62114242 61145039 60435407 59285347 58159426
4737 58159426 57309183 56624727 56019596 54923376 54209037 53086405 51837493 51815497 50519722
4728 50519722 49991777 49053857 48617457 48232693 47870683 47393344 47445849 46845182 46588178 46666183
4718 46666183 46130758 45886395 45568933 45486335 44957721 44639608 43697808 42895977 42630564 42024890
4708 42024890 41575016 41006353 40366212 39543502 39275594 38406402 38628500 37854673 37661125
4699 37661125 37021444 37100245 36711050 36149286 36003352 35324776 35320691 35182719 34457823 34165458
4689 34165458 33960798 32993293 33519173 33114910 32083957 31782214 31182961 30592833 30231691
4680 30231691 29313158 28808375 28159465 27441869 26998957 26072281 25431574 25041302 23828048
4671 23828048 23489831 23545119 23002180 22434845 22323718 22100502 21532618 21654116 21078526 20834047
4661 20834047 20669692 20156980 20460985 19797900 19488593 19167194 19207194 19135939 18902115 18422289
4651 18422289 18145349 17836114 17206946 16456923 16018440 15705221 15708705 15120678 14483022 14289602
4641 14289602 14008415 13492475 13248015 13149045 12581552 12049916 11901812 11870724 11299729 11444510
4631 11444510 11072136 10803252 10899739 10360038 9838798 10173952 9587856 9454665 9099282 8957275
4621 8957275 8839786 8614906 8544271 8079785 7954795 8146531 7577813 6682477 7231607 7104939
4611 7104939 7210162 6684565 6203270 6250252 5904853 5920552 6300499 5584227 5613748 5801379
4601 5801379 5288460 5762065 5541864 5262063 4990971 4788183 4686079 5091319 5112242 5100734
4591 5100734 4770639 5129544 4731503 4842315 4816372 4668900 4686138 4504578 4690469 4612102
4581 4612102 4202944 4182557 4053827 4028732 4484430 3887313 4110204 4370058 4037457 3883036
4571 3883036 4029351 3979734 4134335 4132730 3626372 3794517 3810649 3536307 3854693 3698973
4561 3698973 3445367 3613919 3637627 3501754 3551538 3275221 3391765 3094123 3512863 3468741
4551 3468741 3091611 3435793 3411586 3152807 3314504 3154999 3291730 3439104 3391953 3255719
4541 3255719 2917404 3348557 3343371 2812787 3337348 3126579 3266580 3020658 2786728 2684818
4531 2684818 2702789 3286291 2949003 2906844 2789414 2930286 3034577 3388994 2944949 2953183
4521 2953183 2838420 2849034 3024396 2757457 3049505 2954647 3096621 2690645 2629367 3041549
4511 3041549 2914070 3047552 3067549 2912484 3569244 3080629 2976470 3230227 2642823 3208071
4501 3208071 3142530 3320276 3258675 3232761 3223652 3382493 3461579 3244283 3797906 3164748 3768074
4490 3768074 3347686 3335168 3506597 3038145 3373710 3650681 3297136 3756343 3929551 3240275
4480 3240275 3847834 4329487 3778532 4024989 3455568 4022923 3945862 4071767 4186539 4257895
4470 4257895 4198062 4318311 4589976 4311313 4228618 4566275 4601596 4596762 4568086 4579608 5001684
4459 5001684 5110992 5047027 4988946 5330454 5482486 5884394 6018265 5919125 6733948 7193853
4449 7193853 7195903 8166686 8284161 9689741 11912307 14369390 17378305 20042384 20597396
4440 20597396 20794773 19837767 17754950 16415738 14269856 12950366 11597206 10254937
4432 10254937 9686595 9473942 9167272 9218993 9254497 8937547 9679043 9761647 9673294 10212435
4422 10212435 10817074 11247675 11858254 12859638 14380218 16426242 20064792 26026405 32580360
4413 32580360 37321390 39538423 39655544 37329173 34455374 30538970 27701860 24361771
4405 24361771 22446710 21556796 20982749 22597099 26930511 33499181 41058059 45465249
4397 45465249 46314862 45551056 42189636 37522407 33062089 29113728 26125374 24003449
4389 24003449 22495307 21731403 23167553 25470509 28131484 30327122 31277461 31621794 31038194
4380 31038194 30053266 28623901 27797417 27289456 27772968 29365654 32685695 40756455 54313662
4371 54313662 70691452 81085427 83698837 80999309 75254807 64512379 54561653 46122338
4363 46122338 39407126 33483121 29470993 26183130 24957297 24471464 23808420 24289478 24039418
4354 24039418 24314478 25050363 26485838 30001140 37624494 47575432 55850521 58842962
4346 58842962 59508925 61383303 61814697 63746872 64338194 62408725 58956564 53470928 46739157
4337 46739157 40833465 35786725 32177145 29259037 26917926 25634910 25355693 25052482
4329 25052482 25704892 26261771 26912396 28117720 29543125 32014418 37093630 49410468
4321 49410468 69179995 86352040 94251769 95678218 95792298 88313001 79691355 70408179
4313 70408179 61735704 54113019 46466527 40130396 35194070 31745254 28852829 26787568
4305 26787568 24873078 23991097 22570206 21642920 21191060 20312443 20094323 19752540 19796287
4296 19796287 19925322 21730508 25878950 33612093 41888523 45933193 45887531 44199910 39865614
4287 39865614 34225741 29155935 24417815 20813420 17980981 15755479 14187651 12964305
4279 12964305 12969717 12862448 12910645 12275852 12159720 11981581 11017997 10647924 9930619 9441029
4269 9441029 8889803 8213046 8054125 7224963 7266131 7043869 6087016 6296653 6229810 5813753
4259 5813753 5748896 5666173 5550264 4932632 5255823 5445850 5305664 5080922 5046126 5276393
4249 5276393 5611886 5632218 5528452 5086317 4913179 4623080 4149188 3801293 3456922 3597843
$$ [...]
##END NTUPLES=NMR SPECTRUM
##END=
