##TITLE=abcd
##JCAMPDX= 6.0         $$ Bruker NMR JCAMP-DX V2.0
##DATA TYPE= NMR SPECTRUM
##DATA CLASS= NTUPLES
##ORIGIN= UXNMR, Bruker Analytische Messtechnik GmbH
##OWNER= root
$$ XWIN-NMR		Version 3.5
$$ Tue Aug  4 19:00:40 2026 Russian Standard Time (UT+4h)  servis@DPX200
##.OBSERVE FREQUENCY= 200.131235884673
##.OBSERVE NUCLEUS= ^1H
##.ACQUISITION MODE= SIMULTANEOUS
##.ACQUISITION SCHEME= undefined
##.AVERAGES= 32
##.DIGITISER RES= 18
##SPECTROMETER/DATA SYSTEM= spect
##.PULSE SEQUENCE= zg
##.SOLVENT NAME= MeOD
##.SHIFT REFERENCE= (INTERNAL, MeOD, 0, 16.4885)
##AUDIT TRAIL= $$ (NUMBER, WHEN, WHO, WHERE, WHAT)
$$ ##TITLE= Audit trail, XWIN-NMR		Version 3.5
$$ ##JCAMPDX= 5.01
$$ ##ORIGIN= Bruker BioSpin GmbH
$$ ##OWNER= servis
$$ F:\spectra/data/av/nmr/H1/1/pdata/1/auditp.txt
$$ ##AUDIT TRAIL=  $$ (NUMBER, WHEN, WHO, WHERE, WHAT)
(   1,<2026-08-04 18:30:47.23 +0400>,<servis>,<DPX200>,
      <created by zg, POWCHK disabled, PULCHK disabled
       configuration hash MD5:
       00 E9 B6 7A A2 85 ED C7 34 08 36 98 17 FE 4E 26
       data hash MD5: 32K
       0C A7 92 5D 59 AB F7 10 29 A2 51 7D 93 AD 51 78>)
(   2,<2026-08-04 19:00:10.35 +0400>,<servis>,<DPX200>,
      <Start of raw data processing
       efp BC_mod = 2 LB = 0.05 FT_mod = 6 PKNL = 1 PHC0 = -418.5518 PHC1 = 3.101563 SI = 16K 
       data hash MD5: 16K
       60 D3 FD F4 54 2E 2B 44 EC 23 08 D2 9C 4D CA 06>)
(   3,<2026-08-04 19:00:21.01 +0400>,<servis>,<DPX200>,
      <pk PHC0 = 3 PHC1 = 0 
       data hash MD5: 16K
       DE 0E C0 8F E7 78 F5 50 3D 69 A4 CE CC B1 F7 0B>)
$$ ##END=
$$ 
$$ hash MD5
$$ 51 FE 1E 4D 94 96 F1 3E 18 E0 AC 52 E0 70 75 CD
##$RELAX= 
##$RELAX= 
##$RELAX= 
##$RELAX= 
##$RELAX= 
##$RELAX= 
##$RELAX= 
##$RELAX= 
$$ Bruker specific parameters
$$ --------------------------
##$DU= <F:\spectra>
##$EXPNO= 1
##$NAME= <H1>
##$PROCNO= 1
##$TYPE= <nmr>
##$USER= <av>
##$AMP= (0..31)
100 100 100 100 100 100 100 100 100 100 100 100 100 100 100 100 100 100 
100 100 100 100 100 100 100 100 100 100 100 100 100 100 
##$AQSEQ= 0
##$AQ_mod= 1
##$AUNM= <au_zg>
##$AUTOPOS= <>
##$BF1= 200.13
##$BF2= 200.13
##$BF3= 200.13
##$BF4= 200.13
##$BF5= 500.13
##$BF6= 500.13
##$BF7= 500.13
##$BF8= 500.13
##$BYTORDA= 1
##$CFDGTYP= 0
##$CFRGTYP= 5
##$CHEMSTR= <none>
##$CNST= (0..31)
1 1 145 1 1 1 1 1 1 1 1 1 1 1 1 1 1 1 1 1 1 1 1 1 1 1 1 1 1 1 1 1 
##$CPDPRG= <>
##$CPDPRG1= <>
##$CPDPRG2= <>
##$CPDPRG3= <>
##$CPDPRG4= <mlev>
##$CPDPRG5= <mlev>
##$CPDPRG6= <mlev>
##$CPDPRG7= <mlev>
##$CPDPRG8= <mlev>
##$CPDPRGB= <>
##$CPDPRGT= <>
##$D= (0..31)
0 2 0 0 0 0 0 0 0 0.06 0 0 0 0 0 0 0.0002 0 0 0 0 0 0 0 0 0 0 0 0 0 0 
0 
##$DATE= 1785853846
##$DBL= (0..7)
120 120 120 120 120 120 120 120 
##$DBP= (0..7)
150 150 150 150 150 150 150 150 
##$DBP07= 0
##$DBPNAM0= <>
##$DBPNAM1= <>
##$DBPNAM2= <>
##$DBPNAM3= <>
##$DBPNAM4= <>
##$DBPNAM5= <>
##$DBPNAM6= <>
##$DBPNAM7= <>
##$DBPOAL= (0..7)
0.5 0.5 0.5 0.5 0.5 0.5 0.5 0.5 
##$DBPOFFS= (0..7)
0 0 0 0 0 0 0 0 
##$DE= 6
##$DECBNUC= <off>
##$DECIM= 32
$$ [...]
##$SUBNAM4= <"">
##$SUBNAM5= <"">
##$SUBNAM6= <"">
##$SUBNAM7= <"">
##$SUBNAM8= <"">
##$SUBNAM9= <"">
##$SW= 20.6817932712277
##$SWIBOX= (0..15)
0 0 3 0 0 0 0 0 0 0 0 0 0 0 0 0 
##$SW_h= 4139.07284768212
##$TD= 32768
##$TD0= 1
##$TE= 0
##$TE2= 300
##$TE3= 300
##$TEG= 300
##$TL= (0..7)
0 120 120 120 120 120 120 120 
##$TP= (0..7)
150 150 150 150 150 150 150 150 
##$TP07= 0
##$TPNAME0= <>
##$TPNAME1= <>
##$TPNAME2= <>
##$TPNAME3= <>
##$TPNAME4= <>
##$TPNAME5= <>
##$TPNAME6= <>
##$TPNAME7= <>
##$TPOAL= (0..7)
0.5 0.5 0.5 0.5 0.5 0.5 0.5 0.5 
##$TPOFFS= (0..7)
0 0 0 0 0 0 0 0 
##$TUNHIN= 0
##$TUNHOUT= 0
##$TUNXOUT= 0
##$USERA1= <user>
##$USERA2= <user>
##$USERA3= <user>
##$USERA4= <user>
##$USERA5= <user>
##$V9= 5
##$VALIST= <valist>
##$VCLIST= <CCCCCCCCCCCCCCC>
##$VD= 0
##$VDLIST= <DDDDDDDDDDDDDDD>
##$VPLIST= <PPPPPPPPPPPPPPP>
##$VTLIST= <TTTTTTTTTTTTTTT>
##$WBST= 1024
##$WBSW= 30
##$XGAIN= (0..3)
0 0 0 0 
##$XL= 0
##$YL= 0
##$YMAX_a= 805412
##$YMIN_a= -1089704
##$ZGOPTNS= <>
##$ZL1= 120
##$ZL2= 120
##$ZL3= 120
##$ZL4= 120
##$ABSF1= 0
##$ABSF2= 0
##$ABSG= 0
##$ABSL= 0
##$ALPHA= 0
##$AQORDER= 0
##$ASSFAC= 0
##$ASSFACI= 0
##$ASSFACX= 0
##$ASSWID= 0
##$AUNMP= <proc_1d>
##$AZFE= 0.1
##$AZFW= 0.1
##$BCFW= 0
##$BC_mod= 2
##$BYTORDP= 0
##$COROFFS= 0
##$CY= 18.4799938201904
##$DATMOD= 1
##$DC= 0
##$DFILT= <>
##$DTYPP= 0
##$F1P= 9.9274215381318
##$F2P= -0.165520771350173
##$FCOR= 1
##$FTSIZE= 16384
##$FT_mod= 6
##$GAMMA= 0
##$GB= 0
##$INTBC= 1
##$INTSCL= 4.127829e-11
##$ISEN= 128
##$LB= 0.05
##$LEV0= 0
##$LPBIN= 0
##$MAXI= 10000
##$MC2= 0
##$MEAN= 0
##$ME_mod= 0
##$MI= 50
##$NCOEF= 0
##$NC_proc= -4
##$NLEV= 6
##$NOISF1= 3.799351
##$NOISF2= 2.8
##$NSP= 0
##$NTH_PI= 0
##$NZP= 0
##$OFFSET= 16.48848
##$PC= 4
##$PHC0= -415.5518
##$PHC1= 3.101563
##$PH_mod= 1
##$PKNL= yes
##$PPARMOD= 0
##$PSCAL= 4
##$PSIGN= 0
##$REVERSE= no
##$SF= 200.130005582386
##$SI= 16384
##$SIGF1= 3
##$SIGF2= 2
##$SINO= 400
##$SIOLD= 16384
##$SREGLST= <1H.CDCl3>
##$SSB= 0
##$STSI= 16384
##$STSR= 0
##$SW_p= 4139.07284768211
##$SYMM= 0
##$S_DEV= 0
##$TDeff= 32768
##$TDoff= 0
##$TI= <>
##$TILT= no
##$TM1= 0
##$TM2= 0
##$TOPLEV= 0
##$USERP1= <user>
##$USERP2= <user>
##$USERP3= <user>
##$USERP4= <user>
##$USERP5= <user>
##$WDW= 1
##$XDIM= 16384
##$YMAX_p= 318634380
##$YMIN_p= -307973
$$ End of Bruker specific parameters
$$ ---------------------------------
##NTUPLES= NMR SPECTRUM
##VAR_NAME=  FREQUENCY,     SPECTRUM/REAL,   SPECTRUM/IMAG
##SYMBOL=    X,             R,               I
##VAR_TYPE=  INDEPENDENT,   DEPENDENT,       DEPENDENT
##VAR_FORM=  AFFN,          ASDF,            ASDF
##VAR_DIM=   16384,         16384,           16384
##UNITS=     HZ,            ARBITRARY UNITS, ARBITRARY UNITS
##FACTOR=    0.252644378177508, 1,           1
##FIRST=     3299.83951724647, 0,            0
##LAST=      -839.233330435636, 0,           0
##MIN=       -839.233330435636, -307973,     0
##MAX=       3299.83951724647, 318634380,    0
$$ Real data points
##PAGE= N=1
##DATA TABLE= (X++(R..R)), XYDATA
$$ [...]
10629a19568j726J0353l2502k2425N2739N145l8721M6994p073n6179Q1614r6528
10617a77877J3353Q4503l7474p176n0481O3543n554l6269M5718O687o3962M9858
10605a15131q643p7M633L8765r1147L0167n2212Q7407m2494J0044j4797j6461
10593a69946K7474j2695O335L2574M756k8481L6671k1100J0697m3934M4011k9633
10581a43271l7451k2747J01841P214m3740m6814R8528o7740K5837j8124K3893
10570a22574J6326o6592K4882K3236p541N0752J6191o7414j0791L9635L2845k1091
10558i2136m1515l9030L5064j2167j7532N8421M1404k6463J8196l6386j183j4046
10546a27373M4893r5623K0927j3460J9899P671K294j7995N6892L4942m4191k7014
$$ plain form
10629 -119568 -121294 -110941 -143443 -165868 -113129 -107984 -146705 -99711 -106784 -162963 -81349 -177877
10617 -177877 -164524 -80021 -117495 -124671 -175152 -111609 -117163 -153432 -107714 -101027 -164989 -115131
10605 -115131 -123774 -123851 -119218 -80453 -171600 -141433 -193645 -106238 -148732 -138688 -153485 -169946
10593 -169946 -142472 -155167 -148832 -116258 -111502 -139983 -103312 -124412 -113715 -157649 -113638 -143271
10581 -143271 -180722 -203469 -101628 -94414 -138154 -184968 -86440 -154180 -128343 -146467 -122574
10570 -122574 -106248 -172840 -147958 -124722 -132263 -81511 -65320 -132734 -143525 -103890 -71045 -92136
10558 -92136 -133651 -172681 -137617 -149784 -167316 -108895 -67491 -93954 -75758 -112144 -113327 -127373
10546 -127373 -82480 -178103 -157176 -170636 -150737 -143066 -140772 -158767 -101875 -66933 -111124 -138138
10534a38138Q237o4043J03659p0450M1684k3249M6369j0121P0046l1581o3626
10523a31213J8733m1955l74M0662j1139k1685J3325P010M6709o8089K5957J4536
10511a07523K4675l4559k790n802o2654P974K3108l8984K1377P1787K6805m1433
10499a18019M43J5559m4181L5396p5346P7072k5185m4589J2238J11316n2460m8751
10487a56507R072K3968p5514k143N3600K1966N38n254J9270J2042l8642j2458
10475a50062L1717O7186o6291k1901L2370Q525j6292J7347m8620M7441j5954l3042
10463a47576p40p876K2262l755k4128l4982L7450K9240p167k8196M5448K1744
10451i8276n9890L2556l588k439l5934k0516R0224l5689K2658l9216L3042m594
$$ plain form
10534 -138138 -129901 -193944 -90285 -160735 -119051 -142300 -95931 -106052 -36006 -67587 -131213
10523 -131213 -112480 -154435 -154809 -114147 -125286 -146971 -133646 -126636 -79927 -148016 -122059 -107523
10511 -107523 -82848 -117407 -120197 -125999 -188653 -180679 -157571 -196555 -175178 -103391 -76586 -118019
10499 -118019 -117576 -102017 -146198 -110802 -186148 -109076 -134261 -178850 -166612 -55296 -107756 -156507
10487 -156507 -147435 -123467 -198981 -201124 -147524 -125558 -125020 -130274 -111004 -98962 -137604 -150062
10475 -150062 -118345 -51159 -117450 -139351 -106981 -98456 -114748 -97401 -146021 -98580 -114534 -147576
10463 -147576 -148316 -156192 -133930 -137685 -161813 -196795 -159345 -130105 -137272 -165468 -120020 -98276
10451 -98276 -158166 -125610 -129198 -131637 -167571 -188087 -97863 -133552 -110894 -150110 -117068 -121662
10439a21662k0604K4305k5434M9875p3686Q611K7719L1087n6574N6699k7569q112
10427a35345L9972o3626K0872m8615K3549J3182K7040R839L88L5001m3357M242
10415a16858j9030O331m0135p778L0832K2601L301k1717M6167n177j6915j627
10403a20005o4450P6728l3701N588L1104m5751O9226l0890l3388K7456N351j0301
10391a23033r571l5714J3706N5826n3628M4107p114J880j9725M4689m5426j7845
10379a51848K6781p642j9206N4969k5906J1499l991J1818J5626j8111n2400M7790
10367a10621m0425r75K5158N928M8985l741p7543J02735o2384Q556j2574l9167
10355a56068K2759j1097L1439o7807L9516J6857N1086m9867N043L4444o901l7943
$$ plain form
10439 -121662 -142266 -117961 -143395 -93520 -167206 -158595 -130876 -99789 -156363 -99664 -127233 -135345
10427 -135345 -95373 -158999 -138127 -186742 -163193 -150011 -122971 -113132 -112744 -77743 -121100 -116858
10415 -116858 -135888 -129557 -169692 -177470 -146638 -124037 -120736 -142453 -96286 -101463 -118378 -120005
10403 -120005 -184455 -107727 -141428 -135840 -104736 -150487 -81261 -112151 -145539 -118083 -112732 -123033
10391 -123033 -132604 -168318 -154612 -98786 -152414 -108307 -115421 -113541 -133266 -88577 -134003 -151848
10379 -151848 -125067 -132709 -151915 -96946 -122852 -111353 -115344 -103526 -87900 -106011 -158411 -110621
10367 -110621 -151046 -152021 -126863 -120935 -71950 -75691 -153234 -50499 -112883 -104327 -116901 -156068
10355 -156068 -133309 -144406 -112967 -180774 -141258 -124401 -73315 -123182 -118139 -83695 -90596 -128539
10343a28539Q991L049K7698k1222j3525K5161p7926M7015l068P172l5486M5494
10331a15186J5596Q008l0733L3639o6198j177L9265j2735p073J6863k3904J5868
10319a27767J7600K522m8007Q5161p2538L6445p5781O7671j4154j4191N945O82
10307a36412P5980p8860K1703k8791K6039M748l3990m502J7057n9550O4226J6914
10295a15438K3191K2499o7333J3380N5963o5666j0864M9124L9132m9375m4465
10284a49852M284P4736o4650K674j6191N8861L2921o0450m0885M4203L2194k377
10272h4532j8118p355m9492M1550L0978k6777K8284j7118l1197K6617m9643p731
10260a64534R1593R492Q467o022j02351M3311L8023l4948k1789K1811M3179K2040
$$ plain form
10343 -128539 -119548 -116499 -88801 -110023 -123548 -98387 -176313 -129298 -132366 -125194 -160680 -115186
10331 -115186 -99590 -91582 -122315 -88676 -154874 -156051 -116786 -129521 -136594 -119731 -143635 -127767
10319 -127767 -110167 -107645 -155652 -70491 -143029 -106584 -182365 -114694 -128848 -143039 -137094 -136412
10307 -136412 -60432 -139292 -117589 -146380 -120341 -115593 -149583 -154085 -137028 -196578 -132352 -115438
10295 -115438 -92247 -69748 -137081 -123701 -67738 -133404 -144268 -95144 -56012 -105387 -149852
10284 -149852 -145568 -70832 -135482 -132808 -148999 -90138 -57217 -117667 -158552 -114349 -82155 -84532
10272 -84532 -102650 -110005 -159497 -117947 -86969 -113746 -85462 -102580 -133777 -107160 -156803 -164534
10260 -164534 -72941 -63449 -54982 -61004 -163355 -120044 -82021 -116969 -138758 -116947 -73768 -51728
10248e1728k8961N496K230q3359L3006j9433L9241n0860R5145n2745L081m319
10236a13206K0892K1820o4905N1492p744M89q9937Q4380j7961J5679m6349m181
10224a49531P7855k1256J5813m65r349m4587j9534L2990R467l310l0111N4723
10212h7295l16j9164L0175n3952L213J091k8798N4777k3566o973K3259L1964J8400
10199e7185o7140K1276M7873n5127k3631K7408o0809N4198L5566m9948M505P2758
10187e0256m201q7657K325k9380P7534n2303J5996L9537q7150R2293j2163J6462
10175g8963l4149M892j0540k3138j5293L370M7425K3451m8874M6276K9859l5364
10163i1048k5092L1202K5011p7491L3489J2991m7849M3234M90j1412J5288K66
$$ plain form
10248 -51728 -80689 -75193 -72963 -156322 -123316 -142749 -103508 -154368 -59223 -111968 -108887 -113206
10236 -113206 -92314 -70494 -135399 -83907 -91651 -91162 -181099 -96719 -114680 -99001 -145350 -149531
10224 -149531 -71676 -92932 -77119 -77584 -86933 -131520 -151054 -118064 -108597 -111907 -142018 -87295
10212 -87295 -87611 -106775 -76600 -130552 -127339 -126248 -155046 -100269 -123835 -130808 -107549 -75585 -57185
10199 -57185 -124325 -103049 -55176 -110303 -133934 -106526 -167335 -113137 -77571 -127519 -123014 -50256
10187 -50256 -54457 -142114 -139789 -169169 -91635 -143938 -127942 -88405 -175555 -83262 -95425 -78963
10175 -78963 -113112 -108220 -118760 -141898 -157191 -153821 -106396 -82945 -131819 -85543 -55684 -91048
10163 -91048 -116140 -84938 -59927 -137418 -103929 -90938 -138787 -95553 -95063 -106475 -91187 -90921
10151i0921q2970O7556L6970j3241k4281M6911n1757K8297p585k398L1840j3735
10139g5314j2150M6599m2600l3187l9353M6260l5339N1524j0449N9763j1220n0534
10127a06000J4166j7531M0758J2961n5955N1378l7782K104J0141J7821J1654N463
10115e0822K0543p5027K7689l0964L4054N4271p6759N8730k6750M4125K8791o2463
10103e4582P0912p202n0757j3696m817J3400K3237j8853K2959l6736L5123K3509
10091B497j4581j1576j0280K1888q971J3720m5735J3170R343q462J256J2080M0272
10078A4621m1669l1147L4791j874k9665J8250j1550j9461K0827m7404N8821K3889
10066a1571q0480L3370j058j0752k3305J1194P5984l3930J0397j0286J7459o0549
$$ plain form
10151 -90921 -173891 -106335 -69365 -82606 -106887 -59976 -111733 -83436 -91021 -93419 -61579 -75314
10139 -75314 -87464 -40865 -83465 -116652 -156005 -109745 -145084 -93560 -104009 -44246 -55466 -106000
10127 -106000 -91834 -109365 -68607 -55646 -111601 -60223 -98005 -95901 -85760 -67939 -56285 -50822
10115 -50822 -30279 -105306 -77617 -108581 -74527 -20256 -97015 -38285 -65035 -20910 7881 -54582
10103 -54582 16330 9128 -41629 -55325 -60142 -46742 -23505 -42358 -19399 -56135 -21012 2497
10091 2497 -12084 -23660 -33940 -12052 -21023 -7303 -53038 -39868 -30525 -38987 -37731 -25651 14621
10078 14621 -27048 -58195 -23404 -25278 -54943 -36693 -48243 -67704 -46877 -94281 -35460 -11571
10066 -11571 -92051 -58681 -59739 -70491 -93796 -82602 -6618 -40548 -30151 -40437 -22978 -83527
10054h3527K0045J5132j6742m8597L1423N9349o0497J0710P5299n0266l1092k1432
10042a00195K311R367j7356K3469j6210P3141m3856N6986n5470mP4230r4549O0863
10029b7273p2982N3866k0406L2910l0476l4571N2505l1851L1n842N4015m7393
10017g7467L8754n137o0796M4967J2184l0317m020J1502M2820o3844k0278j4496
10005a26128O1378j4216O181m5616M1993N6065o5161N8641o2505l7639l1537O4135
9993i4409N9176n6872N6959k9122n188l2388N7782l5009k1342K2885j7192l2298
9981a27018K2949j3399R8206j7912Q240m6365K6478n4096L1813K0041k6937k5262
9969a03262n4316Q0458J8828p1108N7278L5015m6744j4927l945J6310m181m2731
$$ plain form
10054 -83527 -63482 -48350 -65092 -113689 -82266 -22917 -83414 -72704 2595 -47671 -78763 -100195
10042 -100195 -97884 -88517 -105873 -82404 -98614 -25473 -69329 -12343 -67813 -67817 6413 -88136 -27273
10029 -27273 -100255 -46389 -66795 -33885 -64361 -98932 -46427 -78278 -78247 -84089 -30074 -77467
10017 -77467 -38713 -43850 -104646 -59679 -47495 -77812 -81832 -70330 -27510 -91354 -111632 -126128
10005 -126128 -64750 -78966 -72785 -118401 -76408 -20343 -85504 -26863 -89368 -127007 -158544 -94409
9993 -94409 -35233 -92105 -35146 -64268 -69456 -101844 -44062 -79071 -100413 -77528 -94720 -127018
9981 -127018 -104069 -117468 -19262 -37174 -28934 -75299 -48821 -102917 -71104 -51063 -78000 -103262
9969 -103262 -157578 -77120 -58292 -129400 -72122 -37107 -83851 -98778 -102723 -86413 -90594 -133325
9957a33325K5397K1307j6632L869j3508L379P0188l3628O1789n4914o4117K4342
9945a05853m443K7864l4574N0067J6687O716m3516K5094J7221k4462k6967J4984
9933h1182j2459j9133K9941j5551O111K0449j4968k1109J4298J3058K2964k297
9921e9878j5295r501K401J8540n4574O0125m4069j5624k2620Q5579l3515J9013
9909f9418J029j602J2944j05906N4415P884K7819j9956J1012N593p974P656J9833
9896e6671l6675M2215l281k3916m1735L0767L0048O767o9913M3224L1681l3506
9884h0995M0208m8465j2l9272N386O1967n9091Q7823k3052M057q3943N0975j5297
9871i9711k0223L3603l1826J5963N5810o4243J2037r045J5575k688m000j8728
$$ plain form
9957 -133325 -107928 -86621 -103253 -99384 -112892 -109513 -39325 -72953 -11164 -66078 -130195 -105853
9945 -105853 -110296 -82432 -117006 -66939 -50252 -43536 -87052 -61958 -44737 -69199 -96166 -81182
9933 -81182 -93641 -112774 -82833 -98384 -92273 -71824 -86792 -107901 -93603 -80545 -57581 -59878
9921 -59878 -75173 -84674 -82273 -63733 -118307 -58182 -102251 -117875 -140495 -54916 -88431 -69418
9909 -69418 -68389 -69991 -57047 -162953 -108538 -100654 -72835 -92791 -81779 -76186 -84160 -76504 -56671
9896 -56671 -93346 -51131 -54412 -78328 -120063 -89296 -59248 -52481 -122394 -79170 -47489 -80995
9884 -80995 -40787 -89252 -89264 -128536 -123150 -61183 -120274 -32451 -55503 -51446 -135389 -84414 -99711
9871 -99711 -119934 -86331 -118157 -102194 -46384 -110627 -98590 -107635 -92060 -94748 -98748 -117476
9859a17476L8672l2679J7752r240r399l568K415L3864j6211L7971K322q178q0986
9846a44741J06502k9631n8992j583L5941l6612J5681K2369N5674m3065k7367L4297
9834g1527l5508M7074n2700L2834N428l1624K3600n3973J01962n5020K8423k05
9822f1236k978o5740K4302o5313R9000K1043m3286J7321r239L9700j9235n3956
9810a19617O1490R605M978o0069K6990J6444k8087k1955J589K0938J3957k6119
9798i9856N2733l4886J9619n781P7050n2530k7842j3977K9196K9189o0051L8950
9786d8186j8456k0736p868J4659K7979q8953O2308L0361Q719J9638m0998K8149
9774c3384p2801R888p901l0835O6700j6932J9350Q2088o6752j43l4537k7467j3108
$$ plain form
9859 -117476 -78804 -111483 -93731 -102971 -112370 -115938 -113523 -79659 -95870 -57899 -55577 -63755 -144741
9846 -144741 -38239 -67870 -126862 -128445 -92504 -129116 -113435 -91066 -35392 -78457 -105824 -71527
9834 -71527 -107035 -59961 -112661 -79827 -74399 -106023 -82423 -136396 -34434 -89454 -61031 -61236
9822 -61236 -64214 -129954 -105652 -170965 -71965 -50922 -94208 -76887 -86126 -46426 -65661 -119617
9810 -119617 -58127 -48522 -43544 -103613 -76623 -60179 -88266 -110221 -108632 -87694 -73737 -99856
9798 -99856 -47123 -82009 -62390 -68171 8879 -43651 -71493 -85470 -56274 -27085 -87136 -48186
9786 -48186 -66642 -87378 -95246 -80587 -52608 -141561 -79253 -48892 -40173 -20535 -61533 -33384
9774 -33384 -106185 -96297 -104198 -135033 -68333 -85265 -65915 16173 -50579 -50722 -85259 -112726 -125834
9761a25834K8061N1378m8966Q6623q5234L3281L541N4521o4000J2648k4468J8185
9749f0264k9243J7951m2437O4877l7580K7382K8533N9499k7868J3377j5474K5486
9737B4239m5578O864p2617L8073j1206r276K0632L3193j8220k4669m0100k822
9725a01487j6223J5692Q48M4963r01L3644l9512j5039j8390J5256Q348k2628Q359
9712h7070Q06r381M7469j8173j6544J7996k8344M4644j3706l6689K8477k0529
9700i1044J6027M97j9718L6261N441n9426J2861K6634m4111N382L2764k8502j5103
9687a22037K4417O161K641M376j4389L1149J9405n7569K6817n2993K5772k6751
9675a33001P3905m1578k9297M5595J5533p977k7308m59m918J2527L0023m9258
$$ plain form
9761 -125834 -97773 -46395 -95361 -8738 -93972 -60691 -57150 -2629 -66629 -53981 -78449 -60264
9749 -60264 -89507 -71556 -113993 -49116 -86696 -59314 -30781 28718 850 14227 -1247 24239
9737 24239 -21339 -14475 -87092 -49019 -60225 -69501 -48869 -15676 -33896 -58565 -98665 -101487
9725 -101487 -117710 -102018 -101170 -56207 -57108 -23464 -62976 -78015 -96405 -81149 -72801 -95429 -87070
9712 -87070 -86264 -95645 -48176 -66349 -82893 -64897 -93241 -48597 -62303 -98992 -70515 -91044
9700 -91044 -75017 -74520 -94238 -57977 -52536 -111962 -99101 -72467 -116578 -111196 -78432 -106934 -122037
9687 -122037 -97620 -91459 -88818 -84442 -98831 -67682 -48277 -105846 -79029 -132022 -106250 -133001
9675 -133001 -59096 -100674 -129971 -84376 -68843 -76820 -104128 -104587 -109505 -96978 -66955 -116213
9663a16213P276j8490K8669K429k6383R300L2899n6360N4343L8261m8199J5560
9651g6908n508O769l9914N4339p3875L0841K1293J3729m3152M420o225j6238L8951
9638i1478k359n0723L0563K3207j0058K6483J846l8889l716j6173P6949j5814
9626g0162n4503J2995j6865K4885r557N7599j2109m5848K4405J4403m5213l1160
9614a51130M3230L2099p676k409k3582P2487J5210o8320j5512m970j3558M1095
9602h3036m3825L7989m1665p758P1450r279n9250k2670O5315J3482l5499K0094
9590i4652l0770M3569n0000J3861m313O5530n8822L7298K620K4053n5379r309
9578a16314j5006K744K0077Q264r1462M5686M8203P817M662k2670r798R7575m7877
$$ plain form
9663 -116213 -108937 -127427 -98758 -96329 -122712 -113412 -80513 -136873 -82530 -44269 -92468 -76908
9651 -76908 -82416 -75647 -115561 -61222 -135097 -104256 -82963 -69234 -112386 -107966 -114191 -130429 -91478
9638 -91478 -93837 -144560 -113997 -90790 -100848 -74365 -72519 -111408 -115124 -131297 -54348 -70162
9626 -70162 -124665 -111670 -128535 -103650 -113207 -55608 -67717 -113565 -89160 -74757 -119970 -151130
9614 -151130 -107900 -75801 -83477 -85886 -109468 -36981 -21771 -90091 -105603 -110573 -124131 -83036
9602 -83036 -126861 -88872 -130537 -138295 -66845 -76124 -135374 -158044 -92729 -79247 -114746 -94652
9590 -94652 -125422 -81853 -131853 -117992 -122305 -56775 -115597 -78299 -75679 -51626 -107005 -116314
9578 -116314 -131320 -128576 -108499 -100235 -191697 -146011 -97808 -89991 -85329 -107999 -117797 -20222 -68099
9565f8099m5179L8360j7167J0911j145j2488o4793j8745N8864J9181J8617M8182
9553c3501k8375j2942j1979K501p7709J8516j3885J9947R445O5852m9636l0717
9541a42483q140Q2234n2733J9738K6548J6235m1771l6487Q781L3709k1319N443
9529a10245j3422O8446l4704K1294l6567k1475K0194m8884J8662N5966l5103L0448
9517h5390O963J8338k113m5360j876j2708L7931l2968m7324K6737K1238k5118
9505a41650M2465m2636K8610L5716M246K9418m223n4753l6577L789m2792O5375
9493a13012P5234m8148M2574l1769O177j4465J090n3276J4187L0119o3933R2727
9481f2495k2255J5060p602K615k1296K1674j7517o3249L0163K6808O992m3973
$$ plain form
9565 -68099 -113278 -74918 -92085 -81174 -82319 -94807 -159600 -178345 -119481 -100300 -81683 -33501
9553 -33501 -61876 -74818 -86797 -84296 -162005 -143489 -157374 -137427 -127982 -62130 -111766 -142483
9541 -142483 -150623 -68389 -121122 -101384 -74836 -58601 -100372 -136859 -128078 -94369 -115688 -110245
9529 -110245 -123667 -55221 -89925 -68631 -105198 -126673 -106479 -155363 -136701 -80735 -115838 -85390
9517 -85390 -78427 -60089 -62202 -107562 -109438 -122146 -84215 -117183 -164507 -137770 -116532 -141650
9505 -141650 -99185 -141821 -113211 -77495 -73249 -43831 -48054 -102807 -139384 -135595 -178387 -113012
9493 -113012 -37778 -85926 -43352 -75121 -68944 -83409 -82319 -135595 -121408 -91289 -155222 -62495
9481 -62495 -84750 -69690 -77292 -74677 -95973 -74299 -91816 -155065 -124902 -98094 -91102 -135075
9469a35075M132R6911l0478p1428O1285P736K0659l5934k3994k6257k028K5712
9457a08759l44N3139R731m9872L443j9025N3786j14902N8665M5343n7032K768
9445a23059J8482J8812L4432Q645l0133M422p2997J401L6350p0950O0195J3239
9433a01161r347P026j8805N3202P732n502p236O45k7715K9958l525m54p762R110
9419g3834q902L5229n9348N509J3198m331j6025n95J9644n085N979n326K409K1207
9405g0271n4526M3274J2491n1396J19J0763K3529L610N1230J6314k4868q383l0264
9392g8378r330k4116L2258o740R855M0038m2773l9831L9246N1958L464p3087M1779
9379e5657p2950J4328M4732j3178L1870m4150j7495P4721k9209o627k7765K2764
$$ plain form
9469 -135075 -130943 -34032 -64510 -135938 -74653 -66917 -46258 -82192 -106186 -132443 -134471 -108759
9457 -108759 -109103 -55964 -46233 -96105 -92662 -111687 -57901 -172803 -114138 -68795 -125827 -123059
9445 -123059 -104577 -85765 -51333 -42688 -72821 -68399 -141396 -139995 -103645 -174595 -114400 -101161
9433 -101161 -110508 -103482 -122287 -69085 -61353 -66855 -74091 -73446 -101161 -71203 -74728 -75182 -82944 -73834
9419 -73834 -82736 -47507 -106855 -101346 -88148 -92479 -108504 -109099 -89455 -94540 -88561 -93887 -91478 -70271
9405 -70271 -124797 -81523 -69032 -120428 -120309 -109546 -86017 -82407 -31177 -14863 -39731 -48114 -78378
9392 -78378 -87708 -111824 -79566 -86306 -76451 -36413 -79186 -119017 -79771 -27813 -24349 -97436 -55657
9379 -55657 -128607 -114279 -69547 -82725 -50855 -95005 -112500 -37779 -66988 -73615 -101380 -78616
9367g8616Q634o2592m5823K3373O5644J0701K3871J3584J5133k0454L9994p3452
9355h0003J8109n1292M5890K1893j00575O7116P875k2401r117N2567n2155L0854
9343g1239J5649j5039K746l554k9298M359K3057l6751M6068o7191Q0695n539k1144
9330g7181N340K7073j3122k4756l3861J9067P646J0755r273J0404J5381k9203
9318i1730j0901O9192k5893O4836l6875j3519k0148j9425K2612j4123M6399j15593
9306a45168M5547L5409Q268K4264K4017j11806O2356P715m0106N304J4038j5688
9294h5850M15K093K8682K4852l8314N10P138p395j2731k4425M6900l9748L1754
9281f6119j3304L8795q840n74M7422r2228P9938p6466P844j5435j3407j0763O7688
$$ plain form
9367 -78616 -69982 -132574 -178397 -155024 -89380 -78679 -54808 -41224 -26091 -46545 -6551 -80003
9355 -80003 -61894 -113186 -67296 -45403 -145978 -78862 -70987 -93388 -102505 -49938 -102093 -71239
9343 -71239 -55590 -70629 -67883 -71437 -100735 -96376 -73319 -110070 -64002 -131193 -50498 -56037 -77181
9330 -77181 -71841 -44768 -57890 -82646 -116507 -97440 -89794 -79039 -88312 -77908 -62527 -91730
9318 -91730 -102631 -33439 -59332 5504 -31371 -44890 -65038 -84463 -61851 -75974 -29575 -145168
9306 -145168 -99621 -64212 -55944 -31680 -7663 -119469 -57113 -49398 -89504 -84200 -70162 -85850
9294 -85850 -85435 -83342 -54660 -29808 -68122 -67612 -60474 -67869 -80600 -105025 -58125 -97873 -66119
9281 -66119 -79423 -40628 -49468 -50042 -2620 -94848 -14910 -91376 -83532 -98967 -112374 -123137 -55449
9268e5449q914j0982p891L7703L7827r6657M7275k5797J1495l2992L8584L3512
9256c2286k9877j9192N2726l6406q644k5285M0971m4254P6040k8141k8186n569
9244h8103P4258l5938O3159q2732R4058j976n2746l1249l953Q3379r4966M1027
9232c5782K6237k6197j1881M7188n8831O2671n7334O1682n8913J3898k9734J7559
9220d9437P2815J4692m2968k4880l3273k8997L4746k204P9371j09915P6123j4579
9208b8506j1140m4910J08530p570n8103n1715L8740L4590k6170p296K4186M650
9196b4714r180J4643K774q171Q088n5145N0843j54m092k6309O0878k967j5450
9183h956J6013M1319p5684k9131j2457q922K8713m9080O8684m902L4397k66J6531
$$ plain form
9268 -55449 -64363 -75345 -83236 -45533 -7706 -104363 -57088 -82885 -71390 -104382 -65798 -32286
9256 -32286 -62163 -81355 -28629 -65035 -73679 -98964 -57993 -102247 -26207 -54348 -82534 -88103
9244 -88103 -13845 -49783 13376 -69356 24702 22726 -30020 -61269 -65222 18157 -76809 -35782
9232 -35782 -9545 -35742 -47623 -435 -59266 3405 -53929 7753 -51160 -37262 -66996 -49437
9220 -49437 23378 38070 -4898 -29778 -63051 -92048 -57302 -59506 19865 -90050 -13927 -28506
9208 -28506 -39646 -84556 23974 16404 -41699 -93414 -54674 -20084 -46254 -53550 -29364 -24714
9196 -24714 -33894 -19251 -16477 -24648 -16560 -71705 -20862 -21016 -25108 -51417 9461 6494 -8956
9183 -8956 7057 48376 -27308 -56439 -68896 -77818 -49105 -98185 -29501 -34403 -6 -272 16259
9170A6259m1736L5982l6348o0120M5064j5104R138K7278J1439M2367k8400l5069
9158b9250K4109j0028n4246L2298K6290j7432K0179P9J4294q161r682Q988j754
9145d316j1079M3008k8999l2549P5863l1985J1668m3044K3976J8607J7308r130
9133B9328n0573r366N9895m4538K4104N1116m6077Q1512j2548m7540k2737k7913
9121a5337J7287J7870R66l5468Q6827j6231L0219p413q422p8700K1896Q487L2972
9108E4953K1901l9896m4761O0275k1118J9355n21l1431L0914M9289r2713K3861
9096C0108P383k9876P6191k6580n5377J04239L704n4309O589l0252J3994J5051
9084F0865M831M7748l9462m077R633J5653J8313k215j0468J4160m209J3881K127
$$ plain form
9170 16259 -25477 10505 -25843 -85963 -40899 -56003 -46865 -19587 -8148 34219 5819 -29250
9158 -29250 -5141 -15169 -69415 -37117 -10827 -28259 -8080 -8001 6293 -1868 -11550 -2562 -4316
9145 -4316 -15395 27613 -1386 -33935 41928 9943 21611 -21433 2543 21150 38458 29328
9133 29328 -21245 -30611 29284 -15254 8850 59966 13889 95401 82853 35313 12576 -15337
9121 -15337 1950 19820 20786 -14682 72145 55914 86133 78720 70298 -8402 13494 21981 54953
9108 54953 76854 36958 -7803 52472 31354 50709 50188 18757 49671 98960 6247 30108
9096 30108 37491 7615 83806 57226 1849 106088 109792 55483 62072 31820 45814 60865
9084 60865 65696 113444 73982 69905 79538 95191 113504 111289 100821 114981 110772 124653 126780
9071A26780M2579l6195j80n6209L0641K2088N1529m8479J8201J016M0295k820
9059A89246J1015K6679m9361L0937N3580q0768O1788k8381J0396N841N6912L4230
9047C22114m1093J7085M2601K2626j9719k4672M2230J2281n3576L3902J03754
9036D57533j9256L4846K099P8612M818K1925l1151M4025N4059L3095M1231M6463
9024G68299K3876Q8540l1200N3754L3462M4711M1404k6621N9515M0067O420K4807
9012A127034O4665r858N0296n8578M7550j1879n1964k1304o6607K5063m9162j697
9000A043559n8040K0489o9718l6393n4989k1942l0126n8146j1542j8261j00810
8989F04081K5885j7119l4592k1109l2345l380q4027j2738K3244l9609k6930l3289
$$ plain form
9071 126780 169359 133164 132984 76775 107416 129504 181033 132554 150755 151771 192066 189246
9059 189246 200261 226940 177579 208516 262096 181328 243116 214735 225131 230972 287884 322114
9047 322114 281021 298106 340707 363333 343614 318942 361172 373453 319877 353779 457533
9036 457533 438277 473123 475222 553834 558652 580577 549426 593451 647510 680605 721836 768299
9024 768299 792175 880715 849515 903269 936731 981442 1022846 996225 1055740 1095807 1102227 1127034
9012 1127034 1191699 1181841 1232137 1173559 1221109 1209230 1157266 1135962 1069355 1094418 1045256 1043559
9000 1043559 985519 1006008 936290 899897 844908 822966 792840 734694 723152 704891 604081
8989 604081 629966 612847 578255 557146 524801 521421 437394 424656 447900 408291 381361 348072
8977C48072N2138n4051L3000m2526j7937M2383m0073r972r08k8916q4278J2757
8965B09689N3166p9221J4891O2200K4340k4099j2284p1261P753K3244R493m4830
8953A73081J5679m240j3139K3187k9394j3397l3192m286K0062M7993o1917M1869
8941A62306p676K608l3963J2596k0972j520L754R221j2480k8012J5155L8152k2394
8928A16775J0435l7836m825N885k0021J5991L5995m2307M5274p6181J8822O35
8916F8642N2176k6256k9601J1291N1516l8821l2023o2275Q2770k6654M1128m55
8904I1438L350K655k8774p807K0009n6989K2384K6140l7256M474L1877j2745k7249
8891C1507P46j716M8097l1645P601m2900M3901N6326m0097j3616k285J0366j8390
$$ plain form
8977 348072 400210 346159 379159 336633 318696 361079 321006 311034 310126 281210 196932 209689
8965 209689 262855 183634 198525 260725 285065 260966 248682 177421 185174 208418 217911 173081
8953 173081 188760 184520 171381 194568 165174 151777 118585 114299 134361 182354 120437 162306
8941 162306 154630 157238 123275 135871 114899 113379 117133 126354 113874 85862 101017 139169 116775
8928 116775 127210 89374 84549 90434 70413 86404 122399 80092 125366 49185 68007 68642
8916 68642 120818 94562 64961 76252 127768 88947 56924 -5351 77419 50765 91893 91438
8904 91438 94788 97443 68669 60862 80871 23882 46266 72406 35150 39624 71501 58756 31507
8891 31507 32253 30537 78634 46989 54590 11690 55591 111917 71820 58204 55919 66285 47895
8878D7895J3791l557j5800k7952J1820l575m8120K9414N8788k184k472j2226P322
8865E3144N238j03124R7264n1925M0834l4965L1542n421j983j7004J0070k1401
8853B269M0981K2118n3679L6508K0353R562p2898O5210m5668M8604o9022p529
8841c191m56M1719K670l1102M9402k171L113M1889l0451o2046k0676L0592L0651
8828D9943l1111O6073n719q1470j4510L8443J5899m579K7716l2573l6840K2678
8816A3950P348K7892L93J0285K0402L3626q2542j3135J804r88K6582k5588j2902
8803G127J8438J7552l4208L2320m450L9888J609r2836Q0414p8527Q3296k3518
8791D7105M255J7443p1385L9370M2939k9616L1650n2014j586n614j5893M133m3545
$$ plain form
8878 47895 61686 58129 42329 14377 26197 22622 -25498 3916 62704 60520 58048 45822 53144
8865 53144 58382 -44742 52522 597 41431 6466 38008 32587 30604 13600 23670 2269
8853 2269 43250 65368 11689 48197 68550 78112 5214 70424 24756 73360 4338 -3191
8841 -3191 -3647 38072 40742 9640 59042 56871 59984 101873 71422 9376 -11300 19292 49943
8828 49943 18832 84905 79186 -2284 -16794 21649 37548 32969 60685 28112 -8728 13950
8816 13950 21298 49190 49583 59868 80270 113896 31354 18219 20023 19035 45617 20029 7127
8803 7127 25565 43117 8909 41229 36779 76667 78276 -14560 65854 -12673 70623 47105
8791 47105 51360 68803 -2582 36788 79727 50111 81761 29747 28161 22547 6654 10787 -32758
8778c2758P4013m3276N6837o0998N1168J5669L2656l601k5582l7604L883J8402
8766D8809l7556k3976J5660N3924k9508N5946m3880L3325R925k8330J3195l1701
8754C5833k512k902l3417N1233k8123P4281n9963P0561k3572m6996K0812j5126
8742D0109l2727M2531k7960L0428p1695M8424L318L9916m4749N2967l0694p164
8730D2704N0379o5992k9414K678L4764Q3773l4138k6038J679m2130L9387k4231
8718C3421k123M869m1674O0070K0473p397q607J6113l3776K8592O681j2262k3814
8705D0566N186P822P1125o8945k8262N2118l7707M7523o253o267J5508m2777k3052
8692B6585O8953k0201J220k6868L2463m878m365L5086M5500o0342M4461n3943
$$ plain form
8778 -32758 41255 -2021 54816 -6182 44986 60655 93311 89710 64128 26524 30407 48809
8766 48809 11253 -12723 2937 56861 27353 83299 39419 72744 82669 54339 67534 35833
8754 35833 33321 30419 -2998 48235 20112 94393 34430 104991 81419 34423 55235 40109
8742 40109 7382 49913 21953 52381 -19314 29110 32428 72344 27595 80562 49868 42704
8730 42704 93083 27091 -2323 355 35119 118892 84754 58716 60395 18265 57652 33421
8718 33421 31298 36167 -5507 54563 75036 67639 59032 75145 41369 69961 76642 64380 40566
8705 40566 45752 53574 124699 55754 27492 79610 41903 89426 83173 76906 92414 49637 26585
8692 26585 95538 75337 76557 49689 82152 77274 72909 107995 153495 93153 137614 83671
8680H3671L9977j0027K378m1059M4138L4087J3411N981J5547m1130k0707J1931
8668A38198j6426M4718q4041N9991j9947J8649K2582j6225r157n7032O8513J7451
8656A67274M6157q8943K690P1081J5780k0084M119n0143J18716m1570k343L4346
8644B57080l0593l6131k230n7147K6405L4606k4240p820K0783J043n750L435j1686
8631A67755m221j8043L3544k3200Q422J7330K7557l3239k1564K4739j389l9226
8619A38465N598J152j5986M8145l7882k6427k5445J1679J9743N3884n3232K170
8607A21864p17M1L59m3918K8810k4053L8682n7445K0720K5438l751j5324n0231
8594D0475j51P6080n7969J7226N026k650J1905l4373L3837n9268k616k3456L7909
$$ plain form
8680 83671 123648 113621 115999 74940 119078 153165 166576 172557 188104 146974 126267 138198
8668 138198 121772 166490 82449 142440 122493 141142 163724 147499 138342 81310 149823 167274
8656 167274 213431 124488 127178 198259 214039 193955 198074 147931 266647 225077 222734 257080
8644 257080 226487 190356 188126 130979 157384 191990 167750 159930 180713 181756 176006 179441 167755
8631 167755 163534 145491 179035 155835 164257 181587 209144 175905 154341 179080 177691 138465
8619 138465 144063 145215 129229 177374 139492 113065 87620 99299 119042 172926 119694 121864
8607 121864 121147 121188 121547 77629 106439 82386 121068 63623 84343 109781 106030 90706 40475
8594 40475 40324 116404 58435 75661 80687 78037 89942 55569 89406 30138 27522 4066 41975
8581D1975m1261P4583j9050k8256M9969O754l3028j5465O0342n2182M0629K0207
8569A05217l5229P782L519P563N0714l8725k7678m6067J8589q904K0211k7031
8557B9961M0706Q476m6243K3318j1944M7552j3170k5953Q010N507M443Q462o9909
8544I216N3215K0677m0595q450k2457M7177k222O195K8577K7190N5272m45269
8532b71474L16918K0161p2391O9142R967n7860N1140j8554L2080M782n1785M5445
8520G7571J6234o5527M7367m2260o128m037L2065J79l8243l4186O4098J7733o207
8507E8659k7421M7366k2335P211j9604N4217k7067l9411j9233O0264j2074p768
8495E2804l0420j05M1627k814P435L2249n7763M1021k1289j6863n937M3799n1387
$$ plain form
8581 41975 714 75297 56247 27991 77960 84714 51686 36221 96563 44381 85010 105217
8569 105217 69988 77770 81289 88852 139566 100841 73163 27096 45685 36781 56992 29961
8557 29961 70667 79143 32900 56218 44274 91826 78656 52703 60713 66220 70663 79125 9216
8544 9216 62431 83108 42513 34063 11606 58783 56561 62756 91333 118523 173795 -271474
8532 -271474 45444 65605 -6786 62356 72323 14463 65603 47049 79129 83911 32126 77571
8520 77571 93805 28278 75645 33385 27257 23220 55285 55464 17221 -16965 47133 64866 58659
8507 58659 31238 78604 56269 63480 43876 98093 71026 31615 12382 72646 60572 52804
8495 52804 22384 22279 63906 61092 68527 100776 43013 84034 62745 45882 39945 83744 32357
8482C2357j8485k350m741J1508O2497q24j1937k2611r362k0432K9054j4505k60
8469B9909J3173L191J6980j7829J7156O334j5594K0351l4648J1693m1174l3339
8457b3797M4129J4972k68r836L1182K7896l426j7027l6899L5200k731m2381J209
8444A8223J9002k011L3685j2667J6485l6264L9930J4521q2204p691K8615N0960
8432H0584K112P004o3580K2781q660O5684m3804k5920L2569j5710m6530O4175
8420G0705K8906m5357K0950n2957m1139Q1715l1318L7318q228M1360n5393p446
8408C9116J6925l911K5899j801m2642q366q387J178N1224j1800j2066k291J181
8395D4259L6522k14l7740K8509o8489K1448K8862j3721J797p14L7537o1847q159
$$ plain form
8482 32357 13872 11522 6781 18289 80786 79962 68025 45414 36052 15620 44674 30169 29909
8469 29909 43082 46273 63253 45424 62580 68914 53320 73671 39023 50716 9542 -23797
8457 -23797 20332 35304 35036 25200 56382 84278 80852 63825 26926 62126 59395 17014 18223
8444 18223 37225 35214 68899 56232 72717 36453 76383 90904 8700 1009 29624 80584
8432 80584 82696 89700 26120 48901 40241 105925 62121 36201 68770 53060 6530 70705
8420 70705 99611 54254 75204 22247 -18892 62823 31505 68823 60595 101955 46562 39116
8408 39116 56041 52130 78029 76228 33586 25220 16833 18011 69235 57435 45369 43078 44259
8395 44259 80781 80567 42827 71336 2847 24295 53157 39436 41233 40519 78056 16209 8050
8382H050J2134j303J7581P2197j24523N6132O0001l320j9682o5382J6387k0126
8370H146P4052o2553m5215O1761j9847J5496J5184m3269J9995L9705j2820n468
8358D5167k3215P0291o1635k547o415O82k5104J19358l4919l2193q30j2322j094
8345C5224n100J070M1804o507l1722m3615j794P9434J6259m5598N9896m2598L2334
8332H9087j5475l4507J1940J2253p6489N4199o1240O4662J3928j5838O97K0736
8320F3953K0656K4998q8762k511K4638N2160k4867n9306L3001k2362q342O6579
8308G9835j9315J03K5332o7241M7760m2513o061q299K6294n948L196O8807J4499
8295A16449j28947O1343P2187l6795j2599m0953j7171N7795n4381K458K8229J8872
$$ plain form
8382 8050 20184 18881 36462 108659 -15864 40268 100269 96949 77267 11885 28272 8146
8370 8146 82198 19645 -25570 36191 16344 31840 47024 3755 23750 63455 50635 45167
8358 45167 21952 92243 30608 28061 21646 22328 -2776 116582 81663 49470 48640 36318 35224
8345 35224 30124 31194 72998 66491 34769 -8846 -10640 68794 85053 39455 99351 56753 89087
8332 89087 73612 39105 51045 63298 -13191 41008 -20232 44430 58358 42520 43217 63953
8320 63953 84609 109607 20845 18334 42972 95132 70265 10959 43960 21598 13256 79835
8308 79835 60520 60623 85955 18714 66474 23961 17900 9601 35895 29947 33143 101950 116449
8295 116449 -12498 48845 121032 84237 71638 30685 13514 71309 16928 19386 47615 66487
8283F6487q987J7072J6012j8008l3744N237K3877l6161j2477K5240M3679q0172
8271H055M1875P758Q480N859L133k9111J0370k1300L0871Q399n9677M3576k879
8258E5409l9869j0253O4847n0294J2687j1016l3206K6155K2931m79q225M1533
8246G0220M028n7014j8575Q8006j7959o894l452L9743p5513O3496k9633K4108
8234H0561m1862L6030j3828k231j5575k292K6528l7478P570l8064O8067j5036
8222E2390m037j167l6460N1018j979l2948K2014j2685O6845j8511r8296P1489
8210E7673r599p724J5968r397L7441j545n2521O8902n6422r07m154L8074k7811
8197D7978p408M4868p7700m9130l009j97238L96752J4241p7196M3727l5648r6266
$$ plain form
8283 66487 57500 74572 90584 72576 38832 44069 67946 31785 19308 44548 88227 8055
8271 8055 49930 57688 66168 72027 75160 46049 56419 35119 65990 74389 14712 58288 55409
8258 55409 15540 5287 70134 19840 32527 21511 -11695 14460 37391 36912 28687 70220
8246 70220 74248 17234 -1341 86665 68706 61812 58360 98103 22590 86086 56453 80561
8234 80561 38699 74729 60901 58670 43095 40803 67331 29853 37423 -641 67426 52390
8222 52390 48353 47186 10726 61744 59765 26817 48831 36146 102991 84480 -13816 57673
8210 57673 48074 40350 56318 46921 84362 82817 30296 99198 42776 41869 37715 75789 47978
8197 47978 40570 85438 7738 -41392 -44401 -241639 155113 169354 92158 135885 100237 3971
8185C971Q2494k7726p688K4268k5835K163L4541J7414k8558K7333n0726Q215l4420
8172B5446k2577Q4273k5337P503K328L3252n6918O1109m6473J8232K4209j8724
8160H6323K3741l8231j286N261m135j3484M8012m6002J4909O7230k3932k1617
8148I6789K7977n1203p607L7638j9358P714p5069K9571J1581L536O0226k9523
8136I2272J9461o4529K162j3678J59J5979k0706M3287j3519M773O3988k9638k3588
8123G6423L5648m1691o2619M2395J7447j2137M7896l8146P8386m0412J3385K6148
8111A42723m8470K8177p3020n44k4398L8626Q765m003J3583K5391j3746R430O701
8098A09215j6631L682l9348K433M6666k1166O331R257o941j0997j6033N8626O504
$$ plain form
8185 3971 86465 58739 51051 75319 49484 51647 86188 103602 75044 102377 51651 59866 25446
8172 25446 2869 87142 61805 69308 71636 104888 47970 109079 62606 80838 105047 86323
8160 86323 110064 71833 70547 75808 71673 58189 106201 60199 75108 142338 118406 96789
8148 96789 124766 73563 65956 103594 84236 91950 16881 46452 58033 61569 121795 92272
8136 92272 111733 47204 49366 35688 35847 51826 31120 74407 60888 65661 129649 100011 76423
8123 76423 112071 70380 7761 50156 67603 55466 103362 65216 143602 103190 116575 142723
8111 142723 94253 122430 49410 48866 24468 63094 71859 67856 81439 106830 93084 102514 109215
8098 109215 92584 96266 56918 59351 106017 84851 91182 100439 93498 82501 66468 125094 131598
8085A31598q4325M0559k2025M7037l5775J968K8433l6700N711N3537o5477O902
8073G1443K9965k0680j8165j2096M4999N486n058l2952P4506l4444l4922M4791
8061A12873l1691M1122l7074p033M7220o2419O9189n4548K3973k5346N4472o4623
8049F6115L8837P604n1718N3296k7580L4594p1679L3963K4895j0534p006n9916
8037C0871J9761M987L7201O712k6137O104P964k2094L7904j1656K8080n3907m061
8024F1729J8501P548q680L6295l3897M028L9998q3281P2549p3125L1845k8005
8012D5505N7813J915J0280l4947L3197j437q546k1327K5694K6187q6990N7330
8000A04674K1503k9434k117M2324J1891K7692q8621j8308O4525k5204M4977m3298
$$ plain form
8085 131598 47273 87832 65807 112844 77069 79037 107470 70770 76481 130018 64541 71443
8073 71443 101408 80728 62563 50467 95466 100952 95894 62942 137448 103004 68082 112873
8061 112873 81182 122304 85230 78197 125417 62998 132187 77639 101612 76266 130738 66115
8049 66115 104952 112556 60838 114134 86554 121148 49469 83432 108327 97793 90787 30871
8037 30871 50632 55619 92820 99532 73395 79499 87463 65369 103273 91617 119697 65790 61729
8024 61729 80230 87778 79098 115393 81496 85524 125522 42241 114790 41665 73510 45505
8012 45505 103318 105233 115513 80566 113763 112326 103780 82453 108147 134334 47344 104674
8000 104674 126177 96743 94626 136950 148841 176533 87912 69604 134129 108925 153902 110604
7988A10604j839l4226L8324K8465k7002j8377K3148k2770K2833n135l7143J3667
7976I0549j2634J52M1851j0425j5717p1338J13538K641j1520r005K4888j5712
7964A27268j2336k441N4144m9147k3280J6028L0709m0276l1478N2253L166N1607
7952A76217l6224k0186k7336N8251n796k3841l84n189L0809k4614R169K1671k2112
7939A30435M525M3283q148M7258n8931o2712k9663P7762n3327N8464k2029M7800
7927A74717l56K1016q1482K8660K1866n1522L2812m7820J690J9373K7142N5749
7915B01845J3022q2533L1475k2559O277L669l5000J0674N022K1972K6830p2610
7903A08084r173N1551l0353O12L0727j432k0577O7394o2678l0008O0426M962K796
$$ plain form
7988 110604 108765 74539 112863 141328 114326 95949 119097 96327 119160 114025 76882 90549
7976 90549 77915 78067 119918 109493 93776 22438 135976 138617 127097 118092 142980 127268
7964 127268 114932 112491 166635 117488 94208 110236 140945 100669 69191 121444 124610 176217
7952 176217 139993 119807 92471 150722 144926 121085 120701 115512 146321 121707 130876 152547 130435
7939 130435 134960 178243 170095 217353 158422 95710 66047 143809 90482 148946 126917 174717
7927 174717 174361 195377 113895 142555 164421 112899 145711 97891 99581 118954 146096 201845
7915 201845 214867 132334 163809 141250 147527 151196 116196 126870 131892 153864 180694 108084
7903 108084 98911 150462 120109 120721 151448 150016 129439 196833 134155 104147 164573 169535 172331
7890A72331m412J735J1917j3823k5244M196r638l338P8429k6754n2972M9579K5478
7877B07484l6583M6460o4742L958K0002l3211J6469k3297L3432K6163p544L899
7865A92490r937m8116M2240k5689j6376K7893J4189k381K0631L9518j8205O677
7853B22934n2462N8020K04785m68135K48713M055J0952m0237J059o845P2706m9895
7841B05650k6819k8040M1787o868l650N9656n3459M5344o1127L8233k864j2462
7829A95381J503l2627J7452L102J3010j6494K1212K7506L6723q2761L0652l406
7817B11253k000r309j289L171O4555r3244L3174m1152J00550n0178r533L6876
7805B42874n361k7432m1600P3835j9043M9563p5444N6640j8290M4188o8247L2477
$$ plain form
7890 172331 167919 169654 181571 167748 142504 146700 137062 133724 212153 185399 132427 182006 207484
7877 207484 170901 217361 152619 156577 176579 143368 159837 136540 169972 196135 188591 192490
7865 192490 182553 134437 176677 150988 134612 162505 176694 174313 194944 234462 216257 222934
7853 222934 170472 228492 433277 -34858 213855 217910 228862 188625 189684 182839 255545 205650
7841 205650 178831 150791 192578 185710 182060 241716 188257 233601 172474 210707 207843 195381
7829 195381 196884 164257 181709 184811 197821 181327 202539 230045 266768 184007 214659 211253
7817 211253 209253 199944 198655 201826 266381 173137 206311 165159 265709 215531 205998 242874
7805 242874 237513 210081 168481 242316 223273 272836 197392 254032 235742 279930 211683 244160
7793B44160q764k5843J7583k371R9j9027N6837k1941N2312p1374M6934J3177n4328
7780B27454O0462J440K4095k3990j3451m418M617P982j6752O9772p9189J5740
7768B73762j5553J5898k4172K2891L4257j4364O548l4302K4494N111J6556k0841
7756B90285J6427k215m992Q3614l5881k2303j1777K1237J9475m0664l3641L0997
7744C10562O1978k2201J1068O6975q8178K2038j6459J077O470j0280L1763l9451
7732C35362J6471j3239M9013j8405J3310q409L3788l8526j2243M5706j9977k9481
7720C53370L1419L5008J4285n5634M6649J0455j8563q186o2271M7796J0381l2957
7708C71752P0137j4119j9185K8175Q496O8250m5359L089J1097N765n7350N8174
$$ plain form
7793 244160 235396 209553 227136 224765 224864 205837 262674 240733 293045 221671 268605 281782 227454
7780 227454 287916 289356 313451 289461 276010 271592 276209 284191 267439 337211 258022 273762
7768 273762 258209 274107 249935 272826 307083 292719 299267 264965 289459 294570 311126 290285
7756 290285 306712 304497 299505 383119 347238 324935 313158 334395 353870 313206 279565 310562
7744 310562 372540 350339 361407 428382 340204 362242 345783 346860 353330 343050 374813 335362
7732 335362 351833 338594 387607 369202 382512 374103 407891 369365 357122 402828 382851 353370
7720 353370 384789 419797 434082 378448 425097 435552 416989 408803 346532 394328 404709 371752
7708 371752 441889 427770 408585 436760 445256 513506 468147 471236 482333 488098 430748 488922
7696D88922k0261M2036j1114o7865P8138J2257j7034o116k1670k841L8801Q187
7684E21440j1595L550K4534l184M5854o2899M4643j7545J569O067L8754N482J1270
7671F07940j7572R590n367k9635M5818L613o9M7255l8875l4343M6660J4322K3253
7658F72590J677j8654P021k9917j8556J01081n2308K2167j1335M4413p9123N5246
7646F94302N1252p0162K2392l4620M6949N715J9430O9449j3286m3842L2739J206
7634G81524P269J4975K6693m5489j2574O4140J5547M0033l4467M7058k8966N7555
7622I33298o635q0330R5620j0657k2495K9762L296o225k6424M8628P251M2560
7610A007649o4058K6835N3891l9910O7049K7136M8253P1826O904J0211j04870
$$ plain form
7696 488922 468661 510697 499583 431718 509856 522113 505079 498963 477293 474452 513253 521440
7684 521440 509845 513395 537929 534745 580599 517700 562343 544798 546367 552434 591188 596670 607940
7671 607940 590368 599958 594591 564956 610774 614387 614318 661573 622698 588355 635015 649337 672590
7658 672590 674267 655613 662634 632717 614161 715242 662934 685101 673766 718179 639056 694302
7646 694302 745554 675392 697784 663164 710113 715828 735258 804707 791421 747579 780318 781524
7634 781524 788793 803768 830461 784972 772398 836538 852085 892118 857651 904709 875743 933298
7622 933298 926663 846333 941953 931296 908801 938563 941859 935634 909210 957838 965089 1007649
7610 1007649 943591 970426 1024317 984407 1051456 1078592 1126845 1198671 1205575 1215786 1110916
7599A110916O589P5448l1580j6022m0350J2666P3245l8661j1023j852J00080m4786
7587A194670l3360P7520J7031M0512M4474M0025N5800K1204k1271j4637j04256
7576A317712N6144l2118M476j7844Q41O0381o200M7825Q481j9475K5137j5575
7564A429785M4108Q045R2480j7716J8721J3174L3138r691J1872l1980P5282p0591
7552A596627J803N2058N2036m9522P3407N2146k6020M0340m4513L8017N70J7255
7540A804204J8056L9996j4446O9868K536M894N4141k9588L3606k2507N0831Q6259
7528B097850O312k6984L7221K752P3659L8646l2946N3740N9098n9411M7041J0687
7516B307665O8030j0206J7758M5282m0504Q0819k056P8282Q9618j5626K397P755
$$ plain form
7599 1110916 1117505 1192953 1161373 1145351 1105001 1117667 1190912 1152251 1141228 1139376 1239456 1194670
7587 1194670 1161310 1238830 1255861 1296373 1340847 1380872 1436672 1457876 1436605 1421968 1317712
7576 1317712 1373856 1341738 1346214 1328370 1329211 1389592 1383392 1431217 1439698 1420223 1445360 1429785
7564 1429785 1473893 1481938 1574418 1556702 1575423 1588597 1621735 1612044 1623916 1591936 1667218 1596627
7552 1596627 1598430 1650488 1702524 1653002 1726409 1778555 1752535 1792875 1748362 1786379 1786949 1804204
7540 1804204 1822260 1862256 1847810 1917678 1920214 1925108 1979249 1949661 1983267 1960760 2011591 2097850
7528 2097850 2104162 2077178 2114399 2117151 2190810 2229456 2196510 2250250 2309348 2249937 2296978 2307665
7516 2307665 2375695 2365489 2383247 2428529 2388025 2468844 2466788 2545070 2634688 2619062 2621459 2629214
7504B629214Q8779O658L0872K813O8270n8448J23061o2543L3997J02447L170j97
7492B968093L7096P7574K28r063N5980J4879Q5530K4075K6386J6845J08751o615
7480C399759Q0380p709K7823K78O3448O5873k6422J27374o9966J82126J8434J3968
7468C875366K7531P7208m0806Q6418R1831L1721L8828P7865M4338L6698R9956
7457D446954j624N5706N4281k1413J58464J7432N3258m809J46815J4665K5899
7446D945628J10055M8854P3269N0928R4064O4878M2251J04180N6119O4418R2733
7435E747377R3062J30820J4617R9424Q4862R7356K8487R8302R7891L1897J66473
7424F690568j555J11913R7029J18802M2278J42038J06330R5956J28290R3248J06212
$$ plain form
7504 2629214 2717993 2724651 2755523 2758336 2826606 2768158 2891219 2828676 2862673 2965120 2968290 2968093
7492 2968093 3005189 3082763 3082991 3073928 3129908 3144787 3230317 3254392 3280778 3297623 3406374 3399759
7480 3399759 3480139 3472430 3500253 3500531 3563979 3629852 3603430 3730804 3660838 3842964 3861398 3875366
7468 3875366 3902897 3980105 3939299 4025717 4117548 4149269 4188097 4265962 4310300 4346998 4446954
7457 4446954 4445330 4501036 4555317 4533904 4692368 4709800 4763058 4758249 4905064 4919729 4945628
7446 4945628 5055683 5104537 5177806 5228734 5322798 5387676 5429927 5534107 5590226 5654644 5747377
7435 5747377 5840439 5971259 5985876 6085300 6170162 6267518 6296005 6394307 6492198 6524095 6690568
7424 6690568 6689013 6800926 6897955 7016757 7059035 7201073 7307403 7403359 7531649 7624897 7731109
7413G731109J12393P6876J73936Q4808K01350Q7813Q5303J36141R5353J70567
7403H955649J36021J45464J31434K00288P4078K05019J27963J53112J32305J98779
7393A0460112J25372J40452K58371J19987J71110J98897K00234J97818J81866
7384A2054219J17856K24533K37238K20075J71105K14307K25109K19591K06189
7375A3890222K23015J98717K35892K65525K37290K44072K74477K62281K81319
7366A6112810K98646K43841K45855L20691K79643K92223K77056L13816L44099
7357A8728680L47331L13281L48670L51963L68338L41879L81554L80949M00407
7348B1963052L87272M53724L48258N19424M44012N10020M54212M66784N15491
$$ plain form
7413 7731109 7843502 7920378 8094314 8179122 8380472 8468285 8553588 8689729 8785082 8955649
7403 8955649 9091670 9237134 9368568 9568856 9642934 9847953 9975916 10129028 10261333 10460112
7393 10460112 10585484 10725936 10984307 11104294 11275404 11474301 11674535 11872353 12054219
7384 12054219 12172075 12396608 12633846 12853921 13025026 13239333 13464442 13684033 13890222
7375 13890222 14113237 14311954 14547846 14813371 15050661 15294733 15569210 15831491 16112810
7366 16112810 16411456 16655297 16901152 17221843 17501486 17793709 18070765 18384581 18728680
7357 18728680 19076011 19389292 19737962 20089925 20458263 20800142 21181696 21562645 21963052
7348 21963052 22350324 22804048 23152306 23671730 24115742 24625762 25079974 25546758 26062249
7339B6062249N12536M86567N54518O26516N83942O02259O46922O27382O36944
7330C1339835O81075P48415O91781P56806P43081P97734P66201Q67031R43499
7321C8335458Q38847R85892R24469J119075R81797J004473J054281J166023J153657
7312D7563972J203869J319121J266325J448690J384955J449604J562511J527541
7304E8726588J657234J753329J801785J782681K025158J988361K142383K212365
7296G4089884K312138K458400K503037K630657K820574K935276L079893L211072
7288I6040931L376482L477090L604974L750394L953969M135428M403248M545744
7280A27288260M866787N080952N278959N507072N868304O075407O428853O612368
$$ plain form
7339 26062249 26574785 27061352 27615870 28242386 28826328 29428587 30075509 30702891 31339835
7330 31339835 32020910 32769325 33461106 34217912 34960993 35758727 36524928 37391959 38335458
7321 38335458 39174305 40160197 41084666 42203741 43185538 44190011 45244292 46410315 47563972
7312 47563972 48767841 50086962 51353287 52801977 54186932 55636536 57199047 58726588
7304 58726588 60383822 62137151 63938936 65721617 67746775 69735136 71877519 74089884
7296 74089884 76402022 78860422 81363459 83994116 86814690 89749966 92829859 96040931
7288 96040931 99417413 102894503 106499477 110249871 114203840 118339268 122742516 127288260
7280 127288260 132155047 137235999 142514958 148022030 153890334 159965741 166394594 173006962
7272A73006962O943337P133649P581362P747182Q160779Q177517Q251013Q330660
7264B35332461Q283805Q180998Q218645Q012277P777134P423003P062880O488898
7256B96780101N759351N097752M145586L246847K235514J236499J32730q15828
7248C17818552j840999k678958l665062m513720n356316o068773o701389p098773
7240B79894562p463037p601200p792011p729248p785471p746955p572540p434507
7232B18769593p270360p025606o876449o605945o356758o082133n829777n619868
7224A67102697n307659n150467m969970m745792m605282m313179m240524l979175
7216A29790649l784419l606589l423322l256280l155694k947192k837045k781208
$$ plain form
7272 173006962 179950299 187083948 194665310 202412492 210573271 218750788 227001801 235332461
7264 235332461 243616266 251797264 260015909 268028186 275805320 283228323 290291203 296780101
7256 296780101 302539452 307637204 311782790 315029637 317265151 318501650 318634380 317818552
7248 317818552 315977553 313298595 309633533 305119813 299763497 293694724 286993335 279894562
7240 279894562 272431525 264830325 257038314 249309066 241523595 233776640 226204100 218769593
7232 218769593 211499233 204473627 197597178 190991233 184634475 178552342 172722565 167102697
7224 167102697 161795038 156644571 151674601 146928809 142323527 138010348 133769824 129790649
7216 129790649 126006230 122399641 118976319 115720039 112564345 109617153 106780108 103998900
7208A03998900k620050k524364k369019k202018k213068k072402k105736j937148
7200H5955095j833986j847723j762732j631778j680996j487172j530608j450246
7192G2729854j415003j411651j305499j231853j291273j270413j200018j173194
7184F2430950j184548j073238j068093j005032j051357r89655j029554r91592
7176E4037881q96333q99431q94559q95722r06783q07037q73128p60206p51932
7167D6352750p33494q23324p40493p03633p68814o50601p25203o14046o37328
7158C9955814o56634n82147o13932n83258n94976n81917n91918n09845n86278
7149C4654909n19832m81241m69715n61581n47602m18188n05343m29297n43951
$$ plain form
7208 103998900 101378850 98854486 96485467 94283449 92070381 89997979 87892243 85955095
7200 85955095 84121109 82273386 80510654 78878876 77197880 75710708 74180100 72729854
7192 72729854 71314851 69903200 68597701 67365848 66074575 64804162 63604144 62430950
7184 62430950 61246402 60173164 59105071 58100039 57048682 56059027 55029473 54037881
7176 54037881 53141548 52242117 51347558 50451836 49545053 48738016 47864888 47104682 46352750
7167 46352750 45619256 44795932 44055439 43351806 42582992 41932391 41207188 40593142 39955814
7158 39955814 39299180 38717033 38103101 37519843 36924867 36342950 35751032 35241187 34654909
7149 34654909 34135077 33653836 33184121 32622540 32074938 31656750 31151407 30722110 30178159
7140C0178159m31818l93192m68930l68985m23586m14848m30793l51528m02040
7131B6492439l95882l44670l83077l19705l24295m17271k88428k83172l97981
7122B3337958l08357l14587k99690l06847l00349k41751k81854l12423k54144
7113B0717956l06677j90891l16658k92810k44281k45605k61141j93084k60013
7104A8406796j79409k11415k20027k69028j90103k34667k35035k25013j75723
7095A6466376j98573k23505k01284j93969j53056j45966k24046j79852k25671
7086A4720454j24705j89518j85710j63840j74155j34204j98652j67514j80983
7077A3201173j06787j49544j74564j90957j27742j96134j31310j18591j87592
$$ plain form
7140 30178159 29746341 29353149 28884219 28515234 28091648 27676800 27246007 26894479 26492439
7131 26492439 26096557 25751887 25368810 25049105 24724810 24307539 24019111 23735939 23337958
7122 23337958 23029601 22715014 22415324 22108477 21808128 21566377 21284523 20972100 20717956
7113 20717956 20411279 20220388 19903730 19610920 19366639 19121034 18859893 18666809 18406796
7104 18406796 18227387 18015972 17795945 17526917 17336814 17102147 16867112 16642099 16466376
7095 16466376 16267803 16044298 15843014 15649045 15495989 15350023 15125977 14946125 14720454
7086 14720454 14595749 14406231 14220521 14056681 13882526 13748322 13549670 13382156 13201173
7077 13201173 13094386 12944842 12770278 12579321 12451579 12255445 12124135 12005544 11817952
7068A1817952j03434o4189k14754j20175j34302j49054j38072j31956o3200j32734
7058A0566082j41550o7519j57749j06684j44719j39286j57355p8701j03539k2801
7048I446179k03375p1700j25638m3339j14481j06395j10062j54388q1810o8646
7038H366345j23180j10768o5578r4514l8752q9721j01631j34071k0868j28477
7028G458785j07600o7820n1009j12330j0587j26819o7630m5784n3044r76n5853
7017F759333Q52J3731p2254j0499p1959j26785r6186j23984j17383j91289m5096
7006E918481j47268K6977j12530k9198o4596k8206j30668L9796o0651r0165o4097
6995E257875j6116k8364r395o8519o0867J3690K1894m527L3766N5350J33708R1605
$$ plain form
7068 11817952 11714518 11650329 11435575 11315400 11181098 11032044 10893972 10762016 10698816 10566082
7058 10566082 10424532 10357013 10199264 10092580 9947861 9808575 9651220 9572519 9468980 9446179
7048 9446179 9242804 9171104 9045466 9002127 8887646 8781251 8671189 8516801 8434991 8366345
7038 8366345 8243165 8132397 8066819 7972305 7933553 7843832 7742201 7608130 7587262 7458785
7028 7458785 7351185 7283365 7232356 7120026 7109439 6982620 6914990 6869206 6816162 6815186 6759333
7017 6759333 6760185 6773916 6701662 6691163 6619204 6492419 6396233 6272249 6154866 5963577 5918481
7006 5918481 5771213 5798190 5685660 5656462 5591866 5563660 5432992 5472788 5412137 5321972 5257875
6995 5257875 5241759 5213395 5204000 5135481 5074614 5088304 5110198 5105671 5139437 5194787 5328495 5420100
6983E420100J57252P4133J48133n1771k8122j57897j64573j22822j66524j92640
6973D915269m0886r3180n2323J3535l9503K5534N9596J05721K40480K96031K90263
6962E720537J76301J88209P6502r0153k04787k06635l45513k60189k98502k96362
6952D459408j63442j67714n6822q7693j12198P3838l7752R5559M8718J62946R1979
6941D306827J39029L6969j01135q5213j87212k68624j23011k18546j48736j53586
6931C196762j72405j0528p9759p3839j11223O8053j29649j9449j14072K4529k8028
6920B550392m1301l4585m2442M6722n9602o5925m4608j6894j4878n9455K0357
6909B237781l6930j1838k2927k0204m0666k7250L9722n2927k2913k7588r0758
$$ plain form
6983 5420100 5577352 5651485 5799618 5747847 5719725 5561828 5397255 5274433 5107909 4915269
6973 4915269 4874383 4781203 4728880 4742415 4702912 4728446 4788042 4893763 5134243 5430274 5720537
6962 5720537 5896838 6085047 6161549 6071396 5866609 5659974 5314461 5054272 4755770 4459408
6952 4459408 4295966 4128252 4071430 3983737 3871539 3945377 3907625 4003184 4051902 4214848 4306827
6941 4306827 4445856 4482825 4381690 4296477 4109265 3840641 3717630 3499084 3350348 3196762
6931 3196762 3024357 3013829 2934070 2860231 2749008 2817061 2687412 2667963 2553891 2578420 2550392
6920 2550392 2509091 2474506 2432064 2478786 2419184 2353259 2308651 2291757 2276879 2217424 2237781
6909 2237781 2200851 2189013 2166086 2145882 2105216 2077966 2117688 2064761 2041848 2014260 1923502
6898A923502P33r5423M5048o3629k9516M2277p3043N904l978N5588o4469k5511
6886A717483M0718K5825j8696n8115l768p9661J0760q8761K19m0591K892l7142
6874A471163j6554k6714j1106m9964j5553J7922o693j04604k1939P678m2885J9371
6862A220122J8376L0643Q710o2946l5860J8155K9413o4183j283k5138j5353n1814
6850A068842P7976l0793r7651O0801k1486k5074m0608K6012n0771K8326l5055
6839I60519l5622M597k6227K6168k9282K5625M351q1840k4737K328k046k9436
6827G94398J2926J0123O169k7454l8983P5590l7909j6643n0419Q777k4034K1655
6815G34196k002J5500q2933N0678M7347l0377m7869j3099J0117j1599K5311k5930
$$ plain form
6898 1923502 1924235 1828812 1873860 1810231 1780715 1822992 1749949 1755853 1751875 1807463 1742994 1717483
6886 1717483 1758201 1784026 1765330 1707215 1703447 1623786 1634546 1545785 1546004 1505413 1508305 1471163
6874 1471163 1454609 1427895 1416789 1366825 1351272 1369194 1362501 1257897 1235958 1243636 1200751 1220122
6862 1220122 1238498 1269141 1277851 1214905 1179045 1197200 1226613 1162430 1161147 1136009 1120656 1068842
6850 1068842 1146818 1116025 1018374 1079175 1057689 1032615 992007 1018019 967248 995574 960519
6839 960519 924897 929494 903267 929435 900153 925778 930129 848289 823552 825880 823834 794398
6827 794398 807324 817447 823616 796162 757179 832769 794860 778217 727798 736575 712541 734196
6815 734196 732194 747694 664761 715439 762786 732409 684540 671441 681558 669959 695270 669340
6803F69340K5837m4314o055R287l32j7027n8202O0074j12858L7619K3702j8729
6791E68342l5230K258O1629j916m3369m3052M0151J3048o6910L9557O810k8704
6779E12614p1212M0444O7276j07819J7908o92O0176n8975J2528J5444l8300M2968
6767D92360n1762L6269n8614J5518l0931L8233o2691N2791q259j768k1014o7279
6755C32853L2026K6392J9727r4957J04183k2918K340L568n6610o220m8076K443
6743B94751N1241O55l7130k4625J1233n993R524J0384l0132j0553O4245k4675
6731C08925M097k4066k419n88k994q682P3923r0841L3385R32j6740n9175Q4539
6718C00296p1980l174l054J9519k5048M3502l8214K2418J5831l5459m7001L3799
$$ plain form
6803 669340 695177 650863 644808 654095 653763 636736 578534 638608 525750 563369 587071 568342
6791 568342 533112 535370 596999 595083 551714 508662 548813 561861 494951 534508 541318 512614
6779 512614 441402 481846 549122 441303 459211 458519 518695 459720 472248 487692 449392 492360
6767 492360 440598 476867 418253 433771 402840 441073 378382 431173 422914 421146 400132 332853
6755 332853 364879 391271 410998 316041 420224 397306 399646 403214 346604 340384 292308 294751
6743 294751 345992 346647 309517 284892 296125 290132 299656 310040 279908 269355 333600 308925
6731 308925 313022 288956 286537 285949 282955 274273 348196 257355 290740 291672 274932 215757 300296
6718 300296 228316 225142 222088 241607 216559 260061 221847 244265 260096 224637 177636 211435
6706B11435M611N3670p5432K1347n655m91m774k298L9453m0253J5800m2819M1104
6693B15698l1735J1962k0116o383N6995n5862L3463J8758k073m2653l5805P5332
6681B17581r8258P3765k1722P526P59j2356L9574l5245J081n834j1610m7341L6302
6668A44222k4229J6497Q611k5709j837M9323k5735L0505J4065l6271k4240R8299
6656B23501j03431K6908J0471m1900j6689K1592L1453L1492o7353P761k6741J7003
6644A14067o137J3176k238m3081L2547M3943m7327J5117j2241l668m534N1930
6632A51554n8362k4717r290k806N7720l0729J5562N5782k8584m8333R470L2605
6620A19872m8676O3239m6901N035k8618o815k0710P9886m4019P7272m7237m5184
$$ plain form
6706 211435 216046 269716 194284 215631 209976 209485 204711 202413 241866 201613 217413 174594 215698
6693 215698 183963 195925 175809 169426 226421 170559 204022 222780 220707 178054 142249 217581
6681 217581 119323 193088 171366 178892 179651 167295 206869 171624 172705 166871 155261 107920 144222
6668 144222 119993 136490 145101 119392 117555 166878 141143 171648 185713 149442 125202 223501
6656 223501 120070 146978 157449 115549 98860 120452 151905 183397 116044 123805 97064 114067
6644 114067 107930 121106 118868 75787 108334 152277 104950 120067 107826 104158 99624 151554
6632 151554 93192 68475 59185 56379 114099 83370 98932 154714 126130 77797 87267 119872
6620 119872 71196 134435 87534 92569 63951 57136 36426 116312 72293 149565 102328 57144
6608E7144M1451K6512m2441j4864J2447l0159j5251N460j667N8102k2108J0709
6596H5335L398J8812j3487o2844K5091M91L5683n0715K5569m5219M8381K4433
6584I4928k2717m7988L9150O030L111p4406k486N1120J7721p9788Q4813n8816
6572A0672M6998Q930k2697j8873r157l4134L9359k9919M3067j9492P2729o7878
6560A9605l709J7680O926r355o9963M9313J847l3802n748K7969K809n767Q977
6547F782j445J5351L990O702k4510n8616O4004l5400O6486n0520j6770L3086j293
6534G847K3297M995j3642j7753j7388J4814j2189L4422m1610j4417K2217J3931
6522D524J6911k8213J1059O297n9760O8169l5559N564K7398l011N42R408K2713
$$ plain form
6608 57144 98595 125107 82666 67802 80249 50090 34839 40299 38632 96734 74626 85335
6596 85335 88733 107545 94058 31214 56305 56796 92479 41764 67333 22114 70495 94928
6584 94928 72211 24223 63373 69403 72514 -1892 -4378 46742 64463 -15325 69488 10672
6572 10672 57670 66600 43903 25030 15873 -18261 21098 -8821 34246 14754 87483 19605
6560 19605 15896 33576 40502 31147 -38816 10497 12344 -21458 -27206 763 3572 -2195 6782
6547 6782 5337 20688 24678 31380 6870 -51746 12258 -23142 43344 -7176 -23946 9140 7847
6534 7847 31144 36139 22497 4744 -12644 2170 -10019 24403 -17207 -31624 -9407 4524
6522 4524 21435 -6778 4281 10578 -49182 18987 -16572 -11008 16390 13379 13921 23329 46042
6509D6042o287j4676J0299n8432P124K1196j4136l6808M5168j7112J320J9135
6497B833o157p053N0657o981j5124j3168J6009k6441L0785L654o394O691O0322
6484H9633l5856J4067K8527P5418K5379j0855N325k6245q1415L7036l813m1139
6472G6062n7279N2683R988r8499P8403n873o9783M5362N4272K3656o9303L6929
6460G6618L163K4630j5948J6089J0199K5471J39162J06640P3279L9208o412m5969
6448D46130p0331j06153m9644k628j3270O2833L7386j0191Q300n1348k3611k6854
6436B00619n6567K6458l3095l9780M9907j0014l4436K1997P119J42653L559O0117
6424C38537J44915J23138m8921k6242o7188o9426l3725j1019P9822J23285J06941
$$ plain form
6509 46042 39755 25079 35378 -23054 -15930 5266 -8870 -45678 -510 -17622 -16302 2833
6497 2833 -3324 -10377 40280 33299 18175 5007 21016 -5425 25360 29014 22620 29311 89633
6484 89633 53777 67844 96371 171789 197168 186313 191638 165393 83978 121014 117201 76062
6472 76062 18783 71466 81454 -17045 61358 55485 -14298 31064 85336 108992 39689 76618
6460 76618 79781 104411 88463 104552 114751 140222 279384 386024 459303 498511 492099 446130
6448 446130 375799 269646 220002 217374 204104 266937 304323 294132 302432 251084 227473 200619
6436 200619 144052 170510 137415 97635 147542 137528 103092 125089 132208 274861 278420 338537
6424 338537 483452 606590 557669 531427 464239 394813 361088 350069 429891 553176 660117
6413F60117O8387n9144j1557j18655j29421l8729j12317m6018n2807K5330o0438
6402A24748k247O081J5205L3139l8614L9102P1672N9703L4899o8552K3808l3865
6390B65079q475M9507M9468J55200J78598Q2660m5231l6088j09970j13851m3477
6379D23420j64124p9001J6044r007k0894n8561k2404L3550L0018q093k6152m9669
6367F5127m380N3857j1284K4014M96K4623K1370J3284J36143n924O5473l3636
6355C49163M142j5400n9363k9159j8212m7801k0865L1339k1547l7117L8866K2401
6343A96447p9861k3452j9424k1972O8371M0598p8272O1074O665r830m4245J6248
6331A12347n552L6142l2530j7536K6473N1568L3414l2921L7486m0981K1717k1281
$$ plain form
6413 660117 728504 669360 657803 539148 409727 370998 258681 212663 159856 185186 124748
6402 124748 122501 128582 143787 176926 138312 177414 249086 308789 343688 275136 298944 265079
6390 265079 256604 306111 355579 510779 689377 772037 726806 690718 580748 466897 423420
6379 423420 259296 180295 196339 187332 166438 107877 85473 119023 149041 140948 114796 65127
6367 65127 60747 114604 103320 127334 127830 152453 173823 187107 323250 317326 382799 349163
6355 349163 353305 337905 278542 249383 231171 183370 162505 193844 172297 135180 174046 196447
6343 196447 116586 93134 73710 51738 120109 160707 82435 143509 150174 140344 96099 112347
6331 112347 106795 142937 110407 92871 119344 170912 204326 171405 208891 167910 189627 168346
6319A68346m905n1343m1452k5961O5683n747k5624K4191k2644j8300Q454L4620
6307A05318j6727m8366k0505K7269k6970N9380k6639K0521L093M9581m7389l1873
6295D6693J3079K1719l6668j5015j871M7269m0777J03690l0506j3892L5681o7794
6283F1608K8548l5229L4546K4345m9664L6657j4174l3861M8850j171K2445k7399
6271I5501O794m708K5970o0149M5765L467k0904J47L3626J6322l4174L0185M908
6258A42750M8831l0690K6001K92R698J7240O2899m3902P9909r1879j7049P315
6246B11415J2352k4487J17955n4139j0646P7827l1191K6349J13115M4730Q0872
6235E64152o806M3075k5381j05415K0985j2393m8947j0813p780K7448J3595k8995
$$ plain form
6319 168346 163441 112098 70646 44685 110368 104621 78997 103188 80544 62244 70698 105318
6307 105318 88591 40225 19720 46989 20019 79399 52760 73281 76374 125955 78566 46693
6295 46693 59772 81491 44823 29808 27937 75206 34429 138119 107613 93721 129402 61608
6283 61608 90156 54927 89473 113818 64154 100811 86637 52776 101626 100455 122900 95501
6271 95501 102295 97587 123557 63408 109173 112640 91736 91883 125509 141831 107657 137842 142750
6258 142750 191581 160891 186892 187184 196882 214122 277021 233119 313028 221149 204100 211415
6246 211415 223767 199280 317235 263096 252450 330277 299086 325435 438550 483280 564152
6235 564152 557346 600421 575040 469625 490610 478217 429270 418457 410677 438125 451720 422725
6223D22725j853j3138N0184q4559P2120m4563J3095K0427K228J3560L3194O2932
6211E46352N515J95357Q4889J14553P6270k3384r4104q8208j56122m2953m3221
6200E74944k7764N6005m4751q246p059J2926q3512J5867l4544o9391R607N2919
6188D47001J7679N1805l7666J11179J5929J54126R1292J42272J36651M4756R896
6177A184920j3064o5023j22377L789J2598J08343M2405R9658L171P805k5588r586
6165A227051n8974R6085J04810J36643J05949J88026M6368Q710p6959L20p5537
6154A702492K0008l0426J5899p5484L8147p2403k0005j4510l3869K18460K14856
6143A963165K92051K89293K23916J83700j8681r3816k00053j90916k42118k09486
$$ plain form
6223 422725 420872 407734 457918 373359 445479 400916 414011 434438 436666 450226 483420 546352
6211 546352 551867 747224 832113 946666 1022936 999552 905448 817240 661118 618165 574944
6200 574944 547180 603185 558434 550188 543129 556055 472543 488410 453866 384475 394082 447001
6188 447001 464680 516485 478819 589998 605927 760053 851345 993617 1130268 1175024 1184920
6177 1184920 1171856 1106833 984456 988245 1000843 1109186 1151591 1251249 1254420 1262225 1236637 1227051
6165 1227051 1168077 1264162 1368972 1505615 1611564 1799590 1845958 1854668 1777709 1778029 1702492
6154 1702492 1722500 1692074 1707973 1632489 1670636 1598233 1578228 1563718 1529849 1748309 1963165
6143 1963165 2255216 2544509 2768425 2952125 2933444 2839628 2639575 2448659 2206541 1997055
6133A997055j27334k16851q3940j21407k338j50272l4570m1792N4752k9314K3878
6122A267867P9292J07752Q8828M71k0794K2922p0275j62547M9002j52540j14074
6111A095904q6261q8740q0240p2754l4028l708p6020q0357L8718j8607m9397o9010
6099D75500k0763J7675m628K9287k3960L6803R898j2260L5723k9696o3747R242
6087D59074L8304l0067L8739j067L3092l7046J2855J7350o532n5383J2569k1979
6075D59909L8223o555j1281N1777N2662l8355M3930L3443n9834N068o1274M2337
6063E50050n1655k386N179k0196K8180K0594M8480k7800J1391L3850k4623o046
6051E65018m3810N8421J1842N1255p1670L5094J526l4775L907j7786L2033m47
$$ plain form
6133 1997055 1869721 1652870 1568930 1447523 1445185 1294913 1260343 1218551 1273303 1243989 1267867
6122 1267867 1347159 1454911 1543739 1544210 1523416 1546338 1476063 1313516 1362518 1209978 1095904
6111 1095904 1009643 920903 840663 767909 733881 730173 654153 573796 612514 593907 544510 475500
6099 475500 454737 472412 467784 497071 473111 509914 519812 507552 543275 513579 449832 459074
6087 459074 497378 467311 506050 504983 538075 501029 513884 531234 524702 469319 481888 459909
6075 459909 498132 491577 480296 532073 584735 546380 590310 623753 563919 568987 507713 550050
6063 550050 498395 496009 501188 480992 509172 529766 578246 550446 561837 595687 571064 565018
6051 565018 521208 579629 591471 642726 571056 606150 607676 572901 576808 559022 591055 590608
6039E90608J4996l268k9932k111K3021K6682J8729k3817N5900N3833m0644r461
6027F74536Q992m315M5207m36M1046M2520M2977j9153N4325o723R539k1442Q9605
6014I56678N382J945K0653N272J7562j6681K5920M7127Q84M0656j3584J3827J1296
6001A116937J00255j6244o371O4883M9477P7682j4159N5254K7726Q0222K5935
5990A561597O6654N6225O8207N1545O8236J03480Q5337J48884N9658N3580Q1477
5979B404880L2937J74073J83863K02620J78627K15254K78372J96031L51278M66284
5969D684219Q20301J262037J490105J497089J092400O66830O30403P95166J525376
5960A4463926J891329J942450N44184L48244j54949R14329J556040K252893R44586
$$ plain form
6039 590608 605604 602336 572404 570293 593314 619996 638725 614908 670808 724641 683997 674536
6027 674536 683528 679213 724420 723984 765030 807550 850527 831374 885699 878976 888515 867073 956678
6014 956678 962060 964005 984658 989930 1007492 990811 1016731 1063858 1064742 1105398 1091814 1105641 1116937
6001 1116937 1217192 1200948 1194577 1259460 1308937 1386619 1372460 1427714 1455440 1535662 1561597
5990 1561597 1628251 1684476 1752683 1804228 1872464 1975944 2061281 2210165 2269823 2323403 2404880
5979 2404880 2437817 2611890 2795753 2998373 3177000 3392254 3670626 3866657 4217935 4684219
5969 4684219 5504520 6766557 8256662 9753751 10846151 11512981 12143384 12938550 14463926
5960 14463926 16355255 18297705 18841889 19190133 19035184 19949513 21505553 23758446 24703032
5951B4703032l74465j081668j892739j087438l78239l5714j001634j163662j854414
5942A5833059j664807j306479o44293p76861j009185j125336j443098j441248
5934F421752j171368r20512p06961m70751l62476j51151k25169j13324j29824
5925B170216r4934j05703j65883O046o4065q8373p1470j5300p2807k8104p003
5914A462620m2891l1276n1071j0910k4043j7856Q98l0690J04l4316P310M609k7381
5901A205107L20K837O648P236N664l59J9844q4377l2209N7K6958n7505j6542k3882
5887A059797l0380K1052l6976K7345k7573l844o0388O446J373n8515k2856J8322
5875H93803k5005J6718o0775K5819k1826m705m8663J9749j156n7544N690J9169
$$ plain form
5951 24703032 24328567 23246899 21354160 20266722 19888483 19852769 18851135 17687473 15833059
5942 15833059 14168252 12861773 12217480 11440619 10431434 9306098 7863000 6421752
5934 6421752 5250384 4329872 3622911 3152160 2789684 2638533 2413364 2300040 2170216
5925 2170216 2075282 1969579 1803696 1809742 1745677 1657304 1585834 1570534 1497727 1469623 1462620
5914 1462620 1419729 1388453 1337382 1326472 1302429 1284573 1285471 1254781 1254885 1220569 1227879 1232488 1205107
5901 1205107 1205427 1208264 1214912 1222148 1227812 1227453 1247297 1162920 1130711 1130768 1157726 1100221 1083679 1059797
5887 1059797 1029417 1050469 1013493 1040838 1013265 1009421 949033 955479 956852 898337 875481 893803
5875 893803 868798 885516 824741 850560 828734 824029 775366 795115 793959 736415 742105 761274
5863G61274l2222K2455j8948l1381l8401J8070l9732N2795q172m2480J6628n4740
5851F05146R2032n0175k2275p010K2686o0088N9703p5876R755r924k6405l6085
5839E01484O0353k6244j173J7069L5443j00994Q4775q0516L4359k8304Q330L6077
5827E40659k4555L578M1485l6485N5147k1926n3754j3802L5742k2183L5249J5863
5815E55018R01M3707q617m3225j2006P6952q4681m2000P7376n2109N7023m2941
5803E25398j6380P0220m6548Q1563l5784O6269j2010l6498K426k8043O3286N705
5791F39604K5328M5770N2048j3534Q618k5764k6266l6747N3905M267M4723P5098
5779H47050J013m403M0794P5967M6373q701P4162O6295R003R8365O5595J68501
$$ plain form
5863 761274 729052 751507 732559 701178 662777 680847 641115 693910 685738 643258 659886 605146
5851 605146 697178 647003 624728 617718 640404 580316 640019 564143 573898 563974 537569 501484
5839 501484 561837 535593 534420 551489 586932 485938 570713 490197 524556 496252 504582 540659
5827 540659 516104 519682 561167 524682 579829 557903 504149 490347 526089 503906 539155 555018
5815 555018 555919 599626 591009 547784 535778 612730 528049 486049 563425 511316 568339 525398
5803 525398 509018 579238 532690 614253 578469 644738 632728 596230 598656 570613 633899 639604
5791 639604 664932 710702 762750 749216 757834 732070 705804 669057 722962 727229 771952 847050
5779 847050 848063 843660 884454 960421 1006794 998093 1072255 1138550 1147553 1245918 1311513 1480014
5767A480014J05187J78047K34004K40599K90964L96647M55957L78249N40690M07489
5757D707847M09365K93080J41452j3424j43247k38150l91196l71671l94319l82164
5747C617573k39087k73816j00437j49107k3581J0500k4717P4092J16987J01933
5737C110340J71294K49378L90237L92270O15360P05265P59464Q35725R08443P06763
5727H844539O63527N06344J98715J3502j73038l88194n64798p06182p25568p57461
5717F911386p44322o32668n48809m18279l91285l14429j97418p1481m6319J2579
5707C558955J3342L8508J36770J94228K01579L48788L48315M06261M24820N66205
5697F237771M52477M74406L20369J34523o0014k06087l86151m17729m18122n61997
$$ plain form
5767 1480014 1585201 1763248 1997252 2237851 2528815 2925462 3381419 3759668 4300358 4707847
5757 4707847 5117212 5410292 5551744 5538320 5395073 5156923 4765727 4394056 3999737 3617573
5747 3617573 3378486 3104670 3004233 2855126 2831545 2842045 2817328 2891420 3008407 3110340
5737 3110340 3281634 3531012 3921249 4313519 4928879 5634144 6393608 7229333 8137776 8844539
5727 8844539 9508066 10014410 10213125 10226627 10053589 9665395 9100597 8394415 7668847 6911386
5717 6911386 6167064 5534396 4985587 4567308 4176023 3861594 3664176 3592695 3546376 3558955
5707 3558955 3572297 3610805 3747575 3941803 4143382 4492170 4840485 5246746 5671566 6237771
5697 6237771 6690248 7164654 7485023 7619546 7559532 7353445 6967294 6549565 6131443 5569446
5687E569446m62162m31065l09953k66625j71880j12621q2422L3712O5796J51735
5677C983961R5572J56357K74531J50079K41948J30618J99601J43552J40348m4788
5667E471779M7124j6643j01353j70604j02269j56831r2945o0035j01573O6449
5657D783099Q1012R9637J89438K72935K33205K68654K45634L57286L30956L93577
5647G255433M30277L72422L49680M66287M61809L27489K52453K41958R2338k1304
5637A0228842j96460k60693m14276l22392l82457l69382l47052k26080j46365
5628G563685r2737K5065J80063J05984L28147L52842K75170L65898K76158K93063
5618I673338J63609J59291R4013J04205k2491P6037l7283N6509k1930Q8113m4966
$$ plain form
5687 5569446 5107284 4676219 4366266 4099641 3927761 3815140 3732718 3766430 3832226 3983961
5677 3983961 4079533 4235890 4510421 4660500 4902448 5033066 5232667 5376219 5516567 5471779
5667 5471779 5518903 5502260 5400907 5230303 5128034 4971203 4878258 4818223 4716650 4783099
5657 4783099 4864111 4963748 5153186 5426121 5659326 5927980 6173614 6530900 6861856 7255433
5647 7255433 7685710 8058132 8407812 8874099 9335908 9663397 9915850 10157808 10250146 10228842
5637 10228842 10032382 9771689 9357413 9035021 8652564 8283182 7936130 7710050 7563685
5628 7563685 7470948 7496013 7676076 7782060 8110207 8463049 8738219 9104117 9380275 9673338
5618 9673338 9836947 9996238 10090251 10194456 10171965 10248002 10210719 10267228 10245298 10333411 10288445
5607A0288445n107r3608o2556m7424j6854l0354K9258J14367K05508K91145K71042
5596A0943862M00468M93663N17806N98389N17744N38913N53282L88985K90456
5587A5243568Q2056r363k94986l60127m81327m58081n59787m14265l64817l27139
5577A2055732j21119k9799Q5929J64264K79975K98230M50894M73384N00983M80186
5567A4638659M95268N37475M88450N45057N55796N80353M93982M14546J97437
5558A8947023N4174j35254m31090n55769p66811p48689p09955o35067n02969l84930
5548A4130663k52500j19652p536Q514J77724K11609J88481J95792J97041J42016
5538A4872152J52411J08163J18408K6020J84620J40386Q2200Q768j9289j75949
$$ plain form
5607 10288445 10283338 10189730 10127174 10079750 10062896 10032542 10061800 10176167 10381675 10672820 10943862
5596 10943862 11344330 11837993 12355799 12954188 13471932 14010845 14564127 14953112 15243568
5587 15243568 15325624 15316261 15021275 14661148 14179821 13721740 13161953 12747688 12382871 12055732
5577 12055732 11934613 11904814 11990743 12155007 12434982 12733212 13184106 13657490 14158473 14638659
5567 14638659 15133927 15671402 16159852 16704909 17260705 17841058 18335040 18749586 18947023
5558 18947023 19001197 18865943 18434853 17879084 17112273 16363584 15653629 15018562 14515593 14130663
5548 14130663 13878163 13758511 13750975 13759489 13937213 14148822 14337303 14533095 14730136 14872152
5538 14872152 15024563 15132726 15251134 15277154 15461774 15602160 15684360 15693128 15673839 15497890
5528A5497890m37972n10522o34478p81617p26054p59192p51837o64415n43638
5519I688165m97592m54543m62601l92531m51794l52313l73846l19277l68386k68161
5509E747121l42559k51294l54008k72222j75284k38216j69329j81796j12434j24738
5499C525241j30878o3707k3413r4140m6463p405m498N2816j13700M7477M0471
5488C181801P4990M2788J9608P5501J9475O4498J16098l4174J02263L141K8562
5477C694551K0867L9125M8482K8608R906m271m185M9925O1517j368O9706Q6766
5465D099629R7168J06876J26177J33164J25336J16499J26648J42182L8842R7766
5455E210287L7695N0212j7196l5831p6705m0038j31553n3886j28229j59927p5579
$$ plain form
5528 15497890 15059918 14549396 13914918 13133301 12407247 11648055 10896218 10231803 9688165
5519 9688165 9190573 8736030 8273429 7880898 7429104 7076791 6702945 6383668 6015282 5747121
5509 5747121 5404562 5153268 4799260 4527038 4351754 4113538 3944209 3762413 3649979 3525241
5499 3525241 3394363 3330656 3307243 3213103 3166640 3159235 3154737 3207553 3093853 3141330 3181801
5488 3181801 3256791 3299579 3319187 3394688 3414163 3478661 3594759 3560585 3662848 3665989 3694551
5477 3694551 3715418 3754543 3803025 3831633 3841539 3837268 3833083 3883008 3944525 3943157 4012863 4099629
5465 4099629 4196797 4303673 4429850 4563014 4688350 4804849 4931497 5073679 5112521 5210287
5455 5210287 5247982 5298194 5280998 5245167 5168462 5128424 4996871 4942985 4814756 4654829 4579250
5444D579250k14234o4662p6938n2695l732q9423J3574N173k4055n525o1232l2547
5432C972954n0002r1774o1426n2261p6909j41765o5401r8549n8719j17720L8781
5421C197209k6893R285P3519j9554K7745o9153l6635j13718q1331k9631m4430
5410B886413K7336J7995k3992j5815O3066p4569M2071r4775m9007K416l5013j20887
5398B625239p6800j22944m8421j52993j8243r0657m3189n3442k1673o5544n539
5387A925794O2184o8965q757l780p4138j7639p3490m7633j9606n6718o5428j23228
5375A428596o9619n3470o2199k4715n9624l1580k2572q9020m318m0412L0122j9661
5363I81528m8797O1810p0486r057J9787q2048J1648L527m795J1444j9164M5654
$$ plain form
5444 4579250 4365016 4300354 4223416 4170721 4166989 4077566 4091140 4096313 4072258 4066733 4005501 3972954
5432 3972954 3922952 3831178 3769752 3717491 3640582 3498817 3433416 3334867 3276148 3158428 3197209
5421 3197209 3170316 3179601 3253120 3233566 3261311 3192158 3155523 3041805 2960474 2930843 2886413
5410 2886413 2913749 2931744 2907752 2891937 2955003 2880434 2922505 2827730 2778723 2781139 2746126 2625239
5398 2625239 2548439 2425495 2377074 2224081 2205838 2115181 2071992 2018550 1996877 1931333 1925794
5387 1925794 1987978 1919013 1910256 1906476 1832338 1814699 1741209 1693576 1673970 1617252 1551824 1428596
5375 1428596 1358977 1305507 1243308 1218593 1158969 1127389 1104817 1015797 1011479 971067 1001189 981528
5363 981528 932731 994541 924055 914998 934785 852737 864385 867912 863117 874561 855397 901051
5351I01051j1203J8874k2096k2115M1845o592M6933m9449l4289M5833J5180O6225
5339I90197o3080N9841o270j6385M9985J9283j2243L5525P0510n3595O4497l0877
5327A107388J16364L3278m0771N3720P1405J4388Q6118K0218j4256O2479J07894
5316A618225J9458J18313N4217R7269J18177R2104J87529J72536K05593K07737
5306B891158K73100K38294J66203L30861J90256K32096K78168J08148J89462J00420
5296D998166K02105Q9893J96966R4198R3409J12506P7164J58355J24112J65318
5286F312192K50241K56358K73378L60873L21356L33012L56388J56390K24369j9919
5276H824638O0625p2971k20442k62837l58470l70719l53567l49470l81094l21630
$$ plain form
5351 901051 889848 908722 886626 864511 906356 899764 946697 897248 862959 908792 923972 990197
5339 990197 927117 986958 980688 964303 1014288 1033571 1021328 1056853 1127363 1073768 1138265 1107388
5327 1107388 1223752 1257030 1216259 1269979 1341384 1355772 1441890 1462108 1447852 1510331 1618225
5316 1618225 1637683 1755996 1810213 1907482 2025659 2117763 2305292 2477828 2683421 2891158
5306 2891158 3164258 3402552 3568755 3899616 4089872 4321968 4600136 4708284 4897746 4998166
5296 4998166 5200271 5290164 5487130 5581328 5674737 5787243 5864407 6022762 6146874 6312192
5286 6312192 6562433 6818791 7092169 7453042 7774398 8107410 8463798 8620188 8844557 8824638
5276 8824638 8885263 8812292 8591850 8329013 7970543 7599824 7246257 6896787 6515693 6194063
5266F194063l59325k93947k53559j30414k20623l3905j38667K1260J685K4071
5256D810639p9749M6828m0175q9926r6564j54710k00079k35730k54385l39742
5246C366407k42335k69563k44309j93752j98009j79797j49617n0416j58594j46638
5236A533377n6976j29506l762n2566r2868o4096m0035k4613n9650R449m6629J1095
5224I83220J0027q3582J3177n9904O2506m2143K9030n2795k4719k708l4645M2452
5212H39916K4878r1445m167l3787j2627M1397n9677M7600J6102P046j6093J4932
5200G74075j02659P6269n794J5449m6148K425L0497k6289j5897K0440j477L7174
5188G58065k9142L2314l1865J4586m6383N5085M2037j8627L61K8451Q1821Q5673
$$ plain form
5266 6194063 5834738 5540791 5287232 5156818 4936195 4902290 4763623 4784883 4786568 4810639
5256 4810639 4730890 4777718 4737543 4647617 4551053 4396343 4196264 3960534 3706149 3366407
5246 3366407 3124072 2854509 2610200 2416448 2218439 2038642 1889025 1838609 1680015 1533377
5236 1533377 1476401 1346895 1343133 1290567 1197699 1133603 1093568 1068955 1009305 1018754 972125 983220
5224 983220 993247 909665 922842 862938 925444 883301 912331 859536 834817 832109 797464 839916
5212 839916 864794 773349 769182 735395 722768 764165 704488 752088 768190 775236 759143 774075
5200 774075 671416 747685 741891 757340 711192 713617 744114 717825 701928 722368 720891 758065
5188 758065 728923 761237 729372 743958 697575 752660 794697 776070 776431 804882 886703 972376
5176I72376M4789L8082J18801P7346J69880J36019J55301K58202K19590J51629
5166B342015R5604P5549j542j35107j45171j46070r3567j48473q8983l2937j15082
5155A606236J8302L0376Q528k2430N5544O4515Q7940J17855J29397J48153K66426
5144B510842K43728L79100L30872M89686K90246M63932M25054M08835L36626K22929
5134F101850l5350j55073m12868m10758n43422m30906l77499k90218j83635j61050
5124C101071j03441p7225L2437r6463L1682O2625J36640R3284K14769K93994L28407
5113D017780L65374M72230M41360M91354N38268M78387L64438L30341J34706j03934
5103G530304l52079n03286n76794o88885n41676n15195m59373l12870k61599j64316
$$ plain form
5176 972376 1017165 1055247 1174048 1251394 1421274 1557293 1712594 1970796 2190386 2342015
5166 2342015 2437619 2513168 2511626 2376519 2231348 2085278 1991711 1843238 1754255 1721318 1606236
5155 1606236 1624538 1654914 1663442 1641012 1696556 1761071 1849011 1966866 2096263 2244416 2510842
5144 2510842 2754570 3133670 3464542 3954228 4244474 4708406 5133460 5542295 5878921 6101850
5134 6101850 6066500 5911427 5498559 5087801 4544379 4113473 3735974 3445756 3262121 3101071
5124 3101071 2997630 2920405 2952842 2856379 2888061 2950686 3087326 3180610 3395379 3689373 4017780
5113 4017780 4383154 4855384 5296744 5788098 6326366 6804753 7169191 7499532 7634238 7530304
5103 7530304 7178225 6674939 6098145 5409260 4867584 4352389 3893016 3580146 3318547 3154231
5093C154231r9332p9629j022N1479m6648k06M5439P0786P5025M3931K61923K22559
5081C698536L58496L84628L37255L15388J48384J37642m5625j76424l16462l80281
5071D461537l43900l97608l97431k72822j42440p8511r854J01890J47546R5788
5061C164195K4308m0208r4842j63848r7487j72801k8819l704P9989O1533O7449
5050B795765J77609O2193J18429M2979m826O0986j03168j34367j54957j47973
5040B712670j72520o7140j49205n4088k8495j2009N1674N3859J8019Q4440J43297
5029B580502N9708R6736J07604J23907J57378J28718J66809J89154J20768J38363
5019C869647K5820M1691j50937q9347j46718j77929j54538p4962j58184p5235
$$ plain form
5093 3154231 3054899 2975270 2974248 3025727 2979079 2978873 3024312 3095098 3170123 3214054 3475977 3698536
5081 3698536 4057032 4441660 4778915 5094303 5242687 5380329 5334704 5158280 4841818 4461537
5071 4461537 4117637 3720029 3322598 3049776 2907336 2828825 2818971 2920861 3068407 3164195
5061 3164195 3188503 3148295 3053453 2889605 2792118 2619317 2590498 2586794 2666783 2728316 2795765
5050 2795765 2973374 3035567 3153996 3196975 3192149 3253135 3149967 3015600 2860643 2712670
5040 2712670 2540150 2473010 2323805 2269717 2241222 2229213 2280887 2334746 2352765 2437205 2580502
5029 2580502 2640210 2736946 2844550 2968457 3125835 3254553 3421362 3610516 3731284 3869647
5019 3869647 3895467 3937158 3786221 3696874 3550156 3372227 3217689 3142727 2984543 2909308
5009B909308r173O758L8251L2778J34087J41320J06873Q8018R5125J95994J11745
4998C851084R9460N4868J66970J50210Q7404J31593J65301O8132O5202R982j59913
4987D690293j53436k04142k53384k76447k01235k18458j91747j06664p0631j3516
4977C000633P9795P3741J15448K9216K32936O9020J10212N9105k0435l8248J8773
4966C730196n9380l3249j4385N9029l5383k866n0928j63258q1665k04148j65583
4955B978380k13600j38721j50678j17530p7788p0239j30983K6317p001O557O7371
4944B172085M8004N3371K8475K6937N385j9394l5833o0559j7231n393r8856j67840
4932A929151j2752j01736q4219n7137p3175L3568j49893n5386o4024q998n9710
$$ plain form
5009 2909308 2900135 2906893 2945144 2977922 3112009 3253329 3360202 3448220 3543345 3739339 3851084
4998 3851084 3950544 4005412 4172382 4322592 4409996 4541589 4706890 4775022 4840224 4850206 4690293
4987 4690293 4536857 4332715 4079331 3802884 3601649 3383191 3191444 3084780 3014149 3000633
4977 3000633 3080428 3154169 3269617 3298833 3531769 3600789 3711001 3770106 3749671 3711423 3730196
4966 3730196 3670816 3637567 3623182 3682211 3646828 3643962 3593034 3429776 3348111 3143963 2978380
4955 2978380 2764780 2626059 2475381 2357851 2280063 2209824 2078841 2105158 2098157 2104714 2172085
4944 2172085 2220089 2273460 2301935 2328872 2334257 2314863 2279030 2218471 2201240 2195847 2096991 1929151
4932 1929151 1916399 1814663 1730444 1673307 1600132 1633700 1483807 1428421 1364397 1355399 1295689
4921A295689o8470Q82J0351m4256k965P2091j3889n03O220q493m750k3099N6914
4908A275722l3874J0669p815l8039m785o6096M7057k9391O8253k6524O2307m7030
4896A210454N5777k5733R2779o2745Q5048k7881J08684P4657J147O6031R4273
4885A672491O0517Q7651N266P3674P7238J19824m619J54946M6192P9744Q0862
4874B453786Q0552J10506M6560J63439K4168J39135O4733J05886R5194J3575J12514
4863C410048P7814J09203J09551J44956J87993K52817K25962J66905L78358L49602
4853E413209M76301M89742N54398O16824P13395P80945R59377J153295J575869
4844A2733355K406285L219220L470872K850034J037349k14429j543904k359656
$$ plain form
4921 1295689 1227219 1228101 1238452 1194196 1191231 1263322 1249433 1248930 1255150 1246657 1241907 1218808 1275722
4908 1275722 1241848 1252517 1244702 1206663 1201878 1135782 1182839 1153448 1221701 1195177 1257484 1210454
4896 1210454 1266231 1240498 1333277 1270532 1355580 1327699 1436383 1511040 1512187 1578218 1672491
4885 1672491 1733008 1820659 1825925 1899599 1976837 2096661 2092042 2246988 2293180 2372924 2453786
4874 2453786 2534338 2644844 2691404 2854843 2879011 3018146 3082879 3188765 3283959 3297534 3410048
4863 3410048 3487862 3597065 3706616 3851572 4039565 4292382 4518344 4685249 5063607 5413209
4853 5413209 5889510 6379252 6933650 7550474 8263869 9044814 10004191 11157486 12733355
4844 12733355 15139640 18358860 21829732 24679766 25717115 25502686 23958782 21599126
4836B1599126k152848j607798r36774m21551j9295N1040l5498J2003r4874m028
4826A6389503O3195K51769M58172O15945P49780Q36476Q25417O61845M29584J38346
4816B1420032j58185m53360n58506n65111o48363n23586k63850j20642R0333K44424
4806A8463186J70303J06387l2746j99167l56052m02170m48577l15986k34917j81494
4796A6568767l6607o5630J50667K7011k3996q0064k37865k40432l70183l40422
4786A5351246l54648l62034l39891l52620l32483l13425l64578k95655k38404
4777A2397508k97257k38378k98358l25337l34509j66625l24960k27376k12402
4768I972306j96887k41103j39954k37765j97989k57070k69152j85235k16482j88647
$$ plain form
4836 21599126 19446278 17838480 16901706 16480155 16460860 16511900 16476402 16488405 16393531 16389503
4826 16389503 16452698 16704467 17162639 17778584 18528364 19364840 20190257 20852102 21281686 21420032
4816 21420032 21261847 20808487 20249981 19684870 19036507 18512921 18249071 18128429 18218762 18463186
4806 18463186 18633489 18739876 18707130 18507963 18151911 17749741 17301164 16985178 16750261 16568767
4796 16568767 16532160 16466530 16617197 16644208 16620212 16540148 16302283 16061851 15691668 15351246
4786 15351246 14996598 14634564 14294673 13942053 13609570 13296145 12931567 12635912 12397508
4777 12397508 12100251 11861873 11563515 11238178 10903669 10737044 10412084 10184708 9972306
4768 9972306 9775419 9534316 9394362 9156597 8958608 8701538 8432386 8247151 8030669 7842022
4758G842022k64159j92437l03847k37628l41344l08690l09237k95387k41349k93512
4748E054432k15073j58719k15350j95465j21187j33559r0382r0152j06895q3155
4738C644495q6857j10011o2167q6205j09592q3044m6694j05890j18364j11515
4728B724156j23005p3665p3172j17260q9622n3049o8992p2899k9870j05394j8571
4717A898657j49872j5911m8338j9406p0750L8720k1615o7673o3589l4038p4201
4706A371984m2678m6078j4672L1220q1449R075q2055n271n1010J5960n7863J4046
4694A061209j20310q833j109k6267J4339j06871p63r595m7222O07L4512n9165
4682G30532m9o8249k0208R308l0602n8988L7184m27m3101K7243K737q0650M3078
$$ plain form
4758 7842022 7577863 7385426 7081579 6843951 6502607 6193917 5884680 5589293 5347944 5054432
4748 5054432 4839359 4680640 4465290 4269825 4148638 4015079 3924697 3834545 3727650 3644495
4738 3644495 3557638 3447627 3385460 3299255 3189663 3106619 3059925 2954035 2835671 2724156
4728 2724156 2601151 2527486 2454314 2337054 2247432 2194383 2125391 2052492 2022622 1917228 1898657
4717 1898657 1748785 1732874 1684536 1665130 1594380 1633100 1611485 1543812 1480223 1446185 1371984
4706 1371984 1329306 1283228 1268556 1299776 1218327 1227402 1145347 1140076 1089066 1105026 1047163 1061209
4694 1061209 940899 932066 930957 904690 919029 812158 811395 801800 754578 755185 789697 730532
4682 730532 730483 662234 642026 651334 620732 561744 598928 598501 555400 582643 585380 504730 547808
4669E47808m6201J4763o062m1686J3382N6747r2065J9808j8j9859k1560J0574
4657D35631m5920K7310J2662n5935j5275O7850j4992J1723n393L5148q1348j7066
4645C54395J4320k304k893j5107r752J0201l2096N3731l4722m557K350R117k8772
4632C13911O138o3876J0609l0183J09540J7884q1411M3173k3619L1949J5183J2849
4620C62147M85k1340J3346o2079J7002q274J8915J1422L5162L5210k0177m1417
4608C40402j6625L7851J4224m7519j2666J4530p025m578L0428L9519l6250l1283
4596C21008L5755N0886m1719L5429O6995l3252J5630m3932l536M2666K8751m0131
4584D34550Q865J5710m9559k6868o1173K5104l5610P1883k2778j3646k5143O496
$$ plain form
4669 547808 501607 516370 510308 468622 482004 538751 446686 466494 466476 446617 425057 435631
4657 435631 389711 417021 429683 373748 358473 426323 411331 423054 417661 452809 371461 354395
4645 354395 368715 366411 363518 348411 338659 348860 316764 370495 335773 331216 333566 342683 313911
4632 313911 320049 256173 266782 236599 346139 364023 282612 325785 302166 334115 349298 362147
4620 362147 362632 341292 354638 292559 309561 301287 320202 331624 366786 401996 381819 340402
4608 340402 323777 361628 375852 328333 315667 330197 323172 318594 349022 388541 352291 321008
4596 321008 356763 407649 365930 401359 468354 435102 450732 406800 403264 445930 474681 434550
4584 434550 443415 459125 409566 382698 321525 346629 311019 382902 360124 346478 321335 327831
4572C27831K7376M8019l3119K6919n1140k9855K8711M4878J5190k4085l2673N024
4560C53076l7520N3324K1271l5743J8789q908k9483J6814j2868j1720K0750k0555
4548C27227n8885L3784K5224J6365l2525q12k15K4857j5292k0461n8120Q4081
4536C25228k9576r709q689o078K673K9904N776m3771K6669J8478j8585k1591r456
4523B61273K2028m5014J8624K3371k1827m4364M293L4217j0926R623j2520K5311
4511B64089k9279m5953j1838M3874j2871K6268k1828K2888j2907j0154J5234K6063
4499B53586l6226j9066J6527j9080J2099k0039L9639m0260n090l5212O5628m505
4487B08001R1K4803K538j6058l8820M0822j8758l3585M1629J2133L0528n0043
$$ plain form
4572 327831 355207 403226 370107 397026 345886 316031 344742 389620 404810 380725 348052 353076
4560 353076 315556 368880 390151 354408 373197 364289 334806 351620 338752 327032 347782 327227
4548 327227 268342 302126 327350 343715 311190 310378 310163 335020 319728 299267 241147 325228
4536 325228 295652 285943 277254 271176 273849 303753 309529 265758 292427 310905 292320 270729 261273
4523 261273 283301 238287 256911 280282 258455 214091 218384 252601 241675 251298 238778 264089
4511 264089 234810 188857 177019 220893 208022 234290 212462 235350 222443 212289 227523 253586
4499 253586 217360 198294 214821 195741 207840 187801 227440 187180 182090 146878 212506 208001
4487 208001 208092 232895 235433 219375 180555 221377 202619 169034 210663 222796 253324 203281
4475B03281j3777m739J0800J3373J6765K8304r6164L7856L8311Q9269j08443P30
4463B15566O9619n7845M9472k5926p416l3018N6873k8034l3009N3991m3429K3481
4451B40325L4106J2776J6052m7014N9305m2246K6672q085p913N826L0844M0901
4439C61549m2383J7291J6757J7795j8674r1618J00768K1283m0524K940M2366k5837
4427C61713O3076k4459M8990R001J5812n6891J0043m5023J3200j2298J03327K5628
4415E12119n1151j9363Q7549L7588k8797J8570r159K3141L1660j2345N4553J7141
4403F61506N2136J05628J09737J15690K19319J63640J26907P4148p1089j23353
4393A434269j21878j30107r0803n4799m5949p987M8185L4689j9085J626N8699
$$ plain form
4475 203281 189504 184765 195565 208938 225703 254007 157843 195699 234010 323279 214836 215566
4463 215566 285185 227340 276812 250886 243470 210452 267325 239291 206282 260273 216844 240325
4451 240325 274431 287207 303259 256245 315550 273304 299976 291891 283978 289804 320648 361549
4439 361549 319166 336457 353214 371009 352335 260717 361485 382768 342244 345184 387550 361713
4427 361713 424789 400330 449320 458321 474133 417242 427285 382262 395462 383164 486491 512119
4415 512119 460968 441605 529154 566742 537945 556515 547356 570497 602157 589812 644365 661506
4403 661506 713642 819270 929007 1044697 1264016 1427656 1554563 1628711 1557622 1434269
4393 1434269 1312391 1182284 1091481 1036682 990733 982746 1030931 1065620 1046535 1048161 1106860
4382A106860J6703R5709P3374N1033K32343K22824K32671R6906J0717J259p0847
4371B069552j09555j51428l4411K2638O9053R1011J05350J39184J67710J70321
4361B539425L59898P62723J113669J140284J155774L41498p0197o06196q14978
4352E921900q50890o34673m40511j66836m2446k6322J00656J38073L2726J21524
4342D153201m1818q6801L3407J63533N49037Q99002R59311P24698l4979k84352
4332G034239r30549r43063q69493p04203m02387l10934o1065O6539K86486L92760
4322C558330N16275L82921R7333m5956l12584n06079n22720m49489k05468j65303
4312B347260J03112K64430M20840M45184J14104j34992l26660m28245l68048l24255
$$ plain form
4382 1106860 1123563 1219272 1292646 1343679 1576022 1798846 2031517 2128423 2139140 2140399 2069552
4371 2069552 1959997 1808569 1774158 1796796 1865849 1956860 2062210 2201394 2369104 2539425
4361 2539425 2899323 3662046 4775715 5915999 7071773 7413271 7343074 6736878 5921900
4352 5921900 5071010 4436337 3995826 3828990 3786544 3760222 3860878 3998951 4031677 4153201
4342 4153201 4111383 4024582 4057989 4221522 4770559 5669561 6628872 7353570 7318591 7034239
4332 7034239 6103690 5160627 4291134 3586931 3184544 2873610 2812545 2879084 3165570 3558330
4322 3558330 4074605 4457526 4554859 4508903 4196319 3690240 3167520 2718031 2512563 2347260
4312 2347260 2450372 2714802 3135642 3580826 3694930 3559938 3233278 2805033 2436985 2112730
4302B112730k42755k39180j44169o1422p6009n2722l9129l3410o4281J766P6598
4291A238017M3840K8225R195O6579O1100R2074L07804M54916P57380R55901J075022
4280E090053K96969K8681o03186q02735p72429p61385n28356l26612j76351j87703
4270A256946j05331n0533j26107l6210k9221J8629M3996n6777M4084L1649R93
4259I92118l5881Q9655J20852K00505L22849M90957M59603J90616j2430k55324
4249B563520l92506l76144l36944l02481j92672j30770p2979n0502n7027K3687
4239F75182m1347P008j7886l3568L1141o9822J0995p0974M537J0954n0656J0385
4227D65949K88n802J1761m632K92K8700j15311p87L6007j6039m8403Q165L3249
$$ plain form
4302 2112730 1869975 1630795 1486626 1425204 1349195 1296473 1257344 1223934 1159653 1161419 1238017
4291 1238017 1281857 1310082 1319277 1385856 1446956 1539030 1846834 2301750 3059130 4015031 5090053
4280 5090053 5387022 5415703 4812517 4009782 3237353 2475968 1947612 1621000 1444649 1256946
4270 1256946 1151615 1101082 974975 938765 909544 928173 972169 915392 959476 991125 992118
4259 992118 956237 1045892 1166744 1367249 1690098 2181055 2640658 2831274 2818844 2563520
4249 2563520 2171014 1794870 1457926 1155445 962773 832003 759024 708522 651495 675182
4239 675182 633835 640843 622957 589389 620530 550708 561703 490729 495266 506220 455564 465949
4227 465949 466237 460435 472196 467564 467856 496556 381245 380458 416465 400426 352023 360188 393437
4214C93437j894j9513N3215k3190m7807M238P137L5707o4893N5688p5508N9821
4202C76438q2782K064L9966O2303j14545J0790J3386j4104n5977M2250O0922n3151
4190B87560J5804m2304N641m0939p203J3578K0210K025n0n778m2142k2700j110
4177A82592L3050J8946m3336j1261L4551l2117j53K369k5313l9461J142N3408
4165A74417r026k5979P2974O246m3921n4132P4623l2717j6851M9307o7130L8782
4153A66593l3021n9610L7718J2698n236R722p336K7932J6615j974J4406j2785
4141A65722m4761M2211q270m7480n609Q1287J8766o7069M4616m3094O0257j460
4129A95116j3566K0434k6860m7416L9142M5738o6123O00R6505k6027m8717r747
$$ plain form
4214 393437 391543 372030 425245 402055 354248 358486 365623 401330 336437 392125 316617 376438
4202 376438 293656 295720 335686 397989 283444 294234 307620 293516 237539 279789 340711 287560
4190 287560 303364 261060 266701 225762 218559 232137 252347 254372 254322 248544 206402 183702 182592
4177 182592 215642 234588 191252 179991 214542 182425 182272 184641 159328 119867 121009 174417
4165 174417 165391 139412 212386 218632 174711 120579 195202 162485 145634 194941 127811 166593
4153 166593 133572 73962 111680 124378 119142 128864 121528 149460 166075 164101 178507 165722
4141 165722 120961 163172 154902 107422 101813 183100 201866 134797 179413 136319 196576 195116
4129 195116 181550 201984 175124 127708 166850 212588 146465 147065 243570 217543 168826 159079
$$ [...]
##END NTUPLES=NMR SPECTRUM
##END=
