##TITLE=abcd
##JCAMPDX= 6.0         $$ Bruker NMR JCAMP-DX V2.0
##DATA TYPE= NMR SPECTRUM
##DATA CLASS= NTUPLES
##ORIGIN= UXNMR, Bruker Analytische Messtechnik GmbH
##OWNER= root
$$ XWIN-NMR		Version 3.5
$$ Mon Jul 27 19:54:30 2026 Russian Standard Time (UT+4h)  servis@DPX200
##.OBSERVE FREQUENCY= 200.131235884673
##.OBSERVE NUCLEUS= ^1H
##.ACQUISITION MODE= SIMULTANEOUS
##.ACQUISITION SCHEME= undefined
##.AVERAGES= 32
##.DIGITISER RES= 18
##SPECTROMETER/DATA SYSTEM= spect
##.PULSE SEQUENCE= zg
##.SOLVENT NAME= CDCl3
##.SHIFT REFERENCE= (INTERNAL, CDCl3, 0, 16.4885)
##AUDIT TRAIL= $$ (NUMBER, WHEN, WHO, WHERE, WHAT)
$$ ##TITLE= Audit trail, XWIN-NMR		Version 3.5
$$ ##JCAMPDX= 5.01
$$ ##ORIGIN= Bruker BioSpin GmbH
$$ ##OWNER= servis
$$ F:\spectra/data/av/nmr/H1/1/pdata/1/auditp.txt
$$ ##AUDIT TRAIL=  $$ (NUMBER, WHEN, WHO, WHERE, WHAT)
(   1,<2026-07-27 19:53:50.57 +0400>,<servis>,<DPX200>,
      <created by zg, POWCHK disabled, PULCHK disabled
       configuration hash MD5:
       00 E9 B6 7A A2 85 ED C7 34 08 36 98 17 FE 4E 26
       data hash MD5: 32K
       08 10 40 98 AF A4 62 F2 B2 CC D4 8F 12 8F 37 E1>)
(   2,<2026-07-27 19:53:51.98 +0400>,<servis>,<DPX200>,
      <Start of raw data processing
       efp BC_mod = 2 LB = 0.05 FT_mod = 6 PKNL = 1 PHC0 = -335.3321 PHC1 = 3.101563 SI = 16K 
       data hash MD5: 16K
       6A 1C 69 9F C9 47 63 2C 05 B7 90 B9 DA 3F 95 F4>)
(   3,<2026-07-27 19:54:04.67 +0400>,<servis>,<DPX200>,
      <pk PHC0 = -80.21966 PHC1 = 0 
       data hash MD5: 16K
       D4 19 AA F5 06 10 40 1F 5A BF 5E 44 85 0B 45 F7>)
$$ ##END=
$$ 
$$ hash MD5
$$ 85 AA 0F 84 D2 33 2B F7 0D F9 63 AF 11 C7 06 F0
##$RELAX= 
##$RELAX= 
##$RELAX= 
##$RELAX= 
##$RELAX= 
##$RELAX= 
##$RELAX= 
##$RELAX= 
$$ Bruker specific parameters
$$ --------------------------
##$DU= <F:\spectra>
##$EXPNO= 1
##$NAME= <H1>
##$PROCNO= 1
##$TYPE= <nmr>
##$USER= <av>
##$AMP= (0..31)
100 100 100 100 100 100 100 100 100 100 100 100 100 100 100 100 100 100 
100 100 100 100 100 100 100 100 100 100 100 100 100 100 
##$AQSEQ= 0
##$AQ_mod= 1
##$AUNM= <au_zg>
##$AUTOPOS= <>
##$BF1= 200.13
##$BF2= 200.13
##$BF3= 200.13
##$BF4= 200.13
##$BF5= 500.13
##$BF6= 500.13
##$BF7= 500.13
##$BF8= 500.13
##$BYTORDA= 1
##$CFDGTYP= 0
##$CFRGTYP= 5
##$CHEMSTR= <none>
##$CNST= (0..31)
1 1 145 1 1 1 1 1 1 1 1 1 1 1 1 1 1 1 1 1 1 1 1 1 1 1 1 1 1 1 1 1 
##$CPDPRG= <>
##$CPDPRG1= <>
##$CPDPRG2= <>
##$CPDPRG3= <>
##$CPDPRG4= <mlev>
##$CPDPRG5= <mlev>
##$CPDPRG6= <mlev>
##$CPDPRG7= <mlev>
##$CPDPRG8= <mlev>
##$CPDPRGB= <>
##$CPDPRGT= <>
##$D= (0..31)
0 2 0 0 0 0 0 0 0 0.06 0 0 0 0 0 0 0.0002 0 0 0 0 0 0 0 0 0 0 0 0 0 0 
0 
##$DATE= 1785167630
##$DBL= (0..7)
120 120 120 120 120 120 120 120 
##$DBP= (0..7)
150 150 150 150 150 150 150 150 
##$DBP07= 0
##$DBPNAM0= <>
##$DBPNAM1= <>
##$DBPNAM2= <>
##$DBPNAM3= <>
##$DBPNAM4= <>
##$DBPNAM5= <>
##$DBPNAM6= <>
##$DBPNAM7= <>
##$DBPOAL= (0..7)
0.5 0.5 0.5 0.5 0.5 0.5 0.5 0.5 
##$DBPOFFS= (0..7)
0 0 0 0 0 0 0 0 
##$DE= 6
##$DECBNUC= <off>
$$ [...]
##$SUBNAM4= <"">
##$SUBNAM5= <"">
##$SUBNAM6= <"">
##$SUBNAM7= <"">
##$SUBNAM8= <"">
##$SUBNAM9= <"">
##$SW= 20.6817932712277
##$SWIBOX= (0..15)
0 0 3 0 0 0 0 0 0 0 0 0 0 0 0 0 
##$SW_h= 4139.07284768212
##$TD= 32768
##$TD0= 1
##$TE= 0
##$TE2= 300
##$TE3= 300
##$TEG= 300
##$TL= (0..7)
0 120 120 120 120 120 120 120 
##$TP= (0..7)
150 150 150 150 150 150 150 150 
##$TP07= 0
##$TPNAME0= <>
##$TPNAME1= <>
##$TPNAME2= <>
##$TPNAME3= <>
##$TPNAME4= <>
##$TPNAME5= <>
##$TPNAME6= <>
##$TPNAME7= <>
##$TPOAL= (0..7)
0.5 0.5 0.5 0.5 0.5 0.5 0.5 0.5 
##$TPOFFS= (0..7)
0 0 0 0 0 0 0 0 
##$TUNHIN= 0
##$TUNHOUT= 0
##$TUNXOUT= 0
##$USERA1= <user>
##$USERA2= <user>
##$USERA3= <user>
##$USERA4= <user>
##$USERA5= <user>
##$V9= 5
##$VALIST= <valist>
##$VCLIST= <CCCCCCCCCCCCCCC>
##$VD= 0
##$VDLIST= <DDDDDDDDDDDDDDD>
##$VPLIST= <PPPPPPPPPPPPPPP>
##$VTLIST= <TTTTTTTTTTTTTTT>
##$WBST= 1024
##$WBSW= 30
##$XGAIN= (0..3)
0 0 0 0 
##$XL= 0
##$YL= 0
##$YMAX_a= 397545
##$YMIN_a= -575624
##$ZGOPTNS= <>
##$ZL1= 120
##$ZL2= 120
##$ZL3= 120
##$ZL4= 120
##$ABSF1= 0
##$ABSF2= 0
##$ABSG= 0
##$ABSL= 0
##$ALPHA= 0
##$AQORDER= 0
##$ASSFAC= 0
##$ASSFACI= 0
##$ASSFACX= 0
##$ASSWID= 0
##$AUNMP= <proc_1d>
##$AZFE= 0.1
##$AZFW= 0.1
##$BCFW= 0
##$BC_mod= 2
##$BYTORDP= 0
##$COROFFS= 0
##$CY= 18.4799938201904
##$DATMOD= 1
##$DC= 0
##$DFILT= <>
##$DTYPP= 0
##$F1P= 9.9274215381318
##$F2P= -0.165520771350173
##$FCOR= 1
##$FTSIZE= 16384
##$FT_mod= 6
##$GAMMA= 0
##$GB= 0
##$INTBC= 1
##$INTSCL= 4.127829e-11
##$ISEN= 128
##$LB= 0.05
##$LEV0= 0
##$LPBIN= 0
##$MAXI= 10000
##$MC2= 0
##$MEAN= 0
##$ME_mod= 0
##$MI= 50
##$NCOEF= 0
##$NC_proc= -6
##$NLEV= 6
##$NOISF1= 3.799351
##$NOISF2= 2.8
##$NSP= 0
##$NTH_PI= 0
##$NZP= 0
##$OFFSET= 16.48848
##$PC= 4
##$PHC0= -415.5518
##$PHC1= 3.101563
##$PH_mod= 1
##$PKNL= yes
##$PPARMOD= 0
##$PSCAL= 4
##$PSIGN= 0
##$REVERSE= no
##$SF= 200.130005582386
##$SI= 16384
##$SIGF1= 3
##$SIGF2= 2
##$SINO= 400
##$SIOLD= 16384
##$SREGLST= <1H.CDCl3>
##$SSB= 0
##$STSI= 16384
##$STSR= 0
##$SW_p= 4139.07284768211
##$SYMM= 0
##$S_DEV= 0
##$TDeff= 32768
##$TDoff= 0
##$TI= <>
##$TILT= no
##$TM1= 0
##$TM2= 0
##$TOPLEV= 0
##$USERP1= <user>
##$USERP2= <user>
##$USERP3= <user>
##$USERP4= <user>
##$USERP5= <user>
##$WDW= 1
##$XDIM= 16384
##$YMAX_p= 390683673
##$YMIN_p= -1496997
$$ End of Bruker specific parameters
$$ ---------------------------------
##NTUPLES= NMR SPECTRUM
##VAR_NAME=  FREQUENCY,     SPECTRUM/REAL,   SPECTRUM/IMAG
##SYMBOL=    X,             R,               I
##VAR_TYPE=  INDEPENDENT,   DEPENDENT,       DEPENDENT
##VAR_FORM=  AFFN,          ASDF,            ASDF
##VAR_DIM=   16384,         16384,           16384
##UNITS=     HZ,            ARBITRARY UNITS, ARBITRARY UNITS
##FACTOR=    0.252644378177508, 1,           1
##FIRST=     3299.83951724647, 0,            0
##LAST=      -839.233330435636, 0,           0
##MIN=       -839.233330435636, -1496997,    0
##MAX=       3299.83951724647, 390683673,    0
$$ Real data points
##PAGE= N=1
##DATA TABLE= (X++(R..R)), XYDATA
$$ [...]
8563b62276O4922j00935K50647j75992K1532j686J90023l8127j48902L01517k72365
8552a71642J9996J69693j27954M8787n44684O75800j13555j40309j02442j6561
8542c02871K52415q3236l65273J52339J56233J29067l31221j43390r61060J795216
8532B98219n1652j44108q2052j28067O8727j22782P3558K72314m64257J48363
8522a31737K15509J63473j16127k17170q624K07181n64490M27621m49371L89490
8512h4245n11J55748n77642M99053k69535j18475K59853r7715K75028j32831j0751
8501a02023j20213q4647K7239K22651l07441J75445J85566j3384j25273j94831
8491c36911J56977j039p771j04907Q847K7803L44852l01424N9314O2348r8878
$$ plain form
8563 -262276 -197354 -298289 -47642 -223634 -202102 -203788 -13765 -51892 -200794 100723 -171642
8552 -171642 -151646 18047 -109907 -61120 -605804 69996 -43559 -183868 -286310 -302871
8542 -302871 -50456 -133692 -498965 -346626 -190393 -61326 -392547 -535937 -1496997 298219
8532 298219 246567 102459 20407 -107660 -38933 -161715 -88157 184157 -280100 -131737
8522 -131737 83772 247245 131118 -86052 -94676 112505 -451985 -24364 -473735 -84245
8512 -84245 -84756 70992 -506650 -7597 -277132 -395607 -135754 -233469 41559 -91272 -102023
8501 -102023 -222236 -306883 -279644 -56993 -364434 -188989 -3423 -16807 -142080 -336911
8491 -336911 -179934 -180973 -188744 -293651 -284804 -257001 87851 -213573 -154259 -91911 -190789
8480a90789k20487J12219J50255j34318R1394K03467l5084q7882j32560K23627
8470b0158p7756m7719J31874J45394m58238K20494J85569k87380K12913j03606
8460i8613j67186p2424L7363P8063J16911O5923p7787n6955N4953Q1564m24076
8449d62264J48617J67257J51447J08885k71434q4676L88579k69375j12639j97414
8439d33017L79388p9124n6231k3369j20889l8722L17583l68769L81944j04017
8429a45223J92265j89259r6204J73237N3648j19549r2114k2581k2882J24806k59297
8418d03153L79019j41269n0225J56875j13188J78558j72499J66585Q7424k48349
8408a60222j18882J71308N0180N3105l9919j6616J75505n38444K39090O3991Q2096
$$ plain form
8480 -190789 -411276 -299057 -148802 -283120 -191726 11741 -23343 -111225 -243785 -20158
8470 -20158 -97914 -145633 -13759 131635 -326603 -106109 79460 -207920 4993 -98613
8460 -98613 -265799 -338223 -300860 -222797 -105886 -39963 -117750 -174705 -119752 -38188 -462264
8449 -462264 -313647 -146390 5057 113942 -157492 -242168 146411 -122964 -235603 -433017
8439 -433017 -53629 -132753 -188984 -212353 -333242 -371964 -54381 -423150 -41206 -145223
8429 -145223 47042 -142217 -238421 -65184 -11536 -131085 -223199 -245780 -268662 -143856 -403153
8418 -403153 -24134 -165403 -215628 -58753 -171941 6617 -165882 703 88127 -160222
8408 -160222 -279104 -107796 -57616 -4511 -44430 -61046 114459 -423985 -184895 -120904 -38808
8397c8808J5691j69266J20618n6959J59820k25763J00857N22405o29490L00384
8387I9489j92814j23950J29235L6438o9575k19227K85967m5405k90201J03157
8377b86886Q5859J13809r9424R1331j66419N9193j2637O3111q957J52860j91952
8366b00112K31779l69803L52706j60214J63237j64977R4721q7595K42664q8938
8356A3468l56042J58692N2961m6214K2674j80533J84406m6191K58291j40078j36467
8345b15033J4521J82621r1154J21392k90031M50211l92439K02703J44774j92327
8335f4762J86678l56282K99102l75500K53129J70768j50392Q4714J19348q4364
8325H2439J66160l0884k93425M2365k90973J99944Q256J29420J09369j55931K10731
$$ plain form
8397 -38808 -23117 -192383 -71765 -128724 31096 -194667 -93810 428595 -200895 99489
8387 99489 -93325 -217275 -88040 -51602 -121177 -340404 -54437 -99842 -390043 -286886
8377 -286886 -201027 -87218 -186642 -95311 -261730 -202537 -215174 -152063 -161020 -8160 -200112
8366 -200112 31667 -338136 14570 -145644 17593 -147384 -52663 -140258 102406 13468
8356 13468 -342574 -183882 -130921 -177135 -154461 -334994 -150588 -196779 61512 -78566 -215033
8345 -215033 -200512 -17891 -109045 12347 -277684 172527 -219912 -17209 127565 -64762
8335 -64762 121916 -234366 64736 -310764 -57635 113133 -37259 47455 166803 82439
8325 82439 248599 217715 -75710 -33345 -324318 -124374 -116118 13302 122671 -33260 177471
8314A77471m76437J73806O949l97K738j70969M81217l20964O0865K51161l76024
8303a90584J76672J2397k84130J35911L356J77496r9031j71143L0267J21518l20282
8292d07553K35141m8013j15287K36314j47056J6498L31015k83277J09932m0029
8282a12315k6744J45353j46102m0143k29176M95382k44467K47486l34051K10981
8272c3796k13319o2366n6088K20986J39531M6266r0883l05048J80289j17716L08905
8261A6761k58064Q3469K6520J08188k63361J71581J5576N1185J59319j40184K8687
8250c23J47291j59719N7639j35792P9419L3584j90393K57734j00341J76025l12796
8239a47672K36370l91380K06728R1948J9043P1238j87775L10265l85033J21278
$$ plain form
8314 177471 -298966 -125160 -118211 -118608 -115870 -286839 194378 -126586 -65721 185440 -190584
8303 -190584 -13912 -1515 -285645 -149734 -146378 31118 -67913 -239056 -208789 -87271 -407553
8292 -407553 -172412 -220425 -335712 -99398 -246454 -229956 101059 -182218 -72286 -112315
8282 -112315 -139059 6294 -139808 -179951 -409127 86255 -158212 89274 -244777 -33796
8272 -33796 -247115 -309481 -365569 -144583 -5052 41214 -49669 -354717 -174428 -292144 16761
8261 16761 -241303 -157834 -131314 -23126 -286487 -114906 -99330 -48145 111174 -29010 -323
8250 -323 146968 -12751 44888 -90904 -11485 22099 -168294 89440 -10901 165124 -147672
8239 -147672 88698 -302682 -95954 -4006 15037 86275 -101500 208765 -176268 -54990
8229e4990K64440k7648j41109J31143r2449J29817k04554P5692J4229k10887K93415
8218A77099k52657L40718k67229p1862q1218k3920L38590j57950K36984j58634
8208G9921l3073J84239l51207J20252m8466K83349k28029J77388l76683M74780
8198B82471j57699M941k71117L01870m20048N24424M41391j068950K46930N2454
8188f3333l7776J19793k32671K2982J32513j27130l6703M29224l91613j50349
8178c35063K66352j36093K70420k03701r1163M0062l83679L72518J51298j00729
8168a49778K21091J89892l87961Q8064j89475K74297l63602J01910p2330M01719
8158A13827m41277Q2796Q7447l84621L53225k09299K17136k14995L95747J56184
$$ plain form
8229 -54990 209450 181802 40693 171836 79387 209204 4650 80342 94571 -116316 177099
8218 177099 -75558 265160 -2069 -73931 -155149 -179069 159521 1571 238555 79921
8208 79921 46848 231087 -120120 132 -48334 235015 6986 184374 -192309 282471
8198 282471 124772 129713 -141404 160466 -259582 264842 706233 -362717 -115787 -63333
8188 -63333 -101109 18684 -213987 -191005 -58492 -185622 -222325 206899 -184714 -335063
8178 -335063 -68711 -204804 65616 -138085 -229248 -189186 -572865 -200347 -49049 -149778
8168 -149778 71313 261205 -126756 -38692 -228167 46130 -317472 -215562 -287892 113827
8158 113827 -327450 -244654 -157207 -541828 -188603 -397902 -180766 -395761 -14 156170
8148A56170o12142L09801j50910K23834j26052o0497J55266J16169j27731Q3118
8138c2974l94027M27953j67096m8901Q8323r6302J56088o8592M1965j85527J14250
8127a64840q0100o9402K47068l05362M03716m06163M28231j43906o6957M2183
8117a15532P800q5459j44608L92811l19486K38251Q4480p5424j90625O6098O8286
8106g3408j35364o225L3276j87691K34333Q4009K274j64645J07393n7830m0561
8095b04439l96719L69246J71283k36555J18699k91286N70858P637l51735j57253
8085d00264K3978J74605J16471q7962K1919p0611J68092k28105K0604O8293k9157
8074b22137J72285j34463K66008j78486k46351K29952p8292R619j59863J9584
$$ plain form
8148 156170 -455972 -146171 -297081 -73247 -199299 -259796 -104530 11639 -116092 -32974
8138 -32974 -427001 952 -166144 -215045 -126722 -223024 -66936 -135528 -93563 -279090 -164840
8127 -164840 -244940 -314342 -67274 -372636 31080 -375083 53148 -90758 -157715 -115532
8117 -115532 -107732 -193191 -337799 55012 -264474 -26223 58257 -17167 -207792 -141694 -73408
8106 -73408 -208772 -214997 -181721 -369412 -135079 -51070 -48796 -213441 -106048 -163878 -204439
8095 -204439 -601158 -231912 -60629 -297184 -178485 -469771 101087 108724 -243011 -400264
8085 -400264 -376286 -201681 -85210 -173172 -151253 -221864 -53772 -281877 -261273 -192980 -222137
8074 -222137 -49852 -184315 81693 -96793 -343144 -113192 -191484 -181865 -341728 -322144
8064c22144o0745L74727k01088j0145K19992l05433K37667k79383L17704M1842
8054A2994j90147j6490l5283J59206j66786k4030K44866j12796L7847J72116n28558
8043d47061M42998k56788J28588m4770P3732K8625m3384J15009o3355N6738j0276
8032a9944O1505j69185j45486R6701r7733K50218q176p1410J74934l21721K54525
8021D228p7341J66365k05742J1816J60856j07370O2638l5813j3590J36752j39459
8010c6660J90801j65163j96158K1019p9L07057j21816P7333m4367K05866m15137
7999a77304j04285M48610j67571j34442J29517l21569M32822q3362p9073j14884
7989a71541K59009j99186K28453m3975j6533o6728k91208J63775o0564J59253
$$ plain form
8064 -322144 -382889 -8162 -209250 -219395 597 -304836 -67169 -346552 -28848 12994
8054 12994 -177153 -193643 -228926 -69720 -236506 -260536 -15670 -128466 -90619 81497 -447061
8043 -447061 -4063 -260851 -132263 -177033 -103301 -74676 -118060 -3051 -66406 -9668 -19944
8032 -19944 41561 -127624 -273110 -176409 -274142 -23924 -32100 -103510 71424 -250297 4228
8021 4228 -73113 93252 -112490 -100674 60182 -47188 15450 -20363 -33953 102799 -36660
8010 -36660 154141 -11022 -207180 -186161 -186240 120817 -999 76334 31967 237833 -177304
7999 -177304 -281589 167021 -550 -134992 -5475 -327044 105778 22416 -56657 -171541
7989 -171541 87468 -111718 116735 72760 56227 -10501 -301709 -137934 -198498 -39245
7979c9245k79584J77813l48088L56420J11202J52240l1679m63049K88857o6489
7969a41602m956R569q8180M27055k61900j81977m1105L34847k64448L59681k25913
7958g8929m5105J00587J10974k61187K24662j36591J43870k08815m1813K01996
7948I649k03388K0257K20751j23450k39046J78428p6085j3604K557j56764J58311
7937b22384N7522o2855Q9496j90219J72807J07685j89884o5675J43613J04523
7927e5371L6171j79118j8839L82433k98222r1436J83195q6524J04151o6801P8005
7916a2356j7474j55855j94291L18552j96068N6659j292J11473j48864k4316K21243
7905d2589j41671J46193j00194O6713k13270J92369O6922j20019o7358j0023K21046
$$ plain form
7979 -39245 -318829 -141016 -489104 -132684 -21482 130758 99079 -363970 -75113 -141602
7969 -141602 -146558 -136989 -225169 201886 -60014 -241991 -283096 51751 -212697 146984 -78929
7958 -78929 -124034 -23447 87527 -173660 51002 -85589 58281 -150534 -192347 9649
7948 9649 -193739 -173482 47269 -76181 -315227 -136799 -212884 -226488 -223931 -380695 -222384
7937 -222384 -164862 -227717 -138221 -328440 -155633 -47948 -237832 -303507 -159894 -55371
7927 -55371 -19200 -198318 -217157 165276 -132946 -224382 -41187 -127711 -23560 -90361 -12356
7916 -12356 -29830 -185685 -379976 -61424 -257492 -200833 -202125 -90652 -239516 -263832 -42589
7905 -42589 -184260 -38067 -138261 -71548 -284818 -92449 -25527 -145546 -212904 -222927 -1881
7894a881j67313J28637N3005j96038L7835J86372k10321q2615J41904m6692L4559
7883a22548j05499l18135L07910N9535J7192K673K8525p2349L47958n58321K68228
7872a44831N764j13920K45979n3269q1582J13805o0636L0213O010l03737L20327
7861c5877L74k49475J52112j37487J89935j57201K01935o039j76008o1068m8691
7850c27490J096180k17683o14917K12783k37576Q696K16276m17973R1058N0853
7840a39793M7066L60552l91301J89264J68031k18644k33835K78667l00174K34510
7830e657P6001j91852K23241l54228M38741o36989L54939k9033j83436j7605K93933
7819c1945J1918k61205K18847k00699K6123K46728j3933p7951K61946k65621j68098
$$ plain form
7894 -1881 -169194 -40557 12448 -183590 -145755 40617 -169704 -252319 -110415 -157107 -122548
7883 -122548 -228047 -546182 -238272 -178737 -161545 -158872 -130347 -202696 145262 -413059 -144831
7872 -144831 -139067 -252987 -7008 -60277 -141859 -28054 -88690 -58477 -52467 -356204 -35877
7861 -35877 -35503 -284978 -132866 -270353 -80418 -237619 -35684 -41723 -217731 -278799 -327490
7850 -327490 768690 551007 -63910 148873 -88703 -80007 136269 -281704 -190646 -139793
7840 -139793 -92727 267825 -123476 65788 233819 15175 -218660 60007 -240167 -5657
7830 -5657 70344 -121508 101733 -252495 186246 -450743 -95804 -124837 -308273 -325878 -31945
7819 -31945 -20027 -281232 -62385 -263084 -236961 9767 -4166 -82117 179829 -85792 -253890
7808b53890L10491r4582L9148j67433m5110J83653L25551l65284n7469N9300N5146
7797a0479k30845Q7203R1244N8948J12087k86366r9480O6373j4127L89768m56534
7786b92208J49851m9479L8617j3195L4999O9315M6570j15428k48786K55801o5192
7775a89135K60601l16030J70653K24949m50361K17789j45089J57722q0891j25816
7765b75608J78605k53078Q9119K93831p4121J04714l39764j76039M12234j4651
7755e4758l7465j09775M05997k69838o0006k6839p5893N6539J80864j33785O5956
7744e9003q8555k36063M27842l05927O8804K7282J8321R6391K09443m54805K03983
7733i2287k14841K26743p4003J22593j32410J47003J12822r9495q0239K23146
$$ plain form
7808 -253890 56601 -37981 1167 -166266 -211376 -27723 297828 -67456 -124925 -65625 -10479
7797 -10479 -241324 -154121 -62877 -3929 108158 -178208 -277688 -211315 -225442 164326 -292208
7786 -292208 -142357 -191836 -153219 -166414 -131415 -62100 -15530 -130958 -379744 -123943 -189135
7775 -189135 71466 -244564 -73911 151038 -299323 -81534 -226623 -68901 -149792 -275608
7765 -275608 -97003 -350081 -260962 32869 -41252 63462 -276302 -452341 -40107 -54758
7755 -54758 -92223 -201998 203999 -65839 -125845 -152684 -228577 -172038 8826 -124959 -59003
7744 -59003 -147558 -383621 44221 -261706 -192902 -165620 -147299 -50908 158535 -296270 -92287
7733 -92287 -307128 -80385 -154388 -31795 -164205 -17202 95620 -3875 -84114 139032
7723A39032k16418j60207L07478l09164J00011j662m0561K18643m41725L92791
7713a1782p6786J10442j41745K01318k83757m4132L81243p4288M3224l79370L58882
7702H3249q1982l41445O13525l49729R5309K9021J92015j70460k63606J01223
7692i2880j09636K37433M7508l68077M60109k43818l5002J54486r2173J72163
7682A30113j64090J15754K9013j81504O2492j65488j7090K15187J69099n37668
7672c44182M64404l35455J79895o8205j32834J60079J17121k41045P6888p2816
7662a96150J35588n1923n9870R4557J04906m1857l6734J36947m5716k16372o9073
7651b45697L46724j48588m1918j31837J74521L63588o67590K98427j191O6316
$$ plain form
7723 139032 -77386 -237593 69885 -239279 -139268 -140930 -181491 37152 -404573 -11782
7713 -11782 -88568 21874 -119871 81447 -202310 -246442 134801 60513 103737 -275633 83249
7702 83249 1267 -340178 273347 -76382 18927 47948 239963 69503 -194103 -92880
7692 -92880 -202516 34917 82425 -285652 174457 -69361 -104363 50123 -42050 130113
7682 130113 -33977 81777 110790 -70714 -8222 -173710 -190800 24387 193486 -344182
7672 -344182 120222 -215233 -35338 -103543 -236377 -76298 40823 -200222 -123334 -196150
7662 -196150 -60562 -112485 -172355 -77798 27108 -14749 -51483 85464 39748 -176624 -245697
7651 -245697 101027 -47561 -89479 -221316 -46795 316793 -350797 -52370 -53561 12755
7641A2755j47066R2818K4171j52376J58317j08245k27673J1081K30137o0855J72731
7630E795j62810k9823K8233o0152J24340J23052o2520K55704n57164L57908M6868
7619F9431j55093K37398l43912J00793p5441L75232k58072l32870L24799j94920
7609b52655n7980j19801M21279J859J16950k71894L05581j04798M7662j82721
7599i6518J63043J726j22058Q2523j58784R8636j915L27369k52798l27164K97167
7588A1227m1718L4175o5306J36157j38179O3274J71703k29074K7193j50989M90395
7577C08858l42692k77080M82636q7473R7371k42723K088R1852j67501o5760K00976
7566E52j2468q1163Q9516J3434M5227l04714M6893l00446O11816m4924n5352m527
$$ plain form
7641 12755 -134311 -41493 -17322 -169698 -11381 -119626 -347299 -336218 -106081 -166936 5795
7630 5795 -157015 -186838 -158605 -218757 -94417 28635 -33885 221819 -335345 22563 69431
7619 69431 -85662 151736 -192176 -91383 -166824 208408 -49664 -382534 -57735 -252655
7609 -252655 -310635 -430436 -9157 -7298 109652 -162242 143339 38541 86203 -96518
7599 -96518 66525 68251 -53807 28716 -130068 -31432 -33347 294022 41224 -285940 11227
7588 11227 -30491 3684 -61622 74535 -63644 -370 171333 -57741 -30548 -181537 308858
7577 308858 -33834 -310914 171722 84249 181620 -61103 -59015 32837 -134664 -200424 552
7566 552 -11916 -93079 -3563 9871 55098 -249616 -202723 -503169 108647 63723 8371 3844
7554C844K0339J93147k73188J20091m86536N22095j94598j36103q8101M20549
7544A01539J01526k61072N1110l8166l6012J12701K01493l11408R075R8885n092
7533B4579Q5908j24470j45p2052J59743j80256J45438r574l73371K86171p3192
7522a31221j9340k17396K52760K44049j45534J41794l17962K22970l88960M20531
7512F1691k8113j85695J61074n2899j49548K59769Q0979m00447K06099J34177
7502H7087j45396J32368Q043k15565J44219Q7375m27929L34987l22571L27597
7492A0215Q7781j55086L3849O5116j75868K07387P6527n3659n7025l3884J17659
7481A23012m906m8238J43344l34438q0263K06201j09287k43964K45237j64675
$$ plain form
7554 3844 24183 217330 -55858 64233 -422303 99792 -94806 -230909 -319010 101539
7544 101539 203065 -58007 -6897 -45063 -81075 31626 233119 -78289 -69214 29671 24579
7533 24579 110487 -13983 -14128 -86180 73563 -106693 38745 29171 -344200 -58029 -131221
7522 -131221 -150561 -367957 -115197 128852 -16682 125112 -192850 30120 -358840 61691
7512 61691 33578 -152117 8957 -43942 -193490 66279 147258 -253189 -47090 87087
7502 87087 -58309 74059 82102 -133463 10756 98131 -329798 5189 -317382 10215
7492 10215 97996 -57090 -23241 41875 -133993 73394 149921 96262 39237 5353 123012
7481 123012 118106 69868 213212 -121226 -201489 4712 -104575 -348539 -103302 -267977
7471b67977N27970l35547k659P8174L4023j41071J90724N1538l16648L40884N948
7460A65359J2974k69200K09394J6355j29291j4550M9984L9752o5540k13176L86283
7449A88344k49394K6263Q7449p3227j72665K46821J04248Q1352k62593K88706
7439B65304j32140J00635r5164J81040o7287J35296j56923j78460J14515Q1433
7429B48249j28058J34124L1885M3383l37196j3520j12224J40457k3833Q6670k73286
7418b03349J61578L32253k63607J86344K5050J0752q476j07454O6650j13669L97691
7407D83763m99588J97877K67760j83687o197N8131j57117K81465k85096J03794
7397B61105q1864l0358J62332j85410P7771j67890r978K11391k65786K38158J91536
$$ plain form
7471 -267977 259993 -75554 -78213 -39 33984 -107087 83637 135175 -181473 159411 165359
7460 165359 178333 -90867 118527 134882 5591 -8959 41025 80777 15237 -197939 188344
7449 188344 -61050 -34787 52662 -20565 -193230 53591 157839 239191 -23402 265304
7439 265304 133164 233799 138635 319675 252388 387684 230761 52301 166816 248249
7429 248249 120191 254315 286200 329583 -7613 -21133 -133357 7100 -16733 69937 -203349
7418 -203349 -41771 290482 26875 213219 238269 249021 240545 133091 199741 86072 483763
7407 483763 -15825 182052 449812 266125 259928 318059 160942 442407 157311 261105
7397 261105 179241 148883 311215 125805 203576 35686 25708 237099 -28687 209471 401007
7386D01007l32951R6687J58027k82245J12414k59840L13924J38134k45577K21885
7376C21465n6498j62120q222n257o2537K13255l72199K95334j19110L56867l97920
7365C058j54706K16577k51749K18817J33189k04667Q0442k4180J4216n637l9941
7354a4581L27603l88235L86922k89837J33709K38892k04243r0173n4115J31710
7344A77652j33009J63389m4302P6636k80968L32693k28092j73572L42373n15780
7334b82980K54593J5852P0324j35568K67911o7264J17574j38255J65270k50471
7324A6986K23903j17110J50586j9544k21929L72414J44985k61047m01387J33782
7314B1639o2526L71284n43249N29627j53612n1824O6301n1423j31411M9805L8522
$$ plain form
7386 401007 68056 164743 322770 40525 152939 -106901 207023 345157 99580 321465
7376 321465 264967 102847 94625 89368 26831 240086 -132113 163221 44111 400978 3058
7365 3058 -151648 64929 -186820 31997 165186 -39481 40961 16781 30997 25360 -14581
7354 -14581 313022 -75213 311709 21872 155581 394473 190230 100057 45942 177652
7344 177652 44643 208032 163730 240366 -40602 292091 63999 -109573 232800 -282980
7334 -282980 -28387 -12535 57789 -77779 190132 122868 240442 102187 267457 16986
7324 16986 240889 123779 274365 254821 32892 405306 550291 289244 -112143 21639
7314 21639 -40887 330397 -212852 316775 163163 111339 177640 126217 -5194 44611 83133
7303H3133j60829l042n4823M22032j57046j3998k40430K50697k84466L42559j43275
7292D0512K64715k32569j18449K81380k88637j18091M95678o2537l03212L02198
7282B60988m5965l8969o00143L66243L57282l17865j75452M91276j36176j26738
7272C4481P5517J5416m2647M9171J01319m3448j69832K88379m1860k46055j21697
7261a01256K96185m9178K29j10774O5554j14820L0237j02894K49145q1679R8332
7250A79081k84981M29962k22997o2332o3630O8978m6259K48523j76476q9458N1605
7239C2016J09001m1372K57340k46250J7981K01404l21208J14281N5026j84398
7229f179J41461k16069N16249k58594l6238Q239k7750q1316l4737L39291j49147
$$ plain form
7303 83133 -77696 -80738 -135561 286471 129425 115427 -125003 125694 -158772 183787 40512
7292 40512 305227 72658 -45791 235589 -53048 -171139 324539 262002 -41210 260988
7282 260988 215023 176054 -424089 -57846 299436 -18429 -193881 297395 161219 34481
7272 34481 109998 125414 82767 131938 233257 189809 19977 308356 266496 20441 -101256
7261 -101256 194929 145751 145980 35206 100760 -14060 16177 -86717 162428 80749 179081
7250 179081 -105900 324062 101065 38733 -24897 44081 -2178 246345 69869 -19589 32016
7239 32016 141017 99645 356985 110735 128716 330120 8912 123193 178219 -6179
7229 -6179 135282 -80787 435462 176868 140630 148869 121119 39803 5066 344357 195210
7218A95210J46424k46717N1682K14341l92199J96378p3605j10111Q4146K79110
7208C44659m55679M53485J30115l37894m7965k6742O4569K26263l18430J42636
7198A75017K1951m04590L52637j85133J92353j1037J13487n8890j70283p4211
7188d8699L01437K0492k25021K60532j05943K02704m42681J90176j17021K23789
7178B59765k29028K01318o364l57731L44282L4381P8966j45457K68419l22815
7168A25736J36903q4219R3849l3102K8856m0359j12511K50152j16982j00462J20067
7157B67928o5049N3591j71093J22326R3784p7823q5518J38855J107m48247K43335
7146G3196j1065j1750j45387K88760J38573k57653L74072k37378L02602n15300
$$ plain form
7218 195210 341634 94917 146599 360940 -31259 165119 91514 -18597 65549 344659
7208 344659 -111020 342465 472580 134686 86721 59979 124548 350811 32381 175017
7198 175017 196968 -207622 145015 -40118 152235 141198 254685 195795 25512 -48699
7188 -48699 252738 273230 48209 308741 202798 405502 -37179 152997 35976 259765
7178 259765 30737 232055 225691 -132040 212242 246623 325589 180132 448551 125736
7168 125736 262639 178420 272269 239167 268023 227664 115153 365305 248323 147861 267928
7157 267928 202879 256470 85377 207703 301487 223664 138146 277001 278108 -170139 73196
7146 73196 62131 50381 -95006 193754 332327 74674 448746 211368 513970 -1330
7136a330L12045r3680j68075J16881p0640K14327j45581R8632J25614k46078j32839
7125I276L81262j31184j53998K22054J57318j60083j00845M29847n43148K82745
7115C93244k40195K25943N9432l2397R5983j86630p4906M0488K16500O4445k89519
7104B72388N1298R0578K1101j83318N00947n54432J74462p8208J23585J28930
7094E47331k49460K87848l08516Q4445j48446p734J19476J34100j95839K37707
7084E00912J53720j94956q078k66443N17589l39978K56227j85023j29772L29654
7074F33852l7950j34587K66509k71649R5676J40951k00980K15578Q8243j40087
7064F55556p0578p9755K46790l94209o2870K41981o3119j14955K29067l247k48334
$$ plain form
7136 -1330 310715 217035 48960 165841 95201 309528 163947 262579 388193 142115 9276
7125 9276 390538 259354 105356 327410 484728 324645 223800 653647 110499 393244
7115 393244 153049 378992 438424 406027 502010 315380 240474 280962 497462 561907 272388
7104 272388 323686 414264 435365 252047 752994 198562 373024 294816 418401 547331
7094 547331 297871 585719 277203 361648 213202 205468 324944 459044 263205 500912
7084 500912 654632 459676 451598 185155 702744 362766 618993 433970 304198 633852
7074 633852 595902 461315 727824 456175 551851 692802 491822 707400 795643 655556
7064 655556 584978 505223 752013 357804 294934 536915 473796 358841 587908 584661 336327
7053C36327K51321N920j73479O5170J44017l25245K30906N0138L06067l32728
7043E58414j56830j67499M03621j13108K990r9507O9727L45726n09885K44143
7033E77792m0347k52307K31728l2106o9249q3257K88764j0078k2784J1802o2412
7022E37546K56349l2717n9666P6382m3472P974m4453m5490K29439j71394K9791
7011G40289k20926k3241K38198J79222j20115j43367K30968j17458o5598R2963
7001G90935l30176L44040j7125J90044k28028K99584p3698n7866m1999j71780
6991G03931K92384o9532J22258l00675L25327p2160j94905M13747O2521q8606
6981A194290j8505J33899l22698J77354K06875q5849N2701o820n9727J9619K98282
$$ plain form
7053 336327 587648 593568 420089 485259 629276 304031 534937 585075 891142 558414
7043 558414 401584 234085 637706 524598 527588 428081 497808 843534 333649 577792
7033 577792 537445 285138 516866 484760 415511 332254 621018 610940 588156 599958 537546
7022 537546 793895 761178 701512 777894 734422 742396 697943 652453 881892 710498 740289
7011 740289 519363 496122 734320 913542 793427 650060 881028 763570 697972 790935
7001 790935 460759 804799 787674 977718 749690 1049274 975576 917710 875711 703931
6991 703931 996315 926783 1049041 748366 1073693 1001533 806628 1220375 1282896 1194290
6981 1194290 1175785 1309684 986986 1164340 1371215 1285366 1338067 1331247 1271520 1291139 1589421
6970A589421k77226j00374M3403K78257m12667L63252J66444l41401K14203j17566
6960A405746K09843k59654K9756J21986j76502J98620J76202k57046o9141K13332
6950A593142m75810O18584l42399J99726K80282K1995k27992K55590j22347J72725
6940A973496J82116j89500N6699n9965K20914n2451j44069J41710K2131J58972
6930B310053l8069J40800J1869J7311O6751k32091L38775N1090N1923M50846o57145
6919B512113L36116K13799j60324k58726L10714P5631J54092k2753J33601K41837
6909C536100O2582m1788m1124J4850L13502J79428j89624K06123j03852P8204
6899D014401J31882J45819m6449n3588R04P9292k32499O8261N3302P4199m25024
$$ plain form
6970 1589421 1312195 1211821 1255224 1533481 1120814 1484066 1650510 1309109 1523312 1405746
6960 1405746 1615589 1355935 1385691 1507677 1331175 1529795 1705997 1448951 1379810 1593142
6950 1593142 1117332 1735916 1393517 1593243 1873525 1895520 1667528 1923118 1800771 1973496
6940 1973496 2155612 1966112 2022811 1962846 2183760 2131309 1987240 2128950 2151081 2310053
6930 2310053 2271984 2412784 2424653 2441964 2508715 2276624 2615399 2666489 2718412 3169258 2512113
6919 2512113 2848229 3062028 2901704 2642978 2953692 3029323 3183415 3160662 3294263 3536100
6909 3536100 3598682 3556894 3515770 3530620 3844122 4023550 3833926 4040049 3936197 4014401
6899 4014401 4146283 4292102 4245653 4192065 4192969 4272261 4039762 4108023 4161325 4235524 3810500
6888C810500n1960L96055k26583k37092k3819j19286K47267k74814J47008K7599
6878C694875r9668r7605J75358m93911J61675R3338j17843k4817K09991j94942
6868C306451m19126K07201L87985j30462n88882N73024m50638M20926n67771L32992
6858C071700Q267j70019J69033j21335J23319m15150K0251p5843P8006k42287
6848B445942K60384q3095j7684r721M2692j56296J42528p4721k0675n1762J37068
6837B614660j65233r8260m682Q0949N2435k32680K49460j16065j35335J79158
6827B424407J40561l54076L75238m08773K03235L65341l25727L7287J17400p7966
6817B496927L1581j17267k4386K31710j74151K61190p7709j94959J89424n6327
$$ plain form
6888 3810500 3758540 4154595 3928012 3690920 3667101 3547815 3795082 3520268 3667276 3694875
6878 3694875 3595207 3497602 3672960 3179049 3340724 3434062 3316219 3291402 3501393 3306451
6868 3306451 2887325 3094526 3482511 3352049 2763167 3336191 2885553 3306479 2738708 3071700
6858 3071700 3079967 2909948 3078981 2957646 3080965 2665815 2686066 2610223 2688229 2445942
6848 2445942 2706326 2623231 2605547 2595826 2638518 2482222 2624750 2550029 2529354 2477592 2614660
6837 2614660 2449427 2351167 2346485 2427434 2479869 2247189 2496649 2380584 2245249 2424407
6827 2424407 2564968 2210892 2586130 2177357 2380592 2745933 2420206 2457493 2574893 2496927
6817 2496927 2528508 2411241 2386855 2618565 2444414 2705604 2627895 2432936 2622360 2566033
6807B566033j95510L39918l34227J67053j61961j91862Q1546L62600j13631j74645
6797B345314j00292J32388j09252j29491J48245K31269M3588J909o5284j91469
6787B306925L48181q6797j58327K04127j74695j82052K30432n2023M51021N6578
6777B943370l39131q4321n1616J46594J50778J31031K52451j01333J9221k83726
6767B783318O1392r2703K38605j07459j7869r750N107M3388J34172K3663k01263
6756B860601K77998K05243J27058j47122J69514n9466L00037j73879O8156J76472
6746C804612P3526j39056N0720K77614j64791K55331m5962N0063N8555k39532
6736C981080J21787R8951L27433l10757r7715M41776P4096k02109M8180J14352
$$ plain form
6807 2566033 2370523 2710441 2376214 2543267 2381306 2189444 2270990 2633590 2519959 2345314
6797 2345314 2245022 2377410 2268158 2138667 2286912 2518181 2561769 2563678 2498394 2306925
6787 2306925 2655106 2568309 2409982 2614109 2439414 2257362 2487794 2435771 2886792 2943370
6777 2943370 2604239 2519918 2468302 2614896 2765674 2896705 3149156 3047823 3067044 2783318
6767 2783318 2844710 2752007 2990612 2883153 2865284 2855534 2860641 2904029 3038201 3061864 2860601
6756 2860601 3138599 3343842 3470900 3323778 3493292 3433826 3733863 3559984 3628140 3804612
6746 3804612 3878138 3739082 3789802 4067416 3902625 4157956 4111994 4162057 4220612 3981080
6736 3981080 4102867 4201818 4529251 4218494 4120779 4562555 4636651 4434542 4482722 4597074
6726D597074j00834K60937L89796j44718K19907k05918M35164j43818L50747K19403
6716E877740M0068J38260J0494L70598J72382R6173k99904J77862P0640L40616
6706F994929m6384K41016K25297j86068L49927j989O5377L26661M88032j0397
6696H446401O5201M94269J56885L03293Q8892L33942O828M11151N34463M92851
6686A1334176L09796N53636J97784M46010L89148L54831O98850O09148N88957
6677A5482336Q45551L92423O33468O25988R30648P21188J187349N55577J164946
6668B2539474J256973J082504J386883J166969J520428J698696J665242J818388
6660C4135557K104183K097336K285258K520392K009939K967867K269074K467101
$$ plain form
6726 4597074 4496240 4757177 5146973 5002255 5222162 5016244 5451408 5307590 5658337 5877740
6716 5877740 5917808 6056068 6066562 6437160 6609542 6705715 6405811 6583673 6654313 6994929
6706 6994929 6948545 7189561 7414858 7228790 7578717 7576728 7642105 7968766 8456798 8446401
6696 8446401 8511602 9005871 9162756 9466049 9554941 9888883 9895711 10306862 10841325 11334176
6686 11334176 11643972 12197608 12395392 12841402 13230550 13585381 14284231 14893379 15482336
6677 15482336 16327887 16720310 17353778 17979766 18910414 19631602 20818951 21374528 22539474
6668 22539474 23796447 24878951 26265834 27432803 28953231 30651927 32317169 34135557
6660 34135557 36239740 38337076 40622334 43142726 45152665 48120532 50389606 52856707
6652E2856707K528016K298448J781949J928173J838548J269691L33526N1093O2128
6643F4948279o66079j306888j625177j401552k165576k019470k346024k287985
6635E1129528k250465k286390k399858k231997j998114j895338j566776k190204
6627C4310386j459396j751056j256060j494678j202292j002190j370128r34987
6619B3839599j170965o08612q71581q18357q42208p14165p67360o04250l86512
6610A7055589p06554k18886j020187l06871o76622m93847L4354n50653m77388
6601A2638935j36295j54187n52505k29402k06880n39342j43071q4621r3514n19220
6591I979898N2457j04970l49019l73260N2545k14904k24828k93397j4844j89809
$$ plain form
6652 52856707 55384723 57683171 59465120 61393293 63231841 64501532 64835058 64886151 64948279
6643 64948279 64282200 62975312 61350135 59948583 57783007 55763537 53417513 51129528
6635 51129528 48879063 46592673 44192815 41960818 39962704 38067366 36500590 34310386
6627 34310386 32850990 31099934 29843874 28349196 27146904 26144714 24774586 23839599
6619 23839599 22668634 22060022 21188441 20370084 19527876 18813711 18046351 17442101 17055589
6610 17055589 16349035 16130149 15109962 14803091 14126469 13632622 13666976 13116323 12638935
6601 12638935 12502640 12348453 11795948 11566546 11359666 10820324 10677253 10592632 10499118 9979898
6591 9979898 10032355 9927385 9578366 9205106 9257651 9042747 8817919 8524522 8509678 8319869
6581H319869k96738j36527j45834P3177k74877K00543L3048l92025j60377K19689
6571G439948m87548J52602k60891K75583j35822M02418m51835J98837k72507O01758
6561G462543K31439L4864N33781k54997J90385j02591j3872N6026K08070l61237
6551G984411L27925m2392J41543K19995L38746R3292o17408M74791q35943k70939
6541G814021l69751L93385k81502N6180M52481M84348O44823O31891J032633J026625
6531A1885134O94165P41880k60124j09312J65156J89248Q16642K95935L86037
6522A4804761J19458M49051J56258N21553n7345p81638q36469j333794j337805
6513A1704030q61195k96652m19978K277j31644O30337K65662P39537J604415Q08921
$$ plain form
6581 8319869 8023131 7886604 7740770 7813947 7539070 7739613 7772661 7380636 7220259 7439948
6571 7439948 6952400 7105002 6844111 7119694 6983872 7386290 6934455 7133292 6860785 7462543
6561 7462543 7693982 7728846 8262627 8007630 8198015 8095424 8081552 8137578 8345648 7984411
6551 7984411 8312336 8269944 8411487 8631482 8970228 9063520 8446112 8920903 8084960 7814021
6541 7814021 7444270 7837655 7556153 7612333 8064814 8549162 9193985 9825876 10858509 11885134
6531 11885134 12579299 13321179 13061055 12951743 13116899 13306147 14122789 14418724 14804761
6522 14804761 14924219 15373270 15529528 16051081 15993736 15212098 14375629 13041835 11704030
6513 11704030 10842835 10546183 10126205 10128482 9996838 10627175 10892837 11632374 13236789 14045710
6503A4045710J044826L24947l21295J50018K60507K28223M33739L60639P28393
6494A7255707j71348L35946m8046L48921p10998j071432r97435j642867j346490
6485A1951958j343069p33835o26221j48227m92537K76246M96944R5879N06473
6476I983611M4597L85917R1822j48993k9804k86306J52548M36246J26632j40590
6466A0615680J76861k72271O3800j92366n90328p47650p33489q59419n82903p54805
6456F123110l93313j33372k60659k76476l65952L15230J8855m92487k42K60468
6446D795162k44934j13239N676q038J5378J89703l95117J63802k76920j19285
6436D012188j94673M8571k32800P0836l13410j75332j31419n785k14527j88446
$$ plain form
6503 14045710 15090536 15415483 15094188 15244206 15504713 15732936 16166675 16527314 17255707
6494 17255707 17084359 17420305 17372259 17721180 17010182 15938750 14941315 13298448 11951958
6485 11951958 10608889 9875054 9248833 9100606 8608069 8884315 9381259 9477138 9983611
6476 9983611 10028208 10414125 10505947 10356954 10327150 10040844 10193392 10629638 10756270 10615680
6466 10615680 10792541 10520270 10584070 10391704 9801376 9053726 8320237 7460818 6877915 6123110
6456 6123110 5729797 5596425 5335766 5059290 4693338 5008568 5027423 4534936 4534694 4795162
6446 4795162 4550228 4436989 4442665 4434627 4450005 4639708 4244591 4408393 4131473 4012188
6436 4012188 3817515 3866086 3633286 3704122 3390712 3215380 3083961 3078176 2863649 2675203
6426B675203N7411K9564O3083K3457l47546R2475j12717J38818r1111n5272k03252
6415B270113m7672K3895j2043L54760j54900j71130l37877L7783L46966l75807
6405A934088L07041l51663J70541j12694P4357k30589R2510J605k13973J82303
6395A853526k47284K54173O1929l3284k1291l17237J52161k27041J43872M6088
6385A665612J53195j04453n1097q6686K8858k16232n3049K15196q4131j62924
6375A304289J51983k27571P1195P7242j5309p7692J64920O49k45685m8114K87579
6364A443486k90427J83899K621j83566L51934l80482k03313L83726l1443O3280
6354A339715K2663p4138k18297j06428L52124k12429K00187j0866J64939l19403
$$ plain form
6426 2675203 2732614 2762178 2825261 2848718 2501172 2593647 2480930 2619748 2528637 2473365 2270113
6415 2270113 2222441 2246336 2234293 2589053 2434153 2263023 1925146 1962929 2309895 1934088
6405 1934088 2241129 1889466 2060007 1947313 2021670 1791081 1883591 1885196 1671223 1853526
6395 1853526 1606242 1860415 1922344 1889060 1867769 1550532 1702693 1475652 1619524 1665612
6385 1665612 1818807 1714354 1663257 1576571 1605429 1389197 1336148 1551344 1467213 1304289
6375 1304289 1456272 1228701 1299896 1377138 1361829 1284137 1449057 1449706 1204021 1155907 1443486
6364 1443486 1153059 1336958 1339579 1156013 1507947 1127465 924152 1307878 1276435 1339715
6354 1339715 1362378 1288240 1069943 963515 1315639 1103210 1303397 1292531 1457470 1138067
6344A138067m6679K24258l52006J39321k06966L31749k47437J30066K00276j94850
6334A115799O9606k36316L96279m98392J48976J36244k12351L49860j53943J19900
6324A235662k00304J3011L7565k86987K53575Q3074m0595Q0517j39341N2264k42435
6313H46006J79010j78233J48797o525O6263R331J21496k87812L4747O4406O399
6302A003885O4911j47461o9249J46663J29948m34119K38055k55798K57787j6851
6292I17771o5064l7616k9304L89413m40973L56865l28385K85034k04500Q6112
6282I29353R4850l5531K38274l93589J87411o9504q0558O1005K44268j31620m5534
6271I98825K05580k88824L36596m34257O8523j94086J09992R6217m5177R1324
$$ plain form
6344 1138067 1091388 1315646 963640 1102961 895995 1227744 980307 1110373 1310649 1115799
6334 1115799 1185405 949089 1345368 846976 995952 1132196 919845 1269705 1115762 1235662
6324 1235662 1035358 1048369 1085934 798947 1052522 1135596 1095001 1175518 1036177 1088441 846006
6313 846006 1025016 846783 995580 989055 1055318 1064649 1186145 898333 933080 997486 1003885
6302 1003885 1068796 921335 852086 998749 1128697 694578 932633 676835 934622 917771
6292 917771 852707 815091 785787 1175200 734227 1091092 762707 1047741 843241 929353
6282 929353 1024203 988672 1226946 833357 1020768 951264 870706 931711 1175979 1044359 998825
6271 998825 1204405 915581 1252177 817920 886443 692357 802349 898566 853389 944713
6261I44713J09965m787n3204k670m98697L42791P4744L143Q2919N0679j5383j1042
6249A023171J49361o1358l24632K47952r4737M08R9829l26068M57291k60230j5893
6238H95094P0236M7623R8291j87552J32957J80613P1196L1882k8769k12533J00198
6227A199236k08309K13455k82029M87732n9566j07652J76335j98380l24473K18704
6217A115053k48705J58099o1342J49419N7182K79885j38118j06310p2669q7190
6207A045304J02053l55327N14956N5776J1094j5013k71722K9757K23541K67079
6197A607498n7486j05794M1463m1912Q4132q4302J2157k10936J23895k04238L71814
6186A536291k4060J2609p5200K54798k05313Q4299n1182J91011J03927n28065
$$ plain form
6261 944713 1054678 1049891 996687 994017 495320 838111 912855 915998 998917 1049596 1034213 1023171
6249 1023171 1172532 1111174 786542 1034494 939757 940165 1039994 713926 1171217 910987 895094
6238 895094 965330 1012953 1111244 923692 1056649 1237262 1308458 1340340 1311571 1099038 1199236
6227 1199236 990927 1204382 922353 1410085 1350519 1242867 1419202 1220822 896349 1115053
6217 1115053 866348 1024447 963105 1112524 1169706 1449591 1311473 1205163 1132494 1045304
6207 1045304 1147357 792030 1306986 1362762 1373856 1358843 1087121 1116878 1340419 1607498
6197 1607498 1550012 1444218 1485681 1443769 1527901 1443599 1455756 1244820 1368715 1164477 1536291
6186 1536291 1512231 1524840 1449640 1704438 1499125 1583424 1532242 1723253 1827180 1299115
6176A299115N36762j56917K38279j26074L95222k25076k00584L45079K17627k14531
6166B108902K99104K99800J07102M5624M00929l8064k54428L28056J67747n1861
6156C412911L10575K02676K04142j8909J31739J83220K52471J25965N8874M74479
6146E338143j5365L40721l37276L01996L99433J5460J32966k80759K61588M652
6136F161559N04044r4292k1676O0569j2249J10217L97269N49246k75797J56688
6126G535578j30850O7728j16808l31109J24606m12273o303j62980l41351q3643
6116F142595l3278j89735o2768j69553j44452N71249k81422K21945p0260j42517
6106E841804J51361k0729k84698l20787k55451m05166r4944j30608j52310j75106
$$ plain form
6176 1299115 1835877 1678960 1917239 1791165 2186387 1961311 1760727 2105806 2323433 2108902
6166 2108902 2408006 2707806 2814908 2860532 3261461 3223397 2968969 3297025 3464772 3412911
6156 3412911 3723486 3926162 4130304 4111395 4243134 4426354 4678825 4804790 4863664 5338143
6146 5338143 5322778 5663499 5326223 5628219 6027652 6043112 6176078 5895319 6156907 6161559
6136 6161559 6665603 6571311 6549635 6610204 6597955 6708172 7105441 7654687 7378890 7535578
6126 7535578 7404728 7472456 7355648 7024539 7149145 6736872 6730569 6567589 6226238 6142595
6116 6142595 6109317 5919582 5856814 5687261 5542809 6114058 5832636 6054581 5984321 5841804
6106 5841804 5993165 5972436 5687738 5366951 5111500 4706334 4611390 4480782 4328472 4153366
6096D153366l26939m1267j6632j31781J95840n4468j58392L03319m48192L12529
6086C787383k052r3952m8420k93272J11271L28069j9965l51882J91979j35272
6076C473887R2705L2046j14694M47747j72637j8417J86980p7028K879L559j88180
6065C668847J55455j24105k3964q1790l46428K97106N9981j84627p7889J73980
6055C516566M4213j66434K00594l79385K73560k60377Q8516j6652j15499P8579
6045C263681j33818p4748K5059J73203j86208K954j44933J07679L8150m7800k44406
6034B778813J16385q0612M6590q5065j02547K74740q0218q4637l04188J9973L21046
6023B820280k15081k6116l03296P5906q0207K57578l25099L1790L71630j61637
$$ plain form
6096 4153366 3826427 3785160 3768528 3636747 3832587 3778119 3619727 3923046 3474854 3787383
6086 3787383 3785331 3691379 3642959 3349687 3460958 3789027 3769062 3417180 3609159 3473887
6076 3473887 3566592 3598638 3483944 3931691 3759054 3740637 3927617 3850589 3853468 3857027 3668847
6065 3668847 3824302 3700197 3676233 3594443 3248015 3545121 3605102 3420475 3342586 3516566
6055 3516566 3560779 3394345 3594939 3215554 3489114 3228737 3317253 3300601 3185102 3263681
6045 3263681 3129863 3055115 3080174 3253377 3067169 3070123 2925190 3032869 3071019 3023219 2778813
6034 2778813 2895198 2814586 2861176 2776111 2673564 2948304 2868086 2783449 2479261 2499234 2820280
6023 2820280 2605199 2579083 2275787 2351693 2271486 2529064 2203965 2235755 2607385 2445748
6013B445748m16053J00239N23350m77244j33722K43991j1632O2861o8690J12612
6003B381460j38802L12046k38523K9064M1093K54835k00066n100m9687J82736
5993B569056n6616k46125M7814J12724j71101K05531O773K04763j8359l3361j46135
5982B474964J40859j62223L31881M7935j19263K22487J11728n4529j03701J49359
5972C039497j18546L06734K72198r2526R3935L24490l05198K03951O2755J02070
5962C889360J13477l6063M42961Q4267M26316O5635k1642J58468J78218j16612
5952E184385L00561J7100K93105K08384J08907J45077J28573J5217R9365j47233
5942F353441L23284j97687K0831K99208J11784K8347M16433p1822J07584N6775
$$ plain form
6013 2445748 2029695 2129934 2653284 2176040 2042318 2286309 2274677 2337538 2268848 2381460
6003 2381460 2242658 2554704 2316181 2345245 2386338 2641173 2441107 2436007 2386320 2569056
5993 2569056 2512440 2266315 2314129 2426853 2255752 2461283 2468056 2672819 2654460 2621099 2474964
5982 2474964 2615823 2453600 2785481 2833416 2714153 2936640 3048368 2993839 2890138 3039497
5972 3039497 2920951 3227685 3499883 3407357 3501292 3825782 3520584 3724535 3787290 3889360
5962 3889360 4002837 3966774 4409735 4494002 4920318 4985953 4964311 5122779 5300997 5184385
5952 5184385 5484946 5502046 5795151 6003535 6112442 6257519 6386092 6401309 6500674 6353441
5942 6353441 6676725 6479038 6499869 6799077 6910861 6939208 7355641 7283819 7391403 7448178
5932G448178L79804k98142K68311K89225l09724k54456k31657R366L0783K4179
5922G355867n7515r0413o6364k3290k05955J22261M6624J15347Q0759k51829j98167
5911F827325J74007j54135j6047k59441l00691m3975k16012k5639m30447p4012
5901E480933q3107k56503j20677L9908k27516p2427L01290k72410Q7113K99413
5891E176017l01585Q4157k85065J42268j49478k62134o1954J50831k45993J06619
5881D353683j54586K5268k69907M42267m91816J00052k04560J65717L40841m95791
5871C811168j1221j94952L12053m3246o0663J92670n1436N3651L82206Q4768n0403
5860D424595k28164p1151K75399n57425O01606K2263k3250J32239j13163M7376
$$ plain form
5932 7448178 7827982 7529840 7798151 8087376 7777652 7523196 7291539 7300905 7331688 7355867
5922 7355867 7298352 7207939 7141575 7118285 6912330 7034591 7081215 7196562 7277321 7025492 6827325
5911 6827325 7001332 6847197 6831150 6571709 6271018 6227043 6011031 5985392 5554945 5480933
5901 5480933 5397826 5141323 5020646 5060554 4833038 4760611 5061901 4789491 4876604 5176017
5891 5176017 4874432 4958589 4673524 4815792 4666314 4404180 4342226 4493057 4247064 4353683
5881 4353683 4199097 4224365 3954458 4396725 3904909 4004961 3800401 3966118 4306959 3811168
5871 3811168 3799947 3604995 3917048 3873802 3813139 4005809 3954373 4008024 4390230 4474998 4424595
5860 4424595 4196431 4125280 4400679 3843254 4444860 4467123 4443873 4576112 4462949 4510325
5850D510325P5896j78400j40589J04607R8492J57190r6721r5430J15892j02535
5840D448727k13616L3629K2414l12696L69428m8342j16618N82335j24889j16867
5830D523505r1059J26457k10101O0312J92569Q212J59685j47409j119J07587L00734
5819E029373n11874j45391J05290N9466O7239n3351R0029j68901J27332p8653
5809D520559j17037M07771j4151p8119J77162M2178j99182J03721k97142M57549
5799E003309k56674l4758K23249J08611M5768k68630K45398R495L9430k52426
5789D862772M80508K01550M08007M9254l99537m0353K3050J73196J9838K16478
5779E994763O1009j16471L09337k49742n3630L99119k64188J66383j27272J19511
$$ plain form
5850 4510325 4586221 4407821 4267232 4371839 4470331 4627521 4530800 4435370 4551262 4448727
5840 4448727 4235111 4268740 4291154 3978458 4347886 4299544 4182926 4765261 4640372 4523505
5830 4523505 4432446 4558903 4348802 4409114 4601683 4609895 4769580 4622171 4621052 4728639 5029373
5819 5029373 4517499 4372108 4477398 4536864 4604103 4550752 4640781 4471880 4599212 4520559
5809 4520559 4403522 4811293 4797142 4719023 4896185 4938363 4739181 4842902 4545760 5003309
5799 5003309 4746635 4711877 4935126 5043737 5089505 4820875 5066273 5075768 5115198 4862772
5789 4862772 5343280 5544830 5952837 6002091 5602554 5562201 5585251 5758447 5778285 5994763
5779 5994763 6055772 5939301 6248638 5998896 5945266 6344385 6080197 6246580 6119308 6238819
5769F238819J69394K52445L5138k25250K47262Q272K37687J02846O8069q3100
5759G051582o1045J99467N6367J95543q9827Q091j14349M6047M32939j64399M00376
5748G960792j52599j82783K25024n8579R4557K2262J56761K13564m4977L63592
5738H597614k12368L3494K19660K29170J59407J37129J06823N4105K98553J85561
5728I809148o6771J75717O8801m3553R6522P12202j0598R2829K5897M9433Q1419
5717A0991046J15829J76299K36342K05994O4157j66003K85343O8309K88964n2185
5707A2214095L72452p4975L71262Q8139K07602O57563j17119L29437k57394L92799
5697A4183861Q5545J67780L95007K49942K87537L05997L64632J28296L20210J28191
$$ plain form
5769 6238819 6408213 6660658 6695796 6470546 6717808 6726080 6963767 7066613 7134682 7051582
5759 7051582 6990537 7190004 7246371 7441914 7352087 7360178 7245829 7291876 7724815 7560416 7960792
5748 7960792 7808193 7625410 7850434 7791855 7886412 7908674 8065435 8278999 8234022 8597614
5738 8597614 8385246 8418740 8638400 8867570 9026977 9164106 9270929 9325034 9623587 9809148
5728 9809148 9742377 9918094 9986895 9943342 10039864 10752066 10741468 10834297 10860194 10909627 10991046
5717 10991046 11106875 11283174 11519516 11725510 11789667 11623664 11909007 11977316 12266280 12214095
5707 12214095 12586547 12511572 12882834 12970973 13178575 13836138 13719019 14048456 13791062 14183861
5697 14183861 14269406 14437186 14832193 15082135 15369672 15675669 16040301 16168597 16488807 16616998
5687A6616998O067K70122M27504K80374L19155J84801L22067Q07863l78129O93058
5677A9549880P6746M53279L22782J84865N38944N92021J91719M65108N33813L62503
5667B3271660L52376O35615M68724M17645P32758L76100N75482L48576P72951
5658B7951887N68185M91541O28497O08152Q17898N34287J080979M08433R88852
5649C4078711R34941P50138R87232R26942Q28709R95405J102055J304822R09367
5640D2818322J116461J197174J220013J154934J521313J299219J589146J736095
5632E3652677J824663J333931J895092J787965J892348K368046J964001K598196
5624F9316919K092064K562527K824179K823630L041531K967445L603509L291674
$$ plain form
5687 16616998 16623065 16893187 17320691 17601065 17920220 18105021 18427088 19234951 18856822 19549880
5677 19549880 19626626 20079905 20402687 20587552 21126496 21718517 21910236 22375344 22909157 23271660
5667 23271660 23624036 24259651 24728375 25146020 25878778 26254878 26830360 27178936 27951887
5658 27951887 28520072 29011613 29640110 30248262 31066160 31600447 32681426 33089859 34078711
5649 34078711 35013652 35763790 36751022 37677964 38506673 39502078 40604133 41908955 42818322
5640 42818322 43934783 45131957 46351970 47506904 49028217 50327436 51916582 53652677
5632 53652677 55477340 56811271 58706363 60494328 62386676 64754722 66718723 69316919
5624 69316919 71408983 73971510 76795689 79619319 82660850 85628295 89231804 92523478
5616I2523478M016406M038565M492216M908009M519192N239373N910426O173320
5608A31820985O488767P377672P668556Q239175Q725800R797663J0440073J1259917
5600B01818608J1953265J3126495J3551357J4151824J5561888J5027785J5729201
5593C00920423J5771240J5483091J3850962J3304671J1392753Q847068O789725
5586C86359933L635050O88690k102908m955683p579931r432309j1257226j2812150
5578C42543466j3658858j4251772j4440214j4483460j4185477j3801570j3165832
5571B44556283j2497714j1763354j1092679j0694698r100782r389677q119272
5564A71898107p988391p316463o456852o081122n693546n067833m712427m369252
$$ plain form
5616 92523478 96539884 100578449 105070665 109978674 114497866 119737239 125647665 131820985
5608 131820985 138309752 145687424 153355980 161595155 170320955 180118618 190558691 201818608
5600 201818608 213771873 226898368 240449725 254601549 270163437 285191222 300920423
5593 300920423 316691663 332174754 346025716 359330387 370723140 379570208 386359933
5586 386359933 389994983 390683673 388580765 383625082 376045151 366612842 355355616 342543466
5578 342543466 328884608 314632836 300192622 285709162 271523685 257722115 244556283
5571 244556283 232058569 220295215 209202536 198507838 189407056 180017379 171898107
5564 171898107 163909716 156593253 150136401 144055279 138361733 133293900 128581473 124212221
5556A24212221m297442l968511l599899l354826l673449k391481l194646k680187
5548I7051780k161630k558218k524865j683527j819619j718290j759278j388221
5540H1438132j502637j675994r49328j667321q53934j506957p52459j021754q25411
5531G0682337o70961j042741j80701m36586r5614P720j53908K42840Q0245M76632
5521F8909263J17191M84862N53732Q32449J252323R85835J523251J596132J480336
5512G7735374J779650J568868J832603J360592J156940Q43408O85197N17008N70115
5503H8049755J98667Q34543K40824P78250M10263P4470K38646q8753k48846r92989
5493H9494830n64058j126397r37051j162359l48248l31687L06459J295195J875783
$$ plain form
5556 124212221 119914779 115946268 112346369 108991543 105318094 102926613 99731967 97051780
5548 97051780 94890150 92331932 89807067 88123540 86303921 84585631 82826353 81438132
5540 81438132 79935495 78259501 77310173 75642852 74788918 73281961 72529502 71507748 70682337
5531 70682337 70011376 68968635 68787934 68351348 68255734 68263454 68109546 68352386 68432631 68909263
5521 68909263 69026454 69511316 70065048 70897497 72149820 73135655 74658906 76255038 77735374
5512 77735374 79515024 81083892 82916495 84277087 85434027 86277435 86962632 87479640 88049755
5503 88049755 88248422 89082965 89323789 90102039 90512302 90586772 90825418 90736665 90487819 89494830
5493 89494830 88930772 87804375 86867324 85704965 85356717 85025030 85331489 86626684 88502467
5484H8502467K135200K577465L011842L271480L159584L541504L369033K367882
5476A11936457K880336K315455J993721J812582J919722J522708J472012R75110
5468A26828103P05806p9860k41050j742176j995944k681065l434241l596739l925521
5459A09837313l842228m049082l329487k999266k708503j541991j033513o59076
5451H9674167P0682M55672N55317Q56993O07428O36528O05620Q935L97347M36753
5441I4305442j15964O49388p5388J98683j75149j32172n33999j354475j654294
5432I1112072k226141k481701k897704k945300k654967l009863k738335k655378
5424F9502683j675848j707049j188310o45910m89333q8767P9608J7205J37679
$$ plain form
5484 88502467 90637667 93215132 96226974 99498454 102658038 106199542 109568575 111936457
5476 111936457 114816793 117132248 119125969 120938551 122858273 124380981 125852993 126828103
5468 126828103 127533909 127454049 127212999 125470823 123474879 120793814 117359573 113762834 109837313
5459 109837313 105995085 101946003 98616516 95617250 92908747 91366756 90333243 89674167
5451 89674167 89744849 90200521 90755838 91612831 92220259 92856787 93462407 93471342 93868689 94305442
5441 94305442 94189478 94838866 94763478 94962161 94787012 94654840 94120841 92766366 91112072
5432 91112072 88885931 86404230 83506526 80561226 77906259 74896396 72158061 69502683
5424 69502683 67826835 66119786 64931476 64285566 63796233 63707466 63787074 63804279 63941958
5415F3941958O46325O74104K49183P36777P86532R42161Q31900R74188O99685
5406G0482813J016090J002674Q88260J320739J128482O55676J097140J150160
5398G8742034K81637O53442O30402K54121O34918K69604K652K69397k17435l67764
5388H1153008o09975o63820p99636j108671j294140j450418j388581j865115j415696
5379G0556956j749873j505328j483117j599560j191565r25821j320744p78955
5371F0001993p07317n68657p55984K0944n84820L2568N9712k20560N01781L05407
5361E8085067L48938J54788l19015K62987l19963K22065m74589J46877l68875
5352E7738280p1827q67139m74845j263862j057327j531400j474566j473019j229578
$$ plain form
5415 63941958 64588283 65262387 65511570 66248347 67034879 67977040 68808940 69783128 70482813
5406 70482813 71498903 72501577 73389837 74710576 75839058 76494734 77591874 78742034
5398 78742034 79023671 79677113 80307515 80561636 81196554 81466158 81468810 81738207 81520772 81153008
5388 81153008 80543033 79879213 79079577 77970906 76676766 75226348 73837767 71972652 70556956
5379 70556956 68807083 67301755 65818638 64219078 63027513 62101692 60780948 60001993
5371 60001993 59294676 58726019 57970035 57990979 57406159 57438727 57498439 57277879 57779660 58085067
5361 58085067 58434005 58588793 58269778 58532765 58212802 58434867 57960278 58107155 57738280
5352 57738280 57666453 56799314 56324469 55060607 54003280 52471880 50997314 49524295 48294717
5343D8294717j029661j023488J42558j80297N98881J407256K381749K063852K756231
5334E5411798K871580L046393K846400K698615K924221K237140K152031K319317
5326G6507495J913528J046538J271042L71170m4371r41439j176980k072402k248474
5317G4626107l144048l051503l219402k764101k876678k373063j797181j711569
5309E3688562k34514k27553N05020R35451J517027J338891J672913J575808J423621
5300F2195226J290869J029836J280664Q79407N93767K45624L12693n76776m75669
5291F6775641j483874j672186k189912k718647k793298k762622k643707k942649
5283D7568746k323037k366067j286688j876909r21961o60121r91801j04513k09901
$$ plain form
5343 48294717 47265056 46241568 46384126 46203829 46802710 48209966 50591715 52655567 55411798
5334 55411798 58283378 61329771 64176171 66874786 69799007 72036147 74188178 76507495
5326 76507495 78421023 79467561 80738603 81109773 81065402 80123963 78946983 76874581 74626107
5317 74626107 71482059 68430556 65211154 62447053 59570375 57197312 55400131 53688562
5309 53688562 53454048 53226495 53731515 54666966 56183993 57522884 59195797 60771605 62195226
5300 62195226 63486095 64515931 65796595 66676002 67269769 67515393 67828086 67251310 66775641
5291 66775641 65291767 63619581 61429669 58711022 55917724 53155102 50511395 47568746
5283 47568746 45245709 42879642 41592954 39716045 38794084 38133963 37142162 37037649 36827748
5274C6827748k10507j11649j06444k19272o58978k46512n45369o91932o23613
5265C3413472l05950l86385l40055k87442j77739k75491o66704q61686p65467
5256B9346553q74479q87681o78389n99173j066199m28583k20136n31370m21255
5247B3639288j53385j58663k68365n61263m19483j88695o46223j98493k06821
5238B0837897k75051o39012l15236m28964k86209n46199k37762p29547k16789
5229A7163128p68041n58332n28481m21394j67892o52230o29684j73756q34124
5220A2429194j87627n35955o28706J6905n41334k17468l94373m7428m88581m0756
5210I363871m84532l4938l16411J07304j54393N3664j44792l81462N2313Q8526
$$ plain form
5274 36827748 36617241 36505592 36399148 36179876 35520898 35274386 34729017 34037085 33413472
5265 33413472 33107522 32721137 32381082 32093640 31915901 31640410 30973706 30112020 29346553
5256 29346553 28472074 27584393 26906004 26306831 25240632 24812049 24591913 24060543 23639288
5247 23639288 23485903 23327240 23058875 22497612 22078129 21889434 21243211 21044718 20837897
5238 20837897 20562846 19923834 19608598 19179634 18893425 18347226 18109464 17379917 17163128
5229 17163128 16395087 15836755 15308274 14886880 14718988 14066758 13437074 13263318 12429194
5220 12429194 12241567 11705612 11076906 11093811 10552477 10335009 9940636 9893208 9404627 9363871
5210 9363871 8879339 8844401 8527990 8635294 8480901 8534565 8389773 8008311 8060624 8149150
5200H149150k08871p9087j07424J59160j93564n5643K56001m97445J78259J008
5190G601544j47608J94138k27342M3709M4473L7762o4360o7923j08756K70390
5180G576027Q4016M69346l29589J8234M48741n91140K40420K19335J51794j55018
5170H132166L26418l39122M19781k08555J63170K2616M5296J68908R4748j69725
5160H655701R4527N53704n0764J69475l07363M26674J32211L1788J27729O71071
5150A0504753J43505L49707K00974J27293M15439M01332O65354L85725N36930
5141A3731012Q13737O67251N82621Q84960O21977J050176N96141J413904J039388
5132B1401167J545097J400947J521852J588417J415630J955141J368400J680516
$$ plain form
5200 8149150 7940279 7861192 7753768 7912928 7719364 7663721 7919722 7422277 7600536 7601544
5190 7601544 7453936 7648074 7420732 7464441 7508914 7546676 7482316 7414393 7305637 7576027
5180 7576027 7660043 8129389 7799800 7818034 8266775 7675635 7916055 8135390 8287184 8132166
5170 8132166 8458584 8119462 8539243 8330688 8493858 8516474 8561770 8730678 8825426 8655701
5160 8655701 8750228 9303932 9253168 9422643 9115280 9541954 9674165 9705953 9833682 10504753
5150 10504753 10648258 10997965 11198939 11326232 11741671 12143003 12808357 13194082 13731012
5141 13731012 14544749 15212000 15794621 16679581 17301558 18351734 18947875 20361779 21401167
5132 21401167 22946264 24347211 25869063 27457480 28873110 30828251 32196651 33877167
5124C3877167J762215J800202J499528J890094J356684J598418J431537J663406
5116D6879251J215198J580917J008092J767271J175615J783166J552286J422754
5108E8384550J685251J343071J503896J249544J424887J157963P31323P88893
5100F8269378Q27329o4086J83687J18516p14542q10086r29124r61452j662523
5091F4257097j920995j865032k030498k003688j880711k232040j495153j794031
5083D9034949j534910j156447j559831j229901j119291j135788j007395j117617
5075C9173769p25019r90923j449748p17232j561088j221014j538831j337452j573814
5066B8058648j749917j619583j604897j802360j204499j540154j329815j445799
$$ plain form
5124 33877167 35639382 37439584 38939112 40829206 42185890 43784308 45215845 46879251
5116 46879251 48094449 49675366 50683458 52450729 53626344 55409510 56961796 58384550
5108 58384550 60069801 61412872 62916768 64166312 65591199 66749162 67480485 68269378
5100 68269378 69096707 69032621 69216308 69334824 68620282 67810196 66881072 65919620 64257097
5091 64257097 62336102 60471070 58440572 56436884 54556173 52324133 50828980 49034949
5083 49034949 47500039 46343592 44783761 43553860 42434569 41298781 40291386 39173769
5075 39173769 38448750 37457827 36008079 35290847 33729759 32508745 30969914 29632462 28058648
5066 28058648 26308731 24689148 23084251 21281891 20077392 18537238 17207423 15761624
5058A5761624p49485j054147q64588r82485k62780q88642m14843m23160m91800
5049I629694p38263P3004k42435m86212j71734n6022k77061j09488j0942o37935
5039F972606J90054k19143j34864k13053J08314k30930n9324j59519m34373J49628
5029E969396m72188K80099j06972l09584l40626K16639k60844L6859n4287m6595
5019D911897j15612j27635K96509l60132k55623K33707j29486K08633n06708K03983
5009D359533j56734J78739j68807j03322J12009k62059o0774N7642K44146k12808
4999C987565j8019M4126j74001M4666P4969k71031K0002P2288P0340l30171K54293
4988C775027Q242J0279K66949k12097R0176n4005K7022k4266J962n4719J74162
$$ plain form
5058 15761624 15012139 13957992 13093404 12110919 11848139 10959497 10544654 10121494 9629694
5049 9629694 8891431 8964435 8722000 8235788 8064054 8008032 7730971 7621483 7610541 6972606
5039 6972606 7162660 6943517 6808653 6595600 6703914 6472984 6413660 6254141 5819768 5969396
5029 5969396 5497208 5777307 5670335 5360751 5020125 5236764 4975920 5012779 4958492 4911897
5019 4911897 4796285 4668650 4965159 4605027 4349404 4583111 4453625 4662258 4155550 4359533
5009 4359533 4202799 4381538 4212731 4109409 4221418 3959359 3898585 3956227 4200373 3987565
4999 3987565 3969546 4013672 3839671 3884337 3959306 3688275 3708277 3780565 3850905 3520734 3775027
4988 3775027 3783269 3793548 4060497 3848400 3938576 3884571 3911593 3887327 3889289 3834570 4008732
4977D008732j35116J23683M1468q4785m46193J33123p1425K10209R8414l58993
4967C519117L68111j71912J92134k97623R2709l1183K85438m74113K69451P7519
4957C829648j46390M1612Q9908K0034L6320L58643k0956J59072k10191K76967
4947D434667J63888j79602M24933k11254K65871O7731j648L32933K15074J18643
4937E631236K70122L60140M36559J86457R46675Q11398J157204J295227J129064
4928A2224082P05017K70054M29590L36881J98859M48912L73091Q48745M21939
4919A6257170O39913M39266Q7640k2052k74298o14034p94489N1708Q7913N7877
4909A5916614L53086K94774M30410J77245K70018P51729Q5151N65211O33138P61600
$$ plain form
4977 4008732 3873616 3997299 4038767 3953982 3507789 3640912 3569487 3779696 3878110 3519117
4967 3519117 3887228 3715316 3907450 3609827 3702536 3671353 3956791 3482678 3752129 3829648
4957 3829648 3683258 3724870 3814778 3834812 3871132 4229775 4208819 4367891 4157700 4434667
4947 4434667 4598555 4418953 4843886 4632632 4898503 4966234 4964586 5297519 5512593 5631236
4937 5631236 5901358 6261498 6698057 6884514 7831189 8642587 9799791 11095018 12224082
4928 12224082 12929099 13199153 13628743 13965624 14164483 14613395 14986486 15835231 16257170
4919 16257170 16897083 17336349 17423989 17401937 17127639 16513605 15719116 15770824 15858737 15916614
4909 15916614 16269700 16564474 16994884 17172129 17442147 18193876 18279027 18844238 19477376 20238976
4899B0238976M00382K97125K68926K94402l95593K11173n60138m06738k11942
4890B0136573J3323K54630J59816J207746N59146J903019J308205J948141K037050
4881B9527649J991049K378660K893109K215606J788208J627320P32368J052474
4873D4206443J406336J327870J580999J087720O70730O74707J36406l4294j017748
4864E0039169j272688j767097k006035j932937j520421j049283l93059J69996
4856D0267645O16220J232981J495800J840067K598407K786029K451817K505187
4848E5794153K552926J735989J608163J339616R54162J468530J375870J252370
4840F8081779P81388N70455q19362m39284j515028j730327k563669l513413l487209
$$ plain form
4899 20238976 20639358 20936483 21205409 21499811 21104218 21315391 20755253 20348515 20136573
4890 20136573 20149896 20404526 20564342 21772088 22331234 24234253 25542458 27490599 29527649
4881 29527649 31518698 33897358 36790467 39006073 40794281 42421601 43153969 44206443
4873 44206443 45612779 46940649 48521648 49609368 50280098 50954805 51091211 51056917 50039169
4864 50039169 48766481 46999384 44993349 43060412 41539991 40490708 40097649 40267645
4856 40267645 40883865 42116846 43612646 45452713 48051120 50837149 53288966 55794153
4848 55794153 58347079 60083068 61691231 63030847 63985009 65453539 66829409 68081779
4840 68081779 68863167 69433622 68614260 68174976 66659948 64929621 62365952 58852539 55365330
4831E5365330k988608l271650k193785j428278j296103p33077K09717J188881
4823D4852427O06811J187541O74826J045080P37462J210406N64671L19068M57233
4814E1655525M89748Q46766P75168L94740N9292K1968r51098r08127k208602k427551
4804D7747829k561730k777942k818933k592248k137257j844554j208544j439855
4796C0366766o51902j061898k38450o42027m38321m61945o41598K08461j54684
4787B6284402l62476K67474k08639J11406q3693k2726j29269k40693p44731n34747
4777B4336308p38245o24117j106122j200786j044331j038667j123568r01299m02787
4768A6156386j011660n61555n46743n91368l09822o99842l32606m86494j43872
$$ plain form
4831 55365330 52376722 49105072 46911287 45483009 44186906 43453829 43663546 44852427
4823 44852427 45459238 46646779 47321605 48366685 49104147 50314553 50879224 51198292 51655525
4814 51655525 52145273 52992039 53767207 54161947 54221239 54243207 53292109 52383982 50175380 47747829
4804 47747829 45186099 42408157 39589224 36996976 34859719 33015165 31806621 30366766
4796 30366766 29714864 28652966 28414516 27772489 27334168 26872223 26230625 26439086 26284402
4787 26284402 25921926 26189400 25980761 26092167 26008474 25985748 25856479 25615786 24871055 24336308
4777 24336308 23598063 22973946 21867824 20667038 19622707 18584040 17460472 16559173 16156386
4768 16156386 15144726 14583171 14036428 13445060 13135238 12435396 12102790 11616296 11472424
4759A1472424n76671J99763k62033l98013K39269n99420J3969o9881l20820M2225
4749I740812m02109J04194l38029j33419j23000n08160r9408r1142n9911j32912
4739G956916k50352K53461l08453l15162K32399l91994K14936r0721M5394m46972
4729F899452J90942o270J64818j29869P878q1699j20272P7507K28891j01540J33631
4718G263469K17339J8542L20726j27216K93143l32155K62841J32368N53644m4342
4708H558359J86195O08033N2957R4469K86045L79029K45595M83116M88831M71190
4698A1853819M42174O60831L56848O93237P13907R14056L28351J058850L45568
4689A7367641P17274P89286R17191P20914P57115O25760R52568Q55297P47652
$$ plain form
4759 11472424 10895753 11095516 10833483 10435470 10674739 10075319 10089288 10019407 9698587 9740812
4749 9740812 9338703 9442897 9104868 8971449 8848449 8340289 8240881 8149739 8089828 7956916
4739 7956916 7706564 7960025 7651572 7336410 7568809 7176815 7391751 7301030 7346424 6899452
4729 6899452 7090394 7084124 7248942 7119073 7126951 7045252 6924980 7002487 7231378 7129838 7263469
4718 7263469 7480808 7499350 7820076 7692860 7986003 7653848 7916689 8049057 8602701 8558359
4708 8558359 8744554 9352587 9405544 9500013 9786058 10165087 10410682 10893798 11382629 11853819
4698 11853819 12295993 12956824 13313672 14006909 14720816 15634872 15963223 17022073 17367641
4689 17367641 18084915 18874201 19791392 20512306 21269421 21895181 22847749 23703046 24450698
4680B4450698Q62006M31810R83702M18046R19806J045154Q03971J305875Q05581
4671C2026649J416725J395344J271314J404106K188144J747295K141616K690560
4663D6281753K552969L038590L008849K803825L339426K846773L502493L048500
4655G0423178L344960L255156L914042L893688M526619M638706M698426M703559
4647A03398334L895443L069681K156315K462279K981687L997390L723659M362633
4639A30047421M470815N236700N691410N231240M719149L309327K153910J329453
4631A62189425Q26498R51998J085217J377057J524769J446444J218840J823574
4623A72443822J132160L19083j387105k886633m044788m626428m540066m261592
$$ plain form
4680 24450698 25312704 25744514 26728216 27146262 28066068 29111222 29915193 31221068 32026649
4671 32026649 33443374 34838718 36110032 37514138 39702282 41449577 43591193 46281753
4663 46281753 48834722 51873312 54882161 57685986 61025412 63872185 67374678 70423178
4655 70423178 73768138 77023294 80937336 84831024 89357643 93996349 98694775 103398334
4647 103398334 107293777 110363458 112519773 114982052 117963739 121961129 125684788 130047421
4639 130047421 134518236 139754936 145446346 150677586 155396735 158706062 160859972 162189425
4631 162189425 163015923 163967921 165053138 166430195 167954964 169401408 170620248 172443822
4623 172443822 173575982 173895065 172507960 169621327 165576539 160950111 156410045 152148453
4615A52148453l644081l665232l314200l334583k416384k124042k422031l222137
4607A28005763l891757m449844m569889m593188m052648l395005l726537l424201
4599I5902694l203952l147976l163117l589496l196903l288574l399628l592280
4591F9320768l647970l052921l209377k518791k858336k243518k243632j968724
4583D7577499k131861j984349j166710j563459p67146j735998p56864j081778
4575C6389334q08253j226491n74906j341016r18745p30031j117150p99918r49327
4566B7923497q02210j077247o41322j308582o72938j039218n30403r02324p09109
4557B0240144m48807j002908n34421o54183m26032o81520n06875m79863n03456
$$ plain form
4615 152148453 148504372 144839140 141524940 138190357 135773973 133649931 131227900 128005763
4607 128005763 124114006 119664162 115094273 110501085 106448437 103053432 99326895 95902694
4599 95902694 92698742 89550766 86387649 82798153 79601250 76312676 72913048 69320768
4591 69320768 65672798 62619877 59410500 56891709 54033373 51789855 49546223 47577499
4583 47577499 45445638 43461289 42294579 40731120 39963974 38227976 37471112 36389334
4575 36389334 35581081 34354590 33779684 32438668 31519923 30789892 29672742 28872824 27923497
4566 27923497 27121287 26044040 25402718 24094136 23421198 22381980 21851577 20949253 20240144
4557 20240144 19791337 18788429 18254008 17599825 17173793 16492273 15985398 15505535 15002079
4548A5002079m37711n34718l72754o55073m62738l10570k36740m23549m32726
4539A1135500l87714j66307n38247l25744j05346j91966k98255j13090o49977
4530H358854o3774l36721q844j35585k68826k15528j66890k54223r312M0937j24736
4519F815352J1249o40785K02779j88639k38651M4755l87261Q0485j31104j10589
4509E457591p3744M9547J8497j93411j59950j90449Q5980k37058M2331j71778
4499D627556J24476j28235J0307j53726j33577J96515n49845N76388j99797l98896
4489C971166R2545M801l22817K88966j9926l69235K00655N6644O7630j69463k23447
4478C577519q5432j83439J46977N5693L6046j4814J66822k60832K56288j52576
$$ plain form
4548 15002079 14564368 14029650 13656896 13001823 12539085 12228515 11991775 11568226 11135500
4539 11135500 10747786 10581479 10043232 9717488 9612142 9420176 9121921 9008831 8358854
4530 8358854 8295080 7958359 7949515 7813930 7545104 7329576 7162686 6908463 6899151 6940088 6815352
4519 6815352 6826601 6185816 6388595 6199956 5961305 6006060 5618799 5699284 5568180 5457591
4509 5457591 5383847 5433394 5451891 5258480 5098530 4908081 4994061 4757003 4799334 4627556
4499 4627556 4752032 4623797 4634104 4480378 4346801 4543316 3993471 4569859 4370062 3971166
4489 3971166 4063711 4068512 3745695 4034661 4014735 3645500 3846155 3902799 3970429 3800966 3577519
4478 3577519 3492087 3308648 3455625 3511318 3547364 3532550 3699372 3438540 3694828 3542252
4468C542252J22690K13432j82086J49762J40319J56117k44564K17683m54929K32221
4458C892897o3469K38811k01769K66616J21999j34121K79370m04883J37778l92352
4448C740877J37845k89607j11349N8403n2017J13473j09021j20063j45425k05361
4438C017755J98414o9728M3935k49741O2J3496J99526j25529K12350m22667J42054
4427B959927L7460n1103k7168j64392J13608j99334K23011n6335J87446j88029
4417B835091q7771J23080j91145J27632q5926q658L5714N8830r6634l1209j67302
4406B511702K67948n0949J46496P902m01589N47624j42199p0661o9153J05512
4396B852633j80063J8510o8242K71276k91047K46482o6293j11581Q5237K72542
$$ plain form
4468 3542252 3664942 3878374 3696288 3846050 3986369 4142486 3897922 4115605 3660676 3892897
4458 3892897 3829428 4068239 3866470 4133086 4255085 4120964 4400334 3995451 4133229 3740877
4448 3740877 3878722 3589115 3477766 3536169 3484152 3597625 3488604 3368541 3223116 3017755
4438 3017755 3216169 3146441 3190376 2940635 2940697 2954193 3153719 3028190 3240540 2817873 2959927
4427 2959927 2997387 2946284 2919116 2754724 2868332 2668998 2892009 2835674 3023120 2835091
4417 2835091 2747320 2870400 2679255 2806887 2720961 2712303 2748017 2806847 2710213 2679004 2511702
4406 2511702 2779650 2728701 2875197 2883099 2481510 3029134 2886935 2816274 2747121 2852633
4396 2852633 2672570 2691080 2622838 2894114 2603067 2849549 2783256 2671675 2756912 3029454
4386C029454j66447j0699o8652l21664L07411k14229K81100J52650J10016k98007
4376B800933L30619k87185J83902j9507m8812K45397r8967K57470l59311K50522
4366C255061j67349K12376j55536O8738J66512k1630k34914j34479J96411J5314
4356C200504J28953m92409K79193q9659k9032k15831K52246k21127M18247n2735
4346C178350L13512K38031l58778Q4501l15083K65521J34115K86918n9092N9154
4336C827149R2686j61111j67791j4680m0556o1202l00994K4312J33972j42814
4326C188971j41046r672o110m2434O3384J60872k02380J82925L82455o17802J9881
4315B979044K78711J38200P3368j78035L0042J34514J20515N849J67496q0897
$$ plain form
4386 3029454 2863007 2852308 2783656 2461992 2769403 2555174 2836274 2988924 3098940 2800933
4376 2800933 3131552 2844367 3028269 3008762 2959950 3205347 3106380 3363850 3004539 3255061
4366 3255061 3087712 3300088 3144552 3213290 3379802 3358172 3123258 2988779 3185190 3200504
4356 3200504 3329457 2837048 3116241 3026582 2997550 2781719 3033965 2812838 3231085 3178350
4346 3178350 3491862 3729893 3371115 3455616 3140533 3406054 3540169 3827087 3767995 3827149
4336 3827149 3919835 3758724 3590933 3576253 3535697 3474495 3173501 3197813 3331785 3188971
4326 3188971 3047925 3038253 3032143 2989709 3053093 3213965 3011585 3194510 3576965 2959163 2979044
4315 2979044 3257755 3395955 3469323 3291288 3321330 3455844 3576359 3582208 3749704 3668807
4305C668807K25483l19802L12299l20188m51175N41038k25362L18322l30084R4344
4295C513682j5672N1217j08186J71578K9348o9300J04583j6256j20975J47532
4285C687551L20900k07018j2161J57725J95293O3151J7733J13741O18413k26652
4275D728676O9063K55699O8229N24518R1346K56250P1514M40485n7240M81707
4265F930247N48665M40512N35564R44316J010689J477088Q88744r2037j36850
4256A2546938O02249L63359P16860N30869N83604J15543M52097Q10930L87702
4247A7110151n27202n02666n52720j117516p57675p25330m48658q6870k44406
4238A2147108O46556K83654Q07887O99569J614162K323942K638824J848627N73713
$$ plain form
4305 3668807 3894290 3574488 3886787 3566599 3115424 3656462 3431100 3749422 3419338 3513682
4295 3513682 3498010 3549227 3441041 3612619 3641967 3572667 3677250 3660994 3540019 3687551
4285 3687551 4008451 3801433 3789272 3946997 4142290 4205441 4223174 4336915 4955328 4728676
4275 4728676 4797739 5053438 5121667 5646185 5737531 5993781 6065295 6505780 6448540 6930247
4265 6930247 7478912 7919424 8454988 9399304 10409993 11887081 12775825 12683788 12546938
4256 12546938 13149187 13512546 14229406 14760275 15343879 15459422 15911519 16722449 17110151
4247 17110151 16582949 16080283 15527563 14410047 13652372 12927042 12478384 12391514 12147108
4238 12147108 12793664 13077318 13885205 14584774 16198936 18522878 21161702 23010329 23584042
4229B3584042n66390J65433Q30214R30413Q85275Q55738N07348N19158J314227
4220B9025458N66430o74143j347549j857499k762998k292793j500492j075629
4212A8080785j093121n37012j41080P520j20849N13744N46692J514500J292750
4203B0063929R25695N56288k0952P85623K31500J455259O02005J373511M82313
4194B6455171J062573J050372J511972Q04213L56553R47842L17265J061883J536093
4185C5103937K581165L070864M054938K312782R62241L54236P4696Q17304J068114
4176E0400277J291271Q90416N08199J06096P09096j02501o79886k564280l854667
4167D6704021m391788m848040m381035k899352k983967k438745j882473j767183
$$ plain form
4229 23584042 23017652 23183085 24013299 24943712 25828987 26684725 27192073 27711231 29025458
4220 29025458 29591888 28917745 27570196 25712697 22949699 20656906 19156414 18080785
4212 18080785 16987664 16450652 16309572 16317092 16196243 16709987 17256679 18771179 20063929
4203 20063929 20989624 21545912 21524960 22310583 22542083 23997342 24599347 25972858 26455171
4194 26455171 27517744 28568116 30080088 30884301 31240854 32188696 32505961 33567844 35103937
4185 35103937 37685102 40755966 44810904 47123686 48085927 48440163 48514859 49332163 50400277
4176 50400277 51691548 52581964 53090163 53196259 53905355 53802854 53122968 50558688 46704021
4167 46704021 42312233 37464193 33083158 30183806 27199839 24761094 22878621 21111438
4159B1111438j408503j045181o23960q26410q44957n15419o02364n75348j81008
4150A4488288n7803l93569k60748K79718j22960P8492P08442k273n9220J85115
4140A4843482m05118j10597M2044j80902Q3220j4057j52435K89218k72278j04190
4130A4018387l71591o18845n86448l70531p12687q1811j61896l11128o6107o4
4120A0737279J83357K71999L65603P56859R21880O71748K74665N3859m0001k35794
4110A3961454N72332J17184q4226J70791R1345L58649L6824o12168q51869m95153
4100A3265163j322918j032082j004969k83703r24309k63184k94029l08026J07431
4091G939374M00748j86770J66449K73364J57961j85973J40818J39665n32457M82935
$$ plain form
4159 21111438 19702935 18657754 18033794 17207384 16362427 15847008 15244644 14669296 14488288
4150 14488288 14430485 14036916 13776168 14055886 13932926 14011418 14719860 14717587 14658367 14843482
4140 14843482 14438364 14327767 14369811 14188909 14272129 14258072 14105637 14394855 14122577 14018387
4130 14018387 13646796 13027951 12441503 12070972 11358285 11276474 11114578 10803450 10737343 10737279
4120 10737279 10920636 11192635 11558238 12315097 13236977 13908725 14183390 14237249 14197248 13961454
4110 13961454 14533786 14650970 14566744 14737535 14828880 15187529 15224353 14612185 13760316 13265163
4100 13265163 11942245 10910163 9905194 9621491 8697182 8433998 8139969 7831943 7939374
4091 7939374 8340122 8153352 8319801 8593165 8751126 8565153 8705971 8845636 8313179 8796114
4081H796114k11959O0433k82906R7773J43054J62175k30725m50815n28549m37082
4071G117513l68400o22158l74754j82656k01492k73801P7270k15625j54223j60720
4061D640954j05527j0364Q1753j82152k47798K8174l78103r9271j43645k0218
4051C563803k16195o7494K55097k74046j05952J58407n8051L10623l77945q3105
4041C105142j35221J64399m09119L10906N1631j36338j00417M07654l70243q7078
4031B801316K52895k20911k06407J56858J13083l23831K04483j40136j20172p3107
4021B444071O8252J6631l19229O0734L7021l4956n1258l1575r769j02022R6991
4010B174891J9759J26713r1255j03737J87188J2469k75100K76756r6939j41356
$$ plain form
4081 8796114 8584155 8644588 8361682 8459455 8602509 8764684 8533959 8083144 7554595 7117513
4071 7117513 6749113 6126955 5752201 5569545 5368053 5094252 5171522 4955897 4801674 4640954
4061 4640954 4535427 4525063 4606816 4424664 4176866 4205040 3826937 3727666 3584021 3563803
4051 3563803 3347608 3280114 3535211 3261165 3155213 3313620 3255569 3566192 3188247 3105142
4041 3105142 2969921 3134320 2725201 3036107 3087738 2951400 2850983 3258637 2888394 2801316
4031 2801316 3054211 2833300 2626893 2783751 2896834 2573003 2777486 2637350 2517178 2444071
4021 2444071 2512323 2528954 2209725 2270459 2307480 2272524 2221266 2189691 2179922 2077900 2174891
4010 2174891 2194650 2321363 2230108 2126371 2313559 2326028 2050928 2327684 2230745 2089389
4000B089389K81089n28011L74157k85531K88030k22076J41005j84862P6989m4076
3990A986103L3683j72325p569K0323k15334L25095m1224L82759l86392J54819
3980B079938k11270K3860j1871r880J12923O8840K92839l30088L1568M7969J75413
3969B270241J05345j00313j58282L4847N1361L4315J36126j74378j20741K13805
3959B292326l6511J25932j53149J67556l56580Q6256L4602r5816M31955n3507
3949B443064O303L3909k39571K79183j10639N3631L21813n1985k06227J01355
3939B630836J9842O1571j4489J33429J01506j73789J11227j55416J811K33666
3929B950194k45614K05971K18014j57856M19052l16351K23432k18325P7177M00512
$$ plain form
4000 2089389 2370478 1842467 2216624 1931093 2219123 1997047 2138052 1953190 2030179 1986103
3990 1986103 2019786 1847461 1839892 1860215 1644881 1969976 1928752 2311511 1925119 2079938
3980 2079938 1868668 1892528 1880657 1870777 1983700 2052540 2345379 2015291 2046859 2094828 2270241
3969 2270241 2375586 2275273 2116991 2151838 2203199 2237514 2373640 2199262 2078521 2292326
3959 2292326 2255815 2381747 2228598 2396154 2039574 2125830 2160432 2064616 2496571 2443064
3949 2443064 2449367 2483276 2243705 2522888 2412249 2465880 2787693 2735708 2529481 2630836
3939 2630836 2650678 2712249 2697760 2831189 2932695 2758906 2870133 2714717 2716528 2950194
3929 2950194 2704580 2910551 3128565 2970709 3389761 3073410 3296842 3078517 3155694 3556206
3919C556206j8390n1597L71212j29138L4919K42461j58681J17803K91937L9795
3909D296527J15026J8813J90438j9400K28787L3752Q0494K3543r2075J00550L08240
3898E284695j54596M92635j62306R952N24238j24626L62680k2319k04200O81708
3888F687861m6386K23290K79881M42155k2977J11251K21762r0851k57947N38172
3878H086211j72528J68503J23070n2649j78763J18837n39824J78525m45525K81490
3868G567347j45369l26441q8266J14524j7270J80830k8856L17317j81185j29770
3858G262861O1168j14583J57750j97894J30303J29177j92337J36110l38913k02918
3848F830724k30973l55723k2275Q720j40297k57853l65166k9292j99131k85880
$$ plain form
3919 3556206 3537816 3486219 3857431 3728293 3763212 4005673 3846992 3964795 4256732 4296527
3909 4296527 4411553 4430366 4620804 4601404 4830191 4863943 4944437 4967980 4875905 4976455 5284695
3898 5284695 5130099 5622734 5460428 5470380 5994618 5869992 6232672 6210353 6006153 6687861
3888 6687861 6641475 6864765 7144646 7586801 7563824 7675075 7896837 7805986 7548039 8086211
3878 8086211 7913683 8082186 8205256 8152607 7973844 8092681 7552857 7731382 7285857 7567347
3868 7567347 7421978 7095537 7007271 7121795 7104525 7285355 7256499 7573816 7392631 7262861
3858 7262861 7324029 7209446 7367196 7169302 7299605 7428782 7236445 7372555 7033642 6830724
3848 6830724 6599751 6244028 6221753 6230473 6090176 5832323 5467157 5437865 5238734 4952854
3838D952854k6465k88378J10742n2487m12790K47306R5412m07696n750l82223
3828C830525J07344k76913k93959M6140l29460R0518l61090J17801Q8107l84410
3818B634603J7414j21822l53905L32838k53907q7138K61300l41471l0037r5572
3808A962303l03552L91807n8565l59972L93445l48366n5831N6138k32122L82733
3798A828018k81961p8553k30440N02610j82168l79155L05764j10523R7254k70061
3788A200785K79686k57008r8462L00841j75547K16051l19263L37902o58871L30987
3778A157101j50790K06864J69819l10878j05294K11981m70298j9517N05041j58690
3768A035339j24551k2735K11121k02606q223p0966o737m5030j61953J75199j01188
$$ plain form
3838 4952854 4926389 4638011 4748753 4696266 4283476 4530782 4626194 4218498 4212748 3830525
3828 3830525 3937869 3660956 3366997 3413137 3083677 3174195 2813105 2930906 3019013 2634603
3818 2634603 2652017 2530195 2176290 2509128 2255221 2168083 2429383 2087912 2057875 1962303
3808 1962303 1658751 2050558 1991993 1632021 2025466 1677100 1621269 1677407 1445285 1828018
3798 1828018 1546057 1467504 1237064 1739674 1557506 1178351 1484115 1373592 1470846 1200785
3788 1200785 1480471 1223463 1125001 1425842 1250295 1466346 1147083 1484985 826114 1157101
3778 1157101 1006311 1213175 1382994 1072116 966822 1178803 708505 688988 1194029 1035339
3768 1035339 910788 888053 1099174 896568 888345 817379 810642 765612 603659 778858 677670
3757F77670n1315K15133j01953j33256Q4884p0544o3441L26098l87655K12011
3747G07632J32803j51680l5820l22021M75344n71839J59055K26116j87931N6954
3737D88613m0350L1744j08640J88325L6271k01823j3506n1085K9642k27255N33979
3726F65915O1177l54846j47146q4274P9897J69800j91504J6035K60512j94573
3716B80993K498j51417J07242j4728K48368l41949J15574k15955M2533J09493
3706A82652k66558K03921N5049O2958k4529o4802n3243R5121J16871j42939j86330
3695b1829k3384P1032l3095K41558l9674j49802K58761l05141n1648o2269K16712
3684A01221l12044K12573q6497L00117j31262j02478M02859l07753l0267r6406
$$ plain form
3757 677670 626355 841488 739535 606279 691163 620619 557178 883276 495621 707632
3747 707632 840435 688755 652935 330914 806258 234419 393474 619590 431659 488613
3737 488613 448263 480007 371367 559692 595963 394140 380634 329549 359191 131936 665915
3726 665915 727092 372246 225100 140826 220723 390523 199019 215054 475566 280993
3716 280993 283491 132074 239316 224588 472956 131007 246581 30626 73159 182652
3706 182652 -83906 120015 175064 238022 213493 148691 95448 190569 307440 164501 -21829
3695 -21829 -45213 25819 -7276 234282 194608 44806 303567 -1574 -53222 -115491 101221
3684 101221 -210823 1750 -84747 215370 84108 -18370 384489 76736 46469 -49937
3674d9937J45428o1682K80164k89547J63761L6731L1559j86002j24947N0662O3777
3663E9967J93154l63756M31579l48996J98982k78999J61575j91393J82031j85704
3653a41560K1196J76151J09649l64914P4643J10772J14093p9669m203L7260J00394
3642A53812K40195j24371j79905R806j04202P0153m4719J83791k92483P1062M3373
3631B6512J00721J39301k82491j87969L59233J3959m4677k80072J39205K87993
3621B71715l41599P0672o2329L18321j94306j4287k42944J90285Q8368j64254
3611h0358R3910k1250O8461o6014k01173J81567j22563K43598P8815n2938j10249
3600A1806j21833K53917k01184o8707N3889k50356L28361R5032k20212J32500
$$ plain form
3674 -49937 95491 33809 313973 24426 188187 224918 256477 70475 -54472 -3810 59967
3663 59967 253121 -110635 320944 -28052 170930 -108069 53506 -137887 44144 -141560
3653 -141560 -120364 55787 165436 -199478 -124835 -14063 100030 20361 16158 53418 153812
3642 153812 394007 269636 89731 99537 -4665 65488 20769 204560 -87923 -16861 26512
3631 26512 127233 266534 -15957 -203926 155307 169266 124589 -155483 -16278 271715
3621 271715 -69884 788 -61541 256780 62474 48187 -194757 -4472 83896 -80358
3611 -80358 13552 -7698 60763 -5251 -206424 -24857 -147420 96178 174993 122055 11806
3600 11806 -110027 143890 -57294 -126001 -72112 -322468 5893 100925 -119287 13213
3590A3213K6353J0137P0225l79650J98282K9876q794J55481j43815J55574k78562
3579a51680Q5886q400j32417R0326J24619r731L6594J885k16254O0635j06115
3568b24652J06902P2023j80629M18931l83362K26698k19291J36292R1083k74908
3558b30913J38669J10235R8353m48828L29315j58685L4702R7675J08733j16164
3548c6908L4720k77363K77735k6879j97084L05381q6031q9614K70651q8232l81517
3537b95141K89453l27823O0878L5723K31288j51483Q3471k45437J33993k3418
3527b08496j4691J73720k47340K50209m9602K12974m28465L79945L6678j90390
3517h5458q0304K04815k88189N4631K82594j97228j2140J59456k03874j42649
$$ plain form
3590 13213 39566 49703 119928 -259722 -61440 -31564 -40358 115123 -28692 126882 -151680
3579 -151680 -65794 -74194 -206611 -116285 8334 -1397 35197 37082 -179172 -118537 -224652
3568 -224652 -117750 -45727 -226356 192575 -190787 35911 -183380 -47088 43995 -230913
3558 -230913 -92244 17991 116344 -332484 -3169 -161854 -127152 -29477 79256 -36908
3548 -36908 -2188 -279551 -1816 -28695 -225779 79602 -6429 -96043 174608 86376 -295141
3537 -295141 -5688 -333511 -272633 -236910 -5622 -157105 -73634 -319071 -185078 -208496
3527 -208496 -223187 -49467 -296807 -46598 -96200 116774 -311691 68254 104932 -85458
3517 -85458 -165762 39053 -249136 -194505 88089 -109139 -121279 38177 -165697 -308346
3507c08346N14974o09229K83459N5656k0859K45882j99844J89172l48465J21723
3497g5877k03554L39330k84500M5097O3949k17973J33331M513N2452j11807K16243
3486c8796r9205n7738J74335o7812K25513j58425j10088q3885K39563K368p9522
3475e3692r260j451k65138j3933J25567L46648l24045J99454j90438j6967Q5295
3464a17960p7427R4566j09676J88104l35423P2834M8316O6907p6670L59153l71789
3453b59065K28276j96395K01991r3137q0086J09037j57751J36519O4079j94568
3443b41100p8364M23401l18493O9496j4365p1244J8038J30251r0454j20243J45157
3432a47920K89505l14686j37858K14994N8857j62166K5415N2327j62549k3538
$$ plain form
3507 -308346 206628 -402601 -119142 -63486 -84345 161537 -38307 150865 -197600 -75877
3497 -75877 -279431 59899 -224601 -179504 -115555 -333528 -200197 -195684 -143232 -255039 -38796
3486 -38796 -138001 -195739 -21404 -89216 136297 -22128 -132216 -216101 23462 25830 -53692
3475 -53692 -62952 -64403 -329541 -343474 -217907 128741 -195304 4150 -186288 -203255 -117960
3464 -117960 -195387 -100821 -210497 -22393 -357816 -284982 -236666 -169759 -246429 112724 -259065
3453 -259065 -30789 -227184 -25193 -118330 -198416 -89379 -247130 -110611 -46532 -241100
3443 -241100 -319464 103937 -214556 -145060 -159425 -230669 -212631 -82380 -172834 -293077 -147920
3432 -147920 141585 -173101 -310959 -95965 -37108 -199274 -173859 -121532 -284081 -307619
3422c07619N25896k52662J17981l79625K08649R0140k15816J11168R766K73528
3412A81406j69755j49208M8032j92677K51036j20447j04998Q0401K85618j71842
3402f2434k75508P2280P1148l6723J41514k87282M13890m0568q1599K45730l69568
3391b09120q0772K26189J11279j38604j22121q8442K16R2539K00473j8427j10125
3380a36915r4396L97861m39754J77094j69324L85762m98992L03543K6468L2k82142
3369c30763P1489O3729J87992j77520R25K11244k04653l1053K2552k1832k1296
3358b29186L4934L98430k11562N3053k56085L0246j5367O469j19168J2620J49391
3347a46225o8888J60431j78578J61012j19005j7637L5323k87311M20023p892J54256
$$ plain form
3422 -307619 218277 -34385 83596 -296029 -87380 2760 -213056 -101888 -92122 181406
3412 181406 11651 -137557 -89525 -282202 -31166 -151613 -256611 -176210 109408 -62434
3402 -62434 -337942 -265662 -194514 -231237 -89723 -377005 36885 -3683 -85282 160448 -209120
3391 -209120 -289892 -63703 47576 -91028 -213149 -301591 -301375 -208836 -8363 -26790 -136915
3380 -136915 -231311 166550 -273204 -96110 -265434 120328 -378664 -75121 -48653 -48621 -330763
3369 -330763 -259274 -195545 -7553 -185073 -184148 27096 -177557 -208610 -186058 -207890 -229186
3358 -229186 -194252 204178 -7384 45669 -210416 -180170 -195537 -189068 -308236 -295616 -146225
3347 -146225 -215113 -54682 -233260 -72248 -191253 -208890 -173567 -460878 -40855 -48747 105509
3336A05509j64787O1336k54283J8104J72622n3587j97420K25003r2555M4507L7785
3325i7766j69736L54664k43326L6564j67442M1344l2906Q2120p63M7257j91768
3314c41758J53413k1227J82544m97218K64598J00471O9735p6871M35728m12377
3304a42962j67650K22614j15907L6007j51251K33442n1342J27399Q9179l5151
3294D4378m08717K80456k5877k9265n4955J05159j35354K64236k70861J09640
3284a21160K28163k22304p3566J19456n1319j42774p357J47368J48514q7509q1668
3273a44156j89919J10871K5386K51895m05060L25779L7603q9391K81989j75314
3263B9683j27563J17463J5516j26536m3077K73575k48614J55204J15965m9735
$$ plain form
3336 105509 -59278 2058 -252225 -234121 -61499 -115086 -312506 -87503 -180058 -135551 -97766
3325 -97766 -267502 87162 -156164 -119600 -287042 -245698 -278604 -196484 -197247 -149990 -341758
3314 -341758 -188345 -209572 -27028 -524246 -259648 -159177 -89442 -166313 269415 -142962
3304 -142962 -310612 -87998 -203905 -167898 -319149 -85707 -137049 -9650 79529 44378
3294 44378 -364339 -83883 -109760 -139025 -193980 -88821 -224175 40061 -230800 -121160
3284 -121160 107003 -115301 -188867 -69411 -120730 -263504 -270861 -123493 25021 -62488 -144156
3273 -144156 -334075 -223204 -197818 54077 -350983 -25204 12399 -76992 204997 29683
3263 29683 -97880 19583 35099 -91437 -134514 139061 -109553 45651 161616 111881
3253A11881j24109k34977J87025J25644K88427l69853J63689L487k16859J8239
3243d7406K82637k08011J58586K1278K5456j41597J62738J38214k39336r802m4015
3232I8742K29890l09007K23439r4194j16213k00905o3263K74422p2264J8170L1785
3221B0602P0949j23173J80869k56609J53419j08407j06469o097J95638J58262
3211A78984n2730J00696k44867R984J73712o8008k6569r3610J66223O0461k67189
3200f2913K39685K42j57656L07788k124m4377O9612J44636L65582J09033K89014
3189A258522N59851k28888j58930J05450r2471Q4335K97098j77125N42511j75341
3179B015012J8254J4462p2004p0924j93954m49314k58319n65074L36933k43432
$$ plain form
3253 111881 -12228 -247205 -60180 65464 353891 -15962 147727 151214 -65645 -47406
3243 -47406 235231 27220 185806 207084 232540 90943 253681 391895 152559 142757 98742
3232 98742 328632 19625 243064 148870 32657 -168248 -231511 42911 -29353 -11183 20602
3221 20602 91551 -31622 149247 -107362 46057 -62350 -168819 -174916 20722 178984
3211 178984 126254 226950 -17917 -7933 165779 97771 71202 -22408 143815 204276 -62913
3200 -62913 176772 177014 19358 327146 325022 280645 350257 494893 860475 969508 1258522
3189 1258522 1818373 1589485 1430555 1536005 1443534 1527869 1824967 1647842 2190353 2015012
3179 2015012 2033266 2047728 1975724 1904800 1710846 1261532 1003213 438139 775072 531640
3169E31640j48836K9548p0701m37152L55365k60752P1790l444Q4339o4040j96150
3158a08393N7307M2543K05706k36588J55890j10177q1186J65461j34012L02050
3148B58601r8934k65630R3861k4108j42195J04616l7378q4226J55731q1224K65394
3137A44508l34752M5080J10795k65184J91273j8146O43q7512J04984Q7515Q0011
3126E9215k55860l6849L2730J65586k2770p8120R234M4455J23752k74119K52036
3115A9290k50506J41393O8979j35345j50474K41924o7720j39150o2488R4035K46896
3104F834l28596J82197M8485L0723j03197l0106o9410J23120J32022k32574R6890
3093a43612R9411o8132n6596J57215n0182l02709N36188k77207k35678O7095K41990
$$ plain form
3169 531640 382804 412352 341651 -95501 259864 -888 70902 67458 151797 87757 -108393
3158 -108393 -51086 -8543 197163 -39425 116465 6288 -74898 90563 -43449 258601
3148 258601 159667 -105963 -12102 -36210 -178405 -73789 -111167 -195393 -39662 -120886 144508
3137 144508 -190244 -145164 -34369 -299553 -108280 -126426 -125783 -213295 -108311 -20796 59215
3126 59215 -196645 -233494 -200764 -35178 -57948 -136068 -126834 -82379 41373 -232746 19290
3115 19290 -231216 -89823 -20844 -156189 -306663 -64739 -132459 -271609 -334097 -240062 6834
3104 6834 -321762 -139565 -91080 -60357 -163554 -193660 -263070 -139950 -7928 -240502 -143612
3093 -143612 -44201 -112333 -168929 -11714 -61896 -364605 171583 -105624 -341302 -274207 -32217
3082c2217j78057j10050K89186k18833J33129p0068M9476k36235L46900N5216
3072B8447n1767j89537L28885l37475Q2695P9778j82827J53217Q0372J35791j31125
3061c546L8706k59377J57449P8552k08115L7479J1909m6387j09077L99307l80595
3050b83695J26824J82719k27130n0627M2689o7845K08923j42675M6164j69015
3040c33668K5379R1197p8516P9231K13375n3341j67880l9247r7409L67708r0949
3029h4120k87722o7309L27921J2892j47266J1630j32691n3687J52834K32889j56356
3018a90985m6108L5810Q3126o354K60273l35629L29511k47274L3666l3051N2256
3007f4759p6087P8202k13643K11163j21734J44550k0781n4982p5490j10851J83266
$$ plain form
3082 -32217 -210274 -320324 -31138 -249971 -116842 -186910 -137434 -373669 -26769 28447
3072 28447 -23320 -212857 116028 -221447 -138752 -58974 -241801 -88584 -8212 127579 -3546
3061 -3546 35160 -224217 -66768 11784 -196331 -158852 -146943 -193330 -302407 96900 -283695
3050 -283695 -156871 25848 -201282 -251909 -209220 -277065 -68142 -210817 -164653 -333668
3040 -333668 -308289 -217092 -295608 -216377 -3002 -56343 -224223 -263470 -360879 6829 -84120
3029 -84120 -371842 -439151 -111230 -98338 -245604 -233974 -366665 -420352 -267518 -34629 -190985
3018 -190985 -237093 -201283 -118157 -124511 135762 -199867 129644 -117630 -83964 -117015 -64759
3007 -64759 -140846 -62644 -276287 -65124 -186858 -42308 -63089 -118071 -193561 -304412 -121146
2996a21146J06234j17179m4217P0490J93671j40261l3717n2699J40361k90914
2986b89377L07049j73538j69508J75713l9800M1030j34356J99470k038k51867
2976c37222L68909p9787K0607m05618J61452L1989Q8648j5985l9724r7096K46365
2965e7462j77968K05504j35682m5961K10436j91735k0475K28234j49873l48591
2955d83573L16126K1543J0298P9274k14340J52283M2238j72740K45631l30233
2945c33493J94603j1030k4733J3150r474J40957j70775P996J71947j47080j00518
2934b68450Q4819L7839j28974J00789k0202J89153j86773L4125q3632j1014R2997
2923a59323j09231K4185j04945L31893r8930j73313M9596N1857j05256o5157K83257
$$ plain form
2996 -121146 -14912 -132091 -176308 -105818 87853 -52408 -86125 -138824 1537 -289377
2986 -289377 17672 -155866 -325374 -149661 -189461 -148431 -282787 -83317 -85355 -337222
2976 -337222 31687 -48100 -27493 -433111 -271659 -239670 -151022 -167007 -206731 -303827 -57462
2965 -57462 -235430 -29926 -165608 -211569 -1133 -192868 -213343 14891 -134982 -483573
2955 -483573 -167447 -145904 -135606 -56332 -270672 -118389 -76151 -248891 -3260 -333493
2945 -333493 -138890 -149920 -174653 -161503 -170977 -30020 -200795 -192799 -20852 -167932 -268450
2934 -268450 -183631 -145792 -274766 -173977 -194179 -5026 -191799 -157674 -241306 -252320 -159323
2923 -159323 -268554 -244369 -349314 -17421 -116351 -289664 -240068 -188211 -293467 -358624 -75367
2912g5367Q7677k95898M878M03410m678m26350K39172k91912K03967j23158L7116
2901b41143M53577k69958m6831k29242K17053k01224K79810k88343P8557K30309
2891a7435k22998P6209k85211M14482l23243K53655l70636K12626N41311o35608
2881c56848L53274m7313Q8156k32533R4179J77204m62124L84049o1469k47259
2871c10684K34487K43727l96495p0669O4674j50404J37317j13819J40792r9229
2861c20303J76194J726K09456m86099K27240l47772K38790J98485k51615k166
2851c56064P7956K5780O1047O2008j45008j26352L89052k00119J01680J22243
2841A2223j28544J17047o9203l06313N87462m72376Q172J43724o6335q18k79225
$$ plain form
2912 -75367 12310 -283588 -278710 124700 120022 -306328 -67156 -359068 -155101 -278259 -241143
2901 -241143 212434 -57524 -104355 -333597 -116544 -317768 -37958 -326301 -247744 -17435
2891 -17435 -240433 -164224 -449435 -34953 -358196 -104541 -475177 -262551 278760 -356848
2881 -356848 -3574 -50887 37269 -195264 -101085 76119 -386005 -1956 -63425 -310684
2871 -310684 -76197 167530 -228965 -299634 -234960 -385364 -248047 -361866 -221074 -320303
2861 -320303 -144109 -142383 67073 -419026 -191786 -539558 -300768 -102283 -353898 -356064
2851 -356064 -278108 -252328 -191281 -129273 -274281 -400633 -11581 -211700 -110020 12223
2841 12223 -116321 726 -68477 -374790 212672 -259704 -251532 -107808 -174143 -174961 -454186
2830d54186J13746q2563L11419P5055k28914j31161J12440K04745J12268j61159
2820a28310o1113m2498L01298j61774p9111j72510L93107o1455k86808L19038
2810A9864l48194J09220K67127l13245p7005K41416p8660p7723K62186j76597
2800a71611P8821r5216P0042k57463N3837P8068K1893J66191j90611n4086K43237
2789e6898m6504n7581j16357K25164q4121N6407m1062p1320j77953M58331k31467
2778a43361j03875P0318m4921Q6038j32739j40542K94891j22765J98485J35595
2768I7124l55812L54407j48659j16080n2910m0207n6472L18040l27455J60298
2758a67726Q0220N4858j49780j31008K43044j44867L7997j0724K07638j59741
$$ plain form
2830 -454186 -340440 -423003 -111584 -36529 -265443 -396604 -284164 -79419 32849 -128310
2820 -128310 -189423 -231921 69377 -92397 -171508 -344018 49089 -12366 -299174 19864
2810 19864 -328330 -219110 48017 -265228 -342233 -100817 -179477 -257200 4986 -171611
2800 -171611 -92790 -188006 -117964 -375427 -321590 -243522 -221629 -55438 -246049 -300135 -56898
2789 -56898 -103402 -160983 -277340 -52176 -136297 -79890 -120952 -192272 -370225 88106 -143361
2778 -143361 -247236 -176918 -221839 -135801 -268540 -409082 -114191 -236956 -38471 97124
2768 97124 -258688 95719 -52940 -169020 -221930 -262137 -318609 -569 -328024 -167726
2758 -167726 -87506 -32648 -182428 -313436 -70392 -215259 -177262 -187986 19652 -140089
2748a40089J37672p1402j83361J75729k34514J3803J2416J87876j0950p3840J62118
2737b4542k89823K56994j82312J68428l31904K76964k07888J80178j0985O7878
$$ plain form
2748 -140089 -2417 -73819 -257180 -81451 -315965 -302162 -289746 -101870 -112820 -186660 -24542
2737 -24542 -314365 -57371 -239683 -71255 -403159 -126195 -334083 -153905 -164890 -97012
$$ [...]
##END NTUPLES=NMR SPECTRUM
##END=
