##TITLE=abcd
##JCAMPDX= 6.0         $$ Bruker NMR JCAMP-DX V2.0
##DATA TYPE= NMR SPECTRUM
##DATA CLASS= NTUPLES
##ORIGIN= UXNMR, Bruker Analytische Messtechnik GmbH
##OWNER= root
$$ XWIN-NMR		Version 3.5
$$ Wed Jul 29 19:25:08 2026 Russian Standard Time (UT+4h)  servis@DPX200
##.OBSERVE FREQUENCY= 200.131235884673
##.OBSERVE NUCLEUS= ^1H
##.ACQUISITION MODE= SIMULTANEOUS
##.ACQUISITION SCHEME= undefined
##.AVERAGES= 32
##.DIGITISER RES= 18
##SPECTROMETER/DATA SYSTEM= spect
##.PULSE SEQUENCE= zg
##.SOLVENT NAME= DMSO
##.SHIFT REFERENCE= (INTERNAL, DMSO, 0, 16.4885)
##AUDIT TRAIL= $$ (NUMBER, WHEN, WHO, WHERE, WHAT)
$$ ##TITLE= Audit trail, XWIN-NMR		Version 3.5
$$ ##JCAMPDX= 5.01
$$ ##ORIGIN= Bruker BioSpin GmbH
$$ ##OWNER= servis
$$ F:\spectra/data/av/nmr/H1/1/pdata/1/auditp.txt
$$ ##AUDIT TRAIL=  $$ (NUMBER, WHEN, WHO, WHERE, WHAT)
(   1,<2026-07-29 19:24:26.67 +0400>,<servis>,<DPX200>,
      <created by zg, POWCHK disabled, PULCHK disabled
       configuration hash MD5:
       00 E9 B6 7A A2 85 ED C7 34 08 36 98 17 FE 4E 26
       data hash MD5: 32K
       3F 7F 87 7B 60 21 E3 F7 44 5D 37 73 96 79 68 B8>)
(   2,<2026-07-29 19:24:28.39 +0400>,<servis>,<DPX200>,
      <Start of raw data processing
       efp BC_mod = 2 LB = 0.05 FT_mod = 6 PKNL = 1 PHC0 = -419.3518 PHC1 = 3.101563 SI = 16K 
       data hash MD5: 16K
       E2 E9 98 26 6B 83 4B A6 74 4F BE 17 B5 7D 94 51>)
(   3,<2026-07-29 19:24:43.42 +0400>,<servis>,<DPX200>,
      <pk PHC0 = 4.400001 PHC1 = 0 
       data hash MD5: 16K
       9E 23 12 B2 68 F4 90 81 21 6D 31 47 5B 41 B9 D4>)
$$ ##END=
$$ 
$$ hash MD5
$$ 4F E8 7B 31 82 2D 68 0F 8B 89 63 E7 1D 47 12 67
##$RELAX= 
##$RELAX= 
##$RELAX= 
##$RELAX= 
##$RELAX= 
##$RELAX= 
##$RELAX= 
##$RELAX= 
$$ Bruker specific parameters
$$ --------------------------
##$DU= <F:\spectra>
##$EXPNO= 1
##$NAME= <H1>
##$PROCNO= 1
##$TYPE= <nmr>
##$USER= <av>
##$AMP= (0..31)
100 100 100 100 100 100 100 100 100 100 100 100 100 100 100 100 100 100 
100 100 100 100 100 100 100 100 100 100 100 100 100 100 
##$AQSEQ= 0
##$AQ_mod= 1
##$AUNM= <au_zg>
##$AUTOPOS= <>
##$BF1= 200.13
##$BF2= 200.13
##$BF3= 200.13
##$BF4= 200.13
##$BF5= 500.13
##$BF6= 500.13
##$BF7= 500.13
##$BF8= 500.13
##$BYTORDA= 1
##$CFDGTYP= 0
##$CFRGTYP= 5
##$CHEMSTR= <none>
##$CNST= (0..31)
1 1 145 1 1 1 1 1 1 1 1 1 1 1 1 1 1 1 1 1 1 1 1 1 1 1 1 1 1 1 1 1 
##$CPDPRG= <>
##$CPDPRG1= <>
##$CPDPRG2= <>
##$CPDPRG3= <>
##$CPDPRG4= <mlev>
##$CPDPRG5= <mlev>
##$CPDPRG6= <mlev>
##$CPDPRG7= <mlev>
##$CPDPRG8= <mlev>
##$CPDPRGB= <>
##$CPDPRGT= <>
##$D= (0..31)
0 2 0 0 0 0 0 0 0 0.06 0 0 0 0 0 0 0.0002 0 0 0 0 0 0 0 0 0 0 0 0 0 0 
0 
##$DATE= 1785338666
##$DBL= (0..7)
120 120 120 120 120 120 120 120 
##$DBP= (0..7)
150 150 150 150 150 150 150 150 
##$DBP07= 0
##$DBPNAM0= <>
##$DBPNAM1= <>
##$DBPNAM2= <>
##$DBPNAM3= <>
##$DBPNAM4= <>
##$DBPNAM5= <>
##$DBPNAM6= <>
##$DBPNAM7= <>
##$DBPOAL= (0..7)
0.5 0.5 0.5 0.5 0.5 0.5 0.5 0.5 
##$DBPOFFS= (0..7)
0 0 0 0 0 0 0 0 
##$DE= 6
##$DECBNUC= <off>
##$DECIM= 32
$$ [...]
##$SUBNAM4= <"">
##$SUBNAM5= <"">
##$SUBNAM6= <"">
##$SUBNAM7= <"">
##$SUBNAM8= <"">
##$SUBNAM9= <"">
##$SW= 20.6817932712277
##$SWIBOX= (0..15)
0 0 3 0 0 0 0 0 0 0 0 0 0 0 0 0 
##$SW_h= 4139.07284768212
##$TD= 32768
##$TD0= 1
##$TE= 0
##$TE2= 300
##$TE3= 300
##$TEG= 300
##$TL= (0..7)
0 120 120 120 120 120 120 120 
##$TP= (0..7)
150 150 150 150 150 150 150 150 
##$TP07= 0
##$TPNAME0= <>
##$TPNAME1= <>
##$TPNAME2= <>
##$TPNAME3= <>
##$TPNAME4= <>
##$TPNAME5= <>
##$TPNAME6= <>
##$TPNAME7= <>
##$TPOAL= (0..7)
0.5 0.5 0.5 0.5 0.5 0.5 0.5 0.5 
##$TPOFFS= (0..7)
0 0 0 0 0 0 0 0 
##$TUNHIN= 0
##$TUNHOUT= 0
##$TUNXOUT= 0
##$USERA1= <user>
##$USERA2= <user>
##$USERA3= <user>
##$USERA4= <user>
##$USERA5= <user>
##$V9= 5
##$VALIST= <valist>
##$VCLIST= <CCCCCCCCCCCCCCC>
##$VD= 0
##$VDLIST= <DDDDDDDDDDDDDDD>
##$VPLIST= <PPPPPPPPPPPPPPP>
##$VTLIST= <TTTTTTTTTTTTTTT>
##$WBST= 1024
##$WBSW= 30
##$XGAIN= (0..3)
0 0 0 0 
##$XL= 0
##$YL= 0
##$YMAX_a= 269093
##$YMIN_a= -472167
##$ZGOPTNS= <>
##$ZL1= 120
##$ZL2= 120
##$ZL3= 120
##$ZL4= 120
##$ABSF1= 0
##$ABSF2= 0
##$ABSG= 0
##$ABSL= 0
##$ALPHA= 0
##$AQORDER= 0
##$ASSFAC= 0
##$ASSFACI= 0
##$ASSFACX= 0
##$ASSWID= 0
##$AUNMP= <proc_1d>
##$AZFE= 0.1
##$AZFW= 0.1
##$BCFW= 0
##$BC_mod= 2
##$BYTORDP= 0
##$COROFFS= 0
##$CY= 18.4799938201904
##$DATMOD= 1
##$DC= 0
##$DFILT= <>
##$DTYPP= 0
##$F1P= 9.9274215381318
##$F2P= -0.165520771350173
##$FCOR= 1
##$FTSIZE= 16384
##$FT_mod= 6
##$GAMMA= 0
##$GB= 0
##$INTBC= 1
##$INTSCL= 4.127829e-11
##$ISEN= 128
##$LB= 0.05
##$LEV0= 0
##$LPBIN= 0
##$MAXI= 10000
##$MC2= 0
##$MEAN= 0
##$ME_mod= 0
##$MI= 50
##$NCOEF= 0
##$NC_proc= -7
##$NLEV= 6
##$NOISF1= 3.799351
##$NOISF2= 2.8
##$NSP= 0
##$NTH_PI= 0
##$NZP= 0
##$OFFSET= 16.48848
##$PC= 4
##$PHC0= -414.9518
##$PHC1= 3.101563
##$PH_mod= 1
##$PKNL= yes
##$PPARMOD= 0
##$PSCAL= 4
##$PSIGN= 0
##$REVERSE= no
##$SF= 200.130005582386
##$SI= 16384
##$SIGF1= 3
##$SIGF2= 2
##$SINO= 400
##$SIOLD= 16384
##$SREGLST= <1H.CDCl3>
##$SSB= 0
##$STSI= 16384
##$STSR= 0
##$SW_p= 4139.07284768211
##$SYMM= 0
##$S_DEV= 0
##$TDeff= 32768
##$TDoff= 0
##$TI= <>
##$TILT= no
##$TM1= 0
##$TM2= 0
##$TOPLEV= 0
##$USERP1= <user>
##$USERP2= <user>
##$USERP3= <user>
##$USERP4= <user>
##$USERP5= <user>
##$WDW= 1
##$XDIM= 16384
##$YMAX_p= 293012928
##$YMIN_p= -1556277
$$ End of Bruker specific parameters
$$ ---------------------------------
##NTUPLES= NMR SPECTRUM
##VAR_NAME=  FREQUENCY,     SPECTRUM/REAL,   SPECTRUM/IMAG
##SYMBOL=    X,             R,               I
##VAR_TYPE=  INDEPENDENT,   DEPENDENT,       DEPENDENT
##VAR_FORM=  AFFN,          ASDF,            ASDF
##VAR_DIM=   16384,         16384,           16384
##UNITS=     HZ,            ARBITRARY UNITS, ARBITRARY UNITS
##FACTOR=    0.252644378177508, 1,           1
##FIRST=     3299.83951724647, 0,            0
##LAST=      -839.233330435636, 0,           0
##MIN=       -839.233330435636, -1556277,    0
##MAX=       3299.83951724647, 293012928,    0
$$ Real data points
##PAGE= N=1
##DATA TABLE= (X++(R..R)), XYDATA
$$ [...]
$$ plain form
6031 31494769 30813133 30157507 29364500 29113702 28267587 29883191 30677324 32192657 34793796
6022 34793796 40539515 45762777 49472499 53415318 52974998 52907056 51787960 48975643 45810512
6013 45810512 43784147 41138072 38984586 37621712 36404762 36126691 35400839 35799689 35380692
6004 35380692 35376447 35670407 35508888 35663585 35853364 36471771 36344201 36982630 37736230 42068467
5994 42068467 45815711 50223669 53750111 55028205 53017506 52019316 48847688 45874909
5986 45874909 42519684 39788877 37758837 36278068 36095786 36270836 36809137 36757778 38561767
5977 38561767 39471744 41205097 42413134 43431140 45236446 47230277 49000093 50380159
5969 50380159 51499951 53193273 54663387 55933808 57148654 56948611 56895019 55233788 54044751
$$ packed form
6031C1494769o81636o55626p93007k50798q46115J615604P94133J515333K601139
6022C4793796N745719N223262L709722L942819m40320o7942j119096k812317l165131
6013D5810512k026365k646075k153486j362874j216950k78071p25852L98850m18997
6004C5380692m245K93960j61519J54697J89779O18407j27570O38429P53600M332237
5994D2068467L747244M407958L526442J278094k010699r98190l171628k972779
5986D5874909l355225k730807k030040j480769j82282J75050N38301n1359J803989
5977C8561767R09977J733353J208037J018006J805306J993831J769816J380066
5969E0380159J119792J693322J470114J270421J214846k00043n3592j661231j189037
$$ plain form
5960 54044751 53001447 51555328 51182335 51509853 52388116 52806268 54184758 55990913 57621826
5951 57621826 58190476 59208041 59716759 60789432 61104371 61628142 63273486 64105122 65188700
5942 65188700 65839489 66246812 66934280 67417760 67214295 66543535 64925790 63902846 62054590
5933 62054590 60125050 59207390 56514989 54363861 52277541 51003654 48877481 47037760
5925 47037760 46361171 46228993 45055458 45079912 45948551 46837879 47813059 49149550 50570550
5916 50570550 52069000 53025928 54562971 55459677 56387448 55659634 55863375 54539612 53930629
5907 53930629 52750384 50555047 48985693 47555666 45491918 43455354 41668924 39037610
5899 39037610 36981256 34485623 33311805 30598389 29129466 27950006 26171631 25096840
$$ packed form
5960E4044751j043304j446119l72993L27518Q78263M18152J378490J806155J630913
5951E7621826N68650J017565N08718J072673L14939N23771J645344Q31636J083578
5942F5188700O50789M07323O87468M83480k03465o70760j617745j022944j848256
5933F2054590j929540r17660k692401k151128k086320j273887k126173j839721
5925D7037760o76589j32178j173535K4454Q68639Q89328R75180J336491J421000
5916E0570550J498450R56928J537043Q96706R27771p27814K03741j323763o08983
5907E3930629j180245k195337j569354j430027k063748k036564j786430k631314
5899C9037610k056354k495633j173818k713416j468923j179460j778375j074791
$$ plain form
5891 25096840 23984378 23681656 23074274 22615895 22007888 21466782 21017784 21221173 20915151
5882 20915151 20110068 20289147 20035456 20690693 19440065 19331848 19496605 19092603 19310777
5873 19310777 19579953 19572488 19725690 19677769 20646528 21005790 21084846 21616922 22019051 22578395
5863 22578395 22683047 23499989 23061685 24390394 24234898 25196763 25751251 27176929 27917816
5854 27917816 29552391 30563851 32121852 34578778 35880187 37698572 38643359 40595390
5846 40595390 41034798 42081393 41579654 41723148 41265007 40354420 39590720 38174590 37933064
5837 37933064 36832500 36708528 36546356 36647998 36572186 37505031 37028704 37383343 36856758
5828 36856758 36327864 36428673 35559156 34192863 33744055 33319016 33079051 32109412 31815804
$$ packed form
5891B5096840j112462l02722o07382m58379o08007n41106m48998K03389l06022
5882B0915151q05083J79079k53691O55237j250628j08217J64757m04002K18174
5873A9310777K69176p465J53202m7921R68759L59262P9056N32076M02129N59344
5863B2578395J04652Q16942m38304J328709j55496R61865N54488J425678P40887
5854B7917816J634575J011460J558001K456926J301409J818385R44787J952031
5846D0595390M39408J046595n01739J43494m58141r10587p63700j416130k41526
5837C7933064j100564j23972j62172J01642p5812R32845m76327L54639n26585
5828C6856758n28894J00809q69517j366293m48808m25039k39965r69639k93608
$$ plain form
5819 31815804 31662711 30893495 30070850 29282464 28826690 27308820 26292495 24427605 24008773
5810 24008773 22899634 22005200 21662345 21200090 20833982 20483147 20643036 20718133 20733969 20892546
5800 20892546 20341869 20835124 21158783 21579807 21879485 22510771 22930231 22804784 23468822
5791 23468822 23898928 24482482 24248103 24374661 23874593 24017543 24346499 24180157 24353876
5782 24353876 24005452 24183445 24090470 23506977 22580366 23041898 22987565 23240459 22277147 22449988
5772 22449988 22241239 22773883 22636152 21094888 21423447 20742663 20520021 19234108 19131154
5763 19131154 19013319 18109682 17796450 18064197 18215207 17897026 18534593 17564972 17416075
5754 17416075 17661841 17633409 16878744 15977282 15700122 15121457 14742214 14227163 14036394 13410380
$$ packed form
5819C1815804j53093p69216q22645p88386m55774j517870j016325j864890m18832
5810B4008773j109139q94434l42855m62255l66108l50835J59889P5097J5836J58577
5800B0892546n50677M93255L23659M21024K99678O31286M19460j25447O64038
5791B3468822M30106N83554k34379J26558n00068J42950L28956j66342J73719
5782B4353876l48424J77993r2975n83493r26611M61532n4333K52894r63312J72841
5772B2449988k08749N32644j37731j541264L28559o80784k22642j285913j02954
5763A9131154j17835r03637l13232K67747J51010l18181O37567r69621j48897
5754A7416075K45766k8432p54665r01462k77160n78665l79243n15051j90769o26014
$$ plain form
5744 13410380 12537472 13026833 12692111 12882846 12209665 12285634 12297696 12092881 12241805 11443191
5734 11443191 11408258 12074058 12331421 11514065 11132092 11840055 11328679 11535960 10845375 11112140
5724 11112140 11027396 11275824 10884314 11246778 10946861 10977634 11084253 10655991 11111534 10765234
5714 10765234 10918547 10828207 10922180 10953266 11175304 10994361 11382791 11135962 11097905 11193737
5704 11193737 11432254 11643866 11445264 11374459 11883993 12307504 12105861 11514589 11731698 12143984
5694 12143984 11855388 11925203 11684252 11832950 12063725 11786084 11818020 11833211 11969829 11973962
5684 11973962 12304494 12583913 12427101 11852753 12535167 12535515 12816414 13362405 13264516 13428032
5674 13428032 13499579 13992153 14098298 14342149 14761751 14963562 15276247 15406413 15772227 15944412
$$ packed form
5744A3410380q72908M89361l34722J90735o73181P5969J2062k04815J48924p98614
5734A1443191l4933O65800K57363q17356l81973P07963n11376K07281o90585K66765
5724A1112140q4744K48428l91510L62464k99917L0773J06619m28262M55543l46300
5714A0765234J53313r0340R3973L1086K22038j80943L88430k46829l8057R5832
5704A1193737K38517K11612j98602p0805N09534M23511k01643n91272K17109M12286
5694A2143984k88596O9815k40951J48698K30775k77641L1936J5191J36618M133
5684A1973962L30532K79419j56812n74348O82414L48K80899N45991r7889J63516
5674A3428032P1547M92574J06145K43851M19602K01811L12685J30166L65814J72185
$$ plain form
5664 15944412 16001511 16821130 16750088 16456920 17256703 17307309 17202871 17571167 17540256 17342328
5654 17342328 17532597 17997038 18028486 17965011 18295461 18413941 18455336 19116735 19597218 19293385
5644 19293385 19725785 20092276 20407390 20240424 21060317 21245292 22416307 22368122 23227503
5635 23227503 24016501 24701723 24933949 25862238 26609208 27233867 28153505 28000159 29450805
5626 29450805 29793538 30324244 30640737 31182815 31512621 32178436 32961585 33802964 34572143
5617 34572143 35659135 36421107 37369112 38276247 39430525 40566659 41356104 43362791 45599075
5608 45599075 47068233 48995313 51208434 54066326 57079782 59621013 63063459 66899980
5600 66899980 70649093 74410848 78052542 81683153 85409858 89075099 91503939 94119548
$$ packed form
5664A5944412N7099Q19619p1042k93168P99783N0606j04438L68296l0911j97928
5654A7342328J90269M64441L1448o3475L30450J18480M1395O61399M80483l03833
5644A9293385M32400L66491L15114j66966Q19893J84975J171015m8185Q59381
5635B3227503P88998O85222K32226R28289P46970O24659R19638j53346J450646
5626B9450805L42733N30706L16493N42078L29806O65815P83149Q41379P69179
5617C4572143J086992P61972R48005R07135J154278J136134P89445K006687K236284
5608D5599075J469158J927080K213121K857892L013456K541231L442446L836521
5600F6899980L749113L761755L641694L630611L726705L665241K428840K615609
$$ plain form
5592 94119548 96180898 97796593 98354833 98540868 98904139 98772994 98444311 97730913 98442995
5583 98442995 97835173 98716524 99063360 100512776 101527353 103546798 105444985 107868117 111058172
5574 111058172 114648882 118388385 123220182 128853279 134528104 140380291 146743036 152376123
5566 152376123 156984560 161138286 164278014 165890189 166366071 166147261 165552820 162900511
5558 162900511 160304670 157104252 153680487 149423061 146862373 143192055 140511189 137620333
5550 137620333 135528265 133447616 131205324 130231827 129296751 128355455 127533992 128339180 128859619
5541 128859619 130850511 132761075 135613032 138541625 142252097 146698563 150453164 153558291
5533 153558291 157364396 159685717 160594570 161749790 161380372 160955963 159628580 158434488
$$ packed form
5592I4119548K061350J615695N58240J86035L63271j31145l28683p13398P12082
5583I8442995o07822Q81351L46836J449416J014577K019445J898187K423132L190055
5574A11058172L590710L739503M831797N633097N674825N852187O362745N633087
5566A52376123M608437M153726L139728J612175M75882k18810n94441k652309
5558A62900511k595841l200418l423765m257426k560688l670318k680866k890856
5550A37620333k092068k080649k242292r73497r35076r41296q21463Q05188N20439
5541A28859619J990892J910564K851957K928593L710472M446466L754601L105127
5533A53558291L806105K321321R08853J155220l69418m24409j327383j194092
$$ plain form
5525 158434488 157200155 155703145 154396064 154286512 153185660 152271559 151317808 151655416 151147361
5516 151147361 150553638 151224635 151443440 150899999 151683839 152536812 152690805 153637908 153503249
5507 153503249 154249429 153663916 152753018 152025541 150715217 148611945 146791724 144246916 141909071
5498 141909071 139625143 137194683 134825426 133600008 132741853 130457407 129435992 128287756
5490 128287756 128126996 127140782 127189703 125715669 124832419 123714758 122652114 120617768 119349680
5481 119349680 117302238 115299434 114033896 111487567 110602285 109354302 107830879 106930567
5473 106930567 106897697 105691948 106443412 105766926 106139667 106573201 107348567 108899107 109553748
5464 109553748 111028814 112681390 114795222 115670067 117200125 117926035 118655390 118464140 117859907
$$ packed form
5525A58434488j234333j497010j307081j09552j100852r14101r53751L37608n08055
5516A51147361n93723O70997K18805n43441P83840Q52973J53993R47103j34659
5507A53503249P46180n85513r10898p27477j310324k103272j820221k544808k337845
5498A41909071k283928k430460k369257j225418q58155k284446j021415j148236
5490A28287756j60760r86214M8921j474034q83250j117661j062644k034346j268088
5481A19349680k047442k002804j265538k546329q85282j247983j523423r00312
5473A06930567l2870j205749P51464o76486L72741M33534P75366J550540O54641
5464A09553748J475066J652576K113832Q74845J530058P25910P29355j91250o04233
$$ plain form
5455 117859907 116494301 114365814 113000592 110873445 109272195 107959590 108301048 107079656
5447 107079656 109058590 110598288 112326882 114824954 117115114 120251035 122414072 124589466
5439 124589466 126591144 128221116 128568097 128969870 129164073 128933000 128054632 126828248 125411543
5430 125411543 123501160 121220542 119049140 116694335 114143905 111528878 108674315 106576003
5422 106576003 104354285 102318072 100585619 99048248 98879648 97689071 97665244 97444236 97020335
5413 97020335 96148511 95998376 95025830 93609030 92144145 90668230 88594045 85686822 82847726
5404 82847726 80330003 77844051 74413470 71414582 69076370 67210621 63915901 61423576
5396 61423576 59614189 57448900 55627838 53004612 51987690 49886733 48294668 46759110
$$ packed form
5455A17859907j365606k128487j365222k127147j601250j312605L41458j221392
5447A07079656J978934J539698J728594K498072K290160L135921K163037K175394
5439A24589466K001678J629972L46981M01773J94203k31073q78368j226384j416705
5430A25411543j910383k280618k171402k354805k550430k615027k854563k098312
5422A06576003k221718k036213j732453j537371j68600j190577k3827k21008m23901
5413I7020335q71824j50135r72546j416800j464885j475915k074185k907223k839096
5404H2847726k517723k485952l430581k998888k338212j865749l294720k492325
5396F1423576j809387k165289j821062k623226j016922k100957j592065j535558
$$ plain form
5388 46759110 45625023 44089522 42870286 41747695 41536490 40915410 39769561 39765439 39605053
5379 39605053 39352040 39079169 39083020 39007934 39429247 39231319 39671063 40371555 40442378 40663287
5369 40663287 40399460 40173459 39762155 39751609 39620017 39989570 40362442 41538926 41846638
5360 41846638 42758618 42638454 42569783 42301626 42391731 42396898 42435824 43228511 43664444 45143548
5350 45143548 46538441 49220479 50337778 52426594 54111208 56890392 58443750 59746507
5342 59746507 61052583 62136013 63772655 64317172 64452693 64967387 65460813 66102578 66255663
5333 66255663 67256027 67679769 68727091 69942866 71620634 73874525 76181391 78156849
5325 78156849 81465188 85079342 88766796 93120500 96959709 102838205 108967284 114535960
$$ packed form
5388D6759110j134087j535501j219236j122591k11205o21080j145849m122j60386
5379C9605053k53013k72871L851p5086M21313j97928M39744P00492P0823K20909
5369D0663287k63827k26001m11304j0546j31592L69553L72872J176484L07712
5360D1846638R11980j20164o8671k68157R0105N167L8926P92687M35933J479104
5350D5143548J394893K682038J117299K088816J684614K779184J553358J302757
5342E9746507J306076J083430J636642N44517J35521N14694M93426O41765J53085
5333F6255663J000364M23742J047322J215775J677768K253891K306866J975458
5325G8156849L308339L614154L687454M353704L839209N878496O129079N568676
$$ plain form
5317 114535960 118968526 122734862 125527613 128247211 131986995 136035361 140238247 142915510
5309 142915510 144867883 144668363 144537131 145752400 148215648 151959960 153904542 155171729
5301 155171729 153209944 149439465 145935521 143493901 141037355 137863840 134592476 129708778
5293 129708778 123064656 117145226 111233892 105991529 100303650 94672355 89317283 83699691
5285 83699691 78728334 72628556 67524872 63145279 59301202 56008170 52256260 50159200
5277 50159200 47539542 45316055 43602469 42385686 40734652 39593000 38266277 37482692
5269 37482692 36793839 36121125 35503225 35332302 34903909 34407723 34682088 34351188 34760682
5260 34760682 35379852 36161730 36517681 37904591 38517694 38691313 38683097 37580959 36837900
$$ packed form
5317A14535960M432566L766336K792751K719598L739784M048366M202886K677263
5309A42915510J952373j99520j31232J215269K463248L744312J944582J267187
5301A55171729j961785l770479l503944k441620k456546l173515l271364m883698
5293A29708778o644122n919430n911334n242363n687879n631295n355072n617592
5285H3699691m971357o099778n103684m379593l844077l293032l751910k097060
5277E0159200k619658k223487j713586j216783j651034j141652j326723p83585
5269C7482692o88853o72714o17900j70923m28393m96186K74365l30900M09494
5260C4760682O19170P81878L55951J386910O13103J73619q216j102138p43059
$$ plain form
5251 36837900 35399491 33503500 32659540 31039809 30282753 29160741 28468185 27674708 27583593
5242 27583593 27313816 27674646 27556635 28945585 29665043 31363729 32806294 34250212 34302251
5233 34302251 34923707 34851737 34919425 34350799 33191447 32274035 31751742 31476792 29698239
5224 29698239 29339534 29314961 29299972 29324855 29016955 29320910 29389124 29982715 30462812 30657605
5214 30657605 31768900 32437150 33248301 33651017 33713454 33840533 33551426 33515519 33612667 32950558
5204 32950558 32981628 32680119 33548718 32734729 33632017 33651250 33975046 34309015 34358521 33650784
5194 33650784 33498954 33668518 32750344 32084298 31659183 31187902 30564469 29598932 29164769
5185 29164769 28093357 27028829 26260615 25822931 24787128 24052068 23460771 23207319 22955600
$$ packed form
5251C6837900j438409j895991q43960j619731p57056j122012o92556p93477r1115
5242B7583593k69777L60830j18011J388950P19458J698686J442565J443918N2039
5233C4302251O21456p1970O7688n68626j159352r17412n22293k74950j778553
5224B9698239l58705k4573j4989K4883l07900L03955O8214N93591M80097J94793
5214C0657605J111295O68250Q11151M02716O2437J27079k89107l5907R7148o62109
5204C2950558L1070l01509Q68599q13989Q97288J9233L23796L33969M9506p07737
5194C3650784j51830J69564r18174o66046m25115m71281o23433r65537m34163
5185B9164769j071412j064528p68214m37684j035803p35060n91297k53452k51719
$$ plain form
5176 22955600 21796187 21566704 21502567 21461436 20876181 20513233 20005661 19271241 19320483 18861121
5166 18861121 18278013 17975780 17783107 17441239 16663392 16081727 15735836 15577124 14900546
5157 14900546 13756342 13420178 12739257 12015614 11734393 11042047 10741148 10611924 10210768
5148 10210768 10320432 10241892 9439109 8940715 8834310 8828324 8621521 9218338 8148256 8644248
5138 8644248 8839508 8862550 7906778 8010019 8186593 7660167 7616609 7549658 8005199 7618849
5128 7618849 7680834 7795993 7455138 7222729 7044373 7426703 7362599 7048217 7420742 7312982
5118 7312982 7467830 7754099 6929641 6949715 7393768 7559954 6708306 6942005 7201034 7650304
5108 7650304 7253985 7182880 6844844 7312704 6891670 6917179 7189587 6320914 6935738 6945111
$$ packed form
5176B2955600j159413k29483o4137m1131n85255l62948n07572p34420M9242m59362
5166A8861121n83108l02233j92673l41868p77847n81665l45891j58712o76578
5157A4900546j144204l36164o80921p23643k81221o92346l00899j29224m01156
5148A0210768J09664p8540q02783m98394j06405n986k06803N96817j070082M95992
5138H644248J95260K3042r55772J03241J76574n26426m3558o6951M55541l86350
5128G618849O1985J15159l40855k32409j78356L82330o4104l14382L72525j07760
5118G312982J54848K86269q24458K0074M44053J66186q51648K33699K59029M49270
5108G650304l96319p1105l38036M67860m21034K5509K72408q68673O14824R373
$$ plain form
5098 6945111 6725133 7319466 7002679 6969670 7316690 8105670 7267412 7304692 7203237 7309502
5088 7309502 7340097 7599727 6912561 7185389 7332464 6899440 7702119 6627376 6876558 6797397
5078 6797397 7398541 6841404 7115525 6873855 7308682 7672989 8039000 7673239 7347558 7621907
5068 7621907 7506014 7617649 7634835 7398175 8104128 7142082 7250443 7778253 7936264 7873178
5058 7873178 8080992 8088598 8024784 8500573 8673877 8514235 8347795 9042434 8998655 8645635
5048 8645635 8783693 9533605 9399446 9449185 10422328 10294933 11127445 11865282 12195089 11421008
5038 11421008 11632851 11631546 11553337 11773055 11471276 11570087 11096476 11414089 11569444 11906999
5028 11906999 12160829 12380245 12393845 12824862 13235632 13783771 13684079 13963218 14306565 15131433
$$ packed form
5098F945111k19978N94333l16787l3009L47020P88980q38258L7280j01455J06265
5088G309502L0595K59630o87166K72828J47075m33024Q02679j074743K49182p9161
5078F797397O01144n57137K74121k41670M34827L64307L66011l65761l25681K74349
5068G621907j15893J11635J7186k36660P05953r62046J08361N27810J58011o3086
5058G873178K07814P606o3814M75789J73304j59642j66440O94639m3779l53020
5048H645635J38058P49912j34159M9739R73143j27395Q32512P37837L29807p74081
5038A1421008K11843j305p8209K19718l01779R8811m73611L17613J55355L37555
5028A1906999K53830K19416J3600M31017M10770N48139r9692K79139L43347Q24868
$$ plain form
5018 15131433 14915392 15833333 15901280 16584778 17097660 17809293 17822510 19150452 20342078
5009 20342078 21031009 21918648 21787690 21973306 21852175 22512713 21353394 21721437 21400323
5000 21400323 21802066 22269193 22798407 23383615 22934840 24140213 24232466 25466298 26023353
4991 26023353 27483518 28869185 30121029 31947510 32992981 34261423 35532414 37776725
4983 37776725 38330356 39278628 40025738 41018221 41699904 42203788 42819478 43372108 44064788
4974 44064788 44284663 44345795 45334507 45317475 45397357 44988431 44443593 45167170 45069365 44789991
4964 44789991 45018137 45888973 46739732 48218012 49383011 50987094 52201925 54853401 56823271
4955 56823271 59311809 61624639 64544510 67347710 70406951 72950952 75077451 77589518
$$ packed form
5018A5131433k16041R17941O7947O83498N12882P11633J3217J327942J191626
5009B0342078O88931Q87639j30958J85616j21131O60538j159319L68043l21114
5000B1400323M01743M67127N29214N85208m48775J205373R2253J233832N57055
4991B6023353J460165J385667J251844J826481J045471J268442J270991K244311
4983C7776725N53631R48272P47110R92483O81683N03884O15690N52630O92680
4974D4064788K19875O1132R88712j7032P9882m08926n44838P23577r7805k79374
4964D4789991K28146Q70836Q50759J478280J164999J604083J214831K651476J969870
4955E6823271K488538K312830K919871K803200L059241K544001K126499K512067
$$ plain form
4947 77589518 78852498 80973187 82119824 82390755 82488039 82739035 81537881 80057810 78317824
4938 78317824 76005357 73967718 71530175 69329474 68217180 66999123 66080014 65605967
4930 65605967 66292265 67130877 67906714 69491425 70894755 73409542 75573872 78336941 80911535
4921 80911535 83593532 86319332 88136434 89961091 91012601 91855606 92106037 92751000 91893008
4912 91893008 90815696 88798235 86147623 84007417 80526559 77663034 73835515 70516432
4904 70516432 67847168 65526546 62626980 60457737 58845684 58012966 57555098 56807346 57274069
4895 57274069 57875541 58424070 59296695 60234101 61612762 61849486 61739502 61688715 61361748
4886 61361748 60808232 59859717 58856136 57796839 56858231 56093286 54738208 53249874 52160692
$$ packed form
4947G7589518J262980K120689J146637K70931R7284K50996j201154j480071j739986
4938G8317824k312467k037639k437543k200701j112294j218057r19109m74047
4930F5605967O86298Q38612P75837J584711J403330K514787K164330K763069K574594
4921H0911535K681997K725800J817102J824657J051510Q43005K50431O44963q57992
4912I1893008j077312k017461k650612k140206l480858k863525l827519l319083
4904G0516432k669264k320622k899566k169243j612053q32718m57868p47752M66723
4895E7274069O01472N48529Q72625R37406J378661K36724j09984n0787l26967
4886F1361748n53516r48515j003581j059297r38608p64945j355078j488334j089182
$$ plain form
4877 52160692 49587691 47777356 45596019 43727901 41924120 40203606 38231751 36887853
4869 36887853 35581827 34819456 33891157 33609824 32785490 33195747 32600500 32943930 32688515
4860 32688515 32738018 32122349 31802445 31339021 30968788 30606752 29902414 29564717 29175069 28586057
4850 28586057 28070499 28045980 27855930 28048332 26621015 26808968 26452394 26438856 25703553 25510777
4840 25510777 25380697 25411674 26103647 26089940 26238161 27305312 27777930 28569247 29003408 29917349
4830 29917349 30984352 32544476 33208405 35490491 39166372 46456256 57478280 69088232
4822 69088232 78614224 86249080 86381615 85383302 80384629 73971620 67421523 60870712
4814 60870712 55182417 50631301 47234821 45532906 43987773 44004999 43665498 43255159 43558660
$$ packed form
4877E2160692k573001j810335k181337j868118j803781j720514j971855j343898
4869C6887853j306026p62371r28299k81333q24334M10257n95247L43430k55415
4860C2688515M9503o15669l19904m63424l70233l62036p04338l37697l89648n89012
4850B8586057n15558k4519j90050J92402j427317J87953l56574j3538p35303j92776
4840B5510777j30080L0977O91973j3707J48221J067151M72618P91317M34161R13941
4830B9917349J067003J560124O63929K282086L675881P289884J1022024J1609952
4822F9088232R525992P634856J32535r98313m998673o413009o550097o550811
4814F0870712n688295m551116l396480j701915j545133J7226l39501m10339L03501
$$ plain form
4805 43558660 44083361 44117869 44725372 45290385 46351443 47383024 47974556 48960374 49864378
4796 49864378 51706332 52950362 54600174 55345652 56809829 59477032 60858278 62539048
4788 62539048 65084734 67046941 69452494 71280132 74359423 76101585 78316981 80710226
4780 80710226 83169551 85845304 87425678 89964585 93059942 96066405 98574190 101113037
4772 101113037 103627392 107003665 109581066 112622376 114892223 118460152 121481408 125006979
4764 125006979 128723490 132672426 137524691 142429235 147556827 152226735 156823823 161103263
4756 161103263 164644366 168095452 171603140 174069719 175707369 178341787 180787011 182152284
4748 182152284 183859475 184642351 186050859 187808726 188391124 189687274 190969411 191808794
$$ packed form
4805D3558660N24701L4508O07503N65013J061058J031581N91532R85818R04004
4796D9864378J841954J244030J649812P45478J464177K667203J381246J680770
4788F2539048K545686J962207K405553J827638L079291J742162K215396K393245
4780H0710226K459325K675753J580374K538907L095357L006463K507785K538847
4772A01113037K514355L376273K577401L041310K269847L567929L021256L525571
4764A25006979L716511L948936M852265M904544N127592M669908M597088M279440
4756A61103263L541103L451086L507688K466579J637650K634418K445224J365273
4748A82152284J707191P82876J408508J757867N82398J296150J282137Q39383
$$ plain form
4740 191808794 193671557 196290646 198552685 201275134 204614795 207160900 208154237 208719220
4732 208719220 208563014 206860285 204934660 202031955 198572855 193773329 189631545 185606767
4724 185606767 181582632 177122916 173609228 169553767 165343909 161739738 157698137 153702833
4716 153702833 149767416 145863010 141432154 137302837 133636468 129382710 125580862 121796196
4708 121796196 117552794 113862915 110322170 106698774 103542238 100409626 97150885 95205251
4700 95205251 92218714 89807825 87541922 85651282 82735296 80798220 78683999 76139223
4692 76139223 73365046 71680694 69311365 66564865 64517574 63093017 60827439 59067670
4684 59067670 57307360 55898785 55006152 53781059 53117040 52110779 51257139 50980516 50217213
$$ packed form
4740A91808794J862763K619089K262039K722449L339661K546105R93337N64983
4732B08719220j56206j702729j925625k902705l459100m799526m141784m024778
4724A85606767m024135m459716l513688m055461m209858l604171m041601l995304
4716A53702833l935417l904406m430856m129317l666369m253758l801848l784666
4708A21796196m243402l689879l540745l623396l156536l132612l258741j945634
4700I5205251k986537k410889k265903j890640k915986j937076k114221k544776
4692G6139223k774177j684352k369329k746500k047291j424557k265578j759769
4684E9067670j760310j408575q92633j225093o64019j006261q53640k76623p63303
$$ plain form
4675 50217213 49987623 49201899 47959754 47132236 46272328 45052965 44302005 42922801 41825927
4666 41825927 41328482 39013897 37755794 37238127 35929098 34570882 34156138 33117801 32456257
4657 32456257 31855074 31274773 30965365 30233766 29852564 29045584 29268600 29244097 28756025 28451167
4647 28451167 27823482 27656993 27306526 27107905 26744413 26973685 26528479 26624023 26655391 26280758
4637 26280758 25755788 25092629 25146862 24396066 24348157 24380338 24083785 23866333 23968357 23871601
4627 23871601 23633188 23690573 23764583 23708687 23994388 24037828 25050695 24366257 25743661 25618185
4617 25618185 26183460 25235731 25918557 25818341 25926038 25723121 25388103 25256856 24640947
4608 24640947 24919857 24431464 24511207 24428620 24170412 24408629 24189869 24525752 24476761 24713817
$$ packed form
4675E0217213k29590p85724j242145q27518q59908j219363p50960j379204j096874
4666D1825927m97445k314585j258103n17667j309029j358216m14744j038337o61544
4657C2456257o01183n80301l09408p31599l81202q06980K23016k4503m88072l04858
4647B8451167o27685j66489l50467j98621l63492K29272m45206R5544L1368l74633
4637B6280758n24970o63159N4233p50796m7909L2181k96553k17452J02024r6756
4627B3871601k38413N7385P4010n5896K85701M3440J012867o84438J377404j25476
4617B5618185N65275r47729O82826j00216J07697k02917l35018j31247o15909
4608B4640947K78910m88393P9743q2587k58208K38217k18760L35883m8991K37056
$$ plain form
4598 24713817 25100432 25374152 25332264 26259257 26382595 26961412 28191023 28625165 28838032
4589 28838032 29128517 30197087 30789736 30827217 31297277 31861905 32360352 34244807 35143582
4580 35143582 36394668 37896337 39582730 41586817 44585696 47977866 51970184 57173408
4572 57173408 63732476 71268336 79331433 88628096 98115075 109489880 121688952 133613362
4564 133613362 144316086 153351469 158782180 159615236 157326278 151019893 142593662 133381800
4556 133381800 122993132 113878580 104216702 96597939 89358013 84397200 80514157 77764286
4548 77764286 75808895 74994020 75229097 77249645 80942441 85833133 91772032 98208372
4540 98208372 105952801 114890401 124453283 135067380 145182349 152527834 157237743 158576965
$$ packed form
4598B4713817L86615K73720m1888R26993J23338N78817J229611M34142K12867
4589B8838032K90485J068570N92649L7481M70060N64628M98447J884455Q98775
4580C5143582J251086J501669J686393K004087K998879L392170L992318N203224
4572E7173408O559068P535860Q063097R296663R486979J1374805J2199072J1924410
4564A33613362J0702724R035383N430711Q33056k288958o306385q426231r211862
4556A33381800j0388668r114552r661878p618763p239926m960813l883043k749871
4548G7764286j955391q14875K35077K020548L692796M890692N938899O436340
4540I8208372P744429Q937600R562882J0614097J0114969P345485M709909J339222
$$ plain form
4532 158576965 155471921 149295328 140233582 129689066 118197461 106520315 95994013
4525 95994013 85858002 76703730 69120478 62664326 57299780 52763364 49056221 45449235
4517 45449235 42135369 39241639 37374998 34967896 33543999 31938850 30915378 29410505
4509 29410505 28175890 27343761 26196477 24840136 24268495 23812462 23168974 22476852 21989475
4500 21989475 20639410 20628127 19958961 19073660 18962227 18973253 19101563 17660634 17536664
4491 17536664 17342643 16517377 16374124 15835767 15552684 15620072 14898720 15143113 14380368 14242779
4481 14242779 14408272 14301620 13805550 14031079 13665012 13574245 13533489 12939392 12864595 13094799
4471 13094799 12258318 12141000 11966971 11906340 11804759 11623386 11305273 11642439 11481281 11007586
$$ packed form
4532A58576965l105044o176593r061746j0544516j1491605j1677146j0526302
4525I5994013j0136011r154272p583252o456152n364546m536416l707143l606986
4517D5449235l313866k893730j866641k407102j423897j605149j023472j504873
4509B9410505j234615q32129j147284j356341n71641m56033o43488o92122m87377
4500B1989475j350065j1283o69166q85301j11433J1026J28310j440929j23970
4491A7536664j94021q25266j43253n38357k83083O7388p21352K44393p62745j37589
4481A4242779J65493j06652m96070K25529l66067r0767m0756n94097p4797K30204
4471A3094799q36481j17318j74029o0631j01581j81373l18113L37166j61158m73695
$$ plain form
4461 11007586 10750366 11026227 10020344 10278900 10192098 10161200 9587878 9943932 9325412 9888127
4451 9888127 9707252 9315340 9595246 10023302 9296738 9724576 9758424 9369941 9685253 9816624
4441 9816624 9517266 9439349 9611909 9733284 9825908 9709108 9776947 9618595 9854292 9228980
4431 9228980 9399903 9583840 8872920 9418473 9190116 9345625 9636081 9968878 8980122 9859904
4421 9859904 9564327 10552690 10739361 10926927 12071237 12671471 13614343 12842217 14452942
4412 14452942 13661425 13871388 13583750 13439043 12698664 12645024 12361002 12313511 12113817 11833233
4402 11833233 12499230 13933769 15055520 15572956 16666124 17661880 19141990 20505308 22517614
4393 22517614 24095883 26008295 26580641 27170684 26980876 26590644 25364911 24030435 22603144
$$ packed form
4461A1007586k57220K75861j005883K58556q6802l0898n73322L56054o18520N62715
4451I888127j80875l91912K79906M28056p26564M27838L3848l88483L15312J31371
4441I816624k99358p7917J72560J21375R2624j16800O7839j58352K35697o25312
4431I228980J70923J83937p10920N45553k28357J55509K90456L32797r88756Q79782
4421I859904k95577R88363J86671J87566J144310O00234R42872p72126J610725
4412A4452942p91517K09963k87638j44707p40379n3640k84022m7491j99694k80584
4402A1833233O65997J434539J121751N17436J093168R95756J480110J363318K012306
4393B2517614J578269J912412N72346N90043j89808l90232j225733j334476j427291
$$ plain form
4384 22603144 21254428 20366216 18812180 17875725 17408816 17224180 16292000 17298489 17244663
4375 17244663 18038170 20146180 21301109 22820304 24991945 26259781 28211874 31510594
4367 31510594 33047783 34332908 35577062 37184741 40284669 44340832 48292485 51677587
4359 51677587 54390055 55059107 53339071 51411412 47583802 43867008 39519303 36173053
4351 36173053 32925293 30241519 28636354 27851952 27858006 27853315 28380106 29111428 29416951 29122061
4341 29122061 29642953 29866933 29920856 32288637 34575714 39845660 44596859 49111327 52372481
4332 52372481 53771246 53867153 52057554 49653431 46236789 43480820 40222338 38053469
4324 38053469 35049513 33684170 31987552 30918676 30418831 29307741 29393266 28918309 29231169
$$ packed form
4384B2603144j348716q88212j554036r36455m66909j84636r32180J006489n3826
4375A7244663P93507K108010J154929J519195K171641J267836J952093L298720
4367C1510594J537189J285125J244154J607679L099928M056163L951653L385102
4359E1677587K712468O69052j720036j927659l827610l716794m347705l346250
4351C6173053l247760k683774j605165p84402O054m691N26791P31322L05523k94890
4341B9122061N20892K23980N3923K367781K287077N269946M751199M514468L261154
4332E2372481J398765R5907j809599k404123l416642k755969l258482k168869
4324C8053469l003956j365343j696618j068876m99845j111090Q5525m74957L12860
$$ plain form
4315 29231169 28556735 29109790 27984252 28832943 28556088 29123866 29074424 30094718 30152092
4306 30152092 30452534 29900206 30099706 29976612 28685937 28404846 28577700 28643579 28414406
4297 28414406 27996875 27184722 27094446 26750119 25584316 24643235 23892490 22803323 22405838
4288 22405838 21211454 20445893 19567832 18612384 18208641 17676869 17090494 16466911 16257772
4279 16257772 15811307 15443844 15423629 14748474 14804883 15514005 15814765 16393775 17247194 17485037
4269 17485037 17914016 17775461 17563670 16825848 16803131 16199401 15614464 15113891 14895903 14559825
4259 14559825 14782863 14309465 14226252 15152098 15135886 15309963 15595293 16288085 17314574 21129598
4249 21129598 26598916 31670374 35695103 38609773 37833527 36888325 33468670 30218102
$$ packed form
4315B9231169o74434N53055j125538Q48691k76855N67778m9442J020294N7374
4306C0152092L00442n52328J99500j23094j290675k81091J72854O5879k29173
4297B8414406m17531q12153r0276l44327j165803r41081p50745j089167l97485
4288B2405838j194384p65561q78061r55448m03743n31772n86375o23583k09139
4279A6257772m46465l67463k0215o75155N6409P09122L00760N79010Q53419K37843
4269A7485037M28979j38555k11791p37822k2717o03730n84937n00573k17988l36078
4259A4559825K23038m73398q3213R25846j6212J74077K85330O92792J026489L815024
4249B1129598N469318N071458M024729K914670p76246r45202l419655l250568
$$ plain form
4241 30218102 26720677 23927752 21653805 19934924 19908826 20493044 21538323 22369176 22483752
4232 22483752 21920606 21518003 20605399 20489803 19474735 19192163 18273264 18795066 19908939
4223 19908939 23369319 33349654 44042953 52581026 61449292 63303663 60428001 57480977
4215 57480977 50775912 44481163 37269866 30518108 25800427 21110043 18718371 17034267
4207 17034267 15592724 14488757 13672027 13655369 12373714 12133691 12371328 11838000 11681809
4198 11681809 11690548 12679384 13427041 15965975 21016449 25704237 30530907 33833798 32828574
4189 32828574 32332438 30184139 26456581 23466025 19812893 17509990 15004644 13072127
4181 13072127 11849110 10966039 10658147 9266335 9079321 8745308 8306257 7165776 6959775
$$ packed form
4241C0218102l497425k792925k273947j718881k6098N84218J045279Q30853J14576
4232B2483752n63146m02603r12604j15596j015068k82572r18899N21802J113873
4223A9908939L460380R980335J0693299Q538073Q868266J854371k875662k947024
4215E7480977o705065o294749p211297o751758m717681m690384k391672j684104
4207A7034267j441543j103967q16730j6658j281655k40023K37637n33328j56191
4198A1681809Q739R88836P47657K538934N050474M687788M826670L302891j005224
4189C2828574m96136k148299l727558k990556l653132k302903k505346j932517
4181A3072127j223017q83071l07892j391812j87014l34013m39051j140481k06001
$$ plain form
4172 6959775 7445709 7401448 6899445 6405091 6658773 6182586 6586690 5830912 5520125 5936991
4162 5936991 6206092 6185344 5571085 5988270 5297768 6040745 5627297 5780237 5996147 5808250
4152 5808250 5328531 5351281 5246341 5227419 5269961 4981152 5169657 4581068 4775186 4430211
4142 4430211 4807099 4662581 4180253 4494680 4522345 4455778 4127232 4141377 4194905 4005049
4132 4005049 4066174 3642090 3939524 3762875 4326021 3964839 4091339 4196221 3997515 3843489
4122 3843489 3714641 3931255 3994020 3981860 4315380 3996850 3953522 3747128 3526169 4033475
4112 4033475 4074946 3980984 3508342 3686304 3600067 3598803 4154677 3670065 3829332 3729278
4102 3729278 3671018 3741711 3658734 3614903 3468157 3200823 3761298 3231310 3506439 3322332
$$ packed form
4172F959775M85934m4261n02003m94354K53682m76187M04104p55778l10787M16866
4162E936991K69101k0748o14259M17185o90502P42977m13448J52940K15910j87897
4152E808250m79719K2750j04940j8922M2542k88809J88505n88589J94118l44975
4142D430211L76888j44518m82328L14427K7665o6567l28546J4145N3528j89856
4132D005049O1125m24084K97434j76649N63146l61182J26500J04882j98706j54026
4122C843489j28848K16614O2765j2160L33520l18530m3328k06394k20959N07306
4112D033475M1471r3962m72642J77962q6237j264N55874m84612J59267j00054
4102C729278n8260P0693q2977m3831j46746k67334N60475n29988K75129j84107
$$ plain form
4092 3322332 3546050 3758663 3644987 3742697 3542422 3992845 3617593 3947664 3536884 4138299
4082 4138299 3866891 3898375 3453683 3412960 3278345 3258320 3335665 3637882 3178702 3467409
4072 3467409 3587069 3299896 2949289 3671103 3641423 3453737 3151797 3608756 3643108 3682624
4062 3682624 3328882 3380686 3553495 3773515 3911033 3680134 3695771 3637338 3116935 4050543
4052 4050543 3237683 4020029 3858950 3547724 3324069 4224682 3268955 3544070 3619233 3454847
4042 3454847 4390665 3660845 3716418 3440695 3861227 3318045 3892411 3424192 3770509 4050657
4032 4050657 4154845 3550914 4198574 3700154 3895706 4444208 4455683 4226337 4622770 4925612
4022 4925612 4992592 4948154 5221946 4674883 4910736 4719731 4353891 4276542 3936908 4017984
$$ packed form
4092C322332K23718K12613j13676R7710k00275M50423l75252L30071m10780O01415
4082D138299k71408L1484m44692m0723j34615k0025P7345L02217m59180K88707
4072C467409J19660k87173l50607P21814k9680j87686l01940M56959L4352L9516
4062C682624l53742N1804J72809K20020J37518k30899J5637n8433n20403R33608
4052D050543q12860P82346j61079l11226k23655R00613r55727K75115P5163j64386
4042C454847R35818p29820N5573k75723M20532n43182N74366m68219L46317K80148
4032D050657J04188o03931O47660m98420J95552N48502J1475k29346L96433L02842
4022D925612O6980m4438K73792n47063K35853j91005l65840p7349l39634Q1076
$$ plain form
4012 4017984 3506024 3916575 3509895 3852025 3437312 3310552 3376213 3233656 3523198 3588365
4002 3588365 3621129 3575732 4495984 4168507 4494717 3966045 4749348 4729231 4444947 4318220
3992 4318220 4614629 4111355 4048663 4049996 3873644 4202639 3407850 4017856 3454702 3920908
3982 3920908 3645807 3940476 4111109 5478684 4912296 5755193 5254308 5782930 5359829
3973 5359829 5480086 5025885 4458647 4613125 3851788 4217606 3544257 4285081 3173147
3964 3173147 3460262 2737487 3042556 2697150 2746055 3196980 3819839 4359799 4669931 4525266
3954 4525266 4252876 4541767 4339479 4090462 2954239 3069141 2789860 2579762 1844510
3945 1844510 1989485 2157635 1732413 2046217 1760473 2063950 1644098 1540978 1281210 1787766
$$ packed form
4012D017984n11960M10551m06680L42130m14713j26760O5661j42557K89542O5167
4002C588365L2764m5397R20252l27477L26210n28672P83303k0117k84284j26727
3992D318220K96409n03274o2692J333j76352L28995p94789O10006n63154M66206
3982C920908k75101K94669J70633J367575n66388Q42897n00885N28622m23101
3973E359829J20257m54201n67238J54478p61337L65818o73349P40824j111934
3964C173147K87115p22775L05069l45406M8905M50925O22859N39960L10132j44665
3954D525266k72390K88891k02288k49017j136223J14902k79281k10098p35252
3945A844510J44975J68150m25222L13804k85744L03477m19852j03120k59768N06556
$$ plain form
3935 1787766 1099606 1168955 1270758 1596041 1273412 1496456 915498 1246415 1145001 1609195
3925 1609195 1008488 1262818 1047457 997297 978651 1246140 725194 757629 870225 818233
3915 818233 1113281 1156474 1281484 953867 853967 784682 1066305 780025 745958 1384997
3905 1384997 904369 1254400 1081227 1271084 1011700 1115725 575126 996449 962648 750819
3895 750819 417032 1204353 1086418 953457 466615 534689 1231644 855465 897585 571808
3885 571808 779962 718397 1503338 501405 1263368 822189 1391854 577146 553729 779508
3875 779508 639198 949381 380637 849909 703836 1017968 758566 675259 887357 194192
3865 194192 677717 387055 847134 373080 795911 105134 844188 772524 519506 411758
$$ packed form
3935A787766o88160O9349J01803L25283l22629K23044n80958L30917j01414M64194
3925A609195o00707K54330k15361n0160j8646K67489n20946L2435J12596n1992
3915H18233K95048M3193J25010l27617r9900o9285K81623k86280l4067O39039
3905A384997m80628L50031j73173J89857k59384J04025n40599M21323l3801k11829
3895G50819l33787P87321j17935j32961m86842O8074O96955l76179M2120l25777
3885E71808K08154o1565P84941j001933P61963m41179N69665q14708k3417K25779
3875G79508j40310L10183n68744M69272j46073L14132k59402q3307K12098o93165
3865A94192M83525k90662M60079m74054M22831o90777P39054p1664k53018j07748
$$ plain form
3855 411758 276315 145344 202592 526261 225980 221583 431087 -7520 449149 322610
3845 322610 204225 494505 31493 604911 310152 -80671 -27539 662851 555207 301247
3835 301247 67137 286858 582593 536000 57781 354667 -179953 743962 -51675 -105562
3825 -105562 228826 271949 28382 356782 131189 619573 562235 619334 71810 622387
3815 622387 -118725 -346949 -51737 105776 184863 -162152 630752 267155 721966 261322
3805 261322 69829 73981 307447 144083 -167196 98476 238752 609860 297339 258513
3795 258513 701052 246434 376344 -37065 421010 84868 683578 182107 594640 757597
3785 757597 666495 570319 206140 694684 395274 599605 377077 663215 444085 204579
$$ packed form
3855D11758j35443j30971N7248L23669l00281m397K09504m38607M56669j26539
3845C22610j18385K90280m63012N73418k94759l90823N3132O90390j07644k53960
3835C01247k34110K19721K95735m6593m78219K96886n34620R23915p95637n3887
3825a05562L34388M3123k43567L28400k25593M88384n7338N7099n47524N50577
3815F22387p41112k28224K95212J57513P9087l47015P92904l63597M54811m60644
3805B61322j91493M152K33466j63364l11279K65672J40276L71108l12521l8826
3795B58513M42539m54618J29910m13409M58075l36142N98710n01471M12533J62957
3785G57597r1102r6176l64179M88544k99410K04331k22528K86138k19130k39506
$$ plain form
3775 204579 471376 231290 453679 795494 56321 786725 451918 541566 153892 535124
3765 535124 384445 112737 140300 225600 497818 116252 397666 505703 449375 158627
3755 158627 252543 83517 232641 325776 333858 432506 321219 573834 451341 394579 474577
3744 474577 447112 81683 225701 595344 384158 528214 141857 -94916 -210292 527353
3734 527353 226770 -103160 403796 -158343 710612 188685 217544 444640 140275 30221
3724 30221 249067 245341 64940 107117 -81445 519497 394711 102148 308514 294620 144107
3713 144107 -572252 1133 -125517 126498 255687 -35758 382444 63282 162028 183671
3703 183671 153830 534207 -30959 297361 550982 382101 457276 324614 183697 3307
$$ packed form
3775B04579K66797k40086K22389L41815p39173P30404l34807Q9648l87674L81232
3765E35124j50679k71708K7563Q5300K72218l81566K81414J08037n6328k90748
3755A58627R3916j69026J49124R3135Q082R8648j11287K52615j22493n6762P9998
3744D74577k7465l65429J44018L69643k11186J44056l86357k36773j15376P37645
3734E27353l00583l29930N06956n62139Q68955n21927K8859K27096l04365j10054
3724C0221K18846l726j80401M2177j88562O00942j24786k92563K06366j3894j50513
3713A44107p16359N73385j26650K52015J29189k91445M18202l19162R8746K1643
3703A83671k9841L80377n65166L28320K53621j68881P5175j32662j40917j80390
$$ plain form
3693 3307 420308 332391 589598 9302 56413 287681 -16663 -73706 124540 288442 473544
3682 473544 326112 258271 512494 479942 -31868 208999 644968 328115 486536 420535
3672 420535 209582 80105 723241 -42257 -263552 126315 433463 273259 167599 214100
3662 214100 -41832 500213 -184255 475284 263399 263284 260302 469093 245263 485782 347562
3651 347562 65896 408983 577631 351540 -568222 11634 68336 90994 524484 -176801
3641 -176801 -503 175815 215715 83158 393394 -170027 -195066 -81403 592300 192583
3631 192583 136980 -252294 -111020 283123 -132365 -120847 340930 -296685 288806 245844
3621 245844 206912 393342 -71528 483237 -152770 511233 -125368 -116759 -124019 -238482 -205038
$$ packed form
3693C307M17001q7917K57207n80296M7111K31268l04344n7043J98246J63902J85102
3682D73544j47432o7841K54223l2552n11810K40867M35969l16853J58421o6001
3672D20535k10953j29477O43136p65498k21295L89867L07148j60204j05660M6501
3662B14100k55932N42045o84468O59539k11885j15k982K08791k23830K40519j38220
3651C47562k81666L43087J68648k26091r19762N79856N6702K2658M33490p01285
3641a76801J76298J76318L9900j32557L10236n63421k5039J13663O73703l99717
3631A92583n5603l89274J41274L94143m15488J1518M61777o37615N85491m2962
3621B45844l8932J86430m64870N54765o36007O64003o36601Q609p260j14463L3444
$$ plain form
3610 -205038 -150998 185958 -237722 -144036 107626 404153 45729 95679 -414204 -28645
3600 -28645 123943 41285 198606 18813 -5547 114696 -4762 -102558 -1613 150934
3590 150934 -92513 67113 -174727 -78524 -103490 109923 -209958 -126116 22860 -22694
3580 -22694 257345 269088 20685 -179400 -209193 386915 628080 262194 636338 608273
3570 608273 -217415 549734 186953 390524 301923 595940 928174 957767 940298 640679
3560 640679 1506570 1884341 1753109 1620656 1267719 1914707 1775982 905166 912715 682044
3550 682044 734609 857919 819393 525605 611875 627431 552399 195791 635177 261528 603494
3539 603494 540296 43860 579404 507526 6838 323687 532944 265677 158957 340555
$$ packed form
3610b05038N4040L36956m23680R3686K51662K96527l58424M9950n09883L85559
3600b8645J52588q2658J57321j79793k4360J20243j19458r7796J00945J52547
3590A50934k43447J59626k41840R6203k4966K13413l19881Q3842J48976m5554
3580b2694K80039J1743k48403k00085k9793N96108K41165l65886L74144k8065
3570F08273q25688P67149l62781K03571q8601K94017L32234K9593j7469k99619
3560F40679Q65891L77771j31232j32453l52937O46988j38725q70816P549k30671
3550F82044N2565J23310l8526k93788Q6270J5556p5032l56608M39386l73649L41966
3539F03494o3198m96436N35544p1878n00688L16849K09257k67267j06720J81598
$$ plain form
3529 340555 -28714 266289 150836 189487 772000 201095 172978 269501 307035 267882 82395
3518 82395 256005 310299 347312 690841 383681 414953 368803 406463 19011 181061 -215048
3507 -215048 509568 390224 -13147 252319 -8100 226328 406567 700916 252061 631676
3497 631676 540510 720829 328322 557405 169892 578573 32517 770104 549161 137764
3487 137764 373051 369835 224479 515502 572328 468681 588336 885993 589929 379705
3477 379705 773789 1059491 249039 386664 645554 807354 571707 758201 780877 1079366
3467 1079366 842390 702580 893746 831268 608985 1027113 932887 448869 650958 945220
3457 945220 665435 752591 515542 559897 1041568 1001757 1184714 509766 467692 771973
$$ packed form
3529C40555l69269K95003j15453L8651N82513n70905k8117R6523L7534l9153j85487
3518H2395J73610N4294L7013L43529l07160L1272m6150L7660l87452J62050l96109
3507b15048P24616j19344m03371K65466k60419K34428J80239K94349m48855L79615
3497F31676r1166J80319l92507K29083l87513M08681n46056P37587k20943m11397
3487A37764K35287l216j45356K91023N6826j03647J19655K97657k96064k10224
3477C79705L94084K85702q10452J37625K58890J61800k35647J86494K2676K98489
3467A079366k36976j39810J91166o2478k22283M18128r4226m84018K02089K94262
3457I45220k79785Q7156k37049M4355M81671l9811J82957o74948m2074L04281
$$ plain form
3447 771973 1077386 496120 550976 784711 710579 932615 943286 434463 865170 1075664
3437 1075664 1034718 872094 1083931 940101 798691 1278570 1363663 1033784 1301402 1514077
3427 1514077 1105704 1218636 1316027 1439616 756522 1217664 1160790 1590756 1106651 1561580
3417 1561580 1420304 1170727 1379715 1194637 1457284 1659539 1864008 1493426 1350716 1606806
3407 1606806 1490429 1603872 1563360 1915509 1555081 2030213 1823228 1933009 1839872 2338857
3397 2338857 1890800 1809787 2110538 2254937 2293295 2293361 2538514 2196929 2468596 2407202 2537192
3386 2537192 2334213 2259610 2382436 2807276 3021269 3042439 2519491 3037998 3070127 3221715
3376 3221715 3641658 3419666 3186640 3757163 3929824 3824025 4083412 4100804 4586013 4611209
$$ packed form
3447G71973L05413n81266N4856K33735p4132K22036J0671n08823M30707K10494
3437A075664m0946j62624K11837j43830j41410M79879Q5093l29879K67618K12675
3427A514077m08373J12932R7391J23589o83094M61142n6874M29966m84105M54929
3417A561580j41276k49577K08988j85078K62647K02255K04469l70582j42710K56090
3407A606806j16377J13443m0512L52149l60428M75132k06985J09781r3137M98985
3397B338857m48057q1013L00751J44399L8358O6K45153l41585K71667o1394J29990
3386B537192k02979p4603J22826M24840K13993K1170n22948N18507L2129J51588
3376C221715M19943k21992k33026N70523J72661j05799K59387J7392M85209K5196
$$ plain form
3366 4611209 4810438 5010652 4488166 4881918 4813737 5598475 5300629 5623242 5553246 5620104
3356 5620104 6502398 6328977 5917897 6429589 7037245 7253090 7507632 8201323 8306112 8853012
3346 8853012 9685588 10669481 11122632 12883921 14639215 18035879 21076017 24768406 26406175
3337 26406175 27796266 30058753 31768898 34095318 37023965 42456152 51330347 79226858
3329 79226858 141485497 196504027 243959850 293012928 283203167 274569539 255862550
3322 255862550 214537544 178603400 143029602 113757578 86261208 64390354 54160464
3315 54160464 47463075 43062316 38879899 34929675 31490349 28334577 25418183 22447674
3307 22447674 19827555 18258820 16469126 15349049 14513144 13567545 12724214 12592033 11683368
$$ packed form
3366D611209J99229K00214n22486L93752o8181P84738k97846L22613o9996O6858
3356E620104Q82294j73421m11080N11692O07656K15845K54542O93691J04789N46900
3346H853012Q32576R83893M53151J761289J755294L396664L040138L692389J637769
3337B6406175J390091K262487J710145K326420K928647N432187Q874195K7896511
3329G9226858O2258639N5018530M7455823M9053078r809761q633628j8706989
3322B55862550m1325006l5934144l5573798k9272024k7496370k1870854j0229890
3315E4160464o697389m400759m182417l950224l439326l155772k916394k970509
3307B2447674k620119j568735j789694j120077q35905r45599q43331j32181r08665
$$ plain form
3298 11683368 11351391 10809690 10452299 9664943 9970458 9372907 8834872 8902236 8678517 8010931
3288 8010931 7882792 7978764 7411056 7035308 6969201 6596627 6402724 6130491 6125190 5610796
3278 5610796 5595112 5788036 5537718 5266195 4845450 5047592 5000208 4451684 4276485 4639621
3268 4639621 4256946 4389266 4304169 3910136 4006108 4063210 3777969 3227434 4127564 3752418
3258 3752418 3230993 2833026 3287063 3105158 2859405 3013357 2686093 2818177 3123718 2883755
3248 2883755 2622892 2494482 2380877 2968787 2059721 2620816 2644383 1998617 2540195 2594771
3238 2594771 2574294 2254757 2015010 2601105 2285370 1647764 1732413 1837084 2003603 1975393
3228 1975393 1632298 1964734 1947803 1935998 1973950 1228471 1615404 2163071 1486867 1547196
$$ packed form
3298A1683368l31977n41701l57391p87356L05515n97551n38035O7364k23719o67586
3288H010931j28139R5972n67708l75748o6107l72574j93903k72233n301n14394
3278E610796j5684J92924k50318k71523m20745K02142m7384n48524j75199L63136
3268D639621l82675J32320q5097l94033R5972N7102k85241n50535R00130l75146
3258C752418n21425l97967M54037j81905k45753J53952l27264J32084L05541k39963
3248B883755k60863j28410j13605N87910r09066N61095K3567o45766N41578N4576
3238B594771k0477l19537k39747N86095l15735o37606Q4649J04671J66519k8210
3228A975393l43095L32436j6931j1805L7952p45479L86933N47667o76204O0329
$$ plain form
3218 1547196 1436709 1529514 1167755 1240296 1347215 1473609 1701818 1020567 1242893 1465764
3208 1465764 1625711 1004940 1145687 761168 1109668 917538 1776777 1255465 1084495 997207
3198 997207 1409002 1579709 975471 696281 693877 796087 1148148 775128 842134 885340
3188 885340 757606 893577 999780 835136 689093 330135 868180 1089684 890540 691386
3178 691386 285900 998276 689526 789740 184423 1123606 550948 1235514 701312 555247
3168 555247 201805 409910 500548 317976 843442 519940 178556 491195 283612 571396
3158 571396 244608 -1659 275163 275981 496953 194209 -40374 -33261 222921 669892 -93646
3147 -93646 318022 406535 126896 123359 256344 191504 75327 -33808 286466 -58107 -192533
$$ packed form
3218A547196j10487R2805l61759P2541J06919J26394K28209o81251K22326K22871
3208A465764J59947o20771J40747l84519L48500j92130Q59239n21312j70970q7288
3198I97207M11795J70707o04238k79190k404J02210L52061l73020O7006M3206
3188H85340j27734J35971J06203j64644j46043l58958N38045K21504j99144j99154
3178F91386m05486P12376l08750J00214o05317R39183n72658O84566n34202j46065
3168E55247l53442K08105R0638j82572N25466l23502l41384L12639k07583K87784
3158E71396l26788k46267K76822Q18K20972l02744k34583P113K56182M46971p63538
3147i3646M11668Q8513k79639l537J32985o4840j16177j09135L20274l44573j34426
$$ plain form
3136 -192533 82018 -48329 149257 -139178 73387 211415 149759 242966 -62735 -1670
3126 -1670 249109 -155056 -148030 197227 -45427 51094 239822 -642575 123669 172064 220773
3115 220773 -806181 454937 420690 381046 -61090 -174207 242924 125258 746290 -194953
3105 -194953 146551 348295 681681 204461 -43349 285375 57396 -185136 603920 753558
3095 753558 698394 688075 1441147 1377199 1585724 1178715 1178160 1790802 1174054 1029067 1035035
3084 1035035 535626 631598 485691 783062 726850 355103 339763 416328 188345 709408
3074 709408 38587 34583 10440 172584 442492 618669 -161535 -91654 349948 -201652
3064 -201652 34730 268251 413689 358999 -137842 -199571 419779 201924 -218914 616720
$$ packed form
3136a92533K74551j30347J97586k88435K12565J38028o1656R3207l05701O1065
3126a670K50779m04165P026L45257k42654R6521J88728q82397P66244M8395M8709
3115B20773j026954J261118l4247l9644m42136j13117M17131j17666O21032r41243
3105a94953L41504K01744L33386m77220k47810L28724k27979k42532P89056J49638
3095G53558n5164j0319P53072o3948K08525m07009n55O12642o16748j44987N968
3084A035035m99409R5972j45907K97371n6212l71747j5340P6565k27983N21063
3074G09408o70821m004k4143J62144K69908J76177p80204O9881M41602n51600
3064b01652K36382K33521J45438n4690m96841o1729O19350k17855m20838Q35634
$$ plain form
3054 616720 -46363 498277 -12833 -24970 217645 572279 238655 -119424 50421 328429
3044 328429 131438 290278 469324 281821 396512 240516 -162926 331771 407581 62783
3034 62783 -53947 626473 496598 23846 -233857 362156 621430 229437 218749 354835
3024 354835 -104010 224932 222365 219263 321279 405120 70156 -277355 -251547 21971 142173
3013 142173 215285 -77182 -101711 -182134 89341 -263256 212958 -264014 -825101 -138909
3003 -138909 -349149 -214529 47059 -123075 -294701 -2322 -314016 -292717 -37310 313635
2993 313635 -453379 -296129 -75861 -72812 87551 -445461 -357500 -519028 -204204 -120940
2983 -120940 -226464 -536072 142955 74467 -548935 -668587 -182885 -179528 -129829 143251
$$ packed form
3054F16720o63083N44640n11110j2137K42615L54634l33624l58079J69845K78008
3044C28429j96991J58840J79046j87503J14691j55996m03442M94697P5810l44798
3034F2783j16730O80420j29875m72752k57703N96013K59274l91993j0688J36086
3024C54835m58845L28942k567l102J02016Q3841l34964l47511K5808K73518J20202
3013A42173P3112k92467k4529q0423K71475l52597M76214m76972n61087O86192
3003a38909k10240J34620K61588j70134j71626K92379l11694K1299K55407L50945
2993C13635p67014J57250K20268L049J60363n33012Q7961j61528L14824Q3264
2983a20940j05524l09608O79027o8488o23402j19652M85702L357M9699K73080
$$ plain form
2973 143251 -166000 -440577 347290 199114 76489 -311206 -103450 496224 303965 512189
2963 512189 625823 -125909 274620 117370 372898 -336041 186076 141378 254785 229777
2953 229777 -129480 134628 -64569 670662 -189459 -40769 -207470 227345 305082 -27991
2943 -27991 -13216 325588 -155809 -82899 119167 9592 253226 174494 107743 -309342 61868
2932 61868 276044 106998 106063 -634955 -27806 -33006 -248574 12164 17174 80771 37493
2921 37493 30621 164629 -228798 346166 -232722 70941 -99344 3638 3504 516398 -373988
2910 -373988 -228106 -70342 -309140 154044 -34245 58847 -2565 -268907 166501 -82716
2900 -82716 -191054 -258109 -78902 99842 77057 -351146 37633 -335151 -54437 -64529
$$ packed form
2973A43251l09251k74577P87867j48176j22625l87695K07756N99674j92259K08224
2963E12189J13634p51732M00529j57250K55528p08939N22117m4698J13407k5008
2953B29777l59257K64108j99197P35231q60121J48690j66701M34815P7737l33073
2943b7991J4775L38804m81397P2910K02066j09575K43634p8732o6751m17085L71210
2932F1868K14176j69046r35p41018O07149n200k15568K60738N010O3597m3278
2921C7493o872J34008l93427N74964n78888L03663j70285J02982j34N12894q90386
2910c73988J45882J57764k38798M63184j88289R3092o1412k66342M35408k49217
2900h2716j08338o7055J79207J78744k2785m28203L88779l72784K80714j0092
$$ plain form
2890 -64529 40518 -271587 -407058 -475363 86014 38577 -232890 171157 -288739 -587969
2880 -587969 32357 12550 241983 -184316 163700 -169534 -258298 52916 108910 242758
2870 242758 -480696 -16153 -571870 288321 189190 -162112 50638 -355597 162104 157448
2860 157448 -291261 -280 362582 -320991 67336 -14989 204408 156703 -431463 310753
2850 310753 -596539 -98950 -226424 -236318 -394141 -310128 383667 -470647 67494 80084
2840 80084 542680 15018 123956 -288684 -269853 -31711 209944 160897 -134507 127434
2830 127434 -41361 71030 -384158 -438648 7484 -789751 -260406 -25260 -185606 -424694
2820 -424694 -302408 -11685 118995 142594 163305 -505711 -19865 44457 -353012 -309430
$$ packed form
2890f4529J05047l12105j35471o8305N61377m7437k71467M04047m59896k99230
2880e87969O20326j9807K29433m26299L48016l33234q8764L11214N5994J33848
2870B42758p23454M64543n55717Q60191r9131l51302K12750m06235N17701m656
2860A57448m48709K90981L62862o83573L88327q2325K19397m7705n88166P42216
2850C10753r07292M97589j27474r894j57823Q4013O93795q54314N38141J2590
2840H0084M62596n27662J08938m12640J8831K38142K41655m9047k95404K61941
2830A27434j68795J12391m55188n4490M46132p97235N29345K35146j60346k39088
2820d24694J22286K90723J30680K3599K0711o69016M85846O4322l97469M3582
$$ plain form
2810 -309430 -301770 -218521 184894 -400124 88384 -498932 -563637 -322859 18768 2874 -8597
2799 -8597 598191 56646 353075 19606 -192035 -9320 203110 -59688 38994 377174
2789 377174 167533 537924 -255027 -47502 309505 176601 -26312 496400 761668 77981
2779 77981 321164 60495 -51080 -61598 355260 130895 34668 150521 90663 33311 215124
2768 215124 439475 39040 60541 -46954 487223 -494602 45840 404281 203737 151750
2758 151750 -209127 105534 -321277 -67649 113518 -113686 47373 -167359 77973 -692050
2748 -692050 145500 -271706 -265150 -442984 -337884 -153784 -152349 141745 -264558 -189448 -274517
2737 -274517 133316 -482726 -384364 -241528 -102636 -305112 -423832 271715 -471577 -577745
$$ packed form
2810c09430P660Q3249M03415n85018M88508n87316o4705K40778L41627j5894j1471
2799h597O06788n41545K96429l33469k11641J82715K12430k62798R8682L38180
2789C77174k09641L70391p92951K07525L57007j32904k02913N22712K65268o83687
2779G7981K43183k60669j11575j0518M16858k24365r6227J15853n9858n7352J81813
2768B15124K24351m00435K1501j07495N34177r81825N40442L58441k00544n1987
2758A51750l60877L14661m26811K53628J81167k27204J61059k14732K45332p70023
2748f92050Q37550m17206O556j77834J05100J84100J435K94094m06303P5110q5069
2737b74517M07833o16042R8362J42836J38892k02476j18720O95547p43292j06168
$$ plain form
2727 -577745 -158708 -244026 -368052 -198031 283453 -702913 -309909 -448916 -719831 -444807
2717 -444807 -118094 -251478 -335966 43703 -437067 -340632 -584213 -74848 -282578 -408377
2707 -408377 -181366 -668197 4612 -261851 -63009 -8556 -223337 -401760 -232645 -447536
2697 -447536 -411465 95207 -531269 122813 -248527 -112156 -281152 -288639 -572989 149040
2687 149040 -331111 -377126 -51723 -90632 143693 -415061 -352789 -152180 186009 74055
2677 74055 -152629 -274936 169075 -444678 -218924 -144180 84537 -389741 -43705 -382194
2667 -382194 -503409 -193544 -60252 553114 305422 -133182 -304865 177441 -148981 363136
2657 363136 -266149 -180564 19053 536340 141781 -393431 -225606 -98657 -446452 223234
$$ packed form
2727e77745M19037q5318j24026J70021M81484r86366L93004j39007k70915K75024
2717d44807L26713j33384q4488L79669m80770R6435k43581N09365k07730j25799
2707d08377K27011m86831O72809k66463J98842N4453k14781j78423J69115k14891
2697d47536L6071N06672o26476O54082l71340J36371j68996p487k84350P22029
2687A49040m80151m6015L25403l8909K34325n58754O2272K00609L38189j11954
2677G4055k26684j22307M44011o13753K25754P4744K28717m74278L46036l38489
2667c82194j21215L09865J33292O13366k47692m38604j71683M82306l26422N12117
2657C63136o29285Q5585J99617N17287l94559n35212J67825J26949l47795O69686
$$ plain form
2647 223234 -396056 -86735 -114483 -26636 142670 -113169 -228673 -97161 -363302 121974
2637 121974 417965 -90224 -23377 129643 -79632 -69601 71932 -112384 -222731 444597
2627 444597 -54600 -72823 -115167 -194661 -163243 11707 -30938 -272256 134545 -160822 541715
2616 541715 -176827 565171 -485987 327217 -4336 452842 -144819 145237 375591 453943
2606 453943 22333 366212 255674 -94399 -145107 -589350 102934 -45563 -48954 -247179
2596 -247179 -192796 52160 68621 -308530 -120865 -541903 -104927 -275061 -411539 -13933
2586 -13933 99127 -306131 -120949 -231406 -626094 129680 -509251 -137401 -583050 -172297
2576 -172297 -109840 -374319 -44470 -486055 -127414 -552173 43927 -618450 -83354 -671739
$$ packed form
2647B23234o19290L09321k7748Q7847J69306k55839j15504J31512k66141M85276
2637A21974K95991n08189O6847J53020k09275J0031J41533j84316j10347O67328
2627D44597m99197j8223m2344p9494L1418J74950m2645k41318M06801k95367P02537
2616E41715p18542P41998j051158Q13204l31553M57178n97661K90056K30354P8352
2606D53943m31610L43879j10538l50073n0708m44243O92284j48497l391j98225
2596b47179N4383K44956J6461l77151J87665m21038M36976j70134j36478L97606
2586a3933J13060m05258J85182j10457l94688P55774o38931L71850m45649M10753
2576a72297O2457k64479L29849m41585L58641m24759N96100o62377N35096n88385
$$ plain form
2566 -671739 -131666 -176949 -15335 -490196 -285570 -282427 -694748 -356143 -366420 533910
2556 533910 -503159 -432372 -933041 -75623 -353521 -321426 -514633 -227898 -40575 -505679
2546 -505679 -429206 -295009 -84538 -248226 -460399 -16256 -230298 -618136 244006 -389858
2536 -389858 802121 -141715 -145349 -115382 150432 -74167 -373024 11244 -172901 -115735
2526 -115735 24488 -178304 69708 206392 -347598 1566 182673 165767 483683 -171354
2516 -171354 -740819 420994 511726 16532 91118 -363478 160437 255169 98112 -128886
2506 -128886 -10997 227555 -285356 201572 -38486 72008 153231 147220 -351462 114446
2496 114446 -250868 -220699 -58268 -436332 197116 80610 -265297 -391105 -57781 -295106
$$ packed form
2566f71739N40073m5283J61614m74861K04626L143m12321L38605j0277R00330
2556E33910j037069P0787n00669Q57418k77898L2095j93207K86735J87323m65104
2546e05679P6473J34197K10471j63688k12173M44143k14042l87838Q62142o33864
2536c89858J191979r43836l634K9967K65814k24599k98857L84268j84145N7166
2526a15735J40223k02792K48012J36684n53990L49164J81107j6906L17916o55037
2516a71354n69465J161813R0732m95194P4586m54596N23915R4732j57057k26998
2506a28886J17889K38552n12911M86928k40058J10494Q1223o011m98682M65908
2496A14446l65314L0169J62431l78064O33448j16506l45907j25808L33324k37325
$$ plain form
2486 -295106 -495070 238293 -409606 -335611 -306893 105084 -519236 -327869 -273528 -362403
2476 -362403 -45809 -265116 -67948 -579309 247219 -57221 -232177 -559753 -180514 -298620
2466 -298620 -491124 241389 -156578 -450499 -26545 -26312 -322461 -251008 -233214 -540249 -410158
2455 -410158 -154072 -26854 -354815 -587794 -328190 53518 15187 -522860 -412601 -337177
2445 -337177 -499574 -155652 -252049 37883 -280475 -33219 64816 -367573 -547512 -417217
2435 -417217 -146118 99406 -123421 64569 36797 -335760 10502 -251751 -776365 -231875
2425 -231875 31796 -203353 24175 -204530 280972 -210688 -332298 -295215 -327146 126289
2415 126289 -11931 119353 -435919 -36526 118237 -131238 6054 -463041 161370 365883
$$ packed form
2486b95106j99964P33363o47899P3995K8718M11977o24320J91367N4341q8875
2476c62403L16594k19307J97168n11361Q26528l04440j74956l27576L79239j18106
2466b98620j92504P32513l97967k93921M23954K33k96149P1453J7794l07035J30091
2455d10158K56086J27218l27961k32979K59604L81708l8331n38047J10259P5424
2445c37177j62397L43922r6397K89932l18358K47256R8035m32389j79939J30295
2435d17217K71099K45524k22827J87990k7772l72557L46262k62253n24614N44490
2425b31875K63671k35149K27528k28705M85502m91660j21610L7083l1931M53435
2415A26289j38220J31284n55272L99393J54763k49475J37292m69095O24411K04513
$$ plain form
2405 365883 253627 -355186 218907 -194411 -233642 -354633 -240880 -500846 -307369 17173
2395 17173 44015 -168601 -422835 -187659 -51897 23660 -478289 -116847 -186412 -515717
2385 -515717 -349619 -271899 -306777 -350456 -266353 -556115 -51815 124942 431777 48302
2375 48302 -127310 -337774 -301518 -515529 -90412 -104611 -77218 1373 62767 -291586 -254720
2364 -254720 264686 -158131 -199551 36002 -222177 245744 -65562 49148 -7941 -197214
2354 -197214 234214 -172593 95420 -502871 -63818 -143527 251773 119628 87476 -131176
2344 -131176 -56494 424110 -123312 78395 345572 252832 -51215 304670 39458 273324
2334 273324 99011 111515 -238907 -6453 -283678 425297 -54159 -142745 -75820 120721
$$ packed form
2405C65883j12256o08813N74093m13318l9231j20991J13753k59966J93477L24542
2395A7173K6842k12616k54234K35176J35762P5557n01949L61442o9565l29305
2385e15717J66098P7720l4878m3679Q4103k89762N04300J76757L06835l83475
2375D8302j75612k10464L6256k14011M25117j4199K7393P8591O1394l54353L6866
2364b54720N19406m22817m1420K35553k58179M67921l11306J14710n7089j89273
2354a97214M31428m06807K68013n98291M39053p9709L95300j32145l2152k18652
2344a31176P4682M80604n47422K01707K67177r2740l04047L55885k65212K33866
2334B73324j74313J2504l50422K32454k77225P08975m79456q8586O6925J96541
$$ plain form
2324 120721 -484775 -165657 106973 -783479 -85321 -333952 -231525 -187058 507000 -28905
2314 -28905 14151 -194231 -18833 119215 87135 273132 -184999 -212602 -496670 179829
2304 179829 -768186 197495 -743439 -260076 65948 -809990 -360319 -684336 345397 -113756
2294 -113756 -32945 -880534 124311 -2807 -502012 -2645 -362358 -67667 -92019 -88376
2284 -88376 -290146 -63838 -214987 -239646 -351495 -430195 91875 220685 -608201 -169171
2274 -169171 -73136 -183130 -776196 -242788 -219038 -18825 -289723 -393328 -360213 -396885
2264 -396885 394992 -448513 -360919 -11173 35280 260222 -246951 -50457 -720335 -128448
2254 -128448 -134809 47713 -746594 -66580 -265810 -306758 -474346 -206406 -191633 -576898
$$ packed form
2324A20721o05496L19118K72630q90452O98158k48631J02427M4467O94058n35905
2314b8905M3056k08382J75398J38048l2080J85997m58131k7603k84068O76499
2304A79829r48015R65681r40934M83363L26024q75938M49671l24017J029733m59153
2294a13756Q0811q47589J004845j27118m99205M99367l59713K94691k4352L643
2284h8376k01770K26308j51149k4659j11849p8700N22070J28810q28886M39030
2274a69171R6035j09994n93066N33408K3750K00213k70898j03605L3115l6672
2264c96885P91877q43505Q7594L49746M6453K24942n07173J96494o69878N91887
2254a28448o361J82522p94307O80014j99230m0948j67588K67940J4773l85265
$$ plain form
2244 -576898 4307 -569653 338524 -168192 282427 -519969 -217933 -557189 64337 -402753
2234 -402753 -648963 -103495 -423234 252804 -564126 -303430 -538410 80736 -449880 -710689
2224 -710689 -690905 -22880 -78276 43249 72580 -7654 -218435 -178295 214516 -606412 -269807
2213 -269807 -567162 195624 -603822 594 -649242 -165848 -664721 -497233 -299127 -533252
2203 -533252 -626629 -521464 -344491 -716936 8128 -387282 -386536 -912425 115331 -267588
2193 -267588 91892 25200 -256461 286580 -244149 -288688 -478522 -148770 -129411 352289
2183 352289 -589548 -348987 -242117 -168125 -604 85289 -175894 -62278 137355 133694
2173 133694 -326847 104121 308438 318299 3634 -341280 394342 98564 47284 -140728
$$ packed form
2244e76898N81205n73960R08177n06716M50619q02396L02036l39256O21526m67090
2234d02753k46210N45468l19739O76038q16930K60696k34980O19146n30616k60809
2224g10689J9784O68025n5396J21525K9331q0234k10781M0140L92811q20928L36605
2213b69807k97355P62786p99446O04416o49836M83394m98873J67488J98106k34125
2203e33252r3377J05165J76973l72445P25064l95410P46n25889J027756l82919
2193b67588L59480o6692k81661N43041n30729m4539j89834L29752J9359M81700
2183C52289r41837K40561J06870P3992J67521Q5893k61183J13616J99633l661
2173A33694m60541M30968K04317R861l14665l44914P35622k95778n1280j88012
$$ plain form
2163 -140728 -66546 -463347 -89388 88010 -110527 -386523 201409 62683 -23661 -131373
2153 -131373 -140184 -55909 123736 191145 -354647 -220805 -229358 324148 -139207 356187 -2818
2142 -2818 211096 51920 73926 -148487 -578476 212797 -13360 -139592 -290249 187907
2132 187907 52617 112867 -98609 -85159 174916 -286399 -248004 -39022 438901 -305475
2122 -305475 403172 -537666 -52206 -289590 -472656 -309578 -398849 56887 -329020 23206
2112 23206 -687640 -404826 -659887 -162319 -207503 -272356 -384203 -284236 -280697 233946 -513381
2101 -513381 -589721 -426194 -352097 -3944 -464061 6493 4893 -281974 -495367 -59692
2091 -59692 -169749 -324429 -458323 -688002 -374020 -411761 -498384 -721311 -108625 -760347
$$ packed form
2163a40728P4182l96801L73959J77398j98537k75996N87932j38726q6344j07712
2153a31373q811Q4275J79645O7409n45792J33842q553N53506m63355M95394l59005
2142b818K13914j59176K2006k22413m29989P91273k26157j26232j50657M78156
2132A87907j35290O0250k11476J3450K60075m61315L8395K08982M77923p44376
2122c05475P08647r40838M85460k37384j83066J63078q9271M55736l85907L52226
2112B3206p10846K82814k55061M97568m5184o4853j11847R9967L539N14643p47327
2101e13381p6340J63527P4097L48153m60117M70554j600k86867k13393M35675
2091e9692j10057j54680j33894k29679L13982l7741q6623k22927O12686o51722
$$ plain form
2081 -760347 -188649 -676702 -523377 -594706 -180317 -321044 -551199 -32586 -590937 -693141
2071 -693141 -276742 -49899 -401565 -562157 -552500 -99473 -419682 -610863 -283173 -68276
2061 -68276 -861367 90668 -210235 -374080 -113638 -346732 -284173 -515203 -405054 -641736
2051 -641736 -183029 -299053 -15142 3321 258776 -522099 -302099 -569873 -201036 -299458
2041 -299458 -259276 -312616 -55397 -27067 -381654 -94077 -426120 62929 -130304 -159961
2031 -159961 -230597 -262991 -164994 306249 235288 -81295 -177028 -306789 -41758 11744 -33611
2020 -33611 -403439 -129075 240885 -83936 -596860 136338 288611 435841 -167971 -274668
2010 -274668 -11367 -250926 86212 -365559 -187033 -99119 -290633 83066 -274470 442612
$$ packed form
2081g60347N71698m88053J53325p1329M14389j40727k30155N18613n58351j02204
2071f93141M16399K26843l51666j60592R657M53027l20209j91181L27690K14897
2061f8276p93091R52035l00903j63845K60442k33094O2559k31030J10149k36682
2051f41736M58707j16024K83911J8463K55455p80875K20000k67774L68837r8422
2041b99458M0182n3340K57219K8330l54587K87577l32043M89049j93233k9657
2031a59961p0636l2394R7997M71243p0961l16583r5733j29761K65031N3502m5355
2020c3611l69828K74364L69960l24821n12924P33198J52273J47230o03812j06697
2010b74668K63301k39559L37138m51771J78526Q7914j91514L73699l57536P17082
$$ plain form
2000 442612 -69663 -86398 -2911 176688 -119915 -324972 285432 -20907 268939 -83994
1990 -83994 -265645 -344534 101476 38325 -1766 -260829 -518808 107026 -125789 -206564 101162
1979 101162 -243060 -483555 10264 -547388 -347383 -275153 -65816 -204784 -27037 -453287
1969 -453287 -40596 -492928 96963 26155 -493910 -578332 51681 -113036 -345512 -452877
1959 -452877 230847 159496 -463591 -250956 -160602 -374192 67898 -222415 -332213 -556832
1949 -556832 -423575 -688205 -387034 -400693 -118367 -282273 211006 332572 -80641 -335334
1939 -335334 -307589 234778 -387565 -47622 -228592 -194157 -328871 -100050 -174298 -10914
1929 -10914 144796 -456265 -190165 -408379 -258448 -318845 247612 -439575 -158190 221036
$$ packed form
2000D42612n12275j6735Q3487J79599k96603k05057O10404l06339K89846l52933
1990h3994j81651p8889M46010o3151m0091k59063k57979O25834k32815q0775L07726
1979A01162l44222k40495M93819n57652K00005P2230K09337j38968J77747m26250
1969d53287M12691m52332N89891p0808n20065q4422O30013j64717k32476j07365
1959d52877O83724p1351o23087K12635R0354k13590M42090k90313j09798k24619
1949e56832J33257k64630L01171j3659K82326j63906M93279J21566m13213k54693
1939c35334K7745N42367o22343L39943j80970L4435j34714K28821p4248J63384
1929a0914J55710o01061K66100k18214J49931o0397N66457o87187K81385L79226
$$ plain form
1919 221036 -185435 -328776 -7944 -26835 -46612 24236 70794 -32967 12038 -235345 -46800
1908 -46800 -369991 -184223 -66128 -182809 -400140 -692484 -318513 -598361 325132 -376703
1898 -376703 -250060 101961 -163144 -378731 -122416 103368 -329587 -206978 -214529 -155954
1888 -155954 -295345 -208976 -589198 171356 149714 -572218 -98243 -469470 -353036 -244787
1878 -244787 -632995 -554140 -628610 -525781 -206435 -696 -396826 -320549 -713190 -86412
1868 -86412 420 -353001 -432070 -149663 -171216 -422291 -412635 -309022 -345746 -23811 -49620
1857 -49620 68031 31243 -274965 -161668 10744 -319349 -427714 -148610 -460098 202446
1847 202446 -118647 136031 -83449 204393 -100374 -571445 86238 -337780 303904 -181908
$$ packed form
1919B21036m06471j43341L20832j8891j9777P0848M6558j03761M5005k47383J88545
1908d6800l23191J85768J18095j16681k17331k92344L73971k79848R23493p01835
1898c76703J26643L52021k65105k15587K56315K25784m32955J22609p551N8575
1888a55954j39391Q6369l80222P60554k1642p21932M73975l71227J16434J08249
1878b44787l88208P8855p4470J02829L19346K05739l96130P6277l92641O26778
1868h6412Q6832l53421p9069K82407k1553k51075R656J03613l6724L21935k5809
1857d9620J17651l6788l06208J13297J72412l30093j08365K79104l11488O62544
1847B02446l21093K54678k19480K87842l04767m71071O57683m24018O41684m85812
$$ plain form
1837 -181908 -116993 -143305 -686886 166272 86498 -185009 -425583 -40883 -111919 -363820
1827 -363820 -795001 -28079 108394 -475114 -220436 -131959 366088 -54352 -325108 -158552
1817 -158552 412844 -453759 149713 -687414 -167159 -451996 -428898 -246685 -454282 -251491
1807 -251491 -204281 -363788 -57761 -1604 106224 -508012 41710 -251637 -99754 -542986
1797 -542986 -115391 -188504 -283253 -683716 -291313 -190253 123258 -155500 -287291 68627
1787 68627 -149372 -503030 -439980 -230379 173921 -439838 -199220 143145 -273791 25172
1777 25172 -462988 -182380 -341343 -332480 -298219 -211910 -544007 125811 -351625 -307377 -248855
1766 -248855 112763 390177 -417035 -428059 -248866 388678 -369847 -178209 -511099 -491109
$$ packed form
1837a81908O4915k6312n43581Q53158p9774k71507k40574L84700p1036k51901
1827c63820m31181P66922J36473n83508K54678Q8477M98047m20440k70756J66556
1817a58552N71396q66603O03472q37127N20255k84837K3098J82213k07597K02791
1807b51491M7210j59507L06027N6157J07828o14236N49722k93347J51883m43232
1797e42986M27595p3113r4749m00463L92403J01060L13511k78758j31791L55918
1787F8627k17999l53658O3050K09601M04300o13759K40618L42365m16936K98963
1777B5172m88160K80608j58963Q863L4261Q6309l32097O69818m77436M4248N8522
1766b48855L61618K77414q07212j1024J79193O37544p58525J91638l32890J9990
$$ plain form
1756 -491109 -164660 -211291 -197634 -407448 242796 -403655 105556 -210974 320435 -267080
1746 -267080 32273 -308244 -492721 224373 -253978 -51963 -215645 -368769 -74938 -515472
1736 -515472 -145496 -36560 -225724 -367875 168038 -170391 -482657 -348567 -10794 -326537
1726 -326537 -745593 315797 -168660 -16948 -467846 168088 187275 -367630 -398169 -114633
1716 -114633 -244177 -26527 137599 -325191 -209069 -28450 -531351 -587432 -190489 4510
1706 4510 -429017 -206717 -276672 -45594 -191030 121117 48787 -196159 -73156 -145968 -30441
1695 -30441 -90058 -80580 -583702 -371269 -22389 -524856 -673266 -5016 116101 292767
1685 292767 -615006 -57960 -404483 -248089 -464864 46385 -540747 -396520 -515076 -64339
$$ packed form
1756d91109L26449m6631J3657k09814O50244o46451N09211l16530N31409n87515
1746b67080K99353l40517j84477P17094m78351K02015j63682j53124K93831m40534
1736e15472L69976J08936j89164j42151N35913l38429l12266J34090L37773l15743
1726c26537m19056J061390m84457J51712m50898O35934J9187n54905l0539K83536
1716a14633j29544K17650J64126m62790J16122J80619n02901n6081L96943J94999
1706D510m33527K22300o9955K31078j45436L12147p2330k44946J23003p2812J15527
1695c0441n9617R478n03122K12433L48880n02467j48410O68250J21117J76666
1685B92767r07773N57046l46523J56394k16775N11249n87132J44227j18556M50737
$$ plain form
1675 -64339 -84593 -449790 -226820 -514465 -689124 -815180 -645736 -496433 -88797 -2349
1665 -2349 -134386 -32156 -422013 7531 -716891 -509252 -368524 -96477 -351953 -487327
1655 -487327 -625368 -514077 -376457 -363921 -1037780 -389492 -89714 -683340 -463030 -174767
1645 -174767 -238490 -411125 -410500 -848160 -376147 -207035 136922 -7089 -313758 -143031
1635 -143031 -160703 -374477 -377561 105105 -48259 -633162 221897 -59534 -137752 -240999
1625 -240999 76450 30997 -267739 -181673 -287515 -227139 133477 5450 -11899 -117463
1615 -117463 192859 162468 -259647 68884 69709 -291386 -113551 126339 88998 -461463 19579
1604 19579 -87550 106115 -292104 -119395 -576411 54380 81398 -363185 188780 -502691
$$ packed form
1675f4339k0254l65197K22970k87645j74659j26056J69444J49303M07636Q6448
1665b349j32037J02230l89857M29544p24422K07639J40728K72047k55476j35374
1655d87327j38041J11291J37620J2536o73859O48288K99778n93626K20310K88263
1645a74767o3723j72635O25m37660M72013J69112L43957j44011l06669J70727
1635a43031j7672k13774l084M82666j53364n84903Q55059k81431p8218j03247
1625b40999L17449m5453k98736Q6066j05842O0376L60616j28027j7349j05564
1615a17463L10322l0391m22115L28531Q25l61095J77835K39890l7341n50461M81042
1604A9579j07129J93665l98219J72709m57016O30791K7018m44583N51965o91471
$$ plain form
1594 -502691 92530 -71471 -655578 26135 209486 244606 -118499 -415578 -146639 -272214
1584 -272214 -124801 -40577 -491849 -106982 116811 -350415 9086 -698567 -223039 115572
1574 115572 -281906 -204353 -147569 -65716 -233694 -622879 -410079 -752369 -270202 -830239
1564 -830239 -80035 -235989 27599 -227534 -97695 -352340 -185549 -504536 -444904 -56982
1554 -56982 -508013 -340814 -655324 69038 -495632 -147643 -163911 -201530 -77255 -493573
1544 -493573 -617897 -119199 -146231 -558248 88741 -709437 -22468 -49465 -401086 6675
1534 6675 -507499 -82979 -233460 -16296 -147459 -261727 37998 -138939 -396978 -497470
1524 -497470 -527890 -169560 -352509 376529 -223539 -475856 -201775 -76980 -1060495 -500021
$$ packed form
1594e02691N95221j64001n84107O81713J83351L5120l63105k97079K68939j25575
1584b72214J47413Q4224m51272L84867K23793m67226L59501p07653M75528L38611
1574A15572l97478P7553N6784Q1853j67978l89185K12800l42290M82167n60037
1564h30239P50204j55954K63588k55133J29839k54645J66791l18987N9632L87922
1554e6982m51031J67199l14510P24362n64670L47989j6268l7619J24275m16318
1544d93573j24324M98698k7032m12017O46989p98178O86969k6997l51621M07761
1534F675n14174M24520j50481K17164j31163j14268K99725j76937k58039j00492
1524d97470l0420L58330j82949P29038o00068k52317K74081J24795r83515N60474
$$ plain form
1514 -500021 -419838 102040 -174965 -175743 48288 -495576 -58578 -500557 -17521 -622922
1504 -622922 173186 -342172 -478502 -379346 128965 -702524 -106732 -26271 -287840 60210
1494 60210 -170042 -555494 -348683 -275826 -307555 99358 -450635 -87440 205420 373304
1484 373304 -332120 -371720 -446226 -349879 98979 33062 -448770 -9314 144389 469609
1474 469609 -373438 -212502 -121233 67202 -18 -307118 -825525 -141811 159518 -269099
1464 -269099 469260 -800388 -147448 -616411 -318343 -69149 62111 -280746 -204229 -377051
1454 -377051 -204589 -267826 -532769 -122549 96712 -180690 -609268 139303 -285645 -590934
1444 -590934 -230267 -296923 -213834 -437853 -869622 -479864 -398952 -502145 -399823 -707318
$$ packed form
1514e00021Q0183N21878k77005p78K24031n43864M36998m41979M83036o05401
1504f22922P96108n15358j36330R9156N08311q31489N95792Q0461k61569L48050
1494F0210k30252l85452K06811P2857l1729M06913n49993L63195K92860J67884
1484C73304p05424l9600p4506R6347M48858o5917m81832M39456J53703L25220
1474D69609q43047J60936R1269J88435o7220l07100n18407O83714L01329m28617
1464b69099P38359j269648O52940m68963K98068K49194J31260l42857P6517j72822
1454c77051J72462o3237k64943M10220K19261k77402m28578P48571m24948l05289
1444e90934L60667o6656Q3089k24019m31769L89758Q0912j03193J02322l07495
$$ plain form
1434 -707318 198765 -329991 -133080 -520519 -292452 -442147 -176935 -262521 -690090 -406413
1424 -406413 -777398 367861 -640426 260149 -532291 82149 283301 241504 -601107 -803820
1414 -803820 967 -141297 56211 -777327 -34299 -717690 -166640 62233 -41188 -322036
1404 -322036 -598513 -99339 135569 -32401 -360341 27840 -372201 54980 -452312 -370483
1394 -370483 -196791 -125115 -46027 -132846 -428134 30349 -324047 154503 -245171 -677031
1384 -677031 -22917 -261261 -157211 -660937 -65525 -317022 105869 -235260 -205283 -389373
1374 -389373 -400538 -398299 -370849 109901 -935913 158311 -590201 75917 -234368 -56440
1364 -56440 -634791 -489134 -119482 -575392 196472 -649391 -80201 -536983 -245822 -468022
$$ packed form
1434g07318R06083n28756J96911l87439K28067j49695K65212q5586m27569K83677
1424d06413l70985J145259j008287R00575p92440O14440K01152m1797q42611k02713
1414h03820Q04787j42264J97508q33538P43028o83391N51050K28873j03421k80848
1404c22036k76477M99174K34908j67970l27940L88181m00041M27181n07292Q1829
1394c70483J73692P1676P9088q6819k95288M58483l54396M78550l99674m31860
1384f77031O54114k38344J04050n03726N95412k51497M22891l41129K9977j84090
1374c89373j1165K239K7450M80750j045814J094224p48512O66118l10285J77928
1364e6440n78351J45657L69652m55910P71864q45863N69190m56782K91161k22200
$$ plain form
1354 -468022 -189173 -280330 -185672 -623176 -701911 -493555 -242436 -428932 -383667 -40453
1344 -40453 -93218 -327905 -247523 -37513 -430968 136453 -244609 44783 -902519 -562285
1334 -562285 -312816 264448 -481290 -312634 -319329 -482476 -52188 -429685 -389951 -68077
1324 -68077 -35112 170866 96479 -129245 285699 97844 -214891 -183850 -484829 -178187
1314 -178187 195190 -173963 -42327 -437660 -6792 -133147 -595694 -214602 -303081 -401016
1304 -401016 -479249 -264030 -587705 69681 -531381 -460081 -394772 -218804 -41920 -374653
1294 -374653 -148637 -410628 -360828 -761599 -361126 -68072 -125404 -702554 -250637 58244
1284 58244 -313423 -322085 -40798 -485188 -247930 -327699 -77640 -487438 -393089 -382197 -43727
$$ packed form
1354d68022K78849r1157R4658m37504p8735K08356K51119j86496M5265L43214
1344d0453n2765k34687Q0382K10010l93455N67421l81062K89392r47302L40234
1334e62285K49469N77264p45738J68656o695j63147M30288l77497L9734L21874
1324f8077L2965K05978p4387k25724M14944j87855l12735L1041l00979L06642
1314a78187L73377l69153J31636l95333M30868j26355m62547L81092q8479r7935
1304d01016p8233K15219l23675O57386o01062P1300O5309J75968J76884l32733
1294c74653K26016k61991M9800m00771M00473K93054n7332n77150M51917L08881
1284E8244l71667q662K81287m44390K37258p9769K50059m09798R4349J0892L38470
$$ plain form
1273 -43727 -145799 -763562 -129404 -328604 -145852 -413819 -435987 -664478 -93864 -526719
1263 -526719 -558412 -355203 -632351 -687580 -144920 -137374 -746048 -281376 -449067 70672
1253 70672 -323539 -347249 -436649 -526538 -719387 -365385 84304 -144207 -368990 -31174
1243 -31174 -936510 -195098 -396835 -409020 -406039 -229058 -594497 -308508 -411630 -316869 -79369
1232 -79369 -539990 -247402 -259099 -135920 -200980 -161391 -300686 343254 -382893 -328495 -649094
1221 -649094 -380962 -425844 -175603 -132854 -414604 -283373 330932 -468374 -442091 -353392
1211 -353392 -2473 -299645 -157407 -343854 -670592 -303227 -151071 -318069 229249 -259525
1201 -259525 -363469 -249496 24664 -367921 63478 -625688 51884 107037 33754 -258186
$$ packed form
1273d3727j02072o17763O34158j99200J82752k67967k2168k28491N70614m32855
1263e26719l1693K03209k77148n5229N42660P546o08674M64672j67691N19739
1253G0672l94211k3710q9400q9889j92849L54002M49689k28511k24783L37816
1243c1174r05336P41412k01737j2185K981J76981l65439K85989j03122R4761K37500
1232g9369m60621K92588j1697J23179o5060L9589j39295O43940p26147N4398l20599
1221f49094K68132m4882K50241M2749k81750J31231O14305p99306K6283Q8699
1211c53392L50919k97172J42238j86447l26738L67365J52156j66998N47318m88774
1201b59525j03944J13973K74160l92585M31399o89166O77572N5153p3283k91940
$$ plain form
1191 -258186 -428225 -332331 223472 -129281 138685 162669 -142036 292446 130566 30579
1181 30579 -69141 193278 -266156 317795 -35862 163326 -271634 -511027 -343327 -170292
1171 -170292 -37086 -219667 -73740 140198 -108580 -188465 171361 -114402 69252 -58489
1161 -58489 -74557 -46281 -234815 52314 -118285 -385965 -44617 -101200 -150248 324128 -243957
1150 -243957 -253047 118011 95666 -202579 -26646 -447258 36019 -257904 -461919 -335994
1140 -335994 -91689 -203684 -7079 25969 -631413 -383246 -18626 -409016 -243862 -418523
1130 -418523 -515877 -589254 27853 42908 -548304 -52405 -665482 -318971 -750640 -106752
1120 -106752 -559631 -351076 -258786 -356606 -262277 -499486 -297733 -187660 -468104 -332198
$$ packed form
1191b58186j70039R5894N55803l52753K67966K3984l04705M34482j61880r9987
1181C0579r9720K62419m59434N83951l53657J99188m34960k39393J67700J73035
1171a70292J33206j82581J45927K13938k48778p9885L59826k85763J83654j27741
1161e8489j6068K8276j88534K87129j70599k67680L41348n6583m9048M74376n68085
1150b43957r090L71058k2345k98245J75933m20612M83277k93923k04015J25925
1140c35994K44305j11995J96605L3048o57382K48167L64620l90390J65154j74661
1130d18523r7354p3377O17107J5055n91212M95899o13077L46511m31669O43888
1120a06752m52879K08555R2290r7820R4329k37209K01753J10073k80444J35906
$$ plain form
1110 -332198 21263 -405911 -461593 -418992 -159796 22536 -171691 -721149 -683802 -140671
1100 -140671 -401056 60540 -785117 -207738 -727926 -821733 -919757 -43611 -346686 -298992
1090 -298992 -309966 -350451 -478504 -558064 -324617 -93033 -284069 -515875 -293747 -830213
1080 -830213 -301455 -450122 109300 -285088 -315605 -186158 -411086 -574006 -462804 123094
1070 123094 -312669 124386 -372591 242438 -403381 36703 -157367 48214 133836 -415475
1060 -415475 -63910 -30076 147877 -372931 -65191 -286592 23283 -492213 -9544 -257493
1050 -257493 289032 -192958 -475796 -55831 -193824 -18596 -115173 -324046 -447025 -166226
1040 -166226 -252423 -229479 322824 -85801 -445181 -77084 114067 -267924 -263752 -56649
$$ packed form
1110c32198L53461m27174n5682M2601K59196J82332j94227n49458L7347N43131
1100a40671k60385M61596q45657N77379n20188r3807r8024Q76146l03075M7694
1090b98992j0974m0485j28053p9560K33447K31584j91036k31806K22128n36466
1080h30213N28758j48667N59422l94388l0517J29447k24928j62920J11202N85898
1070A23094m35763M37055m96977O15029o45819M40084j94070K05581Q5622n49311
1060d15475L51565L3834J77953n20808L07740k21401L09875n15496M82669k47949
1050b57493N46525m81990k82838M19965j37993J75228r6577k08873j22979K80799
1040a66226q6197K2944N52303m08625l59380L68097J91151l81991M172K07103
$$ plain form
1030 -56649 128392 -42186 6152 -184327 67647 -113240 430502 -263951 -18059 -570156
1020 -570156 207562 -99840 -25238 -767197 59323 -420568 65358 -35335 -284664 -231868
1010 -231868 -212050 -343878 -561729 -323792 10679 -36919 -663928 -316056 89617 88539
1000 88539 -271348 -163807 -255168 -108801 -163269 154959 -987814 -573615 111572 -407185
990 -407185 -410182 -276360 -592205 -357062 -171869 -294245 -227515 -264420 -292572 -59356 -397833
979 -397833 -602886 -443894 133764 -242095 246055 -581633 -55644 150600 -612944 -607644
969 -607644 -418217 -444623 -90315 -270030 -564974 49084 -463693 10872 -423640 -133845
959 -133845 -284303 -290702 -494865 -337819 -445354 -351107 -583231 -409877 -336770 -605590 -296247
$$ packed form
1030e6649J85041j70578M8338j90479K51974j80887N43742o94453K45892n52097
1020e70156P77718l07402P4602p41959Q26520m79891M85926j00693k49329N2796
1010b31868J9818j31828k17851K37937L34471m7598o27009L47872M05673j078
1000H8539l59887J07541r1361J46367n4468L18228j142773M14199O85187n18757
990d07185k997J33822l15845K35143J85193j22376O6730l6905k8152K33216l38477
979c97833k05053J58992N77658l75859M88150q27688N25989K06244p63544N300
969f07644J89427k6406L54308j79715k94944O14058n12777M74565m34512K89795
959a33845j50458o399k04163J57046j07535R4247k32124J73354P3107k68820L09343
$$ plain form
948 -296247 -750785 -349280 -337221 -322129 -274820 -657564 -314533 -551533 176217 -373987
938 -373987 -460188 -210615 -174225 -456670 -59976 -677480 -481587 -5880 -211726 175586
928 175586 -760619 -705326 -7282 107103 -310643 -453916 -536926 -416183 -85602 -208071
918 -208071 -353058 169778 -266484 -570205 76370 -448274 -364696 -369575 87969 -341178
908 -341178 96832 -279741 111294 -257676 260591 -313450 -322771 -394889 -358624 -354874 -675725
897 -675725 -339433 -265679 -84091 -125244 30878 -366860 -54869 -334256 -205738 49536
887 49536 -8577 65953 -64333 -108507 403577 -111331 -361517 -13755 -140073 151238 -12328
876 -12328 -505988 -455456 -504703 -381105 -422574 -425957 -468394 -790232 -635361 -248819 145105
$$ packed form
948b96247m54538M01505J2059J5092M7309l82744L43031k37000P27750n50204
938c73987q6201K49573L6390k82445L96694o17504J95893M75707k05846L87312
928A75586r36205N5293O98044J14385m17746j43273q3010J20743L30581j22469
918b08071j44987N22836m36262l03721O46575n24644Q3578m879M57544m29147
908c41178M38010l76573L91035l68970N18267n74041r321p2118L6265L750l20851
897f75725L36292P3754J81588m1153J56122l97738L11991k79387J28518K55274
887D9536n8113P4530j30286m4174N12084n14908k50186L47762j26318K91311j63566
876a2328m93660N0532m9247J23598m1469l383m2437l21838J54871L86542L93924
$$ plain form
865 145105 -222949 -807825 -98059 -74595 169755 -572062 -436190 -728354 -335589 -560089
855 -560089 -337537 -937741 -371993 -171656 -161171 -546528 -815854 -192562 -607374 -225823
845 -225823 -237559 -396668 -907947 -649356 -232713 -75235 -469533 -425100 -623239 -149930
835 -149930 -293641 -303349 -529478 -143097 -173872 -1765 -397296 -204825 -57927 -598550
825 -598550 -533220 207766 -494258 -508104 -808765 -142095 -319032 -378816 -256305 -510511
815 -510511 -234761 -321422 -427591 8986 -528263 -62998 -61827 -317796 -421439 -277729
805 -277729 -144003 -139651 65110 -549680 -448077 -174748 -354749 -603945 -238474 -663724
795 -663724 -579848 -357660 22931 -623548 -292471 -209276 -463346 -233078 -155093 -277637
$$ packed form
865A45105l68054n84876P09766K3464K44350p41817J35872k92164L92765k24500
855e60089K22552o00204N65748K00337J0485l85357k69326O23292m14812L81551
845b25823j1736j59109n11279K58591M16643J57478l94298M4433j98139M73309
835a49930j43711r708k26129L86381l0775J72107l95531J92471J46898n40623
825e98550O5330P40986p02024j3846l00661O66670j76937n9784J22511k54206
815e10511K75750q6661j06169M36577n37249M65265J171k55969j03643J43710
805b77729J33726M352K04761o14790J01603K73329j80001k49196L65471m25250
795f63724Q3876K22188L80591o46479L31077Q3195k54070K30268P7985j22544
$$ plain form
785 -277637 -45463 -647012 41509 -252324 -523516 -577568 179166 -946007 -97305 -482030
775 -482030 -534286 -225718 -348424 -260075 -773347 -342728 -678934 257293 -365323 -298440
765 -298440 163603 -104231 91483 -50156 37844 -272351 20979 290076 -141745 252408
755 252408 -555233 -357216 -493662 -179412 -632485 -50569 -415851 -468709 -59097 -473266
745 -473266 -294085 -418327 -51030 -583528 -14096 -471988 -385661 -60630 -3263 -327279
735 -327279 -379077 -447115 -431988 -287262 -352643 -210685 -46815 -430475 -319024 -335337 -326533
724 -326533 -106563 -28794 -25865 -247945 -178365 -446688 -272459 -251258 -207762 -320295 74939
713 74939 -233387 -505386 49039 -365605 383687 -393351 -242938 -282987 -115410 -357449
$$ packed form
785b77637K32174o01549O88521k93833k71192n4052P56734j125173Q48702l84725
775d82030n2256L08568j22706Q8349n13272M30619l36206R36227o22616O6883
765b98440M62043k67834J95714j41639Q8000l10195K93330K69097m31821L94153
755B52408q07641J98017j36446L14250m53073N81916l65282n2858M09612m14169
745d73266J79181j24242L67297n32498N69432m57892Q6327L25031N7367l24016
735c27279n1798o8038J5127J44726o5381J41958J63870l83660J11451j6313Q804
724c26533K19970P7769K929k22080O9580k68323J74229K1201M3496j12533L95234
713G4939l08326k71999N54425m14644P49292p77038J50413m0049J67577k42039
$$ plain form
703 -357449 -129262 -448800 -383696 41421 -305817 -647048 -579249 -326432 -459063 -417663
693 -417663 -505172 -658872 -525200 -548589 -192153 -79236 -334734 -224193 -315063 -58833
683 -58833 -64084 90750 -92246 -179563 -43750 -409932 -228823 -604752 -97465 -333206 236011
672 236011 -591964 -393771 -280784 -517622 -409026 -224207 -313903 -188705 -427571 -254630
662 -254630 -247464 102050 -615330 -33153 -270156 237413 -188927 -585977 -455064 683
652 683 -308535 -624482 -116284 -616259 -56285 -734612 -558214 -786402 -71589 68675
642 68675 -687840 -480301 -392072 -246047 -371689 -457111 -344100 -609597 -148078 10582
632 10582 -506154 -833157 26072 -500918 -67937 -861270 -495412 -353667 -248136 17064
$$ packed form
703c57449K28187l19538O5104M25117l47238l41231O7799K52817j32631M1400
693d17663q7509j53700J33672k3389L56436J12917k55498J10541r0870K56230
683e8833n251J54834j82996q7317J35813l66182J81109l75929N07287k35741N69217
672B36011q27975J98193J12987k36838J08596J84819q9696J25198k38866J72941
662b54630P166L49514p17380N82177k37003N07569m26340l97050J30913M55747
652F83l09218l15947N08198m99975N59974o78327J76398k28188P14813J40264
642F8675p56515K07539Q8229J46025j25642q5422J13011k65497M61519J58660
632A0582n16736l27003Q59229n26990M32981p93333L65858J41745J05531K65200
$$ plain form
622 17064 -498563 -648616 -515577 -287952 -838131 -269828 32999 -341992 -508771 221928
612 221928 -652514 -28067 -208027 -566403 -70934 -200081 -103217 6780 -634625 -77401
602 -77401 -27726 -371634 -587169 -563183 99461 -371945 -304219 -219107 -74791 -206087 -409780
591 -409780 -144693 -469279 -411261 -382610 -278374 51045 80333 12489 -330229 -192834 -196992
580 -196992 -531067 -205037 49686 -499808 -87554 -119220 -372587 -374099 -241806 -38242
570 -38242 -474749 1670 -103813 -151813 -1120198 -346590 200329 -142231 -656217 -115517
560 -115517 -377802 -104819 104554 -315345 -470120 -342567 291944 -284717 -472444 -603329
550 -603329 -255111 -315495 -554543 -104696 -846909 -147767 98019 -315577 -533878 -196288
$$ packed form
622A7064n15627j50053J33039K27625n50179N68303L02827l74991j66779P30699
612B21928q74442O24447j79960l58376M95469j29147R6864J09997o41405N57224
602g7401M9675l43908k15535K3986O62644m71406O7726Q5112J44316j31296k03693
591d09780K65087l24586N8018K8651J04236L29419K9288o7844l42718J37395m158
580a96992l34075L26030K54723n49494M12254l1666k53367j512J32293K03564
570c8242m36507M76419j05483m8000r68385P73608N46919l42560n13986N40700
560a15517k62285K72983K09373m19899j54775J27553O34511n76661j87727j30885
550f03329L48218o0384k39048M49847p42213O99142K45786m13596k18301L37590
$$ plain form
540 -196288 -379552 -284502 -92809 68588 -286354 7623 -427501 -387854 -486898 -402254 -347170
529 -347170 297462 -345506 107135 51062 96635 -332768 -102507 -693251 -394040 -305260
519 -305260 -58629 -381802 -225977 -190688 -355364 -850799 -296960 -84098 56742 -126195
509 -126195 -2849 99714 -308699 58739 -817880 -565055 -457772 -106707 138674 -427210
499 -427210 -361239 -718468 -346990 20564 -364856 -618033 -378168 -603696 -330383 -478005
489 -478005 -338952 -41784 -201466 -185808 -677490 -262485 -794283 -6152 -234846 -278763
479 -278763 -174438 -882750 -585188 -350400 -444935 -222574 -222851 -450394 -216373 -336775 -542231
468 -542231 -442075 -326444 -294194 -224924 -528276 -359387 -373449 -309710 -358238 -181226 -537040
$$ packed form
540a96288j83264R5050J91693J61397l54942K93977m35124L9647r9044Q4644N5084
529c47170O44632o42968M52641n6073M5573m29403K30261n90744K99211Q8780
519c05260K46631l23173J55825L5289j64676m95435N53839K12862J40840j82937
509a26195J23346J02563m08413L67438q76619K52825J07283L51065K45381n65884
499d27210O5971l57229L71478L67554l85420k53177K39865k25528K73313j47622
489d78005J39053K97168j59682J5658m91682M15005n31798P88131k28694m3917
479b78763J04325p08312K97562K34788r4535K22361k77k27543K34021j20402k05456
468e42231J00156J15631L2250O9270l03352J68889j4062O3739m8528J77012l55814
$$ plain form
457 -537040 -112150 -247069 -330971 -304657 -109373 -390557 -127385 -478259 -394152 -312532 -397946
446 -397946 -345605 -86819 -418609 -111851 -357815 -308716 -348462 -226619 -683614 5733
436 5733 -335809 -559774 -127082 -199956 242257 -428313 -419931 -116430 -288200 -4688 -646761
425 -646761 -443893 -291608 -17128 -426746 14430 -206717 -142388 -436052 -585176 -407535
415 -407535 -471610 -104726 -305334 -680758 -28718 -303914 -727220 143786 63760 112450
405 112450 -58191 45535 -225796 -69882 -460410 -84681 -204651 -274113 -493077 -543021
395 -543021 -411711 -274280 -355330 -264800 -212331 -125070 -435524 -640811 -635422 -153868 -86877
384 -86877 -400183 -280691 -472660 -112969 -92996 -496373 3941 -113941 -206763 -563397
$$ packed form
457e37040M24890j34919q3902K6314J95284k81184K63172l50874Q4107Q1620q5414
446c97946N2341K58786l31790L06758k45964M9099l9746J21843m56995O89347
436E733l41542k23965M32692p2874M42213o70570Q382L03501j71770K83512o42073
425f46761K02868J52285K74480m09618M41176k21147O4329k93664j49124J77641
415d07535o4075L66884k00608l75424O52040k75196m23306Q71006q0026M8690
405A12450j70641J03726k71331J55914l90528L75729j19970o9462k18964m9944
395e43021J31310J37431q1050R0530N2469Q7261l10454k05287N389M81554O6991
384h6877l13306J19492j91969L59691J9973m03377N00314j17882r2822l56634
$$ plain form
374 -563397 -420526 -326213 -265276 -575920 -347043 -397624 -405048 -360812 187952 -345661 -363040
363 -363040 4781 -343824 -488368 -229771 -116719 -631243 -344092 -209951 81760 168512
353 168512 290351 16897 -198106 -333144 -4915 63222 -280508 -137711 -698940 -131946
$$ packed form
374e63397J42871R4313O0937l10644K28877n0581p424M4236N48764n33613j7379
363c63040L67821l48605j44544K58597J13052n14524K87151J34141K91711Q6752
353A68512J21839k73454k15003j35038L28229O8137l43730J42797n61229N66994
$$ [...]
##END NTUPLES=NMR SPECTRUM
##END=
