##TITLE=abcd
##JCAMPDX= 6.0         $$ Bruker NMR JCAMP-DX V2.0
##DATA TYPE= NMR SPECTRUM
##DATA CLASS= NTUPLES
##ORIGIN= UXNMR, Bruker Analytische Messtechnik GmbH
##OWNER= root
$$ XWIN-NMR		Version 3.5
$$ Tue Aug  4 15:58:17 2026 Russian Standard Time (UT+4h)  servis@DPX200
##.OBSERVE FREQUENCY= 200.131235884673
##.OBSERVE NUCLEUS= ^1H
##.ACQUISITION MODE= SIMULTANEOUS
##.ACQUISITION SCHEME= undefined
##.AVERAGES= 16
##.DIGITISER RES= 18
##SPECTROMETER/DATA SYSTEM= spect
##.PULSE SEQUENCE= zg
##.SOLVENT NAME= MeOD
##.SHIFT REFERENCE= (INTERNAL, MeOD, 0, 16.4885)
##AUDIT TRAIL= $$ (NUMBER, WHEN, WHO, WHERE, WHAT)
$$ ##TITLE= Audit trail, XWIN-NMR		Version 3.5
$$ ##JCAMPDX= 5.01
$$ ##ORIGIN= Bruker BioSpin GmbH
$$ ##OWNER= servis
$$ F:\spectra/data/av/nmr/H1/1/pdata/1/auditp.txt
$$ ##AUDIT TRAIL=  $$ (NUMBER, WHEN, WHO, WHERE, WHAT)
(   1,<2026-08-04 15:57:45.56 +0400>,<servis>,<DPX200>,
      <created by zg, POWCHK disabled, PULCHK disabled
       terminated by command 'halt'
       configuration hash MD5:
       00 E9 B6 7A A2 85 ED C7 34 08 36 98 17 FE 4E 26
       data hash MD5: 32K
       C7 8F D9 39 BE BD C2 92 C9 51 6C 52 26 A3 C7 B6>)
(   2,<2026-08-04 15:57:47.32 +0400>,<servis>,<DPX200>,
      <Start of raw data processing
       efp BC_mod = 2 LB = 0.05 FT_mod = 6 PKNL = 1 PHC0 = -413.3518 PHC1 = 3.101563 SI = 16K 
       data hash MD5: 16K
       F5 29 9F 51 7C B5 21 66 9B 65 38 EE EB 52 4D 37>)
(   3,<2026-08-04 15:57:57.53 +0400>,<servis>,<DPX200>,
      <pk PHC0 = -2.6 PHC1 = 0 
       data hash MD5: 16K
       D7 23 2D 9F 51 79 4A 37 5D 5C C5 44 97 C6 BE 6F>)
$$ ##END=
$$ 
$$ hash MD5
$$ 37 4A 0B 5A CD FB 22 DB 60 2F 66 64 EC 7C CA 0B
##$RELAX= 
##$RELAX= 
##$RELAX= 
##$RELAX= 
##$RELAX= 
##$RELAX= 
##$RELAX= 
##$RELAX= 
$$ Bruker specific parameters
$$ --------------------------
##$DU= <F:\spectra>
##$EXPNO= 1
##$NAME= <H1>
##$PROCNO= 1
##$TYPE= <nmr>
##$USER= <av>
##$AMP= (0..31)
100 100 100 100 100 100 100 100 100 100 100 100 100 100 100 100 100 100 
100 100 100 100 100 100 100 100 100 100 100 100 100 100 
##$AQSEQ= 0
##$AQ_mod= 1
##$AUNM= <au_zg>
##$AUTOPOS= <>
##$BF1= 200.13
##$BF2= 200.13
##$BF3= 200.13
##$BF4= 200.13
##$BF5= 500.13
##$BF6= 500.13
##$BF7= 500.13
##$BF8= 500.13
##$BYTORDA= 1
##$CFDGTYP= 0
##$CFRGTYP= 5
##$CHEMSTR= <none>
##$CNST= (0..31)
1 1 145 1 1 1 1 1 1 1 1 1 1 1 1 1 1 1 1 1 1 1 1 1 1 1 1 1 1 1 1 1 
##$CPDPRG= <>
##$CPDPRG1= <>
##$CPDPRG2= <>
##$CPDPRG3= <>
##$CPDPRG4= <mlev>
##$CPDPRG5= <mlev>
##$CPDPRG6= <mlev>
##$CPDPRG7= <mlev>
##$CPDPRG8= <mlev>
##$CPDPRGB= <>
##$CPDPRGT= <>
##$D= (0..31)
0 2 0 0 0 0 0 0 0 0.06 0 0 0 0 0 0 0.0002 0 0 0 0 0 0 0 0 0 0 0 0 0 0 
0 
##$DATE= 1785844665
##$DBL= (0..7)
120 120 120 120 120 120 120 120 
##$DBP= (0..7)
150 150 150 150 150 150 150 150 
##$DBP07= 0
##$DBPNAM0= <>
##$DBPNAM1= <>
##$DBPNAM2= <>
##$DBPNAM3= <>
##$DBPNAM4= <>
##$DBPNAM5= <>
##$DBPNAM6= <>
##$DBPNAM7= <>
##$DBPOAL= (0..7)
0.5 0.5 0.5 0.5 0.5 0.5 0.5 0.5 
##$DBPOFFS= (0..7)
0 0 0 0 0 0 0 0 
##$DE= 6
$$ [...]
##$SUBNAM4= <"">
##$SUBNAM5= <"">
##$SUBNAM6= <"">
##$SUBNAM7= <"">
##$SUBNAM8= <"">
##$SUBNAM9= <"">
##$SW= 20.6817932712277
##$SWIBOX= (0..15)
0 0 3 0 0 0 0 0 0 0 0 0 0 0 0 0 
##$SW_h= 4139.07284768212
##$TD= 32768
##$TD0= 1
##$TE= 0
##$TE2= 300
##$TE3= 300
##$TEG= 300
##$TL= (0..7)
0 120 120 120 120 120 120 120 
##$TP= (0..7)
150 150 150 150 150 150 150 150 
##$TP07= 0
##$TPNAME0= <>
##$TPNAME1= <>
##$TPNAME2= <>
##$TPNAME3= <>
##$TPNAME4= <>
##$TPNAME5= <>
##$TPNAME6= <>
##$TPNAME7= <>
##$TPOAL= (0..7)
0.5 0.5 0.5 0.5 0.5 0.5 0.5 0.5 
##$TPOFFS= (0..7)
0 0 0 0 0 0 0 0 
##$TUNHIN= 0
##$TUNHOUT= 0
##$TUNXOUT= 0
##$USERA1= <user>
##$USERA2= <user>
##$USERA3= <user>
##$USERA4= <user>
##$USERA5= <user>
##$V9= 5
##$VALIST= <valist>
##$VCLIST= <CCCCCCCCCCCCCCC>
##$VD= 0
##$VDLIST= <DDDDDDDDDDDDDDD>
##$VPLIST= <PPPPPPPPPPPPPPP>
##$VTLIST= <TTTTTTTTTTTTTTT>
##$WBST= 1024
##$WBSW= 30
##$XGAIN= (0..3)
0 0 0 0 
##$XL= 0
##$YL= 0
##$YMAX_a= 609305
##$YMIN_a= -906653
##$ZGOPTNS= <>
##$ZL1= 120
##$ZL2= 120
##$ZL3= 120
##$ZL4= 120
##$ABSF1= 0
##$ABSF2= 0
##$ABSG= 0
##$ABSL= 0
##$ALPHA= 0
##$AQORDER= 0
##$ASSFAC= 0
##$ASSFACI= 0
##$ASSFACX= 0
##$ASSWID= 0
##$AUNMP= <proc_1d>
##$AZFE= 0.1
##$AZFW= 0.1
##$BCFW= 0
##$BC_mod= 2
##$BYTORDP= 0
##$COROFFS= 0
##$CY= 18.4799938201904
##$DATMOD= 1
##$DC= 0
##$DFILT= <>
##$DTYPP= 0
##$F1P= 9.9274215381318
##$F2P= -0.165520771350173
##$FCOR= 1
##$FTSIZE= 16384
##$FT_mod= 6
##$GAMMA= 0
##$GB= 0
##$INTBC= 1
##$INTSCL= 4.127829e-11
##$ISEN= 128
##$LB= 0.05
##$LEV0= 0
##$LPBIN= 0
##$MAXI= 10000
##$MC2= 0
##$MEAN= 0
##$ME_mod= 0
##$MI= 50
##$NCOEF= 0
##$NC_proc= -4
##$NLEV= 6
##$NOISF1= 3.799351
##$NOISF2= 2.8
##$NSP= 0
##$NTH_PI= 0
##$NZP= 0
##$OFFSET= 16.48848
##$PC= 4
##$PHC0= -415.9518
##$PHC1= 3.101563
##$PH_mod= 1
##$PKNL= yes
##$PPARMOD= 0
##$PSCAL= 4
##$PSIGN= 0
##$REVERSE= no
##$SF= 200.130005582386
##$SI= 16384
##$SIGF1= 3
##$SIGF2= 2
##$SINO= 400
##$SIOLD= 16384
##$SREGLST= <1H.CDCl3>
##$SSB= 0
##$STSI= 16384
##$STSR= 0
##$SW_p= 4139.07284768211
##$SYMM= 0
##$S_DEV= 0
##$TDeff= 32768
##$TDoff= 0
##$TI= <>
##$TILT= no
##$TM1= 0
##$TM2= 0
##$TOPLEV= 0
##$USERP1= <user>
##$USERP2= <user>
##$USERP3= <user>
##$USERP4= <user>
##$USERP5= <user>
##$WDW= 1
##$XDIM= 16384
##$YMAX_p= 273790690
##$YMIN_p= -278110
$$ End of Bruker specific parameters
$$ ---------------------------------
##NTUPLES= NMR SPECTRUM
##VAR_NAME=  FREQUENCY,     SPECTRUM/REAL,   SPECTRUM/IMAG
##SYMBOL=    X,             R,               I
##VAR_TYPE=  INDEPENDENT,   DEPENDENT,       DEPENDENT
##VAR_FORM=  AFFN,          ASDF,            ASDF
##VAR_DIM=   16384,         16384,           16384
##UNITS=     HZ,            ARBITRARY UNITS, ARBITRARY UNITS
##FACTOR=    0.252644378177508, 1,           1
##FIRST=     3299.83951724647, 0,            0
##LAST=      -839.233330435636, 0,           0
##MIN=       -839.233330435636, -278110,     0
##MAX=       3299.83951724647, 273790690,    0
$$ Real data points
##PAGE= N=1
##DATA TABLE= (X++(R..R)), XYDATA
$$ [...]
10532a43864j9913l114K8548j7842l136l5569L8213J951J0890l2157j3745L0159
10520a59579M745J9314j911j6641q124k1812M8877l9031N287N543N638J2257K1823
10507a23614Q900p9994M8322K460M71M4401o1400J5849Q069k3947J3945k2008
10495a68546J0159k4657N541J0610K017J9226l2341M5292R115j6476m2534J6633
10483a65961L084J2560K9085m2634m2840O5639p2138O9539J8222m9901M1821j5093
10471a48617j4847m1282N4335j2977K4995L093m1754L3058n6676M3601L473o0943
10459b14541K9161M5560r267J3189K0004j8690k0875J239j6578J8802R699l1077
10447a73374P763J8325k4423L4539R44m6905M0656j8332K5787l312J2121p146
$$ y = [-143864, -163777, -166891, -138343, -156185, -159321, -194890, -156677, -154726, -143836, -175993, -189738, -159579, -154834, -135520, -137431, -154072, -162196, -184008, -135131, -174162, -168875, -163332, -157694, -145437, -123614, -114714, -194708, -146386, -143926, -143455, -99054, -160454, -144605, -136536, -160483, -146538, -168546, -158387, -183044, -177503, -166893, -164876, -145650, -177991, -132699, -123584, -140060, -182594, -165961, -162877, -150317, -121232, -163866, -206706, -141067, -213205, -143666, -125444, -175345, -133524, -148617, -163464, -204746, -150411, -163388, -138393, -135300, -177054, -143996, -200672, -157071, -153598, -214541, -185380, -139820, -149087, -135898, -115894, -134584, -155459, -154220, -170798, -151996, -142297, -173374, -165611, -147286, -171709, -137170, -136226, -183131, -142475, -160807, -135020, -138332, -126211, -133357]
10435a33357k5572R087J9170k5237NL4344j4205K3975L6321o8208L945P536J6859
10422a15337o901n0063J7439J6254o108J3146J0076r1737N0781L355l4536P4464
10410a19167l9458j4456N0659J0075m1154L7403n8333J5892K3424q245P150J8111
10398a18099J8203m5229k008J5888j3250j4133j801K408L5984K0458n3066R419
10386a45226k2459j1893n440m844K4355q75L4410n130N668J6004n6362J8070J2364
10373a41358l3817j7862L2058J635K7409o099k319n4817N1254j41j1956J8529
10361a37484m1340L9585q02p74R492K195n8017k84q24M3684P430n1687J3384R567
10347a65875R063L4497m1876K8562K8474k0125n0699N8309n2789P73L3J1849Q223
$$ y = [-133357, -158929, -149842, -130672, -155909, -155904, -121560, -135765, -111790, -75469, -143677, -139732, -132196, -115337, -122238, -172301, -154862, -138608, -144716, -131570, -121494, -213231, -162450, -159095, -193631, -119167, -158625, -173081, -122422, -112347, -153501, -116098, -174431, -158539, -135115, -143360, -136210, -118099, -99896, -145125, -147133, -131245, -144495, -158628, -160429, -158021, -122037, -101579, -154645, -145226, -167685, -179578, -185018, -189862, -165507, -166382, -131972, -137102, -131434, -115430, -171792, -153722, -141358, -175175, -193037, -160979, -159344, -131935, -138034, -140353, -195170, -143916, -144057, -156013, -137484, -178824, -139239, -140041, -140815, -131323, -129128, -187145, -187429, -188253, -144569, -137139, -188826, -175442, -165875, -156812, -122315, -164191, -135629, -107155, -127280, -177979, -119670, -172459, -171686, -171653, -159804, -151581]
10334a51581j0375R130L335l293k7550n723P4893k0998O595l2875K1158m1321
10322a78605k6068N4276n7331O1009N7833j12553N6600J8792l3456K9279l7794
10311a68018K0356J9598l1432l826L1049n1140O827M4217j8313k3481J838M6507
10299a25818m8803M8852L280k3076J8325M345m2169j7503N6747J769m6778M1644
10287a29185q131k0027K8928l6760J1922K0743k7029P5015p3572J0061L080j0322
10275a55277k0267r902K0411L8490m7305L1221Q107n1856Q0686m7375j8193N6490
10263a14770P806o2121J0350o529Q890L7384p3745N8354O914m3486L7777j4502
10251a47678R990J3901o804l0672K8716p122j0651L975l4549M6554l6209M950
$$ y = [-151581, -161956, -152826, -149491, -152784, -180334, -186057, -111164, -132162, -125567, -158442, -137284, -178605, -204673, -150397, -207728, -146719, -88886, -201439, -144839, -126047, -159503, -130224, -168018, -147662, -128064, -159496, -163322, -132273, -183413, -176586, -132369, -150682, -174163, -172325, -125818, -174621, -125769, -122489, -145565, -127240, -122895, -165064, -182567, -125820, -124051, -170829, -129185, -137316, -157343, -128415, -165175, -153253, -132510, -159539, -84524, -158096, -148035, -144955, -155277, -175544, -185446, -165035, -126545, -173850, -142629, -134522, -186378, -105692, -153067, -171260, -114770, -106964, -169085, -158735, -165264, -156374, -118990, -192735, -134381, -127467, -170953, -133176, -147678, -137688, -123787, -130591, -161263, -132547, -139669, -150320, -146345, -180894, -134340, -170549, -165599]
10239a65599K3695k991l8644L2705J8187L0687n2362O95R385J0460J94k4290K3682
10226a34196j7911j8230J7032K072l3020R1221o3617N83P5059l1238p1051N2469
10214a30827o731l5256J9702J148P621M4091k1205k6033k446k7877L894R274J6612
10201a48033Q220L7100l5793r709Q5958j05817k620K002J5597n1606P7917n3662
10189a80446l0327J01992l9740K4274l3316j050J7351J4452k8754L4950p142l0013
10177a57769k8336L4784k8680K0285j0148J1304P262j3882r066J1712O133J649
10165a54752q260J229J9369l391o2993N8004L9245k9550n5135L7334l572M2139
10153a20333k9506k6384L9762n2830L0199J1537k6027J5504j334j0684L5552r200
$$ y = [-165599, -141904, -144895, -183539, -150834, -132647, -101960, -154322, -153627, -144242, -133782, -133588, -157878, -134196, -152107, -170337, -153305, -151233, -184253, -93032, -156649, -156066, -81007, -112245, -183296, -130827, -137558, -172814, -153112, -151964, -144343, -100252, -121457, -147490, -149936, -177813, -173919, -164645, -148033, -139813, -102713, -138506, -148215, -62257, -168074, -170694, -168692, -153095, -204701, -126784, -180446, -210773, -108781, -148521, -124247, -157563, -158613, -141262, -126810, -155564, -120614, -127756, -157769, -186105, -151321, -180001, -159716, -169864, -158560, -151298, -165180, -174246, -162534, -156401, -154752, -163012, -161783, -142414, -145805, -208798, -150794, -111549, -141099, -196234, -158900, -162472, -120333, -149839, -176223, -136461, -189291, -159092, -147555, -173582, -158078, -159412, -170096, -134544, -143744]
10141a43744j7953k1803J9241P521N432r417K9036j5688j918J8954q733j0846
10129a49918j0651K517p133p921R2266j02814k5197P4877j1393K1412n2496J3478
10117a62973j3200L5951J593K2660m7516K844N5811j3165k1731k3656M0326l9680
10105a62736O4118l6517j6586O20N0901l9704L8794j8660k1833M5753j359K2131
10093g5078O1579r6700N1268J20m5087K9025n1101M1184o7476M1424j3504j1416
10081a35762k7842l5179P2253J7937l9555k576K5014l1675R831M3084m4842K5034
10069a24278j52l2604K5306r036l0250J0089Q083J0271k1925n673r192N4303k8968
10056a54026j066L8009q1154k012P1234m9825N3326q118l9522J5915L5216Q231
$$ y = [-143744, -161697, -183500, -164259, -156738, -151306, -160723, -131687, -147375, -149293, -130339, -139072, -149918, -160569, -158052, -165185, -173106, -80840, -183654, -208851, -133974, -145367, -123955, -176451, -162973, -176173, -140222, -138629, -115969, -163485, -160641, -104830, -117995, -139726, -163382, -123056, -162736, -98618, -135135, -151721, -151101, -100200, -139904, -101110, -119770, -141603, -95850, -97209, -75078, -13499, -110199, -58931, -58811, -103898, -74873, -125974, -84790, -152266, -110842, -124346, -135762, -163604, -198783, -126530, -108593, -148148, -150724, -125710, -157385, -147554, -104470, -149312, -124278, -124430, -157034, -131728, -140764, -171014, -160925, -152842, -142571, -164496, -170169, -179361, -125058, -154026, -155092, -117083, -198237, -200249, -129015, -178840, -125514, -133632, -173154, -157239, -122023, -113792]
10044a13792j7097p245k9307L5758j5532K1571j4088L8662q6382M8143k4808Q498
10032a55619K9008o181k8553k1529J9326Q076K8965M3m0746M8253j0370n7418
10020a86745O5292j9285r310l6955N6528J289L636J1120l2850l087l0526O4493
10008a16400j01098J03692K876k9917L2767n3711K835J8185K5569k2554m3134
9997a80890M2605M6317m7769m340R931K1569J848k4857j0719M286p45k8960K1036
9984a50688K2581m0757P2518n0315J7880L4936k6975k1296J9614j4729j0407J4174
9972a33464K0503K510k8708m2297K3200J0320k6852N8359m9664N9006j7577n8266
9960a82930J13609o3838N7386m6808l4728m260K4126J1783l559M5144q7263M1463
$$ y = [-113792, -130889, -138134, -167441, -131683, -147215, -125644, -139732, -101070, -187452, -139309, -164117, -155619, -126611, -132792, -161345, -182874, -163548, -155472, -126507, -126464, -167210, -118957, -129327, -186745, -121453, -140738, -150048, -187003, -130475, -129186, -125550, -114430, -147280, -150367, -180893, -116400, -217498, -113806, -110930, -140847, -108080, -161791, -158956, -140771, -115202, -137756, -180890, -138285, -91968, -139737, -144077, -134146, -112577, -110729, -135586, -146305, -142019, -142764, -171724, -150688, -128107, -168864, -96346, -146661, -128781, -93845, -120820, -142116, -122502, -137231, -147638, -133464, -112961, -110451, -139159, -181456, -158256, -147936, -174788, -116429, -166093, -107087, -124664, -182930, -69321, -133159, -75773, -122581, -157309, -161569, -137443, -125660, -129219, -84075, -171338, -129875]
9948a29875k4177L7522k6019L9859j6103k1047r074K3711L053N1365l0629o3181
9936a64595M0093n2138P2421m812n517m8548N5466m1907J7715L6543k0370o5632
9924a81281K9510K0073K6673j601K1690p1553J208M6240o2072N8030l8806P092
9912a44797O311M171M474J252J5432L710k2511L6516o8409M0297J404m0426P1488
9899i1088l1996J3591m3971N9296l195o7096L8806K3304m3184J9342P468n6304
9887a75027O7189J7893k5111l8998L7266l5283L3854J219j682L0457n2879k345
9875a43447L7235Q487k3951N0827l2128j17444R1727K1523k6916P766j6788O995
9863a36114p700J2595J6591O749k4573n7025M3646L0957n6261Q4619n5231j6606
$$ y = [-129875, -154052, -116530, -142549, -102690, -118793, -139840, -148914, -125203, -122150, -70785, -101414, -164595, -124502, -176640, -104219, -109031, -114548, -163096, -107630, -149537, -131822, -95279, -115649, -181281, -151771, -131698, -105025, -106626, -84936, -156489, -155281, -109041, -171113, -113083, -151889, -144797, -138486, -134315, -129841, -128589, -113157, -109447, -131958, -95442, -163851, -123554, -122150, -162576, -91088, -123084, -109493, -153464, -94168, -97363, -164459, -125653, -102349, -145533, -126191, -118723, -175027, -107838, -89945, -115056, -154054, -116788, -152071, -118217, -116998, -118680, -88223, -141102, -143447, -106212, -97725, -121676, -70849, -102977, -220421, -128694, -107171, -134087, -126321, -143109, -136114, -143814, -131219, -114628, -107879, -132452, -189477, -145831, -114874, -171135, -86516, -141747, -158353]
9851a58353P1651r3611L0506L8177l320l439l3447O3826o6362L2983K6409q031
9839a03011n9159M873k061J2744L0156J6819l9470L876j0058O6128o7650K6793
9827a20020N5535p6756P272K937M7098n7632l117L7106k1135K473k150j4533J4168
9814a28754K7928o373k7475l8855N2358p520L182o499K7817l8260k2102K9770
9802a34783L0102k0020p0550O7776L4730p6722L6234j1687m9651Q1167j0429o428
9790a30261m7125P3955j1643r676R899P486n1936l050J6637O7791q7412l127K5712
9777a42750j8339J2791l025P1575q1566J7366J7794l5029k4346P3076J4752o0714
9765a58415P8167k8539m7114M5127l575J9166o8746K688M8308k2877J9570m4000
$$ y = [-158353, -86702, -180313, -149807, -111630, -114950, -118389, -151836, -88010, -154372, -121389, -94980, -103011, -162170, -157297, -159358, -146614, -116458, -99639, -139109, -135233, -145291, -79163, -146813, -120020, -64485, -141241, -133969, -131032, -83934, -141566, -144683, -107577, -128712, -126239, -128389, -142922, -128754, -100826, -107199, -134674, -173529, -121171, -128691, -125509, -132008, -104191, -142451, -164553, -134783, -104681, -124701, -195251, -127475, -92745, -169467, -133233, -144920, -194571, -113404, -123833, -130261, -177386, -103431, -115074, -124750, -114851, -107365, -159301, -162351, -145714, -77923, -165335, -168462, -142750, -161089, -148298, -151323, -79748, -161314, -143948, -126154, -161183, -185529, -112453, -97701, -158415, -80248, -108787, -155901, -110774, -114349, -95183, -163929, -161241, -112933, -135810, -116240, -160240]
9753a60240N0455j5753J6182k2489j9045J9139N9901m6508k5142M3500q674M8283
9741f0391m4357P8818n1831R050L015k5527J2898n0580M0048o4232N7796k2614
9729a17907J7229j2649j3671l0724K8919o480K6161m9177M7245k3431K2251o2617
9717a74851r61P9760k3487j574n691l9731J6527L8092r968j6329k9963J7803K5611
9704a24762k3981J867k5302K7711k998j3756l505M0198l0375l510L0755k4626
9692a52284J1620J2927j0213L7519k8804k7073j9150P3515l5822j6666N4358q4358
9680a84431N1546l2527O3805k3854M818L062m2547K6532P983R221j5596j8667
9668a50655J9615N3574o5522r21L130K3874n9658O2535L5785n4216J4363J0K1406
$$ y = [-160240, -109785, -125538, -109356, -131845, -150890, -131751, -71850, -118358, -143500, -100000, -108674, -60391, -104748, -25930, -77761, -68711, -65696, -91223, -78325, -128905, -88857, -153089, -95293, -117907, -100678, -113327, -126998, -157722, -128803, -135283, -109122, -158299, -111054, -134485, -112234, -174851, -175812, -96052, -119539, -121113, -126804, -166535, -150008, -111916, -121884, -138213, -168176, -150373, -124762, -148743, -146876, -172178, -144467, -147465, -161221, -164726, -124528, -154903, -158413, -127658, -152284, -140664, -127737, -137950, -100431, -129235, -156308, -175458, -101943, -137765, -154431, -100073, -184431, -132885, -165412, -101607, -125461, -120643, -117581, -160128, -133596, -125613, -116392, -131988, -150655, -131040, -77466, -142988, -143909, -140779, -116905, -176563, -114028, -78243, -132459, -118096, -118086, -96680]
9655i6680o343k521J652l6154K3561m5704M0307n3922K2391P001p268L0118J2689
9642a10873n6793J5739L1841P228R744n1720l782L7039j7846k2246N5145k8425
9630a34949n029O2647m8565m7161J2303m421L2339J0212L6401o4799M386j2589
9618a59225N6979R709o9827L2723j8918l9911J07646o4175q562k5981N7729l3081
9606a54894L1417R915l2770J6348M226l1356J0852K658J368M4596m9450L5033
9594a12057J8115n5839L2746J8955l4708l5120M1731k3259O1701o0528l3548K3299
9582a58512K7010L6079j7677r494j9392j2351M9207j4861J6019L6060o6709k7451
9570a62072M7816k6024K5795N770m8760L7521K5815k4268M832R518o4749M2311
$$ y = [-96680, -103023, -105544, -103892, -140046, -116485, -162189, -121882, -175804, -153413, -146412, -153680, -123562, -110873, -167666, -151927, -120086, -112858, -103114, -154834, -158616, -121577, -139423, -161669, -106524, -134949, -139978, -77331, -125896, -173057, -160754, -165175, -132836, -122624, -86223, -151022, -146636, -159225, -102246, -92537, -162364, -129641, -148559, -188470, -80824, -144999, -153561, -179542, -121813, -154894, -123477, -113562, -146332, -129984, -125758, -157114, -146262, -143604, -142236, -97640, -147090, -112057, -93942, -149781, -117035, -98080, -132788, -167908, -126177, -149436, -87735, -148263, -181811, -158512, -131502, -95423, -113100, -122594, -141986, -154337, -105130, -119991, -103972, -67912, -134621, -162072, -114256, -140280, -114485, -108715, -157475, -119954, -94139, -118407, -113575, -104057, -168806, -126495]
9558a26495l0516L4983M2879q4059j5867Q5895k5569j0327N5129j1389m1622P2900
9546e4058p3425L8685k0246r433N2246k5265n9481O141J5165p744L4626L2475
9534g0314n3172K8758N5507m6581K1647k2567J1365k1768M6948q304K1221p9382
9522a16642J1029J3575P2449M593m5817r836j3003J0347L8085r815k5765O1046
9510i754l0122j4562J5499l737j8196l041m614q117M5099r449M005p666J2005
9497c2650M86j1392L3360j2387L8497n7634j9946K6376P301q672R842M5509q3343
9484f4653l752K9598J9530M1077n8843J3660p2971N1372M111O849J9204k9667
9472d4485j3006l1883L1589J2466j6507J0620j8451K0082K5578l1557m769O598
$$ y = [-126495, -157011, -122028, -79149, -163208, -179075, -93180, -118749, -129076, -73947, -85336, -126958, -54058, -127483, -88798, -109044, -118477, -66231, -91496, -150977, -144836, -129671, -137415, -102789, -70314, -123486, -94728, -39221, -85802, -64155, -86722, -75357, -97125, -50177, -58481, -37260, -116642, -105613, -92038, -19589, -14996, -60813, -70649, -83652, -73305, -35220, -45035, -70800, -9754, -39876, -54438, -38939, -42676, -60872, -63913, -68527, -76644, -31545, -40994, -36989, -44655, -32650, -32164, -43556, -10196, -22583, 15914, -41720, -61666, -35290, -27989, -36661, -26819, 18690, -64653, -68405, -38807, -19277, 21800, -37043, -23383, -96354, -44982, -40871, -34022, -14818, -44485, -57491, -89374, -57785, -45319, -61826, -51206, -69657, -49575, -23997, -55554, -60323, -53725]
9460e3725J4647K3089j5025l1513N4346n375j3244k5834P826j5402K9405K6560
9448d245k6611l5892J6011Q228j5835M7722p5167N345L5042n2800M2357J7505
9436c8340q805l607m649n115K8113j1372l1530M1708M24m7926K8266K3522l8513
9423f7824M6378k4850K8493n8178N4911k4276m867K2412J2069j5825j582k5471
9411e8610J5507J1386k5389N088J603Q935r652M2303k7046o056K7472k6205m6020
9398h6684L5548K7974q2L506R597n3987M2336J6913k708m866J3083l1553R385
9385b1538J0599L6798p12n7253L1104Q625k4738k4432K2218K4707j0428L8970
9373C3920n426K070n2486O6732o1880L2763N037o115j4497K4046k1309L9205q877
$$ y = [-53725, -39078, -15989, -31014, -62527, -8181, -13556, -26800, -52634, -44808, -60210, -30805, -4245, -30856, -66748, -50737, -42509, -58344, -10622, -85789, -80444, -45402, -98202, -55845, -38340, -47145, -50752, -55401, -60516, -32403, -43775, -75305, -33597, -33173, -81099, -52833, -29311, -67824, -21446, -46296, -17803, -75981, -21070, -45346, -50213, -27801, -15732, -31557, -33139, -58610, -43103, -31717, -57106, -52018, -50415, -41480, -51132, -8829, -35875, -41931, -14459, -40664, -86684, -51136, -23162, -23244, -19738, -10141, -64128, -21792, -4879, -7587, -12453, 630, -30923, -21538, -10939, 25859, 25147, -32106, -1002, 7623, -17115, -41547, -19329, 5378, -5050, 33920, 28494, 30564, -21922, 44810, -17070, 15693, 20730, 14615, 118, 24164, 2855, 42060, 33183]
9360C3183j0086K7577M5071l8686m230K6038O851j0294j1247L3409o0676M2763
9348G9673Q1j3242M1773k1772o2898M9229M7634k346m5100j4425l0215Q6017L5779
9335A50188k9250k8361j6702K6589L7134j4248k276K9611N001r575N1510p848
9323A91773m5176L8354J9748k1828J5584M308Q90r834K4074j9822j0987J4381
9311B01465r327P3574k8016l0194q284L6119K1472L717j4293K2502m8592K9053
9299B49196m382L8754j188J669m2540N4561N1358k0692K1311O972r30J988l0288
9286C25789K4109M9541j632l6315L4131j9223J0417J3287K5505L494j6256O226
9274D19073J1986K4454K2414j1129l3724Q1259l5660R1483j9720J4549k6050J6717
$$ y = [33183, 23097, 50674, 95745, 57059, 52829, 78867, 85718, 75424, 64177, 97586, 36910, 79673, 79754, 66512, 108285, 86513, 23615, 72844, 120478, 118132, 73032, 58607, 28392, 114409, 150188, 120938, 92577, 75875, 102464, 139598, 125350, 123074, 152685, 157686, 148111, 199621, 191773, 146597, 184951, 204699, 182871, 198455, 202763, 203653, 193819, 217893, 198071, 187084, 201465, 192138, 265712, 237696, 207502, 199218, 235337, 256809, 260526, 246233, 268735, 220143, 249196, 244814, 283568, 282380, 284049, 241509, 296070, 347428, 326736, 348047, 355019, 354089, 356077, 325789, 349898, 399439, 397807, 361492, 395623, 376400, 386817, 400104, 425609, 429103, 412847, 419073, 431059, 455513, 477927, 466798, 433074, 514333, 478673, 570156, 550436, 564985, 538935, 555652]
9262E55652K800N2263L2596j2137J9668M0938N107O1557j2044l631M5319L9445
9250H27533N6649N0884j9331O4841M4383L8799R0352J8054L6838P5184O7040J04528
9238A455754Q9233J14017J13702J95279K55971L07215K98105L15381K36972J43807
9228C525436J71638P0303K11738J96285L69400L67699L55275K29280M8299l2727
9218E512626p9448j18550j50645j01301P1434O2991J43873M4555K07232K25725
9208E818492L97635O46352Q34358R22948R46617J001142R15532R20873J013257
9199A3417206J177932J444516J637635J615199J386873J131686R84033Q18828
9191B3613908N98444P2002n11906j332781j912639k255326k111400j855638j499778
$$ y = [555652, 558452, 610715, 643311, 631174, 650842, 691780, 696887, 758444, 746400, 742769, 788088, 827533, 884182, 935066, 915735, 980576, 1024959, 1063758, 1154110, 1172164, 1209002, 1284186, 1351226, 1455754, 1544987, 1659004, 1772706, 1967985, 2223956, 2531171, 2829276, 3144657, 3381629, 3525436, 3697074, 3767377, 3979115, 4175400, 4544800, 4912499, 5267774, 5497054, 5545353, 5512626, 5433178, 5314628, 5163983, 5062682, 5134116, 5197107, 5340980, 5385535, 5592767, 5818492, 6216127, 6862479, 7696837, 8619785, 9566402, 10567544, 11483076, 12403949, 13417206, 14595138, 16039654, 17677289, 19292488, 20679361, 21811047, 22795080, 23613908, 24212352, 24284354, 23772448, 22439667, 20527028, 18271702, 16160302, 14304664, 12804886]
9182A2804886j212333j161537r21019p91901n91168m51330p8231J73853L03407
9173H074627M74415O36634R57910J085082J252369J355515J153268O52476M587
9164A5646883o87568j192380j467002j466015j176304q68824n66288n90662n44333
9155G087507n55125l99317m66097l01297k87140k55632j33486o6996N9990O9272
9145D751679K05079K89345J37513K46877K76607K47987L39341M55273N31954N81282
9135H062937M66316K10028R700k42204n14543m32720n07628l79016k9752J25118
9125F768236J55136J14610o9690l00275l94537m91202n53775m30262l15391o2759
9115D420091P5755J18716R2119r0232k30550k30418l63681k40329k21804j54606
$$ y = [12804886, 11592553, 10431016, 9509997, 8718096, 8126928, 7675598, 7597367, 7771220, 8074627, 8549042, 9185676, 10143586, 11228668, 12481037, 13836552, 14989820, 15642296, 15646883, 14959315, 13766935, 12299933, 10833918, 9657614, 8788790, 8222502, 7631840, 7087507, 6532382, 6133065, 5666968, 5365671, 5078531, 4822899, 4689413, 4622417, 4682407, 4751679, 4956758, 5246103, 5383616, 5630493, 5907100, 6155087, 6494428, 6949701, 7481655, 8062937, 8529253, 8739281, 8748981, 8506777, 7992234, 7559514, 7051886, 6672870, 6643118, 6768236, 6923372, 7037982, 6968292, 6668017, 6273480, 5782278, 5228503, 4798241, 4482850, 4420091, 4495846, 4614562, 4706681, 4616449, 4385899, 4155481, 3791800, 3551471, 3329667, 3175061]
9105C175061J7070O9909K46860K43404K82518K17631K87971J25988k9417k11912
9095D425083l24086m33925m39273l96523l24801l50854j12838j97402j17832l8381
9085A689168n4247O6118M5018P1031L7410l4219m19P00j3225j15894l9026K5646
9073A678061m7851k8981p4951p8334p6886o9502k2309n1178p1549q5835n9413
9062A011272p5932q3686q3248o6376j07064N2563q1762p2378k7959l191j7298
9051D44941l6936O5367p8696J9435K658p3790L7885N827j8617m628J129l0538
9039C34037m613j8459o1877M9946j6606m327K3134q6953M6063J454K0199o8647
9027B13351K1665K7168k7079j7823L6800o6080K688L4419Q666J8172k2353l147
$$ y = [3175061, 3192131, 3262040, 3508900, 3752304, 4034822, 4252453, 4540424, 4666412, 4636995, 4425083, 4100997, 3667072, 3227799, 2831276, 2506475, 2155621, 2042783, 1845381, 1727549, 1689168, 1634921, 1701039, 1746057, 1817088, 1854498, 1820279, 1819860, 1820560, 1807335, 1691441, 1652415, 1678061, 1630210, 1601229, 1526278, 1447944, 1371058, 1301556, 1279247, 1228069, 1156520, 1070685, 1011272, 935340, 851654, 768406, 702030, 594966, 647529, 565767, 493389, 465430, 462239, 444941, 408005, 473372, 394676, 414111, 416769, 342979, 380864, 386691, 368074, 363446, 364575, 334037, 329424, 310965, 249088, 299034, 282428, 278101, 301235, 214282, 260345, 261799, 281998, 213351, 235016, 262184, 235105, 217282, 254082, 188002, 190690, 225109, 233775, 251947, 229594, 226447]
9015B26447j5573K8508k4721p123o896l0432K4018K0083j6436k2128J3948m2247
9003A47448L6505M027j0862m8012L7029k7968J958J6242m2638J9545m0999J8587
8991A10862k6514K6041m1498K6415k5811O2963r6907k3808J0945K4317l100J720
8979D5625M255j9887K8257k9930j4479n689K6040m5095K7263Q965M043J483m9073
8966a8222L374J2405k1084K9827m8302M5200k0566N719j2448k0962M0885j6096
8954b0270m0111N8028k2307m410K1019M578j3349n131j4180n3252R8043n1105
8942d2447J1745L3694n5971P5699m6020r664l5197J2280K0234j556P879L1404
8930B080j7179k9777j0651j2133N5836k4544r95L326n0309j899Q9314l7917j5734
$$ y = [226447, 210874, 239382, 214661, 207538, 200642, 170210, 194228, 214311, 197875, 175747, 189695, 147448, 183953, 187980, 177118, 129106, 166135, 138167, 140125, 156367, 113729, 133274, 92275, 110862, 84348, 110389, 68891, 95306, 69495, 132458, 35551, 11743, 22688, 47005, 43905, 45625, 49880, 29993, 58250, 28320, 13841, 8152, 34192, -10903, 16360, 25325, 29368, 30851, -18222, -14848, -2443, -23527, 6300, -42002, 3198, -17368, -11649, -24097, -45059, -4174, -20270, -60381, -2353, -24660, -29070, -8051, -3473, -16822, -21953, -36133, -89385, 8658, -42447, -30702, 2992, -52979, 22720, -23300, -32964, -68161, -55881, -35647, -37203, -29324, 2080, -15099, -44876, -55527, -67660, -11824, -36368, -37363, -34037, -84346, -86245, 3069, -34848, -50582]
8917e0582O6788q2322R578K5874j3230O2692m6839O3515l1600j453K7833l4456
8905d202J0690K162Q523k4760P29Q985L366N0907r7985J4882J7054k5029L9252
8892D574k0121l0915M8768l7968O237J2991Q1908j14151P072L9440N801J9071
8880B2707k3405L3813Q036M2000p8057l7741J2214P077K729M8448o7118J8077
8868a1220q1005P5906j1139l3116K9545k9273j734M0641J2916l8407O1804n5124
8856d0206J1082J7713n0316P852L9080k1192M3283q814p1835O3944P907P504m6186
8843d0184J8960m2487l7139Q0669k8672K5700o258m7001n797P4353n7533K078
8831f3311j0957k0785k686O4947m1980O826L2104o8818O8234k7188l5486L7654
$$ y = [-50582, 16206, -66116, -56538, -30664, -43894, 18798, -28041, 35474, 3874, 2421, 30254, -4202, 6488, 8650, 17173, -7587, -6858, 2127, 5493, 56400, -41585, -26703, -9649, -34678, 4574, -15547, -46462, 2306, -35662, -29425, -16434, 65474, -48677, -41605, -2165, 3636, 22707, -698, 33115, 41151, 83151, 5094, -32647, -20433, -13356, -10627, 37821, -29297, -11220, -92225, -16319, -27458, -60574, -31029, -60302, -62036, -21395, -8479, -46886, 14918, -40206, -29124, -11411, -61727, -53875, -14795, -35987, 7296, -1518, -73353, -9409, -1502, 6002, -40184, -21224, -63711, -100850, -20181, -48853, -23153, -29411, -76412, -82209, -7856, -65389, -63311, -74268, -95053, -97739, -32792, -74772, -67946, -35842, -104660, -36426, -63614, -99100, -61446]
8819f1446J2083m1800L2475j5715K8701m4814L2852J5925J5368p5055K9659j410
8807g3177M3634o3674J1889m1256P4668l7204N460q723J2651N2807o4482k3482
8795a10889N2126r292r441l0996M6049J5129l5722Q219K005l3659M1355N0795
8783a4321r2558M2845q518j3144M0680m3547K2901R43q5148K7836N1487k8717
8771i9261J9575j5677k3391K3020J3075m4025O0400K1085k2262j3076m3419Q8676
8759c5280k8879j4561n784m2342J0471J0443J0020J7584l3337p668J3347K9814
8747g6172J3451J7260n6684q4933R2499l9617Q6952m8777N911J7164r5308P3858
8735i4396p394k2315L7146k2769J014L0406p083K4297p730k1480K2255n1529J487
$$ y = [-61446, -49363, -91163, -58688, -74403, -45702, -90516, -57664, -41739, -26371, -101426, -71767, -73177, -29543, -93217, -81328, -122584, -47916, -85120, -79660, -88383, -75732, -22925, -87407, -110889, -58763, -68055, -77496, -108492, -62443, -47314, -83036, -74817, -72812, -106471, -65116, -14321, -106879, -64034, -72552, -85696, -45016, -88563, -65662, -64719, -149867, -122031, -70544, -99261, -79686, -95363, -118754, -95734, -82659, -126684, -66284, -45199, -67461, -80537, -123956, -35280, -64159, -78720, -84504, -126846, -116375, -105932, -95912, -78328, -111665, -119333, -105986, -76172, -62721, -45461, -102145, -187078, -94579, -134196, -47244, -96021, -90110, -72946, -168254, -94396, -101790, -124105, -86959, -109728, -108714, -78308, -85391, -61094, -68824, -90304, -68049, -119578, -118091]
8722a18091K7030J9303p4257N2329n0925L6295J3453J0664N1494r5552K7693J538
8710i9026J0528Q919m224J7016k6701j1132p968K9912j9127J8188N8397r4663
8698a19881L8743j9305m5477R4023k8913j0153M5503o0171o684k3400L8182m8326
8686a45859K2989N0590m2759K2602K0570l1942M1381m6072K0880k8915J6299K0640
8674g9596n2579N2995m0995P681K2253m1065K3855J9319K1962m5596M1078p0534
8662a41222N3761K9917n6878n360k5080N3012o2603N7099M2840l1220o564j3522
8650a05820j5527K8668J2340k23m4241K9383k8004j0607K8374k9424N6770l6703
8638a15014j3771M9625Q50m0707P918K8294L670p2237L4329q794Q821P953k7455
$$ y = [-118091, -91061, -71758, -146015, -93686, -144611, -108316, -94863, -84199, -32705, -128257, -100564, -99026, -88498, -79579, -83803, -66787, -93488, -104620, -112588, -82676, -101803, -83615, -25218, -119881, -81138, -100443, -145920, -51897, -80810, -90963, -45460, -105631, -112315, -135715, -97533, -145859, -122870, -72280, -115039, -92437, -71867, -103809, -62428, -108500, -87620, -116535, -100236, -79596, -132175, -79180, -120175, -112494, -90241, -131306, -107451, -88132, -66170, -111766, -70688, -141222, -87461, -57544, -114422, -119782, -144862, -91850, -154453, -97354, -54514, -85734, -92298, -105820, -121347, -92679, -80339, -80562, -124803, -95420, -123424, -134031, -105657, -135081, -78311, -115014, -128785, -79160, -78310, -119017, -111099, -82805, -79135, -151372, -117043, -125837, -117016, -109063, -136518]
8625a36518l2687P7864P09o311K9129o7656k2566M8469n4652Q2728m6737J5792
8613a12436J344J6361k1862M0046o6681M6672R713q829j5191m2033P9591L745
8601f9560Q048J2389j00511L5010r221J3899k5593k604j313J0866M9061m9750
8589a29279J4224K8694m4445N8297k0944K0935n715o9615K6034N183L643M1738
8577g1250k9235j5575O4441n8263p825r370K4549K6042R844p198j6559n0573R315
8564a31657j138O6263k4900J0078n6447J7286M8515L2069p2266J0681L8572J3906
8552d9038l5418j6903L495M851J1846k5181J87L5365K477o678J9392m4643O3149
8539c7099p0136o578O3203k8650M326m6846J590K7103O0921o9322M5856J09763
$$ y = [-136518, -169205, -91341, -90632, -96943, -67814, -135470, -158036, -109567, -164219, -81491, -128228, -112436, -111092, -94731, -116593, -76547, -143228, -96556, -86843, -95672, -110863, -152896, -73305, -69560, -61512, -49123, -149634, -114624, -123845, -109946, -135539, -138143, -139456, -128590, -79529, -129279, -115055, -86361, -130806, -72509, -93453, -72518, -78233, -147848, -121814, -116631, -112988, -71250, -100485, -116060, -51619, -109882, -117707, -127077, -102528, -76486, -66642, -73840, -90399, -140972, -131657, -132795, -66532, -91432, -81354, -137801, -120515, -72000, -39931, -112197, -101516, -62944, -49038, -84456, -101359, -97864, -93013, -81167, -106348, -106161, -70796, -68319, -74997, -55605, -100248, -37099, -107235, -113813, -50610, -79260, -74934, -121780, -120190, -93087, -32166, -101488, -55632, 54131]
8527E4131k33438J33484p396J1998J3815m8770L0998K0811p8477q399Q516L4758
8515f7969n797L852Q86O081R274j2694O9893n6799n874q5296P1721M4495k8634
8502e6861j1741n026J7229M1081o5675M60K791l5989J8314N41N8384k2446l6798
8489i5736J5405Q797j729j4950M5207n4152N0026J3546p8662M8085k821n02j0039
8476g7525J8494k5655K8568n5049K5215N0405j438q2417L3436M3141l4722l8177
8464a15724R3488k6806j7494K4712l8738J967K3694j4466J7859m5763M2888k3989
8452g8372l46o4533J28332q618k9015l0451q31L7772j835K9110o4434j3963N340
8439i1844R296j3072k062R542L7395n3046P2804j8540k9142L1590N591l5190m533
$$ y = [54131, -179307, -45823, -53219, -41221, -27406, -76176, -45178, -24367, -102844, -111243, -102727, -67969, -73766, -69914, -69028, -62947, -53673, -66367, 3526, -53273, -59147, -144443, -72722, -28227, -56861, -68602, -73628, -56399, -15318, -80993, -80533, -77742, -113731, -95417, -94876, -36492, -58938, -95736, -80331, -71534, -73263, -88213, -43006, -97158, -47132, -33586, -112248, -64163, -66984, -67486, -77525, -59031, -84686, -56118, -111167, -85952, -35547, -36985, -119402, -85966, -42825, -77547, -115724, -22236, -49042, -66536, -41824, -80562, -78595, -54901, -69367, -51508, -97271, -54383, -78372, -78718, -143251, -14919, -23537, -52552, -83003, -83834, -46062, -47897, -18787, -83221, -97184, -91844, -82548, -95620, -97682, -88140, -50745, -103791, -30987, -49527, -78669, -47079, -41488, -76678, -81211]
8426h1211O996l66K4460j4338n041J3229k1763N495K6400k9420q814P4336j11949
8413a21986P2779J9244l7952J1750k7892j9662M7027p625N507j9291j1402N0326
8401c9177l6586J8404K1825k4452K8891m5244j8751N0710R440l9984P2752l6339
8389c8511m8500L497L9936j3006K2965l2774R729q606k1234P9443j5537n8499
8377h1097J5L0865q58k3973K6247J1168k124j4914O1944l8089m1105M4093l1040
8364e8868J1030O7528p2005m647J6448Q622j2080R479p135k2756K3490o442J9762
8351b7574l2309L040M0706N225m637j1012r149K2998k4787L3561p905m7393L6167
8338b3069j2350Q671L4098l5988K714L8605m3264J4017j729j5731l6334O5551
$$ y = [-81211, -74215, -74581, -50121, -64459, -69500, -56271, -78034, -72539, -46139, -75559, -84373, -10037, -121986, -49207, -29963, -67915, -56165, -84057, -103719, -56692, -64317, -58810, -78101, -89503, -39177, -75763, -57359, -35534, -59986, -31095, -76339, -95090, -44380, -34940, -74924, -2172, -38511, -87011, -83514, -43578, -56584, -33619, -66393, -56664, -65270, -86504, -7061, -22598, -81097, -81082, -50217, -51075, -75048, -48801, -37633, -39757, -54671, 7273, -30816, -71921, -27828, -58868, -47838, 19690, -52315, -56962, -40514, -31892, -43972, -34493, -41628, -64384, -40894, -47336, -27574, -59883, -56843, -16137, -10912, -15549, -26561, -35710, -12712, -37499, -3938, -11843, -59236, -23069, -35419, -26748, 7350, -28638, -25924, 12681, -30583, -16566, -18295, -34026, -70360, -4809]
8326d809j5251M5453q7102P553L3517M4190k4024n3792J8601P781L848k1164N0006
8313D807n4649O4468j8688j4611J6880j4995o3293N9178k9679K6326L7286m7896
8301c4866J5869j1424J5463m2547J7656L8395k5648l9025J01184k1996l7918M1298
8289A6441n8680J5413K2589j6372k1336P9307o5438N517m0722K1142O6098l6157
8277a2198j5128l300O2502p2139r19O2444m8102j5598M2308j7815r0393R7494
8265a0844K317l9411L1178k454n2412M5755k3015N8696m9114j249k1153R3542
8253C1836p2703j8945K0788J451j0759l9725M1779l6499L8145j1538k0350N0217
8241b6303M4804j6181n7316K2795M247n494j2946J1365L9372k7082q0367P0189
$$ y = [-4809, -20060, 25393, -61709, -54156, -20639, 23551, -473, -54265, -35664, -27883, -24035, -45199, 4807, -49842, 14626, -4062, -18673, -1793, -16788, -80081, -20903, -50582, -24256, 13030, -34866, -18997, -30421, -14958, -57505, -39849, -1454, -27102, -66127, 35057, 13061, -24857, 16441, -42239, -26826, -4237, -20609, -41945, 37362, -28076, -22559, -63281, -42139, 23959, -12198, -27326, -30626, 31876, -40263, -41182, 21262, -26840, -42438, -130, -17945, -108338, -10844, -8527, -47938, -16760, -19214, -71626, -25871, -48886, 9810, -39304, -40553, -61706, 31836, -40867, -59812, -39024, -37573, -48332, -88057, -46278, -82777, -44632, -56170, -76520, -26303, 18501, 2320, -54996, -32201, -27954, -33448, -46394, -35029, 4343, -22739, -103106, -32917]
8229c2917j0812j797K0626m8401N9776j7300q84M27k7618N2428k6987m7872Q5965
8216D634K2045o6399n666m0652M5397M2881m7781p027M5860l9898j6639J0264
8204e2981m329M5881l8462O3092o1787N7330k5443N998j1684N7936n7118L4026
8192A2459K65208m10884J15490k9596o2267Q6732n5290j5045K7647L7571k8908
8181e6883R029j6079k5204O9051l378j7020k1695P1842J5949n9936M8805m353
8169A0128l5883p469O353R803M3343j00149N1762N3582p2481L6985L9381r4929
8157e9574M9310K5749l7145K1249m6625J4763k2323J8500M6970k3295k8428K7934
8145a2915l3050O1560j6725o168K3581n9562q6N5967j3718q4374M9191m366K6498
$$ y = [-32917, -43729, -45526, -24900, -73301, -13525, -30825, -31709, -31282, -58900, -6472, -33459, -81331, 4634, 26679, -39720, -45386, -86038, -40641, 2240, -45541, -52568, -6708, -46606, -63245, -52981, -57310, -11429, -49891, 13201, -48586, 8744, -16699, -10701, -22385, 35551, -21567, 12459, 277667, -133217, -17727, -47323, -109590, -22858, -78148, -93193, -65546, -27975, -56883, -47854, -63933, -89137, -20086, -23464, -40484, -62179, 9663, 25612, -34324, 14481, 10128, -25755, -33224, -26871, -17068, 26275, -73874, -22112, 31470, -41011, -4026, 35355, -59574, -10264, 15485, -21660, -411, -47036, -32273, -54596, -36096, 10874, -12421, -40849, -12915, -45965, 15595, -1130, -7298, 16283, -43279, -43365, 12602, -1116, -85490, -36299, -40665, -14167]
8132a4167M0492m6407L4313l4025J9091n3848M6111J9350M4522o1993k3697M454
8120b5804K4561J7515k7249p95J6493m3703k6646P6693n0911P4386m0434j3998
8108a9892j6559J1852L2769j817K0338m9305l3254Q2693m8875K5426M0775o7158
8096b3007K1538J0993K8959k4808P451j03683N3609L7311p1200J04862n8205l7573
8084e3753N0308J705N115n4078O4652k2007P496j1071l5965N5788n528k5000M0742
8071A8404l0115M3250n3892K2671n688k1308N5853p9456R8884m7921l9777m305
8059d3400j1147N1273m9940L1576l1844j3740k34K7195M7213j6898K8919p662
8047A1311o0160N1675n827n2525L2946m6080K4896K3239R044p374Q659l2679m089
$$ y = [-14167, 26325, -20082, 14231, -19794, -703, -54551, -8440, 10910, 55432, -6561, -30258, -25804, -1243, 16272, -10977, -11772, 4721, -38982, -65628, 11065, -39846, 34540, -5894, -19892, -36451, -24599, 8170, 6353, 26691, -22614, -55868, 26825, -22050, 3376, 44151, -23007, -1469, 9524, 38483, 13675, 21126, -82557, -28948, 8363, -62837, 42025, -16180, -53753, -3445, -1740, 3375, -50703, 13949, -8058, -562, -11633, -47598, 8190, 2662, -22338, 18404, -11711, 31539, -22353, 318, -5370, -26678, 29175, -50281, 48603, 682, -39095, -43400, -54547, -3274, -53214, -21638, -53482, -67222, -67456, -40261, 6952, -9946, 18973, 11311, -48849, 2826, -3001, -55526, -22580, -68660, -43764, -20525, -11481, -18855, -10196, -42875, -46964]
8034d6964N5428m5250M7082m5341M650K7222j9262k2072L7388k6530K8367l2067
8022c7349P329Q319j6625N6151o4135P3159o5390J8193k7703K7219J429K3053
8010C650j6584o1767O3499K4771l5215N3665n9806M386j7728K1150J3817L6747
7998C0585l8079j2786j9665O2252J4934n8446K6941R362m7180K9075J3019l2475
7986b2463O3290p3733K9217J1838L2516l6497k776J2717K320k2855j553J5779
7974G800O223K9339k816l5166j0248K6849j263J1004q018n0932O5798j6998N3880
7961G5452m5552l6051N4114J047q704J8793m3338J5480J3342j7793M6696l8005
7949C5481M862k1184L9109m273M3700m9959m0014N6760k1271O4448p6733K2971
$$ y = [-46964, 8464, -36786, 10296, -35045, -30395, -3173, -22435, -44507, -7119, -33649, -5282, -37349, -30020, -21701, -38326, 17825, -46310, 26849, -38541, -20348, -48051, -20832, -19403, 3650, -12934, -74701, -11202, 13569, -21646, 32019, -27787, -23401, -41129, -19979, -6162, 30585, -7494, -20280, -39945, 22307, 37241, -21205, 5736, 15098, -32082, -3007, 10012, -22463, 40827, -32906, -3689, 8149, 40665, 4168, 1392, 14109, 16429, -6426, -7979, 7800, 14023, 43362, 40546, 5380, -4868, 21981, 20718, 31722, 23704, -27228, 38570, 21572, 75452, 29900, -6151, 47963, 49010, 40306, 59099, 15761, 31241, 44583, 26790, 73486, 35481, 40343, 19159, 58268, 53995, 97695, 47736, 7722, 64482, 43211, 107659, 30926, 53897]
7937E3897l7453N3271j5599L4407l6207P735m102L1798K3403l4127j7627K0632
7925H0028J7608K162n121j8998P626N1413l4086J1139k7140o0610N9284k2453
7913F0852N7763K8973j06381N6571l275K4337l4k3705J933L5460J9968k3222N6519
7900A85759r4172P9261J3367l7450N1235j15132Q3227J6420J7858L3634q4053
7889A49954O4389j9425J3416L5855n0888J5153J7553J9501K3097O355o524J713
7877B70149J02537k9828r566J02463p5871L2060J13753J6197P1978P1869L0027
7866F95768R2449O7879J35375Q4184J66971N9063J21874J33994K0150J19045J21734
7855A818486k91790n4456l7479j55483p3623N1375r5747K1541j4152j1158O5391
$$ y = [53897, 16444, 69715, 54116, 88523, 52316, 60051, 55949, 87747, 111150, 77023, 59396, 80028, 97636, 99798, 94677, 75679, 83305, 134718, 100632, 111771, 84631, 24021, 83305, 60852, 118615, 147588, 41207, 97778, 94503, 118840, 118806, 95101, 97034, 132494, 152462, 129240, 185759, 91587, 170848, 184215, 146765, 198000, 82868, 166095, 182515, 200373, 234007, 149954, 214343, 194918, 208334, 244189, 193301, 208454, 226007, 245508, 268605, 274960, 268436, 270149, 372686, 342858, 333292, 435755, 359884, 391944, 505697, 521894, 593872, 665741, 695768, 788217, 856096, 991471, 1075655, 1242626, 1301689, 1423563, 1557557, 1577707, 1696752, 1818486, 1526696, 1472240, 1434761, 1279278, 1205655, 1257030, 1161283, 1182824, 1168672, 1157514, 1222905]
7844A222905J9003R1809N5053J11448J10765J34499K84111K19045M19157K58328
7834B926123N00059M80199L40133L40431J04552r500j37598k73007l42906l49071
7824C579415l68356l75430k20051k40540j95691j37893j26910o0205k2257K5755
7814A857837l0174P7235J44301Q5043J91276K11009K83936M08136L93054L49577
7804C971230M17845K89664J47955n4238j45943l14860l36460m59062l82750l45953
7794B787428l56070k63933k68710j96415j53314j00369q4809n3912o5862j2558
7784A231476n9830N4386r259M7697M8564P5611J13558R0042O5981M9884J411Q951
7772A718472l7977j01688j09307j29400j28104r4906p2057r1318j65857n8997
$$ y = [1222905, 1241908, 1333717, 1388770, 1500218, 1610983, 1745482, 2029593, 2248638, 2667795, 2926123, 3426182, 3906381, 4246514, 4586945, 4691497, 4681997, 4544399, 4271392, 3928486, 3579415, 3211059, 2835629, 2615578, 2375038, 2179347, 2041454, 1914544, 1854339, 1832082, 1857837, 1827663, 1904898, 2049199, 2134242, 2325518, 2536527, 2820463, 3228599, 3621653, 3971230, 4389075, 4678739, 4826694, 4772456, 4626513, 4311653, 3975193, 3516131, 3133381, 2787428, 2431358, 2167425, 1898715, 1702300, 1548986, 1448617, 1363808, 1309896, 1244034, 1231476, 1171646, 1226032, 1216773, 1264470, 1313034, 1388645, 1502203, 1592245, 1658226, 1708110, 1709521, 1718472, 1680495, 1578807, 1469500, 1340100, 1211996, 1117090, 1045033, 953715, 787858, 728861]
7762G28861q3512l9536l1513n4939J6114k3844k3187n1487n7941j5728M9583n104
7750D07767k9045n549l3323J1439K1050o497j14967N9441p5945O4883J5160P728
7738C22142m8645j7733O9326m6259J1020r569m8959L1534j3604Q429j800o465
7726B49417K6872n1477J8969k339k023l2494O3918n7682K5082J2724l1002N8342
7714B78307N11n2587n362k2011K6249K6229J9834n9301N6229m1437n3362N2420
7702B25719N005r820q557o043L7510l4398M6744p187l9176M0159l1416j0789K4807
7689B32558j4829K8083l230j3404K9741n659m1013M3060K3344m9385k1514J4886
7677B22638K0572L4305l5940O3152l5417j6403P3724n2278l993k8794L846K7049
$$ y = [728861, 645349, 605813, 574300, 519361, 535475, 511631, 488444, 436957, 379016, 363288, 412871, 407767, 378722, 373173, 339850, 351289, 372339, 365842, 250875, 310316, 234371, 299254, 314414, 322142, 273497, 255764, 325090, 278831, 289851, 280282, 231323, 262857, 249253, 257682, 255882, 249417, 276289, 224812, 243781, 241442, 239419, 206925, 270843, 213161, 238243, 250967, 219965, 278307, 278818, 226231, 220869, 198858, 225107, 251336, 271170, 211869, 268098, 226661, 173299, 225719, 230724, 220904, 212347, 206304, 243814, 209416, 256160, 248973, 209797, 249956, 218540, 207751, 232558, 217729, 245812, 242582, 229178, 258919, 253260, 212247, 255307, 278651, 229266, 207752, 222638, 243210, 277515, 241575, 304727, 269310, 252907, 326631, 274353, 270360, 241566, 245412, 272461]
7665B72461Q384N065j2209L4638n0688O3550j9963o7350N6255K9632m2914M7059
7653C23920k84m3098K4972O608L4161q5728O6548l7187j002O4459k8984R289J2402
7640C46076J8564J6050Q04n2274N2866j0743l005k4966J3203P7078p1618l143
7628C58892L7085j5273J8776j4890K4819j3077N3894k2504k4138L6997K7739l2246
7616D36074K7171l6917O4070l4153k0528N2018K9514l5463P7257m1420L7422K6444
7604E81489J1656k2864l0100M7862j2911l9053J9279M9787o906M9113k2311k728
7592F22313R849l666J7255N4248m2473L5205J5593j1002j1514O2039l3383l080
7580G11384L0184J8958r934k8774O5115L9116j6368l292j8783K7237L6209p221
$$ y = [272461, 280845, 285910, 273701, 308339, 257651, 321201, 301238, 233888, 290143, 319775, 276861, 323920, 323636, 280538, 305510, 312118, 346279, 260551, 327099, 289912, 288910, 353369, 324385, 333674, 346076, 364640, 380690, 381494, 329220, 382086, 371343, 368338, 343372, 356575, 433653, 362035, 358892, 395977, 380704, 399480, 384590, 409409, 396332, 450226, 427722, 403584, 440581, 468320, 436074, 463245, 426328, 490398, 456245, 435717, 487735, 517249, 481786, 559043, 517623, 555045, 581489, 593145, 570281, 540181, 588043, 575132, 536079, 555358, 605145, 598239, 647352, 625041, 622313, 632162, 628496, 645751, 699999, 657526, 692731, 708324, 697322, 685808, 747847, 714464, 711384, 741568, 760526, 750592, 721818, 786933, 826049, 809681, 806389, 787606, 814843, 851052, 843831]
7568H43831J3850L2219m6741M8820l653j6306O8963K708k2559K4817J4786K0932
7556I81667J5183K2870m4830M2133J1605o3299O9331P705R145o85K3671K415L4569
7543A111480Q5880j07133P1481K6842m7270P2808o8299K6342P7455j0042j0312
7532A229232r219N0843J916J6145J1649N8612l6442M3877M8741l9067L9831j5490
7520A400628j1446J02918n8886K4128L0005l8516M9777O3806L063k4432O6119
7509A607164K2787o015R244K1208K2484J3473L5511R233K7434L8014j6173m133
7497A780231J1971P1173K1958j1460q196M6064O8662l3957K1133O4032m1007M9094
7485B039698P0550n753M8544J1235K1824J873N2834M4972j0882P817N2114r40
$$ y = [843831, 857681, 889900, 843159, 891979, 888326, 872020, 940983, 943691, 921132, 945949, 960735, 981667, 996850, 1019720, 974890, 1017023, 1028628, 965329, 1034660, 1042365, 1051510, 1050825, 1074496, 1076911, 1111480, 1197360, 1090227, 1161708, 1188550, 1141280, 1214088, 1145789, 1172131, 1249586, 1239544, 1229232, 1220013, 1270856, 1272772, 1288917, 1300566, 1359178, 1322736, 1366613, 1415354, 1376287, 1416118, 1400628, 1389182, 1492100, 1433214, 1457342, 1487347, 1448831, 1498608, 1562414, 1565477, 1541045, 1607164, 1629951, 1623936, 1633180, 1654388, 1676872, 1690345, 1725856, 1735089, 1762523, 1800537, 1784364, 1780231, 1792202, 1863375, 1885333, 1873873, 1865677, 1911741, 1980403, 1946446, 1967579, 2031611, 1990604, 2039698, 2110248, 2104495, 2153039, 2164274, 2186098, 2187971, 2240805, 2285777, 2274895, 2282712, 2334826, 2333886]
7473B333886O1801K8232N487L7293M8519K9994L9673K8489J74P3760N0092k7713
7461B709687R3685J2165j2909P1035M9664O2275m28J1396M6072R6387j9038M3365
7449C163356O3228O2363K9280J4837O9643L0064J12661k648M6602M9784P8683
7438C717853J6885P5750P1580Q223N9013J19915j7557R6467R0459M0690J8467
7427D297745R0970N9830P3568M0125P4579R9663N1205N1381Q7299R9208N0046
7416E075619O8961O8633O3036O4761J35052N3136O3650J05478J00369Q7712J02017
7405E988424J03414N7086J22241J09077M1128J14937J09639O4779K02504P0018
7395F983247O1730J18751J44911O3478K03901P9157O9050J41599J14445J32285
$$ y = [2333886, 2395687, 2423919, 2429406, 2466699, 2515218, 2545212, 2584885, 2613374, 2613548, 2687308, 2737400, 2709687, 2803372, 2815537, 2802628, 2873663, 2923327, 2985602, 2985174, 2996570, 3042642, 3139029, 3119991, 3163356, 3226584, 3288947, 3318227, 3333064, 3402707, 3432771, 3545432, 3542784, 3589386, 3639170, 3717853, 3734738, 3810488, 3882068, 3890291, 3949304, 4069219, 4051662, 4148129, 4238588, 4279278, 4297745, 4388715, 4448545, 4522113, 4562238, 4636817, 4736480, 4787685, 4839066, 4926365, 5025573, 5075619, 5144580, 5213213, 5276249, 5341010, 5476062, 5529198, 5592848, 5698326, 5798695, 5886407, 5988424, 6091838, 6148924, 6271165, 6380242, 6421370, 6536307, 6645946, 6710725, 6913229, 6983247, 7044977, 7163728, 7308639, 7372117, 7576018, 7655175, 7724225, 7865824, 7980269, 8112554]
7385H112554J87064J21663J04086J72610J56912J41149J50231J61940J27385J39801
7375I575395J35944J42753K45782J20863J55491J68810J59921J64900J93293J73079
7365A1236231J67279K30826J78881J69526K06692K22746K46526J18230K05595
7356A2982532K68588J81758L07800J62985K91829K53904J83840L01389K17095
7347A5151720L34985K04150L06727K93480L10146K76594L17339L05171L06971
7338A7807283L47889L11406L38590M00538L36887L77203M23468L92631M42810
7329B1178705L73428M22811M79902M66292N24233M81612M99202N21773N16636
7320B5464594N94174N67659O41396O01423N94626O93150O70452P29946P26445
$$ y = [8112554, 8299618, 8421281, 8525367, 8697977, 8854889, 8996038, 9146269, 9308209, 9435594, 9575395, 9711339, 9854092, 10099874, 10220737, 10376228, 10545038, 10704959, 10869859, 11063152, 11236231, 11403510, 11634336, 11813217, 11982743, 12189435, 12412181, 12658707, 12776937, 12982532, 13251120, 13432878, 13740678, 13903663, 14195492, 14449396, 14633236, 14934625, 15151720, 15486705, 15690855, 15997582, 16291062, 16601208, 16877802, 17195141, 17500312, 17807283, 18155172, 18466578, 18805168, 19205706, 19542593, 19919796, 20343264, 20735895, 21178705, 21552133, 21974944, 22454846, 22921138, 23445371, 23926983, 24426185, 24947958, 25464594, 26058768, 26626427, 27267823, 27869246, 28463872, 29157022, 29827474, 30557420, 31283865]
7311C1283865Q08016P43906Q44119Q32452R00315R26934R54412R80641J027555
7302C9302215J091319J082115J146233J227353J240074J297296J364683J384941
7294D9136229J533137J566893J639349J700629J810212J859590J989547K076123
7286F3311709K158425K237685K323736K480937K618351K773092K914934L007749
7278H3826618L188597L447876L546668L778154M016164M213720M432508M733121
7270A15183426M899212N341883N552074N794938O110346O273728O645968O757871
7262A62559446P059272P288517P593185P784529P858653P948635P939952P873646
7254B23905835P758956P352853P046764O428633N813351N007990M140351L181711
$$ y = [31283865, 32091881, 32835787, 33679906, 34512358, 35412673, 36339607, 37294019, 38274660, 39302215, 40393534, 41475649, 42621882, 43849235, 45089309, 46386605, 47751288, 49136229, 50669366, 52236259, 53875608, 55576237, 57386449, 59246039, 61235586, 63311709, 65470134, 67707819, 70031555, 72512492, 75130843, 77903935, 80818869, 83826618, 87015215, 90463091, 94009759, 97787913, 101804077, 106017797, 110450305, 115183426, 120082638, 125424521, 130976595, 136771533, 142881879, 149155607, 155801575, 162559446, 169618718, 176907235, 184500420, 192284949, 200143602, 208092237, 216032189, 223905835, 231664791, 239017644, 246064408, 252493041, 258306392, 263314382, 267454733, 270636444]
7246B70636444K140083J014163j81925j267623k414816l456661m371035n211239
7238B56887391n821663o422155o811448p253380p406235p474375p564178p496337
7230B00637620p399984p286689p082621o814251o604642o375736o060851n821655
7222A47191191n560019n311067n105822m895412m634986m342860m163618l918700
7214A09258707l804135l580543l428973l180966l151210k901072k769432k719654
7206H3722722k545016k435406k352427k193161k074681k039468j991041j827073
7198F6264449j802157j764680j635133j588551j507337j427282j412023j408017
7190E3719269j283622j207183j260513j123546j224772j032673j051294j062892
$$ y = [270636444, 272776527, 273790690, 273608765, 272341142, 269926326, 266469665, 262098630, 256887391, 251065728, 244643573, 237832125, 230578745, 223172510, 215698135, 208133957, 200637620, 193237636, 185950947, 178868326, 172054075, 165449433, 159073697, 153012846, 147191191, 141631172, 136320105, 131214283, 126318871, 121683885, 117341025, 113177407, 109258707, 105454572, 101874029, 98445056, 95264090, 92112880, 89211808, 86442376, 83722722, 81177706, 78742300, 76389873, 74196712, 72122031, 70082563, 68091522, 66264449, 64462292, 62697612, 61062479, 59473928, 57966591, 56539309, 55127286, 53719269, 52435647, 51228464, 49967951, 48844405, 47619633, 46586960, 45535666, 44472774]
7182D4472774r87938r31271r09012r22241q08926q31532q63907p88523q09972
7173C6619452p10945o91882p22936o41173o55324o87384o44081n32635o58490
7164C0674602n82043n27254n44962n92772m65609n13426m68915n41102m83017
7155B5955502m02003m14361m51975m46065l86184m34280l77200m02292l68679
7146B2272463l81485l42721l83180l31636l54744k82400l04418l70406l05665
7137A9215808l33750k70503k84695k53320l28112j93522k84512l02569k66726
7128A6698099k02341l18608k46902k34742k31654k24270k29294j85632k53905
7119A4570751j83988k81176j43081k04153k16990j82983k14300k31841j21973
$$ y = [44472774, 43484836, 42553565, 41644553, 40722312, 39913386, 39081854, 38217947, 37429424, 36619452, 35908507, 35216625, 34493689, 33852516, 33197192, 32509808, 31865727, 31333092, 30674602, 30092559, 29565305, 29020343, 28427571, 27961962, 27448536, 26979621, 26438519, 25955502, 25553499, 25139138, 24687163, 24241098, 23854914, 23420634, 23043434, 22641142, 22272463, 21890978, 21548257, 21165077, 20833441, 20478697, 20196297, 19891879, 19521473, 19215808, 18882058, 18611555, 18326860, 18073540, 17745428, 17551906, 17267394, 16964825, 16698099, 16495758, 16177150, 15930248, 15695506, 15463852, 15239582, 15010288, 14824656, 14570751, 14386763, 14105587, 13962506, 13758353, 13541363, 13358380, 13144080, 12912239, 12790266]
7110A2790266j88735j86434j40371k32695j52995j31260j85049j30328j75950
7101A1266449j58157j69058j39537q7914j94086j28687j55956j09758j33769j15415
7091I874112j38348j51576q9794j12710j42011j03371j19435j01510q5538j93492
7081H636327p8720j04739q3786j10182p6955j33522n3011j47029q8778o4253p8196
7070G617156j72188o6405m7312p4391j09519j11083j02081o7540k9693j33674
7060F703270r1162m6438j29869l6240r7710o0801p2427j7515j80930J5902j05487
7049E880593p3247q9657j4450j15843o2625j1987j67219j1934r858r5833j27639
7038E100301k7288j2605o3941r2312k5322j07224N603j24168k8888k179j09946
$$ y = [12790266, 12601531, 12415097, 12274726, 12042031, 11889036, 11757776, 11572727, 11442399, 11266449, 11108292, 10939234, 10799697, 10711783, 10517697, 10389010, 10233054, 10123296, 9989527, 9874112, 9735764, 9584188, 9494394, 9381684, 9239673, 9136302, 9016867, 8915357, 8829819, 8636327, 8557607, 8452868, 8369082, 8258900, 8181945, 8048423, 7995412, 7848383, 7759605, 7695352, 7617156, 7444968, 7378563, 7331251, 7256860, 7147341, 7036258, 6934177, 6866637, 6836944, 6703270, 6612108, 6565670, 6435801, 6399561, 6301851, 6241050, 6168623, 6151108, 5970178, 5986080, 5880593, 5807346, 5717689, 5703239, 5587396, 5524771, 5512784, 5345565, 5333631, 5323773, 5227940, 5100301, 5073013, 5060408, 4996467, 4904155, 4878833, 4771609, 4777212, 4653044, 4624156, 4621977, 4512031]
7027D512031o3635k2583m9666p0032k2761l596o5662l5824m4831J5201K7061L2503
7015D208206l6104r1936J3968l6073j31230p7391o5713q9286p5594n6554n8966
7004C503327r840r2047m5785J6582o0328L70q0840n8304l190l1155n3587l4184
6992C051019j1919n8825p1488P482o8029k7379M969k6198l9704l6048m6070j4714
6980B663096j6283n4394k5059k669n0643m6336k709o2140m1513K1275o665k0438
6968B355522j9429l5115o6616J9822m3557k3140K2829j07545N854j6624m3198
6957B048803L4918o3220Q583n6228l63l8218n6500O0319p5012J0184k5909j1704
6945A835653o4888r463K4785l1383j1876k4315n8966L1435l5252m983l3217l8941
$$ y = [4512031, 4448396, 4425813, 4376147, 4306115, 4283354, 4279758, 4214096, 4178272, 4133441, 4148642, 4175703, 4208206, 4172102, 4080166, 4094134, 4058061, 3926831, 3849440, 3783727, 3694441, 3618847, 3562293, 3503327, 3493487, 3401440, 3355655, 3372237, 3311909, 3312279, 3231439, 3173135, 3169945, 3138790, 3085203, 3051019, 3039100, 2980275, 2908787, 2916269, 2848240, 2820861, 2825830, 2799632, 2759928, 2723880, 2677810, 2663096, 2646813, 2592419, 2567360, 2564691, 2514048, 2467712, 2465003, 2402863, 2361350, 2382625, 2375960, 2355522, 2336093, 2300978, 2234362, 2254184, 2210627, 2187487, 2210316, 2102771, 2108625, 2092001, 2048803, 2083721, 2020501, 2029084, 1972856, 1972493, 1934275, 1877775, 1938094, 1863082, 1873266, 1847357, 1835653, 1770765, 1761302, 1786087, 1754704, 1742828, 1718513, 1659547, 1690982, 1655730, 1650747, 1617530, 1578589]
6933A578589n485j1766K9444n9177J2530o5780r170L9996j7503j8371q3282J4058
6921A404083k67m1296j045l3526L104l7569r862k7071N8522p4318n076J3290N778
6908A254747k1424m7430m900o926J1980m6549N411j3520j484n8031J8703k8398
6896A062179j4438j0293J3119k6758j2049M2695p5275K2116K893l172k1449j1806
6884I67762p2947P5273m0823n6881K2248k964k0732j6601L3962k9574m2100R740
6872H26363j1659J8002R254q304m7625j4007N051k4597j0403j1238k45M8150p0642
6859G08100Q2498p5253m1417N2830n4684K8902j525k9868K9656k2016J1453l4384
6847F54292o4374K8382M7967n3805O496j6276k1438O3304o314l5765J3163m9986
$$ y = [1578589, 1573104, 1561338, 1590782, 1531605, 1544135, 1478355, 1469185, 1509181, 1491678, 1473307, 1390025, 1404083, 1403816, 1362520, 1361475, 1327949, 1331053, 1293484, 1283622, 1256551, 1315073, 1240755, 1235679, 1248969, 1254747, 1233323, 1185893, 1180993, 1174067, 1186047, 1139498, 1144909, 1131389, 1129905, 1071874, 1090577, 1062179, 1047741, 1037448, 1050567, 1023809, 1011760, 1054455, 979180, 1001296, 1004189, 1001017, 979568, 967762, 894815, 970088, 929265, 872384, 894632, 891668, 870936, 854335, 888297, 858723, 816623, 826363, 814704, 832706, 841960, 833656, 786031, 772024, 777075, 752478, 742075, 730837, 730592, 778742, 708100, 790598, 715345, 673928, 726758, 672074, 700976, 699451, 669583, 699239, 677223, 688676, 654292, 589918, 618300, 666267, 612462, 618958, 602682, 581244, 644548, 638234, 602469, 615632, 565646]
6835E65646o8646Q5370m247j8218l4933m2037K6543N5620K618j4108Q046o6526
6823D95128L237J7557j8065K4377m1527N628M2626o025l8756o122K6302k5134
6811D79226j6961l181j9574J9147k9802M3267k4974k3083L859j3737K6195j4862
6799D25520l1042j0248K0368K9614L1969m6323m7651M9641R577k5991l348l2721
6787C69365K2591l0097P406M3527n7081L3277j4522l2959K1579j334k2300o107
6775C33345n443Q122L5142p1004j5777L1266J0920k478J298p4282N6149M429n885
6762C05802j1000K2322J9837j9378L678j7000k4358M2639n2108j163L9221m0924
6750B67568n3326O7344m9312J5526M1591m8209J9901J4110l7954q5J0313l313
$$ y = [565646, 497000, 582370, 578123, 559905, 524972, 482935, 509478, 565098, 567716, 553608, 561654, 495128, 498365, 515922, 497857, 522234, 480707, 486335, 528961, 522936, 484180, 478058, 504360, 479226, 462265, 459084, 439510, 458657, 428855, 472122, 447148, 424065, 427924, 414187, 440382, 425520, 394478, 384230, 404598, 434212, 466181, 419858, 372207, 421848, 431425, 405434, 402086, 369365, 391956, 361859, 369265, 412792, 355711, 388988, 374466, 341507, 363086, 361752, 339452, 333345, 327902, 336024, 371166, 300162, 284385, 315651, 326571, 324093, 325391, 251109, 307258, 311687, 305802, 294802, 317124, 336961, 317583, 321261, 304261, 279903, 322542, 270434, 269271, 308492, 267568, 214242, 281586, 232274, 247800, 289391, 241182, 261083, 275193, 237239, 237154, 247467, 244154]
6738B44154j7242J6591R408n1502N9120m8922l754M5938m9085j9176j2776Q866
6726A81620K6437K3470R912n8231K8502O635o470m5412L8184k6098m4523M3627
6714A77653k2128M8415k3826K351K8465n1267L1054j8675K2454n0727l6549K6920
6702A34140M4808p5697P1378o2620K4269k7093N0467n8355P1764m1442m0555N2180
6690A43244j5674k0578K4394L131k5164J4156l87j8540N345j1308j8603P3648
6678A53664l3910K4899j896k7791j1504L6203k083j5687n159J0943j5162k6895
6666H5622N8227l6622j1109r394M9262j9971L1354k0136M062j281j2803L8976
6654A56187j0515k8453J5460N9334R631k3696J888j9218K8621l795k4994j2909
$$ y = [244154, 226912, 243503, 252911, 201409, 260529, 211607, 207853, 253791, 204706, 185530, 172754, 181620, 208057, 231527, 241439, 183208, 211710, 218345, 211875, 166463, 204647, 178549, 134026, 177653, 155525, 203940, 180114, 182465, 210930, 159663, 190717, 172042, 194496, 143769, 107220, 134140, 178948, 103251, 174629, 112009, 136278, 109185, 159652, 101297, 173061, 131619, 91064, 143244, 127570, 106992, 131386, 134517, 109353, 123509, 123122, 104582, 109927, 98619, 80016, 153664, 119754, 144653, 142757, 114966, 103462, 139665, 137582, 121895, 116736, 127679, 112517, 85622, 143849, 107227, 96118, 86724, 135986, 116015, 147369, 127233, 131295, 130014, 117211, 156187, 145672, 117219, 132679, 192013, 201644, 177948, 179836, 160618, 189239, 185444, 160450, 147541]
6642A47541q364P589r901p074K5323n0168n280N767l965K5685k7214j2756O4665
6629A51848j1966m1809M1668j8741l297J2786J2568K7770K7739q5993L3368J1427
6617A57368j7634K1210l0392J949k151L0228m2013l6363K5335l9281j1226N4959
6605A11989p7490J8336P7833l6777J867J3795l1601R048K3072k8200N0314n3598
6593G8588J4856L6089K197m821J2567l5339n176m3652L9788j5714k6137j6172
6581C7074Q3085l9700k4935M117j1092J4835J5039L4703m5810k8296j1070M0579
6569F8529J6562K3521o1008N620Q084N4495j8068n2294l8743O0496o359k8498
6557C2337M7259j8148k7811K7946j8514j9637j6863J2642M2123l1137N4751j5853
$$ y = [147541, 139177, 146766, 136865, 129791, 155114, 104946, 99666, 105433, 101468, 127153, 99939, 87183, 151848, 139882, 98073, 139741, 121000, 117703, 130489, 143057, 170827, 198566, 112573, 145941, 157368, 139734, 160944, 130552, 132501, 130350, 160578, 118565, 82202, 107537, 68256, 57030, 111989, 34499, 52835, 130668, 93891, 95758, 109553, 77952, 87000, 110072, 81872, 132186, 78588, 93444, 129533, 131730, 126909, 139476, 104137, 98961, 55309, 95097, 79383, 53246, 37074, 120159, 80459, 55524, 59641, 48549, 63384, 78423, 113126, 67316, 39020, 27950, 68529, 85091, 108612, 47604, 53224, 61308, 115803, 97735, 45441, 6698, 67194, 60835, 32337, 79596, 61448, 33637, 61583, 43069, 23432, 6569, 19211, 61334, 30197, 84948, 69095]
6545F9095m5308j815L364M5477l1668q374J5451k6582N932Q1037q3048k3180L869
6532D250R358J5515L43j7566l414l3370K7248L2974J359n9015L1479M8843l3144
6519B4860l350P060R178j3101N7219m7486l990k3693K8451l961l4610K7073n5614
6506c1964j93M6973j887j3706M5747k4080J9470J1393o3534Q416L6616j6286L4357
6493E1322J5519r3819P5071m9160n169J4660N1091j6396j4202N3768k4847j3790
6481D4048L4958L080J0275k763q2038N1563k4495j4291L9811k5013l0212P0707
6469G5630l0254m7255O7557K6951m7160N709J9802l5995k3310N1057N1990l1439
6457H3283k8410R639M6523M2962P4175l296j8222O2796k7179m8490l0758l1588
$$ y = [69095, 23787, 21972, 25336, 70813, 39145, 30771, 46222, 19640, 25572, 106609, 23561, 381, 4250, 13608, 29123, 29466, 11900, 8486, -24884, 2364, 35338, 36697, -22318, 9161, 58004, 24860, 21510, 28570, 37748, 24647, 81866, 34380, 30390, 6697, 35148, 31187, -3423, 23650, -31964, -32157, 14816, 12929, -777, 44970, 20890, 40360, 51753, -11781, -3365, 33251, 16965, 51322, 66841, -26978, 48093, -1067, -6236, 8424, 59515, 43119, 28917, 82685, 57838, 44048, 79006, 82086, 92361, 89598, 7560, 59123, 34628, 20337, 60148, 35135, 4923, 75630, 45376, -1879, 65678, 92629, 45469, 51178, 70980, 34985, 11675, 62732, 114722, 83283, 54873, 64512, 111035, 153997, 228172, 224876, 206654, 269450, 242271, 193781, 163023, 131435]
6445A31435L1987m2260J7484N5830l8111J7050p7424M1185J7145n5456j0802k4355
6433F3708N4541q375N459p7569Q2500Q840K6373K6630R602O7949L3472l3782J3683
6420B73031k5239n1458L2295K148M7862J5945P9875m2046P403m0964n7557n0236
6408A91059J296j9185j2137m0317l6299J5226j4128k0067K525M5775k6737M751
6396I1762O4352k9245K872K9381m6914p195K0215M4930M9303L9536N8281K7006
6384C44284p802p4661j0230o2195k2342j376j252m2400L4477l5769J8451r3526
6372D5659O9447O214m1800q09R867j6758k064n35m0185M7010j2850L1151q625
6359H5722K9640k0551K8519k4603M2549j0521j0438k6797p9623O8586l2984J0369
$$ y = [131435, 163422, 121162, 138646, 194476, 156365, 173415, 95991, 137176, 154321, 98865, 88063, 63708, 118249, 109874, 115333, 37764, 120264, 129104, 155477, 182107, 191709, 259658, 293130, 259348, 273031, 247792, 196334, 228629, 230777, 278639, 294584, 374459, 332413, 339816, 298852, 241295, 191059, 192355, 173170, 161033, 120716, 84417, 99643, 85515, 65448, 67973, 113748, 87011, 91762, 156114, 126869, 129741, 159122, 112208, 105013, 125228, 170158, 219461, 258997, 317278, 344284, 336482, 261821, 251591, 189396, 167054, 165678, 164426, 122026, 156503, 120734, 139185, 45659, 115106, 121320, 79520, 78711, 88578, 71820, 69756, 69221, 29036, 76046, 63196, 94347, 85722, 115362, 94811, 123330, 98727, 141276, 130755, 120317, 93520, 13897, 82483, 49499, 59868]
6347E9868j0502J2139o8745R0904n44n2049M1775m1415J556j2902J3773k9206
6335D652J4661J1313N5558p671l6648p426L7412M670k4547J3041k3829k185L8904
6322G7905N4001o5089J6761j3238l7068L5918N460K7068m3116K811j4344L6988
6310H4057J0885l7735N484O381r938J7853K2176n1760J8139M5183Q470j2161J044
6297A08078O949K0990Q033j1649k0176k7522K9714J4473L9637m7223L0458J341
6285A53103k3862J422R1170m2711o5818M7486J4455L7113j49K1368l5762P3204
6273B71019L986j4778L7364J6250j4474K3380k6068P100r648J1875J7417q726
6261C14697o63J211J467M3605K6538M8274n1992O4370k6211Q6641N730p3630N3173
$$ y = [59868, 49366, 61505, -7240, 83664, 83120, 31071, 72846, 31431, 32987, 20085, 33858, 4652, 19313, 30626, 86184, 78513, 41865, 34439, 71851, 76521, 51974, 65015, 41186, 39001, 77905, 131906, 66817, 83578, 70340, 33272, 69190, 74650, 101718, 58602, 61413, 47069, 84057, 94942, 57207, 62691, 69072, 59134, 76987, 99163, 47403, 65542, 110725, 119195, 107034, 108078, 115027, 136017, 144050, 132401, 112225, 84703, 114417, 128890, 168527, 121304, 151762, 153103, 129241, 130663, 221833, 179122, 113304, 160790, 175245, 212358, 212209, 233577, 197815, 271019, 275005, 260227, 297591, 313841, 299367, 322747, 296679, 303779, 294131, 306006, 323423, 314697, 314034, 315245, 316712, 360317, 386855, 435129, 383137, 447507, 421296, 507937, 513667, 440037, 493210]
6248D93210K5431l320L9332l0241j4544J7312L3471M2100L3336m6834L5315K0060
6236F44628O3773K9000M6706N5755k1798L4602J0353p069M8225J2194l8808j5517
6224H62044Q4424n5135m5K0604O476M0901J3062J9743J18115M0325Q0780J08451
6212A339745J22351J47753J87676J98304K55176K67113K14360J03117J2119n2152
6202B795562j21819k22080k16007j97878j52002q5093n9044q5383n0756k7735
6192A577765K7475k4699J08571P8935J23639J19260K29124K72461K61203K67987
6182C041721M20763L48416K92224K94794J76928K5131j9175n2420j80690j42093
6172D205599j34900j91124m7139j03504j00311j08796j89756k03899j51574j96003
$$ y = [493210, 518641, 515321, 554653, 524412, 509868, 527180, 560651, 602751, 636087, 589253, 624568, 644628, 708401, 737401, 784107, 839862, 818064, 852666, 863019, 855950, 904175, 916369, 877561, 862044, 946468, 891333, 891288, 911892, 918368, 959269, 972331, 992074, 1110189, 1150514, 1231294, 1339745, 1462096, 1609849, 1797525, 1995829, 2251005, 2518118, 2732478, 2835595, 2847714, 2795562, 2673743, 2451663, 2235656, 2037778, 1885776, 1800683, 1741639, 1656256, 1605500, 1577765, 1605240, 1580541, 1689112, 1768047, 1891686, 2010946, 2240070, 2512531, 2773734, 3041721, 3462484, 3810900, 4103124, 4397918, 4574846, 4599977, 4580802, 4528382, 4347692, 4205599, 4070699, 3879575, 3832436, 3728932, 3628621, 3519825, 3330069, 3126170, 2974596, 2778593]
6162B778593j46915m3157q9873j4704R0673J09501J60687J97450J55963J96116
6152C394334J42788N0281j8870M8288j715M9014k1214m0131q4639r5240j69319
6141C253577j65781r9765j45225k01437j57488j75768j63554j60256j59339p4650
6131A750314j00653k5534k8110m7086L5241j4M5918L8310Q2003Q2675P6539O6241
6119A975844J12352R2369O5645M4138P943M6476P3818J19809J58645R4336O7328
6108B858703n8101j23500j64226k21531j37253p255Q5252p02J88412M9608R0333
6097B559740L3587p0874p8572o0309k06433r8643j36978j59662p1320r241o1615
6086A639680j184O7243J56597K36110J71070Q7044O4480o2002k24981j72474n4052
$$ y = [2778593, 2631678, 2588521, 2498648, 2483944, 2574617, 2684118, 2844805, 3042255, 3198218, 3394334, 3537122, 3587403, 3568533, 3616821, 3615106, 3664120, 3642906, 3602775, 3518136, 3422896, 3253577, 3087796, 2988031, 2842806, 2641369, 2483881, 2308113, 2144559, 1984303, 1824964, 1750314, 1649661, 1624127, 1596017, 1548931, 1584172, 1584158, 1630076, 1668386, 1750389, 1833064, 1909603, 1975844, 2088196, 2180565, 2246210, 2290348, 2298291, 2344767, 2418585, 2538394, 2697039, 2791375, 2858703, 2800602, 2677102, 2512876, 2291345, 2154092, 2146837, 2232089, 2231387, 2419799, 2469407, 2559740, 2593327, 2522453, 2443881, 2383572, 2177139, 2078496, 1941518, 1781856, 1710536, 1701295, 1639680, 1638496, 1705739, 1862336, 2098446, 2269516, 2356560, 2421040, 2359038, 2134057, 1961583, 1907531]
6075A907531j0305l386p439k3055k5924J4617K8040n271l318j7947J0178K6430
6063A890151R7644j065K8147P4757J43011N9954J80883K65168K04997L28426L17077
6052C589150L59536M19104K99643K47602K65986J2819p6014j72810l59638k76003
6042D309375k25690l04692k03577j07119j56340k0288j2682P8401M5528J08778
6032C511694J46254K00797K31095K19278J59705K18556J11122n0040m6140k32649
6022D469672j57218j43176j84702j03116k6986n6487K8788J07735J27478K93192
6012D355180K32208K85035L46136L16889L72857K49692K85052L48758L23588K91079
6002G406474K59876K02251N3591j5206l831M5645L5702O2656J48093J11587J63432
$$ y = [1907531, 1897226, 1893840, 1886401, 1863346, 1837422, 1852039, 1880079, 1874808, 1871490, 1853543, 1863721, 1890151, 1987795, 1986730, 2014877, 2089634, 2232645, 2292599, 2473482, 2738650, 2943647, 3272073, 3589150, 3948686, 4367790, 4667433, 4915035, 5181021, 5193840, 5117826, 4945016, 4585378, 4309375, 4083685, 3778993, 3575416, 3468297, 3311957, 3291669, 3278987, 3357388, 3402916, 3511694, 3657948, 3858745, 4089840, 4309118, 4468823, 4687379, 4798501, 4748461, 4702321, 4469672, 4312454, 4169278, 3984576, 3881460, 3854474, 3797987, 3826775, 3934510, 4061988, 4355180, 4587388, 4872423, 5218559, 5535448, 5908305, 6157997, 6443049, 6791807, 7115395, 7406474, 7666350, 7868601, 7922192, 7906986, 7903155, 7948800, 7984502, 8047158, 8195251, 8306838, 8470270]
5991H470270Q0594J15185K52178L19810M70795L57846L76295L38239J67494P7650
5981A1026356j08505k69720l27799l07334j79579q0600L7938l1940P5074L0095
5971I863986R8578J42892L26523O82522J052573R85409N63392L04550J76113J69934
5961A4366472J289361J699955J466934M35177L30499n25507L40303J695927J983895
5952B3083016J038335p2169r06255j908011r67763M3281M33250n12572m82429
5943A9748683j492539j331165m90838K05642Q9421l58088p88287j550633j724227
5934A2307969j465768j279402j015275r80652q12546p29464o36410n13300m33961
5925D441191l11280k68596j98154j16604j39960r5092o8477j43333N6815j18982
$$ y = [8470270, 8550864, 8666049, 8918227, 9238037, 9708832, 10066678, 10442973, 10781212, 10948706, 11026356, 10917851, 10648131, 10320332, 10012998, 9833419, 9752819, 9790757, 9758817, 9833891, 9863986, 9962564, 10105456, 10431979, 11114501, 12167074, 13152483, 13715875, 14020425, 14196538, 14366472, 15655833, 17355788, 18822722, 19257899, 19588398, 19062891, 19403194, 21099121, 23083016, 24121351, 24049182, 23142927, 21234916, 20267153, 20310434, 20743684, 20231112, 19748683, 18256144, 16924979, 16434141, 16639783, 16729204, 16371116, 15582829, 14032196, 12307969, 10842201, 9562799, 8547524, 7566872, 6754326, 6024862, 5388452, 4875152, 4441191, 4129911, 3861315, 3663161, 3546557, 3406597, 3311505, 3243028, 3099695, 3156510, 3037528]
5915C037528j1447j33170q6328j24168j35798p5241q2108q5013j06695j31372
5905B066188n2922j12098o8220m2389j29511k6895o9602o7201n5247l4478l9041
5894A368584j8279k4559j12672L4317p9357o7922R0353l2489l4958q8480N5172
5883A089710p4097K3574L5038p0373M2025k345k597k6333k1172l5254j3150o2982
5871H82044m1407Q857l277l9423l2619Q03l9132K1392l6922L3068n7136j3943
5859F82305m5275j9824R594O7101n2291l4534M8106p8249N7179q969l836n0298
5847E71009J6301l8072K4320l1860j647L587j4113q460J7324q857j6613k8876
5835D84043K1179k1424M8125K7351p7097n989K6605l0970K5102j6374m7898K0514
$$ y = [3037528, 3026081, 2892911, 2806583, 2682415, 2546617, 2471376, 2389268, 2304255, 2197560, 2066188, 2013266, 1901168, 1832948, 1790559, 1661048, 1634153, 1564551, 1497350, 1442103, 1407625, 1368584, 1350305, 1325746, 1213074, 1247391, 1168034, 1100112, 1190465, 1157976, 1123018, 1034538, 1089710, 1015613, 1039187, 1074225, 1003852, 1045877, 1043532, 1040935, 1014602, 993430, 958176, 945026, 882044, 840637, 849494, 846217, 806794, 774175, 774978, 735846, 757238, 720316, 753384, 696248, 682305, 637030, 617206, 626800, 693901, 641610, 607076, 655182, 576933, 634112, 625143, 621307, 571009, 587310, 549238, 573558, 541698, 540051, 543638, 529525, 521065, 538389, 529532, 512919, 484043, 505222, 483798, 531923, 559274, 482177, 476188, 502793, 471823, 496925, 480551, 432653, 453167]
5823D53167N3900o8736L4970M5711j10534N1406P066q4209N0096k2359k9916R086
5811C89648J9470k4184J0838J7686j2354N9700q9651P7687l1940J7857o115j2386
5799D16256j7232L7446l7303P053j302Q224k2735M7849n3391K0399L3330P190
5787D45784k5263K1904m9438M5368j9747k091p038M6509o7696P1593M2749j1740
5775D90894k5820q291q223K1630m2754M0630M0030j4672n0781K2609N1173O54
5763E17079k9281k4828K0483J0834N2240m3468P0759J2742n33p285p606K1680
5751E92816J37024j8684M194N9512O6827J8029N3707P7814o660j4420M483k4669
5739I49973M5809o3774m2551j2418k2470M2665n0578m965J8160m1965K7891M6893
$$ y = [453167, 507067, 438331, 473301, 519012, 408478, 459884, 466950, 382741, 432837, 410478, 380562, 389648, 409118, 384934, 395772, 413458, 401104, 460804, 371153, 448840, 416900, 434757, 428642, 416256, 399024, 436470, 399167, 406220, 404918, 413142, 390407, 438256, 384865, 405264, 438594, 445784, 420521, 442425, 392987, 438355, 418608, 416517, 409479, 455988, 388292, 459885, 502634, 490894, 465074, 456783, 448560, 470190, 427436, 468066, 508096, 493424, 442643, 465252, 516425, 517079, 487798, 462970, 483453, 494287, 546527, 503059, 573818, 586560, 586027, 578742, 571136, 592816, 729840, 711156, 715350, 774862, 841689, 859718, 913425, 991239, 984579, 970159, 974642, 949973, 995782, 932008, 889457, 877039, 854569, 897234, 846656, 841691, 859851, 817886, 845777, 892670]
5727H92670J3649j3473L3624O8016j1093R3919R001Q7868N0360M0647J12923J03337
5715A481448P4841Q5451N2538J2856o0114N9333p2311m4394L807n4948j3265o2374
5703A462868l3663J8139J0961k0309o9691P6108j0580P7932Q5224m0324J30964
5692A687629O7581L5813J29149J14892J31022J06709J41062J93980J94362J62885
5682B965084K07569K39427K52113K76542K76612L53989L84643L53519M23092L67788
5672F100378L41595K73780J47348L0028o3722j86619k68240l11558k84742l00493
5662E477755k92328k45474j36891r7020p728m1514Q2874J27340J56294K15280
5652E238588L03650L26781N01358N07353O24719P73300Q04962Q22823R24408Q42706
$$ y = [892670, 906319, 892846, 926470, 994486, 983393, 1077312, 1086313, 1174181, 1224541, 1265188, 1378111, 1481448, 1556289, 1641740, 1694278, 1707134, 1647020, 1706353, 1634042, 1589648, 1593455, 1538507, 1525242, 1462868, 1429205, 1447344, 1458305, 1437996, 1368305, 1444413, 1433833, 1511765, 1596989, 1556665, 1687629, 1755210, 1791023, 1920172, 2035064, 2166086, 2272795, 2413857, 2607837, 2802199, 2965084, 3172653, 3412080, 3664193, 3940735, 4217347, 4571336, 4955979, 5309498, 5732590, 6100378, 6441973, 6715753, 6863101, 6893129, 6829407, 6642788, 6374548, 6062990, 5778248, 5477755, 5185427, 4939953, 4803062, 4706042, 4698314, 4656800, 4739674, 4867014, 5023308, 5238588, 5542238, 5869019, 6370377, 6877730, 7502449, 8275749, 9080711, 9903534, 10827942, 11670648]
5642A1670648O86329N93681K98879L8477k04695m55621o97170p59576q06455q36663
5632I527834q56024o78780o50177m57432l97135k93282j51487o3966p7248N3647
5622E955950J26565J32308J74707K98314L07354M32342M62904M96560N84709N31060
5612I502773M92472M18311L08571J42137m5984k00591k98410l02364m27557l14661
5602I274697l38997k39258j60601j28743n0121L6951R9810J2665J29274P6902
5592H712579J23873Q5320Q3635R8072J27150M6461J54549J99871J62371J94744
5582I988625K27104K60971K48219L16339L16270J77792L56814K39425J94104J55819
5572A2481482R9624l7650k1630j02347k19844k17255k66690k87584j70981k13969
$$ y = [11670648, 12356977, 12950658, 13249537, 13288014, 13083319, 12627698, 11930528, 11170952, 10364497, 9527834, 8671810, 7993030, 7342853, 6885421, 6488286, 6195004, 6043517, 5979551, 5902303, 5955950, 6082515, 6214823, 6389530, 6687844, 6995198, 7427540, 7890444, 8387004, 8971713, 9502773, 9995245, 10413556, 10722127, 10864264, 10818280, 10617689, 10319279, 10016915, 9589358, 9274697, 8935700, 8696442, 8535841, 8407098, 8356977, 8393928, 8493738, 8506403, 8635677, 8712579, 8836452, 8921772, 9005407, 9103479, 9230629, 9277090, 9431639, 9631510, 9793881, 9988625, 10215729, 10476700, 10724919, 11041258, 11357528, 11535320, 11892134, 12131559, 12325663, 12481482, 12581106, 12543456, 12521826, 12419479, 12199635, 11982380, 11715690, 11428106, 11257125, 11043156]
5562A1043156j98155r5898m7944L7595J76902J62017K50365L79221L02022L60436
5552A2369717K78665R5959O6472j28453j82643l03852m69935m99424n54904n33241
5542A0138361m75128m41063m71260l63792k88296j87042j76752p5565M5946J32937
5532G838346K52833L53633N07613N27402O36616O73624O27937N43096M43399L24751
5522A2729250P2479n8628l01088m08771o18188n91095p40433p28379p72053o80469
5512G902625o36023m97007m58789l32724k73833k23235j32841k0456l6011L9835
5502E331541R0994J78769J95979K44120L52152L07367L45987K38228J56121P5987
5492G517245K1964k53807l23598l10453m39897n09878m53827m43199l82918m26759
$$ y = [11043156, 10845001, 10749103, 10701159, 10738754, 10915656, 11077673, 11328038, 11707259, 12009281, 12369717, 12648382, 12744341, 12810813, 12682360, 12499717, 12195865, 11725930, 11226506, 10671602, 10138361, 9663233, 9222170, 8750910, 8387118, 8098822, 7911780, 7735028, 7659463, 7705409, 7838346, 8091179, 8444812, 8952425, 9479827, 10116443, 10790067, 11418004, 11961100, 12404499, 12729250, 12801729, 12743101, 12442013, 12033242, 11415054, 10823959, 10083526, 9355147, 8583094, 7902625, 7266602, 6769595, 6310806, 5978082, 5704249, 5481014, 5348173, 5327717, 5291706, 5331541, 5422535, 5601304, 5797283, 6041403, 6393555, 6700922, 7046909, 7285137, 7441258, 7517245, 7539209, 7285402, 6961804, 6651351, 6211454, 5701576, 5247749, 4804550, 4421632, 3994873]
5482C994873l57445l04298k24172k30001r4038j27486j85611m5337o4486j13262
5472B248737n5718K660o8672p5435L740j0596p6653K7857k6611l4998J4090K1048
5460A969449j5978j6271m817j2697N4247L764J3375J9846m3615L0022L5519k1429
5448B011415L604O6349l0084L3292l1232O6729j4886l51l8971J0401o552r112
5436B060602l6879m1343J8770J5715l1426j2435j6655N688N2828r6949L9660n79
5424A956997K6515R130R7388k3851j887O6399M3258R6289O7924l094k0134K8624
5412B343558P158N213j1457M8730J2902Q0101J14924Q6238J24736J56529J88540
5401C157172K33721K26914J68831L33786K83136K12421K26926K29529R9914J62281
$$ y = [3994873, 3637428, 3333130, 3108958, 2878957, 2784919, 2657433, 2471822, 2426485, 2361999, 2248737, 2193019, 2195679, 2127007, 2051572, 2055312, 2044716, 1968063, 1995920, 1969309, 1934311, 1948401, 1969449, 1953471, 1937200, 1932383, 1919686, 1973933, 1977697, 1991072, 2010918, 1967303, 1997325, 2032844, 2011415, 2015019, 2081368, 2051284, 2084576, 2053344, 2120073, 2105187, 2104836, 2065865, 2076266, 2069714, 2060602, 2023723, 1982380, 2001150, 2016865, 1985439, 1973004, 1956349, 1962037, 2014865, 1917916, 1957576, 1956997, 1983512, 1992642, 2090030, 2066179, 2064292, 2130691, 2173949, 2270238, 2338162, 2335068, 2314934, 2343558, 2350716, 2355929, 2344472, 2393202, 2406104, 2486205, 2601129, 2687367, 2812103, 2968632, 3157172, 3390893, 3617807, 3786638, 4120424, 4403560, 4615981, 4842907, 5072436, 5172350, 5334631]
5391E334631R9110N1840j2676M6389n0706L0770L3948k4969P0381R0152J45583
5380E814453K32392K78518K21512L01465L62957L89838L75892M47145L41944L26228
5370I092344K96575K11705J09249J9695o4542j92236k28460k66010l66966k87974
5360H323380l70531l10353l17482k41272j97471j81513j27774j61702n4652l5904
5350F324726q9222p4580r8442r6368j52983j87162k20952k55747k60675l27096
5340D561499k57969l04692l13261l10979k26854j86608k60809j88673k09167j33597
5330B168890m9208j88118j17092r0305m1636o5469k7202q6386p7957k1142o8846
5319A335529l2668K2909l5881j11930J9137o7369L6125k9370o4684k5454J3399
$$ y = [5334631, 5433741, 5485581, 5472905, 5519294, 5468588, 5499358, 5533306, 5508337, 5578718, 5668870, 5814453, 6046845, 6325363, 6546875, 6848340, 7211297, 7601135, 7977027, 8424172, 8766116, 9092344, 9388919, 9600624, 9709873, 9729568, 9665026, 9472790, 9244330, 8978320, 8611354, 8323380, 7952849, 7642496, 7325014, 7083742, 6886271, 6704758, 6576984, 6415282, 6360630, 6324726, 6235504, 6160924, 6062482, 5966114, 5813131, 5625969, 5405017, 5149270, 4888595, 4561499, 4303530, 3998838, 3685577, 3374598, 3147744, 2961136, 2700327, 2511654, 2302487, 2168890, 2119682, 1931564, 1814472, 1724167, 1682531, 1617062, 1589860, 1503474, 1425517, 1404375, 1335529, 1302861, 1325770, 1289889, 1177959, 1197096, 1129727, 1165852, 1136482, 1071798, 1046344, 1059743]
5308A059743m8031K7577R484l1592l9204L6742l1436r319M9653p2700M6104O83
5296I97704q621K2185L3959m25j0542O664J1870O631l0300R840K8892L7764n6973
5283A048648j1501J9701K4077k0184M8420o8897N2184q450M3249M8218L403J2997
5271A191865L106L1273J857L4869o8016K4806n4823l930m9897R144r0280j6065
5259A013909m2015l9847r793n6569k4784O996l2227n2185K0901Q835k2545m0681
5247G29995M9121n7463l4998k322L371j618J6969j11864M921M5603q4502j2760
5235E44453j5221p2803L3903m0932j8807K478l8409l5704p755J7691k2834j2014
5223C34046K1582m5611m501j2579L9765r4912J0733L8863l3036Q0391n2977m5546
$$ y = [1059743, 1011712, 1039289, 1048773, 1017181, 977977, 1014719, 983283, 973964, 1023617, 950917, 997021, 997704, 989083, 1011268, 1045227, 1044802, 1034260, 1040924, 1052794, 1059425, 1029125, 1038965, 1067857, 1105621, 1048648, 1037147, 1056848, 1080925, 1060741, 1109161, 1040264, 1092448, 1083998, 1127247, 1175465, 1178868, 1191865, 1194971, 1226244, 1228101, 1262970, 1194954, 1219760, 1164937, 1161007, 1111110, 1120254, 1029974, 1013909, 971894, 932047, 922254, 865685, 840901, 847897, 815670, 763485, 784386, 793221, 770676, 729995, 779116, 721653, 686655, 684333, 687704, 686086, 703055, 591191, 596112, 641715, 557213, 544453, 529232, 456429, 490332, 449400, 430593, 433071, 394662, 358958, 351203, 368894, 346060, 334046, 355628, 310017, 305516, 292937, 332702, 237790, 248523, 287386, 254350, 334741, 281764, 236218]
5211B36218M3211o531J2080L1990j6543o2277K7395J4475j9295M1670l4794l9287
5199B28312K5765l5004M9329j6720J1493J4344M572k6056m3719J5620O1762m3084
5187B46614J6967m0789k3821K1194M5853j916k7819K6473o8760J4526K1158M4644
5175B74324l72m9206K3528j4995P2468l7541j0701N8723k755J8121Q286R11M1825
5162C82616K4346L4639n293m464O797k614J0552m4057q493n0194J9421p184j5152
5149C40920L2211o6316O489P2288o0146J3437K7966j6699O2025m0450o71P1834
5137D42888L0942m2922P2541O1431m2881J37384r365N5961R9691n4825J8620P812
5125G77277o4674k0369M1841n9132j3290m396j14588j5013M0279K7576m5445J809
$$ y = [236218, 279429, 272898, 284978, 316968, 300425, 238148, 265543, 280018, 260723, 302393, 267599, 228312, 254077, 219073, 268402, 251682, 263175, 277519, 282091, 256035, 212316, 227936, 289698, 246614, 263581, 222792, 198971, 220165, 266018, 264102, 236283, 262756, 193996, 208522, 229680, 274324, 273952, 224746, 248274, 233279, 305747, 268206, 257505, 316228, 313473, 331594, 339880, 340791, 382616, 406962, 441601, 436308, 431844, 438641, 436027, 446579, 402522, 394029, 343835, 363256, 356072, 340920, 373131, 306815, 313304, 385592, 325446, 338883, 366849, 350150, 412175, 371725, 371054, 442888, 473830, 430908, 503449, 564880, 521999, 659383, 650018, 705979, 805670, 750845, 769465, 777277, 712603, 692234, 734075, 674943, 661653, 657257, 542669, 527656, 567935, 595511, 550066, 551875]
5113E51875J5373K6297j094O8781q4803L4525N9649r820O0713p08O5019M7470
5101H33277O2583m751N2740O4703k5827P6289r0270m9998l050l8468l7883J2034
5089H51379m7436l6128l2350p916J1034J5818L1967m9142L723K803M6826l7985
5077G52593L1200K7927L2040M1977o286N7967L3432K0521N8831j675M5194J9360
5065A113081J171J12935M3175J12253Q7877j1744K4436J8328k5048j04357l6630
5054A335477j7933L7417M1997J6894N6624J7656N2633J00771J75088J30167J34919
5043B081710K66325J64858J66096J75001J7905M4194L7153o8572p4993j32073
5033B677604j23005o5843L168k2197j08101L4621R475N4659P8817O7881J06734
$$ y = [551875, 567248, 593545, 592451, 661232, 576429, 610954, 670603, 660783, 721496, 720788, 785807, 833277, 895860, 891109, 943849, 1008552, 982725, 1059014, 968744, 918746, 915696, 877228, 839345, 851379, 803943, 767815, 735465, 727549, 738583, 754401, 786368, 737226, 740949, 743752, 790578, 752593, 783793, 811720, 843760, 885737, 879451, 937418, 970850, 991371, 1050202, 1048527, 1093721, 1113081, 1114252, 1227187, 1270362, 1382615, 1470492, 1458748, 1483184, 1501512, 1476464, 1372107, 1335477, 1317544, 1354961, 1396958, 1413852, 1470476, 1488132, 1540765, 1641536, 1816624, 1946791, 2081710, 2348035, 2512893, 2678989, 2853990, 2871895, 2916089, 2953242, 2884670, 2809677, 2677604, 2554599, 2488756, 2491924, 2469727, 2361626, 2396247, 2405722, 2460381, 2539198, 2607079, 2713813]
5022B713813Q5386J86149J30348L33464J43314K21006L80156M46096M57352N71838
5012E668922M94404M97425M34703J63001k309j79222l49268m24563l75218m55843
5002E472032l56533l38745k43425k06030p4225j39185n7516l8087P7506O2086
4992D157878J01370J88227O7545K32487L11249L67765M33952N48694N66003O52871
4982G628041O90240N12748L40621J65624k19416l73466n62589p09066o91897o33833
4972F147007n75181m81872k76725m24745l21309j65525p8151k0807n7735m2831
4962C702126l3603R0643R1697R684R1243J50200J43016L78942L64323L91145L59786
4951E739202K19431Q1967j8217k36124m10526m10262m26525l93299l72897m11245
$$ y = [2713813, 2799199, 2985348, 3115696, 3449160, 3592474, 3813480, 4193636, 4639732, 5097084, 5668922, 6163326, 6660751, 7095454, 7258455, 7256146, 7076924, 6727656, 6303093, 5927875, 5472032, 5115499, 4776754, 4533329, 4327299, 4253074, 4113889, 4056373, 4018286, 4095792, 4157878, 4259248, 4447475, 4515020, 4747507, 5058756, 5426521, 5860473, 6409167, 6975170, 7628041, 8318281, 8831029, 9171650, 9337274, 9117858, 8744392, 8181803, 7472737, 6780840, 6147007, 5571826, 5089954, 4813229, 4388484, 4067175, 3901650, 3823499, 3802692, 3744957, 3702126, 3668523, 3759166, 3850863, 3860547, 3951790, 4101990, 4245006, 4623948, 4988271, 5379416, 5739202, 5958633, 6040600, 6022383, 5786259, 5375733, 4965471, 4538946, 4145647, 3772750, 3361505]
4941C361505l83446j87043j81343j38668j37919l4598o6906k0568m8205k2823
4931B139986o6431r4746k2247K4546L7679R761j7108k144L9421O72M3264j5249
4919B077404l4359k3922r8159j27361p3992r9878j68553l1125r9842p6198o9081
4908A174934j06290O697j3024l5839n0205J9983o5305k3998N8037l5960K1336
4897I50366n1888K942J2104k1711J6927m0778R070J1878m3537M7578J6057l3674
4885H75334K4698J4276N6251l8057l2244n402P5888p668j4722K8688j4801R3049
4873A055290J468J1756J0597M375L7721M2345k5060J26504o78L4314K279P0324
4861A371235L0322q956J5147K2402R6553K3433M2840N4076L5569J58689P8926
$$ y = [3361505, 2978059, 2791016, 2609673, 2471005, 2333086, 2298488, 2231582, 2211014, 2162809, 2139986, 2073555, 1978809, 1956562, 1981108, 2018787, 2028548, 2011440, 2009296, 2048717, 2049389, 2092653, 2077404, 2043045, 2019123, 1920964, 1793603, 1719611, 1619733, 1451180, 1420055, 1320213, 1244015, 1174934, 1068644, 1075341, 1062317, 1026478, 976273, 996256, 930951, 906953, 964990, 929030, 950366, 898478, 901420, 913524, 891813, 908740, 867962, 877032, 888910, 845373, 892951, 909008, 875334, 900032, 914308, 970559, 932502, 900258, 894856, 970744, 963076, 948354, 977042, 962241, 1055290, 1056758, 1068514, 1079111, 1083486, 1121207, 1163552, 1138492, 1264996, 1264318, 1298632, 1300911, 1371235, 1401557, 1392601, 1407748, 1430150, 1526703, 1550136, 1592976, 1647052, 1682621, 1841310, 1920236]
4850A920236O3264P8933J37992K36910J84949M16741O97949R84342Q18010N08422
4840F047748J87023k15712n35060n45095m01524j48325j96468j16841j90344r5132
4830C790270L8384K4971O4276J49620J22844J95533P5047J33310Q1686P1583J14346
4819D861870P1977J73581P7545J97553J42301J69880K57777J47672J76011J93424
4809F469591J61405J77487J54287K04393J53997K52230K78822K59178K76296K37595
4799H625281L13836J79996J63985J30290J23045J07987J21835J51901K24502K35524
4789A0378182K10125K69090L07029L39789M55583N07169M74370O69387O25450
4780A4236174N93023M57150L40269J62491N9470m9396j05745q6739o5325k6290
$$ y = [1920236, 1983500, 2062433, 2200425, 2437335, 2622284, 3039025, 3736974, 4721316, 5539326, 6047748, 6234771, 6019059, 5483999, 4938904, 4537380, 4389055, 4192587, 4075746, 3885402, 3790270, 3828654, 3853625, 3917901, 4067521, 4190365, 4385898, 4460945, 4594255, 4675941, 4747524, 4861870, 4933847, 5107428, 5184973, 5382526, 5524827, 5694707, 5952484, 6100156, 6276167, 6469591, 6630996, 6808483, 6962770, 7167163, 7321160, 7573390, 7852212, 8111390, 8387686, 8625281, 8939117, 9119113, 9283098, 9413388, 9536433, 9644420, 9766255, 9918156, 10142658, 10378182, 10588307, 10857397, 11164426, 11504215, 11959798, 12466967, 12941337, 13610724, 14236174, 14829197, 15286347, 15626616, 15789107, 15848577, 15799181, 15693436, 15606697, 15541372, 15515082]
4770A5515082K129m5546K5266M7899p318J2833k5954p3131j31806j78194j45148
4759A4996112k04884j43393m5378q0234j28662j37998l03310l92271n37260n90071
4749A2432651o91829o33916o39344n48528m98978l94470k70154l39192k92017
4740H124223k04132k06363k46645j98132j01914j70304j80895j37842k02505j72743
4730F302748k70912j69323k10353k75339j51301k40540j87493j94815j79201k24890
4720D198581j48263j28562j27790j04181j07191n3919q3674j31417l4336J6371
4710C295619o5121j14072k5841q4558m7334n6601j27156k8508m0147k01137l1987
4699B473157n6163p0948j27328k9806p5121L3608m3688j07282m4299K4323q1993
$$ y = [15515082, 15517211, 15471665, 15496931, 15544830, 15537512, 15550345, 15524391, 15451260, 15319454, 15141260, 14996112, 14791228, 14647835, 14602457, 14522223, 14393561, 14255563, 13952253, 13559982, 13022722, 12432651, 11740822, 11106906, 10467562, 9919034, 9420056, 9025586, 8755432, 8416240, 8124223, 7920091, 7713728, 7467083, 7268951, 7167037, 6996733, 6815838, 6677996, 6475491, 6302748, 6031836, 5862513, 5652160, 5376821, 5225520, 4984980, 4797487, 4602672, 4423471, 4198581, 4050318, 3921756, 3793966, 3689785, 3582594, 3528675, 3445001, 3313584, 3279248, 3295619, 3230498, 3116426, 3090585, 3006027, 2958693, 2902092, 2774936, 2746428, 2706281, 2505144, 2473157, 2416994, 2346046, 2218718, 2188912, 2113791, 2147399, 2103711, 1996429, 1952130, 1976453, 1894460]
4688A894460n0026J1603o3886m9636p4179l5239o7990M2311r5511k5535k8545
4677A457827J8340j0684K3417j00745O0547j7892l2066j032n832K3073l7796O8394
4665A445551m8316P2888n94l3108k7038L9911K5330k3561j791P2841l7914K5762
4653A509961Q1O4305r356L1284N6551m2663O7223L6765L5104N6429L7159L343
4641A846186P7176M8405P5340J30809N8937K8600J52282J14215O2446J87529J21763
4630B903688J37916J88944K33447K45762L07892L29384L60518M61195M88420O84697
4620F341863Q20657J002505J336705J718398K119403K488373K316473J814388
4612A9958765P98679k04861j137034j738020j936505j813239j676782j448777
$$ y = [1894460, 1844434, 1856037, 1792151, 1742515, 1668336, 1633097, 1565107, 1607418, 1511907, 1486372, 1457827, 1476167, 1465483, 1488900, 1388155, 1448702, 1430810, 1398744, 1397712, 1391880, 1414953, 1377157, 1445551, 1397235, 1470123, 1469529, 1436421, 1409383, 1449294, 1474624, 1451063, 1449272, 1522113, 1484199, 1509961, 1510042, 1574347, 1564991, 1596275, 1652826, 1610163, 1677386, 1714151, 1749255, 1805684, 1842843, 1846186, 1923362, 1971767, 2047107, 2177916, 2236853, 2265453, 2417735, 2531950, 2594396, 2781925, 2903688, 3041604, 3230548, 3463995, 3709757, 4017649, 4347033, 4707551, 5168746, 5657166, 6341863, 7162520, 8165025, 9501730, 11220128, 13339531, 15827904, 18144377, 19958765, 20757444, 20552583, 19415549, 17677529, 15741024, 13927785, 12251003, 10802226]
4604A0802226j183241r89035q66638m77385m21769k45554r7214p200J38746J55551
4594F808487L51501N04613N45515Q19184J075920J518103J882236K226308K198547
4585A7930414J858193R60303p0601j132067j753734k065170k036537j897722j620947
4576A0172132j424256j188055j066728q03488o61227m29510m56382l71712k16218
4567C554556k20824k03800j89810r2806j25198l6347n5904j22302m1122j21894
4557B344549j32226p0187j05293j25034l6228r3688o8631r9312j02652l4161M7476
4546A524613j11752k9656n9989k3569n0092L1503q4325o1368k6737n8394J2255
4535A062489j4579Q132m9796l5923L0006k3262o2508m021j1431r174J2967n7801
$$ y = [10802226, 9618985, 8629950, 7763312, 7285927, 6864158, 6618604, 6521390, 6514190, 6652936, 6808487, 7159988, 7664601, 8210116, 9029300, 10105220, 11623323, 13505559, 15731867, 17930414, 19788607, 20748910, 20678309, 19546242, 17792508, 15727338, 13690801, 11793079, 10172132, 8747876, 7559821, 6493093, 5689605, 5028378, 4598868, 4142486, 3770774, 3554556, 3333732, 3129932, 2940122, 2847316, 2722118, 2685771, 2629867, 2507565, 2466443, 2344549, 2212323, 2142136, 2036843, 1911809, 1875581, 1781893, 1713262, 1613950, 1511298, 1477137, 1524613, 1412861, 1383205, 1323216, 1299647, 1249555, 1281058, 1196733, 1135365, 1108628, 1050234, 1062489, 1047910, 1056042, 1006246, 970323, 1000329, 977067, 914559, 910538, 899107, 889933, 902900, 845099]
4523H45099m8885m0047P0816o0903l6249j3257j545p496l4278N2111j6714k4266
4511F84386q4439M3611K6939n9586P35K1938q5360j4460N1839m9654M9320k4421
4499E60848n6616J2863K9309P182k4263n1903Q253L7938o5953n8273L4175L9013
4487D72573J558j7097j5860l7881K4233L979k4396L909J4963q2722M6351K4367
4475D13977K3398n9679j8658K8974M9647o7682l276K4300j9402M8j8678n446J0147
4462C57670n2775J6782K9619Q061n0581k4288K0174J582O0861o5625k1275L3680
4450C13885l0656R2778j4239k7566j4494M1958j9870l5871K972k3451K9165k9402
4438B85209K2182M2219k8498o0128R4950m5511j1163N156j0679j8620N1572l0539
$$ y = [845099, 796214, 756167, 826983, 766080, 729831, 716574, 715029, 707533, 673255, 725366, 708652, 684386, 599947, 643558, 670497, 610911, 611646, 633584, 548224, 533764, 585603, 535949, 585269, 560848, 504232, 517095, 546404, 553586, 529323, 477420, 485673, 523611, 457658, 399385, 433560, 472573, 474131, 457034, 441174, 403293, 427526, 431505, 407109, 411018, 425981, 343259, 389610, 413977, 437375, 377696, 359038, 388012, 437659, 369977, 366701, 391001, 371599, 371647, 352969, 347523, 357670, 304895, 321677, 351296, 359357, 308776, 284488, 304662, 306244, 367105, 301480, 280205, 313885, 283229, 376007, 361768, 334202, 319708, 361666, 341796, 305925, 308897, 285446, 314611, 285209, 307391, 349610, 321112, 260984, 355934, 310423, 299260, 304416, 293737, 275117, 326689, 296150]
4426B96150n134J3649J4292L919P7856m3286o266m2073k5824M4074M4302L3314
4414D04973o1008O165Q074K508J4340K0910m4573Q730K7689L7372M6270l0658
4402D40792j1065R6684N640P531N5348m8095M3254M0373p5336j0341J0313n278
4390E49820K9613J7060n4835K3853M220M7738N8697M0232j5621M246j4093R5261
4378G86191P7357K6563Q2773m5907N1337J8917j109N1692L6015K0478K6026Q4571
4366A214904L3763O8960N2693Q5655J13268K73516L01067N82837N19072K29541
4356C475276O5299j55523l79488k98939k52100j38389j03989o3527l0777k7569
4346B090274R9864P6330R2299M5820Q6996N9109J73922J79232K68469L80488K63450
$$ y = [296150, 291016, 304665, 318957, 322876, 400732, 357446, 351180, 309107, 283283, 327357, 371659, 404973, 343965, 350130, 358204, 360712, 375052, 395962, 351389, 360119, 387808, 425180, 471450, 440792, 429727, 526411, 532051, 539582, 594930, 546835, 590089, 630462, 555126, 544785, 555098, 549820, 579433, 596493, 541658, 565511, 569731, 617469, 676166, 716398, 700777, 705023, 690930, 786191, 863548, 890111, 972884, 926977, 978314, 997231, 996122, 1047814, 1083829, 1104307, 1130333, 1214904, 1248667, 1317627, 1370320, 1455975, 1569243, 1842759, 2143826, 2726663, 3245735, 3475276, 3540575, 3385052, 3005564, 2706625, 2454525, 2316136, 2212147, 2148620, 2117843, 2090274, 2190138, 2266468, 2358767, 2404587, 2491583, 2550692, 2724614, 2903846, 3172315, 3552803, 3816253]
4335C816253j8964j01982l60255m39053m56903k50825j99073j39234j06428j47347
4325A596189L1209J45875J91029J76005J29303P5704n4802j69729j91715k47612
4315A681456j73406q0682k7524O5175J08967J41010J92949k0063q447j62718j83596
4304A533121j66250n3819q8688q1245o7375r1798M5198J9714M5841J93489K43882
4293A532070K59339J18858R4973j39066k11381j96242q8015o5226L2363J20515
4283A458188K63875L80152L74342Q6550M8961k57773m12567k64886k17506j44300
4273A315036j21653r4327k0856j671K8457K10262M14268M87571M89176K46588
4263B952851K64l51213m06182l45934k84945k28169n2588j24784O798K05321J01682
$$ y = [3816253, 3797289, 3695307, 3335052, 2895999, 2439096, 2188271, 1989198, 1849964, 1743536, 1596189, 1627398, 1773273, 1964302, 2140307, 2269610, 2345314, 2290512, 2120783, 1929068, 1681456, 1508050, 1427368, 1399844, 1465019, 1573986, 1714996, 1907945, 1887882, 1879435, 1716717, 1533121, 1366871, 1313052, 1224364, 1143119, 1075744, 983946, 1029144, 1048858, 1094699, 1288188, 1532070, 1791409, 1910267, 2005240, 1866174, 1654793, 1458551, 1370536, 1305310, 1337673, 1458188, 1722063, 2102215, 2476557, 2563107, 2612068, 2354295, 1941728, 1676842, 1459336, 1315036, 1193383, 1099056, 1078200, 1076529, 1104986, 1315248, 1729516, 2217087, 2706263, 2952851, 2953115, 2601902, 2195720, 1849786, 1564841, 1336672, 1284084, 1159300, 1166098, 1371419, 1473101]
4252A473101K8536n6380j56442j46642j20058j43487j03191l8856j07323K3913
4242F53171J1101k7443J41848J78449K66019K05822Q9854l2904j79212j58725
4232A147980j86671j44225j72589m7203j26356k9872L195r2180m5135R967m5398
4221B71513N2116l5784o9948L3439j2848O175j63l6967K6140q189j6463p661Q766
4208B10126K8384n7057L8000j8749L4796l7795l7974L850K8236L1637n6995M216
4196A70675m8712p401L7941k6974O6847m8158j0401n0251L9887j1338N496m0912
4184G6699K4616J068j4113l2200Q884K0901j899K2479l888o043q4644J17335p105
4171A22090m8606Q620L5414o3732J3201N0119j4417o8473J5684M2702N1445o8866
$$ y = [1473101, 1501637, 1445257, 1288815, 1142173, 1022115, 878628, 775437, 736581, 629258, 653171, 664272, 636829, 778677, 957126, 1223145, 1428967, 1518821, 1485917, 1306705, 1147980, 961309, 817084, 644495, 597292, 470936, 441064, 444259, 352079, 306944, 316911, 271513, 323629, 287845, 217897, 251336, 238488, 244663, 244500, 207533, 233673, 225484, 209021, 201360, 210126, 238510, 181453, 219453, 200704, 235500, 197705, 159731, 163581, 191817, 223454, 166459, 170675, 121963, 114562, 152503, 125529, 192376, 144218, 133817, 83566, 123453, 112115, 117611, 76699, 101315, 102383, 88270, 56070, 64954, 85855, 83956, 106435, 102547, 96504, 11860, 129195, 122090, 73484, 82104, 117518, 53786, 66987, 117106, 102689, 34216, 49900, 92602, 144047, 75181]
4159G5181j842L0732l0581j6924K6709L199p710l0181K4380m6066M8548j2042
4147F3403R438l4257l991n80k2447K2545J3055L6831j9011k5798k8275N5681j9980
$$ y = [75181, 73339, 104071, 73490, 56566, 83275, 86474, 78764, 48583, 72963, 26897, 75445, 63403, 72841, 38584, 34593, 34013, 11566, 34111, 47166, 83997, 64986, 39188, 10913, 66594, 46614]
$$ [...]
##END NTUPLES=NMR SPECTRUM
##END=
