##TITLE=abcd
##JCAMPDX= 6.0         $$ Bruker NMR JCAMP-DX V2.0
##DATA TYPE= NMR SPECTRUM
##DATA CLASS= NTUPLES
##ORIGIN= UXNMR, Bruker Analytische Messtechnik GmbH
##OWNER= root
$$ XWIN-NMR		Version 3.5
$$ Thu Jul 30 15:33:08 2026 Russian Standard Time (UT+4h)  servis@DPX200
##.OBSERVE FREQUENCY= 200.131235884673
##.OBSERVE NUCLEUS= ^1H
##.ACQUISITION MODE= SIMULTANEOUS
##.ACQUISITION SCHEME= undefined
##.AVERAGES= 32
##.DIGITISER RES= 18
##SPECTROMETER/DATA SYSTEM= spect
##.PULSE SEQUENCE= zg
##.SOLVENT NAME= DMSO
##.SHIFT REFERENCE= (INTERNAL, DMSO, 0, 16.4885)
##AUDIT TRAIL= $$ (NUMBER, WHEN, WHO, WHERE, WHAT)
$$ ##TITLE= Audit trail, XWIN-NMR		Version 3.5
$$ ##JCAMPDX= 5.01
$$ ##ORIGIN= Bruker BioSpin GmbH
$$ ##OWNER= servis
$$ F:\spectra/data/av/nmr/H1/1/pdata/1/auditp.txt
$$ ##AUDIT TRAIL=  $$ (NUMBER, WHEN, WHO, WHERE, WHAT)
(   1,<2026-07-30 15:32:10.03 +0400>,<servis>,<DPX200>,
      <created by zg, POWCHK disabled, PULCHK disabled
       configuration hash MD5:
       00 E9 B6 7A A2 85 ED C7 34 08 36 98 17 FE 4E 26
       data hash MD5: 32K
       90 C2 AE E5 33 86 38 F3 13 63 62 FB 69 05 DB 03>)
(   2,<2026-07-30 15:32:46.60 +0400>,<servis>,<DPX200>,
      <Start of raw data processing
       efp BC_mod = 2 LB = 0.05 FT_mod = 6 PKNL = 1 PHC0 = -414.9518 PHC1 = 3.101563 SI = 16K 
       data hash MD5: 16K
       73 6E A9 D6 1A C0 F4 DE 2D 0F 26 8B 5C CD 4D 3C>)
$$ ##END=
$$ 
$$ hash MD5
$$ 18 B9 51 5D EE E8 F1 5A 77 5F 0E 1D B8 A7 7B 02
##$RELAX= 
##$RELAX= 
##$RELAX= 
##$RELAX= 
##$RELAX= 
##$RELAX= 
##$RELAX= 
##$RELAX= 
$$ Bruker specific parameters
$$ --------------------------
##$DU= <F:\spectra>
##$EXPNO= 1
##$NAME= <H1>
##$PROCNO= 1
##$TYPE= <nmr>
##$USER= <av>
##$AMP= (0..31)
100 100 100 100 100 100 100 100 100 100 100 100 100 100 100 100 100 100 
100 100 100 100 100 100 100 100 100 100 100 100 100 100 
##$AQSEQ= 0
##$AQ_mod= 1
##$AUNM= <au_zg>
##$AUTOPOS= <>
##$BF1= 200.13
##$BF2= 200.13
##$BF3= 200.13
##$BF4= 200.13
##$BF5= 500.13
##$BF6= 500.13
##$BF7= 500.13
##$BF8= 500.13
##$BYTORDA= 1
##$CFDGTYP= 0
##$CFRGTYP= 5
##$CHEMSTR= <none>
##$CNST= (0..31)
1 1 145 1 1 1 1 1 1 1 1 1 1 1 1 1 1 1 1 1 1 1 1 1 1 1 1 1 1 1 1 1 
##$CPDPRG= <>
##$CPDPRG1= <>
##$CPDPRG2= <>
##$CPDPRG3= <>
##$CPDPRG4= <mlev>
##$CPDPRG5= <mlev>
##$CPDPRG6= <mlev>
##$CPDPRG7= <mlev>
##$CPDPRG8= <mlev>
##$CPDPRGB= <>
##$CPDPRGT= <>
##$D= (0..31)
0 2 0 0 0 0 0 0 0 0.06 0 0 0 0 0 0 0.0002 0 0 0 0 0 0 0 0 0 0 0 0 0 0 
0 
##$DATE= 1785411129
##$DBL= (0..7)
120 120 120 120 120 120 120 120 
##$DBP= (0..7)
150 150 150 150 150 150 150 150 
##$DBP07= 0
##$DBPNAM0= <>
##$DBPNAM1= <>
##$DBPNAM2= <>
##$DBPNAM3= <>
##$DBPNAM4= <>
##$DBPNAM5= <>
##$DBPNAM6= <>
##$DBPNAM7= <>
##$DBPOAL= (0..7)
0.5 0.5 0.5 0.5 0.5 0.5 0.5 0.5 
##$DBPOFFS= (0..7)
0 0 0 0 0 0 0 0 
##$DE= 6
##$DECBNUC= <off>
##$DECIM= 32
##$DECNUC= <off>
##$DECSTAT= 4
##$DIGMOD= 1
##$DIGTYP= 9
##$DL= (0..7)
0 120 120 120 120 120 120 120 
##$DP= (0..7)
150 150 150 150 150 150 150 150 
##$DP07= 0
##$DPNAME0= <>
$$ [...]
##$SUBNAM4= <"">
##$SUBNAM5= <"">
##$SUBNAM6= <"">
##$SUBNAM7= <"">
##$SUBNAM8= <"">
##$SUBNAM9= <"">
##$SW= 20.6817932712277
##$SWIBOX= (0..15)
0 0 3 0 0 0 0 0 0 0 0 0 0 0 0 0 
##$SW_h= 4139.07284768212
##$TD= 32768
##$TD0= 1
##$TE= 0
##$TE2= 300
##$TE3= 300
##$TEG= 300
##$TL= (0..7)
0 120 120 120 120 120 120 120 
##$TP= (0..7)
150 150 150 150 150 150 150 150 
##$TP07= 0
##$TPNAME0= <>
##$TPNAME1= <>
##$TPNAME2= <>
##$TPNAME3= <>
##$TPNAME4= <>
##$TPNAME5= <>
##$TPNAME6= <>
##$TPNAME7= <>
##$TPOAL= (0..7)
0.5 0.5 0.5 0.5 0.5 0.5 0.5 0.5 
##$TPOFFS= (0..7)
0 0 0 0 0 0 0 0 
##$TUNHIN= 0
##$TUNHOUT= 0
##$TUNXOUT= 0
##$USERA1= <user>
##$USERA2= <user>
##$USERA3= <user>
##$USERA4= <user>
##$USERA5= <user>
##$V9= 5
##$VALIST= <valist>
##$VCLIST= <CCCCCCCCCCCCCCC>
##$VD= 0
##$VDLIST= <DDDDDDDDDDDDDDD>
##$VPLIST= <PPPPPPPPPPPPPPP>
##$VTLIST= <TTTTTTTTTTTTTTT>
##$WBST= 1024
##$WBSW= 30
##$XGAIN= (0..3)
0 0 0 0 
##$XL= 0
##$YL= 0
##$YMAX_a= 206966
##$YMIN_a= -351123
##$ZGOPTNS= <>
##$ZL1= 120
##$ZL2= 120
##$ZL3= 120
##$ZL4= 120
##$ABSF1= 0
##$ABSF2= 0
##$ABSG= 0
##$ABSL= 0
##$ALPHA= 0
##$AQORDER= 0
##$ASSFAC= 0
##$ASSFACI= 0
##$ASSFACX= 0
##$ASSWID= 0
##$AUNMP= <proc_1d>
##$AZFE= 0.1
##$AZFW= 0.1
##$BCFW= 0
##$BC_mod= 2
##$BYTORDP= 0
##$COROFFS= 0
##$CY= 18.4799938201904
##$DATMOD= 1
##$DC= 0
##$DFILT= <>
##$DTYPP= 0
##$F1P= 9.9274215381318
##$F2P= -0.165520771350173
##$FCOR= 1
##$FTSIZE= 16384
##$FT_mod= 6
##$GAMMA= 0
##$GB= 0
##$INTBC= 1
##$INTSCL= 4.127829e-11
##$ISEN= 128
##$LB= 0.05
##$LEV0= 0
##$LPBIN= 0
##$MAXI= 10000
##$MC2= 0
##$MEAN= 0
##$ME_mod= 0
##$MI= 50
##$NCOEF= 0
##$NC_proc= -7
##$NLEV= 6
##$NOISF1= 3.799351
##$NOISF2= 2.8
##$NSP= 0
##$NTH_PI= 0
##$NZP= 0
##$OFFSET= 16.48848
##$PC= 4
##$PHC0= -414.9518
##$PHC1= 3.101563
##$PH_mod= 1
##$PKNL= yes
##$PPARMOD= 0
##$PSCAL= 4
##$PSIGN= 0
##$REVERSE= no
##$SF= 200.130005582386
##$SI= 16384
##$SIGF1= 3
##$SIGF2= 2
##$SINO= 400
##$SIOLD= 16384
##$SREGLST= <1H.CDCl3>
##$SSB= 0
##$STSI= 16384
##$STSR= 0
##$SW_p= 4139.07284768211
##$SYMM= 0
##$S_DEV= 0
##$TDeff= 32768
##$TDoff= 0
##$TI= <>
##$TILT= no
##$TM1= 0
##$TM2= 0
##$TOPLEV= 0
##$USERP1= <user>
##$USERP2= <user>
##$USERP3= <user>
##$USERP4= <user>
##$USERP5= <user>
##$WDW= 1
##$XDIM= 16384
##$YMAX_p= 360386491
##$YMIN_p= -1605167
$$ End of Bruker specific parameters
$$ ---------------------------------
##NTUPLES= NMR SPECTRUM
##VAR_NAME=  FREQUENCY,     SPECTRUM/REAL,   SPECTRUM/IMAG
##SYMBOL=    X,             R,               I
##VAR_TYPE=  INDEPENDENT,   DEPENDENT,       DEPENDENT
##VAR_FORM=  AFFN,          ASDF,            ASDF
##VAR_DIM=   16384,         16384,           16384
##UNITS=     HZ,            ARBITRARY UNITS, ARBITRARY UNITS
##FACTOR=    0.252644378177508, 1,           1
##FIRST=     3299.83951724647, 0,            0
##LAST=      -839.233330435636, 0,           0
##MIN=       -839.233330435636, -1605167,    0
##MAX=       3299.83951724647, 360386491,    0
$$ Real data points
##PAGE= N=1
##DATA TABLE= (X++(R..R)), XYDATA
$$ [...]
$$ plain form
9297 -73245 133224 198699 -153011 90661 -147123 -649959 61524 95357 355755 22416
9287 22416 -160568 345096 62434 -259080 58092 -150704 -134628 331223 -55117 76364
9277 76364 273445 -181216 88184 -303652 237668 -26848 18434 -77066 26538 672662
9267 672662 53753 167331 45945 1077 659819 627535 -87185 467149 259164 627288
9257 627288 437627 594855 74816 49555 393691 148395 189616 497509 545175 692050
9247 692050 540322 445854 295812 356171 -59674 353727 49603 737051 627803 147292
9237 147292 -20482 237987 739743 542447 295115 611808 732454 875679 606934 462534
9227 462534 961547 1319248 792182 657985 1410116 1421358 1178425 1233193 1358169 1180617
$$ packed form
9297g3245K06469O5475l51710K43672k37784n02836P11483L3833K60398l33339
9287B2416j82984N05664k82662l21514L17172k08796J6076M65851l86340J31481
9277G6364J97081m54661K69400l91836N41320k64516M5282r5500J03604O46124
9267F72662o18909J13578j21386m4868O58742l2284p14720N54334k07985L68124
9257F27288j89661J57228n20039k5261L44136k45296M1221L07893M7666J46875
9247F92050j51728r4468j50042O0359m15845M13401l04124O87448j09248m80511
9237A47292j67774K58469N01756j97296k47332L16693J20646J43225k68745j44400
9227D62534M99013L57701n27066j34197P52131J1242k42933N4768J24976j77552
$$ plain form
9217 1180617 2043015 1349409 1336549 1306548 2118010 2172167 1680711 1800593 1774630 1836786
9207 1836786 1788830 1812423 1851678 2086271 2202643 2153800 1773073 1953296 2512274 2006300
9197 2006300 2386788 2444379 2473329 2650269 2748137 2581156 2944922 3023829 3010055 3211497
9187 3211497 3455083 3544053 4207350 3392519 3581620 4139393 3816726 4027719 3661856 3815725
9177 3815725 3905103 4668410 3828982 3972133 3966723 4457954 4310791 4758191 4760274 4729950 5193589
9166 5193589 5507290 5804468 5730193 6363243 7090948 6746998 7025090 7695939 7970795 8261222
9156 8261222 8205129 8204846 8429855 8891185 8816517 9005280 9536854 9361472 10247624 10731660
9146 10731660 11128800 11854496 12699573 13263791 15432386 16648883 19047205 20878158 23201934
$$ packed form
9217A180617Q62398o93606j2860l0001Q11462N4157m91456J19882k5963O2156
9207A836786m7956K3593L9255K34593J16372m8843l80727J80223N58978n05974
9197B006300L80488N7591K8950J76940R7868j66981L63766P8907j3774K01442
9187C211497K43586Q8970O63297q14831J89101N57773l22667K10993l65863J53869
9177C815725Q9378P63307q39428J43151n410M91231j47163M47400K083l0324M63639
9166E193589L13701K97178p4275O33050P27705l43950K78092O70849K74856K90427
9156H261222n6093k83K25009M61330p4668J88763N31574j75382Q86152M84036
9146A0731660L97140P25696Q45077N64218K168595J216497K398322J830953K323776
$$ plain form
9137 23201934 25582899 28259721 29978669 31874800 33653902 34731388 34742340 35078283 34359361
9128 34359361 34071142 33238770 32415585 31714002 30421433 29486838 28382074 27655590 26358567
9119 26358567 24967134 24776880 24092317 23822114 24193247 24244744 24644575 25615635 26211955
9110 26211955 26596709 26596490 26976316 26484357 24993231 24071348 22603334 21709420 20603222
9101 20603222 19321157 18150187 17205361 15900390 15581453 14848138 14463399 14126557 13786368
9092 13786368 13247350 13402603 13226355 13589219 13304680 13278421 13393327 13729459 13557855 13891045
9082 13891045 14069136 14080733 14227173 14209135 14209084 14319950 14676668 14739971 14398678 13942245 14393198
9071 14393198 13815408 13736868 13522589 12986949 13199864 12681991 12852510 12409097 12604462 12164139
$$ packed form
9137B3201934K380965K676822J718948J896131J779102J077486J0952L35943p18922
9128C4359361k88219q32372q23185p01583j292569r34595j104764p26484j297023
9119B6358567j391433j90254o84563k70203L71133N1497L99831R71060N96320
9110B6211955L84754k19L79826m91959j491126r21883j468014q93914j106198
9101B0603222j282065j170970r44826j304971l18937p33315l84739l36842l40189
9092A3786368n39018J55253j76248L62864k84539k6259J14906L36132j71604L33190
9082A3891045J78091J1597J46440j8038n1J10866L56718O3303l41293m56433M50953
9071A4393198n77790p8540k14279n35640K12915n17873J70519m43413J95365m40323
$$ plain form
9061 12164139 12536577 11913430 11729315 11475986 11470436 11087909 10713273 10983249 10255903 10248164
9051 10248164 10557456 9737073 9765136 9636251 9476373 9345178 9268474 9449826 9186054 8538731
9041 8538731 8626607 8585887 9019022 9147500 9283197 8619022 8551124 8326866 7989718 7735432
9031 7735432 7380252 7133186 6472242 6320151 5977527 5540786 5894325 5317418 5608620 5118057
9021 5118057 5557568 5058056 5320115 5196139 4937336 4942881 4905171 4631196 4258781 4719981
9011 4719981 4292736 4249805 3839229 4291998 4021260 3909765 3524629 3300157 3618221 3122959
9001 3122959 2901807 2801956 3011895 2916195 2978901 2253729 2416659 2563587 2343530 1762808
8991 1762808 1749059 2015810 2007485 1706728 1611355 1849250 1789869 1846947 1720890 1652013 1373282
$$ packed form
9061A2164139L72438o23147j84115k53329n550l82527l74636K69976p27346p739
9051A0248164L09292q20383K8063j28885j59878j31195p6704J81352k63772o47323
9041H538731Q7876m0720M33135J28478J35697o64175o7898k24258l37148k54286
9031G735432l55180k47066o60944j52091l42624m36741L53539n76907K91202m90563
9021E118057M39511m99512K62059j23976k58803N545l7710k73975l72415M61200
9011D719981m27245m2931m10576M52769k70738j11495l85136k24472L18064m95262
9001C122959k21152r9851K09939r5700O2706p25172J62930J46928k20057n80722
8991A762808j3749K66751q325l00757r5373K37895n9381N7078j26057o8877k78731
$$ plain form
8980 1373282 1853269 1373304 1072395 877708 1518242 1273890 1161272 827657 1287209 1012680
8970 1012680 1544648 1128699 989223 961320 1045897 1269853 990462 1033806 978516 1074407
8960 1074407 898672 671504 581646 774913 952612 1105966 950246 634682 1128718 594638
8950 594638 784449 784213 556346 249178 313833 106661 711924 230347 864568 705427
8940 705427 443336 647638 264085 479168 778991 424241 867152 25833 40014 600466
8930 600466 368857 227390 177351 222847 81121 677616 366433 472244 41484 676502
8920 676502 66118 461363 510117 -225104 279462 570778 147952 50716 351264 55928
8910 55928 503067 295262 -4482 112718 286028 8180 86886 -57569 -103573 230239
$$ packed form
8980A373282M79987m79965l00909j94687O40534k44352j12618l33615M59552k74529
8970A012680N31968m15949j39476k7903Q4577K23956k79391M3344n5290R5891
8960A074407j75735k27168q9858J93267J77699J53354j55720l15564M94036n34080
8950E94638J89811k36k27867l07168O4655k07172O05263m81577O34221j59141
8940G05427k62091K04302l83553K15083K99823l54750M42911q41319J4181N60452
8930F00466k31609j41467n0039M5496j41726N96495l11183J05811m30760O35018
8920F76502o10384L95245M8754p35221N04566K91316m22826r7236L00548k95336
8910E5928M47139k07805k99744J17200J73310k77848P8706j44455m6004L33812
$$ plain form
8900 230239 205192 38655 -145130 38723 -209861 271709 167400 -36768 335112 94909
8890 94909 216683 841144 333471 110805 201731 46615 204964 41977 6881 281731
8880 281731 -162174 -113528 324627 366978 -157988 -416155 100512 242539 175321 -46034
8870 -46034 -76458 390488 11868 221705 -303922 15311 -202304 -309831 124270 -89022
8860 -89022 -325959 191881 -45264 -78579 -56313 373244 -454082 137638 284720 -295489
8850 -295489 429916 136779 -159540 226712 -70627 -55835 90079 -7099 -108656 78553
8840 78553 177204 20205 17883 602720 49895 36779 181774 319237 220729 163787 -251808
8829 -251808 203238 -404897 116641 -330667 -81362 137286 367011 -183803 -98864 -277889
$$ packed form
8900B30239k5047j66537j83785J83853k48584M81570j04309k04168L71880k40203
8890I4909J21774O24461n07673k22666R0926j55116J58349j62987l5096K74850
8880B81731m43905M8646M38155M2351n24966k58167N16667J42027o7218k21355
8870d6034l0424M66946l78620K09837n25627L19233k17615j07527M34101k13292
8860h9022k36937N17840k37145l3315K2266M29557q27326N91720J47082n80209
8850b95489P25405k93137k96319L86252k97339J4792J45914r7178j01557J87209
8840G8553R8651j56999k322N84837n52825j3116J44995J37463r8508n6942m15595
8829b51808M55046o08135N21538m47308K49305K18648K29725n50814Q4939j79025
$$ plain form
8819 -277889 394355 58466 43601 50351 171227 448733 261170 -56400 -320312 -211332
8809 -211332 -8186 134392 -47000 55169 -249045 -325649 125107 97354 -49890 -212774
8799 -212774 -61462 32049 -297971 -151983 17837 80664 350165 178480 409272 -387753
8789 -387753 175618 138190 53705 -465101 335471 199452 -383635 240787 45051 160856
8779 160856 222319 -75145 391238 -395956 -525713 -229160 -257462 -484747 -107140 -380453
8769 -380453 -31464 -132190 -138312 -489004 -314306 -59474 -93481 184979 -286161 -216852
8759 -216852 -193332 -269708 38188 -132739 -204591 256717 45365 105418 -188824 -355082
8749 -355082 -469515 -96068 -418373 -143003 -549395 -322802 -213193 -54964 -25626 -88978
$$ packed form
8819b77889O72244l35889j4865O750J20876K77506j87563l17570k63912J08980
8809b11332K03146J42578j81392J02169l04214p6604M50756k7753j47244j62884
8799b12774J51312R3511l30020J45988J69820O2827K69501j71685K30792p97025
8789c87753N63371l7428q4485n18806Q00572j36019n83087O24422j95736J15805
8779A60856O1463k97464M66383p87194j29757K96553k8302k27285L77607k73313
8769c80453L48989j00726o122l50692J74698K54832l4007K78460m71140O9309
8759b16852K3520p6376L07896j70927p1852M61308k11352O0053k94242j66258
8749c55082j14433L73447l22305K75370m06392K26593J09609J58229K9338o3352
$$ plain form
8739 -88978 -66023 -162868 -5410 85957 -65924 -343630 -215886 -422449 31373 -42457 -281909
8728 -281909 -355266 -303983 -39534 98051 -205062 -76483 53888 1211 -382429 10299
8718 10299 -362638 -409377 121149 -264034 -573129 -216852 -5231 -39304 -341974 -61482
8708 -61482 -176342 180027 276614 -654634 -254536 -733262 -142796 -343455 -500294 -49668
8698 -49668 -123755 5493 -46450 -230903 -115063 -368727 244702 -387626 16176 -146160
8688 -146160 -290706 -299236 -72338 49481 -106373 156359 -166989 -571244 -379653 -696102
8678 -696102 -396347 -370665 -393893 -323117 -440786 -615323 -334647 -98092 -278460 -446343
8668 -446343 -690964 97866 -233530 -320422 -48490 -188197 -550039 -184750 -158186 -502637
$$ packed form
8739h8978K2955r6845J57458R1367j51881k77706J27744k06563M53822p3830k39452
8728b81909p3357N1283K64449J37585l03113J28579J30371n2677l83640L92728
8718A0299l72937m6739N30526l85183l09095L56277K11621l4073l02670K80492
8708f1482j14860L56369R6587r31248M00098m78726N90466k00659j56839M50626
8698d9668p4087J29248n1943j84453J15840k53664O13429o32328M03802j62336
8688a46160j44546q530K26898J21819j55854K62732l23348m04255J91591l16449
8678f96102K99755K5682k3228P0776j17669j74537K80676K36555j80368j67883
8668d46343k44621P88830l31396q6892K71932j39707l61842L65289K6564l44451
$$ plain form
8658 -502637 -461542 -110463 -307028 -347513 -164629 -359408 -121851 -472255 -313635 -71073
8648 -71073 39598 -357313 -410191 -149150 183659 -177561 -375536 -439158 -575566 -223572
8638 -223572 -167155 -182858 -771011 -293817 -150813 -495497 -129117 -416576 -569738 -360862
8628 -360862 -316274 -113431 -97852 14245 95297 -747960 -391274 -305607 -122750 -319325
8618 -319325 -430770 -420894 -186405 -204526 -422010 -262789 -356650 -74948 -151016 -505881 -266023
8607 -266023 -401098 -12751 -532379 -196005 -363657 10488 -174090 -288590 -477291 -120655
8597 -120655 -99157 -120411 -278641 -295224 -584182 -100890 247926 -297802 -179911 -367475
8587 -367475 -73809 -500324 -59432 257128 -221989 -209976 -213039 -389093 -34092 -393644
$$ packed form
8658e02637M1095L51079j96565m0485J82884j94779K37557l50404J58620K42562
8648g1073J10671l96911n2878K61041L32809l61220j97975o3622j36408L51994
8638b23572N6417j5703n88153M77194J43004l44684L66380k87459j53162K08876
8628c60862M4588K02843J5579J12097Q1052q43257L56686Q5667J82857j96575
8618c19325j11445R876K34489j8121k17484J59221r3861K81702p6068l54865K39858
8607b66023j35075L88347n19628L36374j67652L74145j84578j14500j88701L56636
8597a20655K1498k1254j58230j6583k88958M83292L48816n45728J17891j87564
8587c67475K93666m26515M40892L16560m79117J2013l063j76054L55001l59552
$$ plain form
8577 -393644 -111341 -323043 49356 5767 -8029 33162 -328125 -11560 -393328 -370598
8567 -370598 -115321 -510370 -352776 -50802 -296299 -704785 -300912 -390327 -189648 -628549
8557 -628549 -348645 -15462 -554135 -680198 -610693 -145593 -408469 -231680 19026 -453100
8547 -453100 -159969 -657110 -283941 -311590 -534851 -432817 -250419 -148764 -190005 -128143
8537 -128143 -476890 -33672 -466160 -1071285 -1048836 -565204 -713673 -554668 -401572 -183515
8527 -183515 76053 -266799 -233822 -432221 -204545 -795517 -464192 -459678 -506049 -363146
8517 -363146 -374375 -293176 -487720 -247859 -599740 -720657 -439325 -259211 -110691 -830971
8507 -830971 -371209 -484534 -90004 -473326 -363818 -481445 140506 23533 -474214 -792716
$$ packed form
8577c93644K82303k11702L72399m3589j3796M1191l61287L16565l81768K2730
8567c70598K55277l95049J57594L01974k45497m08486M03873q9415K00679m38901
8557f28549K79904L33183n38673j26063O9505M65100k62876J76789K50706m72126
8547d53100K93131m97141L73169k7649k23261J02034J82398J01655m1241O1862
8537a28143l48747M43218m32488o05125K2449M83632j48469J59005J53096K18057
8527a83515K59568l42852L2977j98399K27676n90972L31325M514m6371J42903
8517c63146j1229Q1199j94544K39861l51881j20917K81332J80114J48520p20280
8507h30971M59762j13325L94530l83322J09508j17627O21951j16973m97747l18502
$$ plain form
8497 -792716 -387625 -658313 -240765 -115867 -112390 -295011 -463864 -379476 -502149 -871822
8487 -871822 -150947 -482074 -479271 -232002 -397780 -425848 22639 5182 -426934 -448790 -516628
8476 -516628 -189527 202322 -257914 -321799 -380453 -537980 -181540 -392659 -586693 -388734
8466 -388734 -510869 -100482 -60643 -260718 76247 -180331 -66346 -108673 -391388 -216846
8456 -216846 -8148 -214159 -209580 -180508 -577010 -162993 -241761 -538639 -578912 -565437 -13494
8445 -13494 -117539 2083 -555893 -482083 -258374 -546575 -231890 -334622 -313959 -395926
8435 -395926 -91766 -344260 -329722 -457412 -32623 -269441 -122838 -530528 -395201 -538433
8425 -538433 -2851 120091 -528660 -375636 -426125 182226 214681 -516151 -70758 -408312
$$ packed form
8497g92716M05091k70688M17548J24898L477j82621j68853Q4388j22673l69673
8487h71822P20875l31127K803K47269j65778k8068M48487j7457m32116k1856o7838
8476e16628L27101L91849m60236o3885n8654j57527L56440k11119j94034J97959
8466c88734j22135M10387L9839k00075L36965k56578J13985m2327k82715J74542
8456b16846K08698k06011M579K9072l96502M14017p8768k96878m0273J3475N51943
8445a3494j04045J19622n57976P3810K23709k88201L14685j02732K0663q1967
8435c95926L04160k52494J4538j27690M24789k36818J46603m07690J35327j43232
8425e38433N35582J22942o48751J53024n0489O08351L2455p30832M45393l37554
$$ plain form
8415 -408312 -425594 -71620 -400936 -667168 -357934 -502264 -283300 -257360 -292246 -626280
8405 -626280 -267212 -170115 -557074 -286397 -681329 -473554 -266228 -245318 -131220 -105913
8395 -105913 -965159 -733615 15472 -382331 -223355 -31660 -406770 -32748 -175086 -348074
8385 -348074 -426990 -260596 -161052 -106392 -760005 -165039 -311832 -394286 -580311 -457753
8375 -457753 -606370 -3047 -65391 -651212 -27146 -360839 -379272 -545820 -674516 -709127
8365 -709127 -470641 -457591 -346529 -439457 -461694 -364553 -308934 -122779 -971440 -256907 -421018
8354 -421018 113578 -599413 -384341 -81861 -152385 -213609 -658961 -357842 -17609 -176704
8344 -176704 -239011 -53992 -498197 -240434 -547633 -467543 -303290 -169530 -456809 -521058
$$ packed form
8415d08312j7282L53974l29316k66232L09234j44330K18964K5940l4886l34034
8405f26280L59068R7097l86959K70677l94932K07775K07326K0910J14098K5307
8395a05913q59246K31544P49087l97803J58976J91695l75110L74022j42338j72988
8385c48074p8916J66394R9544N4660o53613N94966j46793q2454j86025J22558
8375d57753j48617O03323o2344n85821O24066l33693j8433j66548j28696l4611
8365g09127K38486J3050J11062r2928k2237R7141N5619J86155q48661P14533j64111
8354d21018N34596p12991K15072L02480p0524o1224m45352L01119L40233j59095
8344a76704o2307J85019m44205K57763l07199Q0090J64253J33760k87279o4249
$$ plain form
8334 -521058 -118372 64198 19761 -441478 -374903 -260464 90357 -567596 -70671 -612020
8324 -612020 -419280 -478973 -196804 -366212 -614713 -405563 -184287 -687055 -368097 -256388
8314 -256388 -40267 50733 -388643 -498926 -162472 -71809 -512825 -36794 -611485 -544090
8304 -544090 -15166 -409090 -278105 -245515 -214788 -478646 -430926 -388360 63027 -305545
8294 -305545 -607304 -973623 -56157 -156394 -227509 -389639 -128029 -200392 -59388 -711336
8284 -711336 -54861 -294954 -439885 -721340 -423528 74442 -179622 52890 -338846 -477033
8274 -477033 -122094 -19163 -568968 -179270 -295795 -22037 -404902 -261045 -517223 -484209
8264 -484209 -405958 -455064 -389621 -193925 -387068 -376120 -511585 -526408 -581327 -744595 -503769
$$ packed form
8334e21058M02686J82570m4437m61239O6575J14439L50821o57953M96925n41349
8324f12020J92740n9693K82169j69408k48501K09150K21276n02768L18958J11709
8314b56388K16121R1000m39376j10283L36454R0663m41016M76031n74691O7395
8304e44090N28924l93924J30985L2590L0727k63858M7720M2566M51387l68572
8294c05545l01759l66319R17466j00237p1115j62130K61610p2363J41004o51948
8284g11336O56475k40093j44931k81455K97812M97970k54064K32512l91736j38187
8274d77033L54939J02931n49805L89698j16525K73758l82865J43857k56178L3014
8264d84209P8251m9106O5443J95696j93143J0948j35465j4823n4919j63268K40826
$$ plain form
8253 -503769 98344 -365595 141772 -131377 -237744 -642275 -605512 -441256 -231380 22587
8243 22587 -106046 -374093 -128181 -432726 -61889 -536733 -41603 -18286 93619 -224774
8233 -224774 -230078 -210080 -477321 -462041 -637396 -183272 -477572 -419799 -486467 -624714 -116162
8222 -116162 -470812 -379843 -142572 -215003 -272216 -478828 63529 -940644 -210471 -584044
8212 -584044 -646281 -615275 -247231 -502521 -100487 -90689 -725796 -600638 -750936 -636093
8202 -636093 -433746 -400689 -681280 -819114 -755897 -164926 -231689 -435930 -264536 -1605167
8192 -1605167 1680654 775337 76068 -36941 -524432 -328688 -176840 -497844 -303500
8183 -303500 -173667 -498998 -559703 -591634 -639550 -221367 -176775 -353995 -204307 -424160
$$ packed form
8253e03769O02113m63939N07367k73149j06367m04531L6763J64256K09876K53967
8243B2587j28633k68047K45912l04545L70837m74844M95130K3317J11905l18393
8233b24774n304J9998k67241J5280j75355M54124k94300N7773o6668j38247N08552
8222a16162l54650R0969K37271p2431n7213k06612N42357j004173P30173l73573
8212e84044o2237L1006L68044k55290M02034R798o35107J25158j50298J14843
8202f36093K02347L3057k80591j37834O3217N90971o6763k04241J71394j340631
8192a605167L285821r05317o99269j13009m87491J95744J51848l21004J94344
8183c03500J29833l25331o0705l1931m7916M18183M4592j77220J49688k19853
$$ plain form
8173 -424160 -130649 -435137 28781 -393266 -182096 -564272 -227482 -209504 -550373 -643841
8163 -643841 -134270 -65251 -181944 -359308 -904451 -419907 -439950 -196564 -230228 -385146
8153 -385146 -350136 -228220 -451064 -414371 -379292 -261952 -138722 -305119 -170928 -350915
8143 -350915 -568899 -286448 -364734 -88964 -432276 -158454 -473877 -702156 -266154 -387913
8133 -387913 -205282 -275039 71365 52370 -362676 -421237 -150558 -263582 -72507 -210940
8123 -210940 -62727 -415170 -474673 -321639 -656015 -466494 -270404 -382594 -108964 -300438
8113 -300438 -355976 -197664 -59688 -330423 -185579 -122927 -181926 -310424 -353846 -229874
8103 -229874 -270007 -228594 -336620 -430580 -47815 -576444 -94981 -196604 -314104 -273791
$$ packed form
8173d24160K93511l04488M63918m22047K11170l82176L36790J7978l40869r3468
8163f43841N09571O9019j16693j77364n45143M84544k0043K43386l3664j54918
8153c85146L5010J21916k22844L6693L5079J17340J23230j66397J34191j79987
8143c50915k17984K82451p8286K75770l43312K73822l15423k28279M36002j21759
8133c87913J82631o9757L46404j8995m15046n8561K70679j13024J91075j38433
8123b10940J48213l52443n9503J53034l34376J89521J96090j12190K73630j91474
8113c00438n5538J58312J37976k70735J44844O2652n8999j28498m3422J23972
8103b29874m0133M1413j08026r3960L82765n28629M81463j01623j17500M0313
$$ plain form
8093 -273791 -204635 -101145 -512345 -174149 -573177 -380640 -388207 -198334 -271775 -204959 -241883
8082 -241883 -332166 -136993 -372739 -63998 -401365 -385763 -344217 -508681 -152321 -249514
8072 -249514 -156534 217918 -473583 -149623 -315158 -127393 -153187 154222 -361831 -422336
8062 -422336 -174344 -131127 -176576 -5575 235688 -104520 -331078 -41072 -68104 -218265
8052 -218265 -530429 90860 254097 158830 -235680 -329147 -197148 -15077 -665080 -264875
8042 -264875 -405222 442315 -26394 251250 172544 108789 -48166 462293 -112891 -30884
8032 -30884 142230 313333 458953 468996 189182 48433 219024 537856 178470 646472
8022 646472 775507 502434 501453 159460 822721 808616 802533 1316413 1149812 1273655 1156535
$$ packed form
8093b73791O9156J03490m11200L38196l99028J92537p567J89873p3441O6816l6924
8082b41883r0283J95173k35746L08741l37367J5602M1546j64464L56360r7193
8072b49514R2980L74452o91501L23960j65535J87765k5794L07409n16053o0505
8062d22336K47992M3217m5449J71001K41263l40208k26558K90006k7032j50161
8052b18265l12164O21289J63237r5267l94510r3467J31999J82071o50003M00205
8042b64875j40347Q47537m68709K77644p8706o3755j56955N10459n75184Q2007
8032c0884J73114J71103J45620J0043k79814j40749J70591L18832l59386M68002
8022F46472J29035k73073r81l41993O63261j4105o083N13880j66601J23843j17120
$$ plain form
8011 1156535 1139005 1328370 1591009 1171813 1518417 1498694 1895289 1378275 1927313 1788294
8001 1788294 1855083 1975466 2581886 1973134 2333732 2102208 2520895 2171607 2319689 2449324
7991 2449324 2043012 2272285 2259045 1981288 1909478 1965178 2111869 2032586 1761316 1518110
7981 1518110 1386161 1624251 1399121 1040021 1486416 1538951 936436 1181735 1513990 1176786
7971 1176786 1127412 758541 367886 764930 855222 648966 425032 802475 311595 955517
7961 955517 538645 260140 475015 820138 707630 391978 450243 558769 443325 346416
7951 346416 335040 265538 483219 269003 109075 302646 417004 464835 203544 211473 -272012
7940 -272012 76809 60791 118849 -320970 -320676 -291099 73089 252705 -342402 206596 -381879
$$ packed form
8011A156535j7530J89365K62639m19196L46604j9723L96595n17014N49038j39019
8001A788294O6789J20383O06420o08752L60598k31524M18687l49288J48082J29635
7991B449324m06312K29273j3240k77757p1810N5700J46691p9283k71270k43206
7981A518110j31949K38090k25130l59100M46395N2535o02515K45299L32255l37204
7971A176786m9374l68871l90655L97044R0292k06256k23934L77443m90880O43922
7961I55517m16872k78505K14875L45123j12508l15652N8265J08526j15444r6909
7951C46416j1376o9502K17681k14216j59928J93571J14358M7831k61291P929m83485
7940b72012L48821j6018N8058m39819K94K9577L64188J79616n95107N48998n88475
$$ plain form
7929 -381879 -215184 38626 379209 592321 -36638 -144331 206354 486366 -3482 230554
7919 230554 -270161 159869 -142228 276148 -224209 -26021 318739 108029 205663 166631
7909 166631 -506104 -105264 -123779 -636972 98037 -274777 275854 121038 299477 -283341
7899 -283341 -199563 247518 147188 -337153 -184524 -50312 -356657 -286121 -11439 486445
7889 486445 189514 -110066 22228 -671398 -8924 64675 46334 -242374 225762 -231222
7879 -231222 -137660 -338872 139529 -556802 -94704 -110960 399289 -166297 116323 172615
7869 172615 -260102 -83931 11658 -390641 195814 151274 -137478 -39485 -93259 -789159
7859 -789159 -229269 -208532 7102 -383907 -239955 -528194 -31820 126808 -1245825 -95339
$$ packed form
7929c81879J66695K53810L40583K13112o28959j07693L50685K80012m89848K34036
7919B30554n00715M30030l02097M18376n00357J98188L44760k10710R7634l9032
7909A66631o72735M00840j8515n13193P35009l72814N50631j54816J78439n82818
7899b83341Q3778M47081j00330m84341J52629J34212l06345P0536K74682M97884
7889D86445k96931k99580J32294o93626O62474P3599j8341k88708M68136m56984
7879b31222R3562k01212M78401o96331M62098j6256N10249n65586K82620N6292
7869A72615m32717J76171R5589m02299N86455m4540k88752R7993n3774o95900
7859g89159N59890K0737K15634l91009J43952k88239M96374J58628j372633J150486
$$ plain form
7849 -95339 608841 127597 194780 91995 311329 263656 41866 -27569 132426 -363131
7839 -363131 -78956 76842 660510 646731 -174968 344999 312318 468310 296176 -157411
7829 -157411 123961 385417 254334 334734 286753 163843 592274 367061 61156 635674
7819 635674 323665 813097 883474 1371942 1163530 1511639 986116 1128882 1466112 1532526
7809 1532526 1906016 1913569 2339139 1622546 1545510 1657454 1774785 1599575 1576600 1637546
7799 1637546 1405417 1536089 1870096 1548099 1685105 1362554 2139524 2517913 2793265 3089724
7789 3089724 2732360 3654869 3955568 4334229 4516503 5008267 5001374 5616278 5324283 5455404
7779 5455404 5399353 5416059 5141213 4775361 4871155 4082707 3783468 4074577 3142704 3248094
$$ packed form
7849i5339P04180m81244O7183j02785K19334m7673k21790o9435J59995m95557
7839c63131K84175J55798N83668j3779q21699N19967l2681J55992j72134m53587
7829a57411K81372K61456j31083Q0400m7981j22910M28431k25213l05905N74518
7819F35674l12009M89432P0377M88468k08412L48109n25523J42766L37230O6414
7809A532526L73490P553M25570p16593p7036J11944J17331j75210k2975O0946
7799A637546k32129J30672L34007l21997J37006l22551P76970L78389K75352K96459
7789C089724l57364R22509L00699L78661J82274M91764o893O14904k91995J31121
7779E455404n6051J6706k74846l65852R5794p88448k99239K91109r31873J05390
$$ plain form
7769 3248094 3170017 2891286 2731591 2989614 3119386 2983000 3031806 3632058 3442865 3550315
7759 3550315 4318099 3951450 5056166 5368295 5427604 5418233 5289963 5588194 5651953 5401380
7749 5401380 4682930 4632646 4007671 4260317 3324253 3006294 3115824 2864816 2706679 2457530
7739 2457530 1971488 1728865 2411424 1899470 1793306 1621538 1496010 2001938 2011853 1746223
7729 1746223 1772578 2029431 2363552 2532752 1771750 2089832 1997879 2049647 1471061 2031081
7719 2031081 1680642 1385511 1379945 1514222 1465792 1284597 579299 588197 769930 979617
7709 979617 470993 967870 576903 1055118 738892 623570 762374 841371 585057 883306
7699 883306 166899 547741 439808 903449 772671 591116 776183 354117 817283 344384
$$ packed form
7769C248094p8077k78731j59695K58023J29772j36386M8806O00252j89193J07450
7759C550315P67784l66649J104716L12129N9309r371j28270K98231O3759k50573
7749E401380p18450n0284o24975K52646r36064l17959J09530k51008j58137k49149
7739B457530m86042k42623O82559n11954j06164j71768j25528N05928R915k65630
7729A746223K6355K56853L34121J69200p61002L18082r1953N1768n78586N60020
7719B031081l50439k95131n566J34277m8430j81195p05298Q898J81733K09687
7709I79617n08624M96877l90967M78215l16226j15322J38804P8997k56314K98249
7699H83306p16407L80842j07933M63641j30778j81555J85067m22066M63166m72899
$$ plain form
7689 344384 -142642 164976 225181 138732 285746 133099 172464 255075 61682 120513 542728
7678 542728 -283815 120085 67951 -170096 -357805 223540 539198 -61784 76096 240660
7668 240660 547973 -28534 -229375 423368 -54774 -188282 179545 -89528 382948 416859
7658 416859 39768 121637 -529144 291299 157628 -561344 170123 -133120 326463 -58365
7648 -58365 141467 157987 126110 4772 42444 -327840 -131147 -88480 285455 -96323 117881
7637 117881 61256 -58958 -146186 -511156 -5701 -147314 335180 -237485 -251239 159293
7627 159293 111935 -237371 -187822 -326736 -113818 -176163 -81573 -12708 100640 44426 203521
7616 203521 -235532 200282 27726 -198198 -393502 -293083 -328664 76187 -14447 -23424
$$ packed form
7689C44384m87026L07618O0205q6449J47014j52647L9365Q2611j93393N8831M22215
7678E42728q26543M03900n2134k38047j87709N81345L15658o00982J37880J64564
7668B40660L07313n76507k00841O52743m78142j33508L67827k69073M72476L3911
7658D16859l77091Q1869o50781Q20443j33671p18972P31467l03243M59583l84828
7648e8365J99832J6520l1877j21338L7672l70284J96693M2667L73935l81778K14204
7637A17881n6625j20214q7228l64970N05455j41613M82494n72665j3754M10532
7627A59293m7358l49306M9549j38914K12918o2345R4590O8865J13348n6214J59095
7616B03521m39053M35814j72556k25924j95304J00419l5581M04851r0634q977
$$ plain form
7606 -23424 -536458 355425 397101 -29786 -279605 174804 7282 341903 -680716 -94697
7596 -94697 -187905 51296 -525525 -270478 -229465 -341497 115195 -106581 -46572 -348543
7586 -348543 -428559 -172844 -80138 -192023 9968 -389926 -14791 46466 152421 33420
7576 33420 -512031 28885 127641 -178017 93230 266442 167157 -131828 -312527 123674
7566 123674 -271102 -34089 -79673 -48050 4134 -318372 376055 -78824 -76101 -559594 -352165
7555 -352165 49151 53340 -439087 -117727 -54202 -19397 -394942 -32454 -294495 -284007 -185455
7544 -185455 -33821 -482332 -21429 -228585 -257576 119315 -10186 -315297 -131098 -592242
7534 -592242 -150639 -8081 264593 333810 -126955 -183802 235949 162627 -7985 -732984
$$ packed form
7606b3424n13034Q91883M1676m26887k49819M54409j67522L34621j022619N86019
7596i4697r3208K39201n76821K55047M1013j12032M56692k21776O0009l01971
7586c48543q0016K55715R2706j11885K01991l99894L75135O1257J05955j19001
7576C3420n45451N40916R8756l05658K71247J73212r9285k98985j80699M36201
7566A23674l94776K37013m5584L1623N2184l22506O94427m54879K723m83493K07429
7555c52165M01316M189m92427L21360O3525L4805l75545L62488k62041J0488R8552
7544a85455J51634m48511M60903k07156k8991L76891j29501l05111J84199m61144
7534e92242M41603J42558K72674O9217m60765n6847M19751p3322j70612p24999
$$ plain form
7524 -732984 -163450 -239448 276856 85663 -499249 -397866 -50913 -156272 7656 -164115
7514 -164115 325871 23834 -188462 -185374 -396192 -63961 -416265 -4677 -478173 157695
7504 157695 321328 -173061 77084 -19755 -197432 -131136 189248 -290534 -145951 4310
7494 4310 -250532 1020 -121531 -194690 124803 -127002 177572 -171859 -385364 133472
7484 133472 285246 26124 -168733 -71902 -49281 -256789 328164 -399557 -68790 -341549
7474 -341549 -524496 -459118 -93117 -380364 -258788 -137542 -62185 18765 9836 -185362 -169449
7463 -169449 193027 -79237 -176440 -175360 319716 215592 165594 -398705 93115 249358
7453 249358 -227717 -284308 -248645 -62194 25070 -124911 -182454 -2919 -62327 18904 -43105
$$ packed form
7524g32984N69534p5998N16304j91193n84912J01383L46953j05359J63928j71771
7514a64115M89986l02037k12296L088k10818L32231l52304M11588m73496O35868
7504A57695J63633m94389K50145r6839j77677O6296L20384m79782J44583J50261
7494D310k54842K51552j22551p3159L19493k51805L04574l49431k13505N18836
7484A33472J51774k59122j94857R6831K2621k07508N84953p27721L30767k72759
7474c41549j82947O5378L66001k87247J21576J21246P5357Q0950q929j95198J5913
7463a69449L62476k72264r7203J080M95076j04124m9998n64299M91820J56243
7453B49358m77075n6591L5663J86451Q7264j49981n7543J79535n9408Q1231o2009
$$ plain form
7442 -43105 251822 -208971 -191464 65539 -591277 -252967 -317920 -82853 -219415 -567903
7432 -567903 -377330 -316399 61906 75636 -302384 -107115 -85764 -605625 84750 -140134
7422 -140134 -269784 -393096 -314490 -279984 -61849 -154150 -355231 -673026 -28870 -385163
7412 -385163 219555 -300038 -74257 -122817 293451 -127823 -45185 -61519 -174841 -181084 -332829
7401 -332829 -300968 -325245 207011 -152508 2870 -8009 -83922 26630 -179575 -125654 119603
7390 119603 91452 -345335 -67252 -359237 -95765 -231170 -449625 248853 -49888 -411590
7380 -411590 -246505 23945 -256723 -112714 -558191 -5714 -380572 63707 -90454 1286
7370 1286 -426182 -334545 -202692 5316 -480616 -63794 -684762 -398733 155923 79576
$$ packed form
7442d3105K94927m60793J7507K57003o56816L38310o4953K35067j36562l48488
7432e67903J90573O0931L78305J3730l78020J95269K1351n19861O90375k24884
7422a40134j29650j23312P8606L4506K18135r2301k01081l17795O44156l56293
7412c85163O04718n19593K25781m8560M16268m21274Q2638j6334j13322o243j51745
7401c32829L1861k4277N32256l59519J55378j0879p5913J10552k06205N3921K45257
7390A19603k8151m36787K78083k91985K63472j35405k18455O98478k98741l61702
7380d11590J65085K70450k80668J44009m45477N52477l74858M44279j54161R1740
7370A286m27468R1637J31853K08008m85932M16822o20968K86029N54656p6347
$$ plain form
7360 79576 3420 -307699 104104 -180531 -124245 -498728 -260407 31982 -111423 -195248
7350 -195248 -677358 -478061 -65068 86699 -575492 -87192 -579193 -277308 -190928 -563606
7340 -563606 -295430 -350051 -231661 -480938 35353 -696129 -765001 -212875 -694973 -191971
7330 -191971 100126 65749 -118127 280096 -309258 -353354 -242861 -271450 -147523 -311881
7320 -311881 -279167 -246466 70726 -322969 -262514 -369020 -132369 -259727 -182963 -219126 -235644
7309 -235644 -322233 -621819 -130298 -256913 52993 -518888 100113 -127473 14808 -57085
7299 -57085 178678 94916 38768 183691 -97199 37353 81967 -379222 -49722 -254427
7289 -254427 -451455 -213592 210618 -266941 -634008 -548799 133083 298715 181738 -58353
$$ packed form
7360G9576p6156l11119M11803k84635N6286l74483K38321K92389j43405q3825
7350a95248m82110J99297M12993J51767o62191M88300m92001L01885Q6380l72678
7340e63606K68176n4621J18390k49277N16291p31482o8872N52126m82098N03002
7330a91971K92097l4377j83876L98223n89354m4096J10493k8589J23927j64358
7320c11881L2714L2701L17192l93695O0455j06506K36651j27358P6764l6163j6518
7309b35644q6589k99586M91521j26615L09906n71881O19001k27586J42281p1893
7299e7085K35763q3762n6148J44923k80890J34552M4614m61189L29500k04705
7289b54427j97028K37863M24210m77559l67067Q5209O81882J65632j16977k40091
$$ plain form
7279 -58353 -383891 143222 -258690 -134805 -166100 -128665 118797 -291699 -195262 -544371
7269 -544371 -49604 -491876 -98071 29702 -14776 142764 376097 93965 -389384 -134709
7259 -134709 -516548 175019 -448335 -480698 -386873 -187494 -239269 -101791 -24950 -216214
7249 -216214 -377266 -172382 -338677 -312610 -73510 169839 -161659 -411720 -360121 149131
7239 149131 -373095 -383354 246342 -114538 -376713 99030 -340851 160019 -49413 120240
7229 120240 -294167 -40086 -429172 -168184 -735254 -160435 -188812 -15706 -138148 -94901
7219 -94901 200063 -370080 -89600 -44667 -38051 -9006 -130827 354400 -95616 -461502 -294133
7208 -294133 -17404 -101640 -116070 239463 80738 -144855 -251192 -373031 1259 -256237
$$ packed form
7279e8353l25538N27113m01912J23885l1295L7435K47462m10496R6437l49109
7269e44371M94767m42272L93805J27773m4478J57540K33333k82132m83349K54675
7259a34709l81839O91567o23354l2363R3825J99379n1775J37478P6841j91264
7249b16214j61052K04884j66295K6067K39100K43349l31498k50061N1599N09252
7239A49131n22226j0259O29696l60880k62175M75743m39881N00870k09432J69653
7229A20240m14407K54081l89086K60988n67070N74819k8377J73106j22442M3247
7219i4901K94964n70143K80480M4933O616K9045j21821M85227m50016l65886J67369
7208b94133K76729q4236j4430L55533j58725k25593j06337j21839L74290k57496
$$ plain form
7198 -256237 -372629 -129597 305262 -148759 270641 14009 -285810 -273771 -261838 -149577
7188 -149577 14251 -132015 -49577 2227 -250875 -317225 -192799 -162380 108468 338258
7178 338258 -433482 180823 162753 308449 -195933 69266 -199388 417177 144255 185582
7168 185582 335329 247136 168862 -152616 -25720 76987 -52306 130505 347963 -6775
7158 -6775 379646 52700 243284 -144092 32691 75946 395474 51041 -44221 -4889 394055
7147 394055 212622 18855 339129 98856 -290901 -93544 461661 165990 356208 -222257
7137 -222257 113890 93644 30523 903 371424 379536 -9611 233884 212111 327459 9310
7126 9310 -12818 13903 -277348 -230798 280020 -43015 -160807 -66465 -222098 -101662 180647
$$ packed form
7198b56237j16392K43032M34859m54021M19400k56632k99819J2039J1933J12261
7188a49577J63828j46266Q2438N1804k53102o6350J24426L0419K70848K29790
7178C38258p71740O14305j8070J45696n04382K65199k68654O16565k72922M1327
7168A85582J49747q8193p8274l21478J26896J02707j29293J82811K17458l54738
7158f775L86421l26946J90584l87376J76783M3255L19528l44433r5262L9332L98944
7147C94055j81433j93767L20274k40273l89757J97357N55205k95671J90218n78465
7137b22257L36147k0246o3121k9620L70521Q112l89147K43495k1773J15348l18149
7126I310k2128K6721k91251M6550N10818l23035j17792R4342j55633J20436K82309
$$ plain form
7115 180647 -5624 -152678 141708 -88036 267100 -310173 200633 6639 202728 340
7105 340 -58739 274797 430709 155177 1470 -166815 20474 399518 65631 82200 -118279
7094 -118279 89861 -190200 77399 -132885 -492852 87908 -73580 7821 116853 -281447
7084 -281447 -214936 -40767 -210336 211696 170257 -157287 -431159 131058 -50779 -205933
7074 -205933 -56033 -231582 151300 -108108 -205601 -354764 -220034 -416947 -71389 4536
7064 4536 -129623 -345812 -39779 238004 -47197 -302588 351614 -263907 -135814 12486
7054 12486 17600 192579 -260132 -101816 -547845 -263448 -423242 -571044 -393556 -242841
7044 -242841 -323763 -278766 -249088 -78740 -117807 92179 96653 -76512 -70187 309635 -103904
$$ packed form
7115A80647j86271j47054K94386k29744L55136n77273N10806j93994J96089k02388
7105C40n9079L33536J55912k75532j53707j68285J87289L79044l33887J6569k00479
7094a18279K08140k80061K67599k10284l59967N80760j61488Q1401J09032l98300
7084b81447O6511J74169j69569M22032m1439l27544k73872N62217j81837j55154
7074b05933J49900j75549L82882k59408r7493j49163J34730j96913L45558P5925
7064D536j34159k16189L06033K77783k85201k55391O54202o15521J28093J48300
7054A2486N114J74979m52711J58316m46029K84397j59794j47802J77488J50715
7044b42841q0922M4997K9678J70348l9067K09986M474j73165O325L79822m13539
$$ plain form
7033 -103904 -170674 -395283 -391348 -107393 9031 -140650 59955 -221627 -134767 -452730
7023 -452730 72870 -177230 -395680 222753 -208295 -391364 -136478 -199913 5998 -480658
7013 -480658 -466821 -93744 161530 -5951 -308341 -364821 -374638 -149385 -47199 -372557
7003 -372557 -317812 -17754 -251820 -165218 235691 43033 -109845 190353 -627125 -87562
6993 -87562 -340781 -202121 -320774 -198632 -382089 -295082 -91581 -64791 -475117 86950
6983 86950 -315386 -174768 -437023 -152918 -124955 -404925 -742026 -109429 -345579 -348762
6973 -348762 -117988 -458690 -216453 309920 -435382 -139340 -24345 -359002 167364 -128655
6963 -128655 -215259 -571414 -489522 -563505 -217540 -457044 -462824 -635434 -523772 -296569 -114803
$$ packed form
7033a03904o6770k24609L935K83955J16424j49681K00605k81582Q6860l17963
7023d52730N25600k50100k18450O18433m31048j83069K54886o3435K05911m86656
7013d80658J3837L73077K55274j67481l02390n6480r817K25253J02186l25358
7003c72557N4745L00058k34066Q6602M00909j92658j52878L00198q17478N39563
6993h7562k53219J38660j18653J22142j83457Q7007K03501K6790m10326N62067
6983H6950m02336J40618k62255K84105K7963k79970l37101O32597k36150l183
6973c48762K30774l40702K42237N26373p45302K96042J14995l34657N26366k96019
6963a28655q6604l56155Q1892p3983L45965k39504n780j72610J11662K27203J81766
$$ plain form
6952 -114803 -398671 -239404 -164770 -157534 -450891 -145276 -348890 -306742 -152778 -830287
6942 -830287 -112772 -140526 -312963 -545916 -295165 -407954 -388803 -271651 -379898 80989
6932 80989 -327900 -7983 -223976 -10567 -138838 32182 -281952 521 -181644 -169922
6922 -169922 -334734 -307035 -243390 -388500 -277203 -351529 -28476 -39675 -78264 32640 -52651
6911 -52651 -200665 292771 -23026 -205810 43503 -62072 45551 37115 -199478 -358416
6901 -358416 -100284 -214403 -154123 -21970 -59685 -487348 -86338 -64852 -130775 -232087
6891 -232087 -196558 -67887 -79057 285557 -225421 74832 129563 -75177 -101664 248222
6881 248222 203766 307713 -195197 -72762 -30633 -17151 105987 94452 124855 182833 68410
$$ packed form
6952a14803k83868J59267P4634P236k93357L05615k03614M2148J53964o77509
6942h30287P17515k7754j72437k32953K50751j12789J9151J17152j08247M60887
6932H0989m08889L19917k15993K13409j28271J71020l14134K82473j82165J1722
6922a69922j64812K7699O3645j45110J11297p4326L23053j1199l8589J10904q5291
6911e2651j48014M93436l15797j82784K49313j05575J07623q436k36593j58938
6901c58416K58132j14119O0280J32153l7715m27663M01010K1486o5923j01312
6891b32087L5529J28671j1170L64614n10978L00253N4731k04740k6487L49886
6881B48222m4456J03947n02910J22435M2129J3482J23138j1535L0403N7978j14423
$$ plain form
6870 68410 395045 275152 139521 -10033 -7097 -298523 -451916 158859 -119801 -160781
6860 -160781 200847 -210602 100914 631229 -251081 293791 59529 -86623 -466365 -24489
6850 -24489 242713 412436 -44951 -243581 -68491 181003 26262 366041 169160 -234071
6840 -234071 123296 39070 -31397 434946 -212449 -303095 -27443 -92901 -120892 -451938 -256557
6829 -256557 100654 17691 322266 311442 157396 386969 -96196 -51266 72903 467972
6819 467972 178205 107203 202676 521656 -229602 337912 -265928 210862 -483722 25699
6809 25699 134050 289924 -232311 149180 -17156 -86604 132169 107278 458275 -36823
6799 -36823 333937 149767 243817 269602 22528 383417 215606 -357756 185917 621129
$$ packed form
6870F8410L26635j19893j35631j49554K936k91426j53393O10775k78660m0980
6860a60781L61628m11449L11516N30315q82310N44872k34262j46152l79742M41876
6850b4489K67202J69723m57387j98630J75090K49494j54741L39779j96881m03231
6840b34071L57367q4226p0467M66343o47395r0646K75652o5458k7991l31046J95381
6829b56557L57211q2963L04575j0824j54046K29573m83165M4930J24169L95069
6819D67972k89767p1002R5473L18980p51258N67514o03840M76790o94584N09421
6809B5699J08351J55874n22235L81491j66336o9448K18773k4891L50997m95098
6799c6823L70760j84170R4050K5785k47074L60889j67811n73362N43673M35212
$$ plain form
6789 621129 79017 -8137 -135923 -19756 -69670 172339 247235 52268 167559 120793
6779 120793 103398 261968 -423468 332400 170010 463398 708636 11877 143634 270631
6769 270631 47962 11081 -5599 -110283 -204748 11258 506694 -76306 85792 -63152
6759 -63152 22428 107449 67909 184226 443485 388632 -188067 330388 192373 219383 226132
6748 226132 437858 405801 241234 569180 580158 373450 182318 349039 77214 310681
6738 310681 832514 411561 -62610 271066 255600 134730 600692 295232 574692 246030
6728 246030 356203 329362 338233 103652 553295 876751 331056 120636 683662 392601
6718 392601 554163 489912 206228 436870 607905 967584 630161 444897 676159 730193
$$ packed form
6789F21129n42112q7154j27786J16167m9914K42009P4896j94967J15291m6766
6779A20793j7395J58570o85436P55868j62390K93388K45238o96759J31757J26997
6769B70631k22669l6881j6680j04684r4465K16006M95436n83000J62098j48944
6759f3152Q5580Q5021l9540J16317K59259n4853n76699N18455j38015K7010O749
6748B26132K11726l2057j64567L27946J0978k06708j91132J66721k71825K33467
6738C10681N21833m20953m74171L33676j5466j20870M65962l05460K79460l28662
6728B46030J10173k6841Q871k34581M49643L23456n45695k10420N63026k91061
6718C92601J61562o4251k83684K30642J71035L59679l37423j85264K31262N4034
$$ plain form
6708 730193 718727 470122 687601 280691 908329 774807 691878 887041 808721 254987
6698 254987 383867 751358 769016 659475 595226 595822 762503 733429 754523 1042290 741165
6687 741165 789758 906417 660409 668507 1065405 628766 793182 1232694 1164455 669208
6677 669208 1225022 1182256 359296 1137089 1218948 1275543 679187 963225 895986 1166631
6667 1166631 1234286 1196592 1060019 972709 1347306 1307529 1363273 1339080 1004008 1048292 1456254
6656 1456254 1126661 973810 1298527 1447409 1401815 1592468 1871937 1018298 1349226 1229250
6646 1229250 1312553 962253 1079655 1135896 948576 1290269 1135210 1362245 1118631 1144267
6636 1144267 1390670 1059508 1224285 1537462 1081881 1775799 1451672 998991 1801736 1541808
$$ packed form
6708G30193j1466k48605K17479m06910O27638j33522q2929J95163p8320n53734
6698B54987J28880L67491J7658j09541o4249N96J66681k9074K1094K87767l01125
6687G41165M8593J16659k46008Q098L96898m36639J64416M39512o8239m95247
6677F69208N55814m2766q22960P77793Q1859N6595n96356K84038o7239K70645
6667A166631O7655l7694j36573q7310L74597l9777N5744k4193l35072M4284M07962
6656A456254l29593j52851L24717J48882m5594J90653K79469q53639L30928j19976
6646A229250Q3303l50300J17402N6241j87320L41693j55059K27035k43614K5636
6636A144267K46403l31162J64777L13177m55581O93918l24127m52681Q02745k59928
$$ plain form
6626 1541808 1539772 1490056 1797878 1190557 1846673 1859369 1536481 1802617 1595625 1652454
6616 1652454 2051591 1492781 1511117 1992182 1440835 1780015 1859423 1957496 1777350 2131225
6606 2131225 2259019 2035692 2075196 2394846 1677657 2363380 2011790 1872269 1986538 1954605
6596 1954605 2411503 2008055 2151469 2257266 2259315 2244252 2438117 2311031 2722865 2331823
6586 2331823 1944442 2368898 2734474 2388648 2649381 2885049 2857794 2824773 3105089 2691869
6576 2691869 3045150 2923382 2989265 3309214 2901986 3473284 2817484 3118684 3140476 3476013
6566 3476013 3386687 3318913 3417269 3527143 3346783 3801241 3351607 3951042 3832782 3817640
6556 3817640 3766196 4167383 3782931 3862448 4483856 3916846 4292530 4000221 4576578 4584004
$$ packed form
6626A541808k036m9716L07822o07321O56116J2696l22888K66136k06992N6829
6616A652454L99137n58810J8336M81065n51347L39180P9408R8073j80146L53875
6606B131225J27794k23327L9504L19650p17189O85723l51590j39521J14269l1933
6596A954605M56898m03448J43414J05797K049j5063J93865j27086M11834l91042
6586B331823l87381M24456L65576l45826K60733K35668k7255l3021K80316m13220
6576B691869L53281j21768O5883L19949m07228N71298o55800L01200K1792L35537
6566C476013q9326o7774R8356J09874j80360M54458m49634N99435j18260j5142
6556C817640n1444M01187l84452P9517O21408n67010L75684k92309N76357P426
$$ plain form
6546 4584004 4072084 4591245 4253737 4514293 4351710 4692874 4713865 4460828 4614357 5275976
6536 5275976 4582592 4959069 4991767 4957180 5136103 5394750 5365652 5719946 5686717 5814616
6526 5814616 5700726 5933235 5959715 5881258 6223254 5787595 6184808 6523464 6134702 6040886
6516 6040886 6303161 6067062 6589792 5763441 6178278 6819433 7203069 6743060 6889000 6840697
6506 6840697 6958098 7419781 6870232 7064010 6876503 7943377 7978962 7464513 7468816 7807289
6496 7807289 8196316 8423696 8322169 8369910 8731279 9066642 8636905 8690261 9135573 9666897
6486 9666897 9670031 9404789 9791502 9597874 10477322 10106426 10138518 10986223 10846446 10735805
6476 10735805 11267679 11353678 11558070 11964836 11800609 12175494 12661394 12754793 12887632 12789647
$$ packed form
6546D584004n11920N19161l37508K60556j62583L41164K0991k53037J53529O61619
6536E275976o93384L76477L2698l4587J78923K58647k9098L54294l3229J27899
6526E814616j13890K32509K6480p8457L41996m35659L97213L38656l88762r3816
6516F040886K62275k36099N22730q26351M14837O41155L83636m60009J45940m8303
6506F840697J17401M61683n49549J93778j87507J066874L5585n14449M303L38473
6496G807289L89027K27380j01527M7741L61369L35363m29737N3356M45312N31324
6486I666897L134k65242L86713j93628Q79448l70896L2092Q47705j39777j10641
6476A0735805N31874Q5999K04392M06766j64227L74885M85900R3399J32839r7985
$$ plain form
6466 12789647 13293393 14005800 14196222 14266683 14255362 14459904 15184152 15698911 15855753 15707693
6456 15707693 16211065 16675998 17063861 17331273 17533896 18021339 18647954 19028017 19242263
6447 19242263 19971789 19847501 20718390 20874773 21141015 21709336 22809992 23348594 23447045
6438 23447045 23949246 24414096 25119371 25723879 26589564 27044844 27801457 28446935 29340182
6429 29340182 29760922 30821070 32057693 32603227 33404702 34878413 35563553 36879724 37379193
6420 37379193 38700142 40190439 41040968 42629374 44031027 45752206 47044215 49177600
6412 49177600 50442570 51474145 54033069 56193601 58111859 60053290 62334663 64591020
6404 64591020 67764067 70506102 73091456 76824682 79785784 83456216 86390453 90672129
$$ packed form
6466A2789647N03746P12407J90422P0461j1321K04542P24248N14759J56842j48060
6456A5707693N03372M64933L87863K67412K02623M87443O26615L80063K14246
6447A9242263P29526j24288Q70889J56383K66242N68321J100656N38602R8451
6438B3447045N02201M64850P05275O04508Q65685M55280P56613O45478Q93247
6429B9340182M20740J060148J236623N45534Q01475J473711O85140J316171M99469
6420C7379193J320949J490297Q50529J588406J401653J721179J292009K133385
6412D9177600J264970J031575K558924K160532J918258J941431K281373K256357
6404F4591020L173047K742035K585354L733226K961102L670432K934237M281676
$$ plain form
6396 90672129 94618373 99565092 103961289 108711544 114197119 120477914 126406789 132911452
6388 132911452 140116993 147197641 155394361 163539460 172523958 182377899 192364162 202739142
6380 202739142 214005249 225442348 237740136 249710022 261852161 274646305 287421658
6373 287421658 299539585 310571541 321914712 331538797 340232376 347894047 353777330 357509634
6365 357509634 360105782 360386491 359142474 355865211 350472615 344444058 336869274 328085739
6357 328085739 318373430 308596825 297150227 286603558 275431450 263712799 252916188
6350 252916188 242052331 231249408 221255013 211002795 202358289 193546406 184734170 177428596
6342 177428596 169607509 162763189 155766593 149600864 143145648 137406182 132329034 127309699
$$ packed form
6396I0672129L946244M946719M396197M750255N485575O280795N928875O504663
6388A32911452P205541P080648Q196720Q145099Q984498R853941R986263J0374980
6380B02739142J1266107J1437099J2297788J1969886J2142139J2794144J2775353
6373B87421658J2117927J1031956J1343171R624085Q693579P661671N883283L732304
6365C57509634K596148K80709j244017l277263n392596o028557p574784q783535
6357C28085739r712309r776605j1446598j0546669j1172108j1718651j0796611
6350B52916188j0863857j0802923r994395j0252218q644506q811883q812236p305574
6342A77428596p821087o844320o996596o165729o455216n739466n077148n019335
$$ plain form
6334 127309699 122674517 118654241 114111234 110419220 106594032 103245047 99535142 96425083
6326 96425083 93579126 90171405 87763445 84809650 82539094 80159974 77941312 75775347
6318 75775347 73819183 71911184 69648617 68042988 65880615 64643439 62667822 61451040
6310 61451040 59878335 58206414 57134071 55570177 54466575 53390063 51867185 50837203
6302 50837203 49721938 48227392 47450704 46576575 45440323 44313066 43598432 42408357 41769076
6293 41769076 41102711 39934987 39332507 38592255 37700304 37004249 36653328 35605624 35047311
6284 35047311 34177941 33602287 33351472 32763983 32252360 30955280 31081773 30462178 29651997
6275 29651997 29166668 29041224 29029695 27907989 27576094 26577562 26720267 26241631 26029844
$$ packed form
6334A27309699m635182m020276m543007l692014l825188l348985l709905l110059
6326I6425083k845957l407721k407960k953795k270556k379120k218662k165965
6318G5775347j956164j907999k262567j605629k162373j237176j975617j216782
6310F1451040j572705j671921j072343j563894j103602j076512j522878j029982
6302E0837203j115265j494546p76688q74129j136252j127257p14634j190075o39281
6293D1769076o66365j167724o02480p40252q91951o96055l50921j047704n58313
6284C5047311q69370n75654k50815n87489n11623j297080J26493o19595q10181
6275B9651997m85329j25444j1529j121706l31895r98532J42705m78636k11787
$$ plain form
6266 26029844 25585479 25087114 24862369 24886324 23610596 23685404 23142142 23181159 23050967 22314996
6256 22314996 22336266 22170521 21836565 21251544 20912514 20667809 20706246 20109097 19841064 19773661
6246 19773661 19251740 19561279 19233397 18716318 18413292 18676144 18175352 17696771 17944822
6237 17944822 17713491 17435582 16698773 16852062 16769443 16726662 16359068 16196460 15816837 15739760
6227 15739760 15849551 15292380 15022096 14932266 14852453 15083766 14416315 14398306 13914633 14423390
6217 14423390 14089312 13596118 13650562 13431084 13618060 13232004 12979781 13130949 13059283 12890765
6207 12890765 13013119 12663715 12584201 12616422 12507745 12293767 12448114 12380868 12286158 11985283
6197 11985283 11596819 12010826 11761811 11771230 11699319 11644610 11487368 11547957 11629467 11093917
$$ packed form
6266B6029844m44365m98365k24745K3955j275728P4808n43262L9017j30192p35971
6256B2314996K1270j65745l33956n85021l39030k44705L8437n97149k68033o7403
6246A9773661n21921L09539l27882n17079l03026K62852n00792m78581K48051
6237A7944822k31331k77909p36809J53289q2619m2781l67594j62608l79623p7077
6227A5739760J09791n57171k70284q9830p9813K31313o67451j8009m83673N08757
6217A4423390l34078m93194N4444k19478J86976l86056k52223J51168p1666j68518
6207A2890765J22354l49404p9514L2221j08677k13978J54347o7246r4710l00875
6197A1985283l88464M14007k49015R419p1911n4709j57242O0589Q1510n35550
$$ plain form
6187 11093917 11268957 11221211 10784828 11337969 11096511 11122815 11328346 10979359 10809690 10708910
6177 10708910 11140527 11141199 10055228 10322610 10801629 11088977 10923976 10193975 10309863 10331188
6167 10331188 10396643 10242502 10223785 10672361 10498638 10775947 10547727 10346605 10402068 10809476
6157 10809476 10547959 10147845 10251647 10583521 10453617 10523313 10642391 10335039 10615920 10933091
6147 10933091 10706226 10547392 10815616 10820799 10776111 10750941 11140353 11026401 10959664 11486730
6137 11486730 11076296 11262890 11484360 10979585 11723810 11621252 11798183 11578301 11848935
6128 11848935 11760627 12255284 12295474 12020719 11721455 12507716 12158209 12157782 12425409 12213761
6118 12213761 12581901 12726778 12890670 12712883 12292995 12071022 12816455 12536644 12249180
$$ packed form
6187A1093917J75040m7746m36383N53141k41458K6304K05531l48987j69669j00780
6177A0708910M31617O72j085971K67382M79019K87348j65001p30001J15888K1325
6167A0331188O5455j54141j8717M48576j73723K77309k28220k01122N5463M07408
6157A0809476k61517m00114J03802L31874j29904O9696J19078l07352K80881L17171
6147A0933091k26865j58834K68224N183m4688k5170L89412j13952o6737N27066
6137A1486730m10434J86594K21470n04775P44225j02558J76931k19882K70634
6128A1848935q8308M94657M0190k74755k99264P86261l49507m27K67627k11648
6118A2213761L68140J44877J63892j77787m19888k21973P45433k79811k87464
$$ plain form
6109 12249180 12215061 12372471 12745033 12685410 12553495 12587179 13465024 13257930 12572762 13047117
6099 13047117 12976836 13228233 13410558 13277258 13354690 13525175 13441480 13831751 13637946 13966782
6089 13966782 14445010 14338372 14424982 14714315 13955155 14197106 14426815 14310891 13986573 14262081
6079 14262081 14134949 14124417 14050383 14246887 13996034 14262244 13711114 14023483 14389029 13852870
6069 13852870 13972083 13570661 13581375 13841196 13735066 13963212 13843577 14335687 14267539 13837169
6059 13837169 14415893 14249364 14609685 14606836 14822448 15199832 15296337 15677840 15681974 15384606
6049 15384606 15356502 15754492 15400603 15705077 15403368 15261943 15405753 14912690 15029277 15008497
6039 15008497 15030643 14602075 14068098 15030494 14178088 14692978 14761369 14861944 14314162 14463785
$$ packed form
6109A2249180l4119J57410L72562n9623j31915L3684Q77845k07094o85168M74355
6099A3047117p0281K51397J82325j33300P7432J70485q3695L90271j93805L28836
6089A3966782M78228j06638Q6610K89333p59160K41951K29709j15924l24318K75508
6079A4262081j27132j0532p4034J96504k50853K66210n51130L12369L65546n36159
6069A3852870J19213m01422J0714K59821j06130K28146j19635M92110o8148m30370
6059A3837169N78724j66529L60321k849K15612L77384R6505L81503M134k97368
6049A5384606k8104L97990l53889L04474l01709j41425J43810m93063J16587k0780
6039A5008497K2146m28568n33977R62396q52406N14890O8391J00575n47782J49623
$$ plain form
6029 14463785 14268102 14804968 14971174 14768570 14953852 14918181 15395308 15262968 15334653 15349643
6019 15349643 15630799 15796843 15864153 16795584 16778096 16134179 16850534 17064341 16768117 17371401
6009 17371401 17384949 18236585 17963443 18410324 18268035 18772504 19188565 20158465 20177676 20197110
5999 20197110 20655237 20858632 21074356 21797407 22025526 22017777 22530818 22706587 22742549 23331637
5989 23331637 22666338 22910487 23678641 23423868 23752880 23931795 23823777 24917297 24626633
5980 24626633 25165155 25249765 25738838 26626957 26992296 26941717 27263084 27682951 28368819 28657662
5970 28657662 29372039 30054726 30427666 31130108 31916276 32822230 33591154 33944252 35121490
5961 35121490 35902001 36217207 37117200 37589857 38320747 39140722 40680690 40959251 41634426
$$ packed form
6029A4463785j95683N36866J66206k02604J85282l5671M77127j32340P1685J4990
6019A5349643K81156J66044O7310R31431j7488o43917P16355K13807k96224O03284
6009A7371401J3548Q51636k73142M46881j42289N04469M16061R69900J9211J9434
5999B0197110M58127K03395K15724P23051K28119p749N13041J75769L5962N89088
5989B3331637o65299K44149P68154k54773L29012J78915j08018J093520k90664
5980B4626633N38522Q4610M89073Q88119L65339n0579L21367M19867O85868K88843
5970B8657662P14377O82687L72940P02442P86168R05954P68924L53098J177238
5961C5121490P80511L15206Q99993M72657P30890Q19975J539968K78561O75175
$$ plain form
5952 41634426 42659621 43565665 44281383 45657607 46358029 47503188 48522277 49743661 50882787
5943 50882787 51773139 52955306 54286727 55232453 56792509 58128269 59295652 60468717
5935 60468717 61971233 63401840 64626239 65765705 66819765 68695688 69958572 70396446
5927 70396446 71758673 73036070 74148359 75460628 77021175 77972137 79291638 80468619
5919 80468619 81832916 83179934 84146764 85514753 87440437 88048785 89453602 90968934
5911 90968934 92022485 92899199 94021951 94309595 94884503 95426095 95348554 95672934 96156153
5902 96156153 95208659 95345262 95337284 95036196 94008742 93343391 92215328 91273552 90831384
5893 90831384 89748549 88376536 87508819 85676168 84464525 82436366 81064056 79753615
$$ packed form
5952D1634426J025195R06044P15718J376224P00422J145159J019089J221384J139126
5943E0882787Q90352J182167J331421R45726J560056J335760J167383J173065
5935F0468717J502516J430607J224399J139466J054060J875923J262884M37874
5927G0396446J362227J277397J112289J312269J560547R50962J319501J176981
5919H0468619J364297J347018R66830J367989J925684O08348J404817J515332
5911I0968934J053551Q76714J122752K87644N74908N41592p7541L24380M83219
5902I6156153r47494J36603p978l01088j027454o65351j128063r41776m42168
5893I0831384j082835j372013q67717j832651j211643k028159j372310j310441
$$ plain form
5885 79753615 78251333 76404972 75143560 72662434 71254100 69460647 68060946 66091640
5877 66091640 64418262 63097697 61473567 60223998 58464336 56739610 55359532 54209110
5869 54209110 53160349 51733317 50621535 49428577 48052289 46874968 46095357 45084712
5861 45084712 44378126 42954440 42735922 41524440 40832105 40000381 39230616 38724218 38205340
5852 38205340 37959368 37385245 36952810 36449904 36196841 35845724 35527256 35125729 34828266
5843 34828266 33809666 34088489 33329620 32647241 32601072 32325047 31709076 31045968 30443722
5834 30443722 30117317 29955420 29683183 29661913 29718302 29477575 29627778 29470272 29843328 30280546
5824 30280546 30155575 30215441 30849061 31354648 31218916 31582013 31642063 31805444 31994529 32048050
$$ packed form
5885G9753615j502282j846361j261412k481126j408334j793453j399701j969306
5877F6091640j673378j320565j624130j249569j759662j724726j380078j150422
5869E4209110j048761j427032j111782j192958j376288j177321p79611j010645
5861D5084712p06586j423686k18518j211482o92335q31724p69765n06398n18878
5852C8205340k45972n74123m32435n02906k53063l51117l18468m01527k97463
5843C4828266j018600K78823p58869o82379m6169k76025o15971o63108o02246
5834C0443722l26405j61897k72237k1270N6389k40727J50203j57506L73056M37218
5824C0280546j24971N9866O33620N05587j35732L63097O0050J63381J89085N3521
$$ plain form
5814 32048050 31729933 31915067 31778496 31449406 31076829 30532997 30116507 29285946 29099808
5805 29099808 28220515 27417272 26630414 25681740 24887115 24241983 23732627 22906027 22112957
5796 22112957 21294457 20386518 19547828 19395699 18060460 17952781 17649705 17160424 17051735
5787 17051735 16496860 16131476 15967128 15464827 15408878 15279277 15150438 14732097 14570490 14268876
5777 14268876 13765693 13736260 13529743 13240592 13544171 13147717 12704552 12593952 12497576 12217097
5767 12217097 12025404 11880701 11852091 11850543 11603324 11345793 11012565 10676718 11046091 10695021
5757 10695021 10872896 10296748 10345974 10590232 10025834 9744393 10063340 9529615 9686927 9502464
5747 9502464 9250041 9092739 9275067 8819463 9393573 8901499 8328911 8222391 8262373 8373825
$$ packed form
5814C2048050l18117J85134j36571l29090l72577n43832m16490q30561j86138
5805B9099808q79293q03243p86858r48674p94625o45132n09356q26600p93070
5796B2112957q18500r07939q38690j52129j335239j07679l03076m89281j08689
5787A7051735n54875l65384j64348n02301n5949j29601j28839m18341j61607l01614
5777A4268876n03183k9433k06517k89151L03579l96454m43165j10600r6376k80479
5767A2217097j91693j44703k8610j548k47219k57531l33228l35847L69373l51070
5757A0695021J77875n76148M9226K44258n64398k81441L18947n33725J57312j84463
5747I502464k52423j57302J82328m55604N74110m92074n72588j06520L9982J11452
$$ plain form
5737 8373825 8507102 7817033 7980775 7986567 7945044 7855293 8074301 7722594 7770408 7916279
5727 7916279 7985143 7683492 7293122 7709386 7469398 7613397 7269810 7298353 7503201 7299559
5717 7299559 7465956 7047140 7344797 7596960 7487423 7340571 7057485 7275532 7506470 7544252
5707 7544252 7694890 7315271 7646140 7584216 7511479 7771021 7636288 7903562 7979589 7672152
5697 7672152 8097429 8120798 7578010 7629102 8021243 8470344 8114516 8196473 8354597 8256156
5687 8256156 8121677 8258602 8099295 8217546 8266500 8497113 8365190 8291693 8484327 8541924
5677 8541924 8806035 8936382 8592379 8870633 8841207 9485565 9413678 9327889 9802569 10217762
5667 10217762 9886449 9995773 9950986 10555524 10356822 10755480 10767954 10827010 10963862 10851247
$$ packed form
5737H373825J33277o90069J63742N792m1523q9751K19008l51707M7814J45871
5727G916279O8864l01651l90370M16264k39988J43999l43587K8543K04848k03642
5717G299559J66397m18816K97657K52163j09537j46852k83086K18047K30938L7782
5707G544252J50638l79619L30869o1924p2737K59542j34733K67274P6027l07437
5697G672152M25277K3369n42788N1092L92141M49101l55828Q1957J58124r8441
5687H256156j34479J36925j59307J18251M8954K30613j31923p3497J92634N7597
5677H541924K64111J30347l44003K78254k9426O44358p1887q5789M74680M15193
5667A0217762l31313J09324m4787O04538j98702L98658J2474N9056J36852j12615
$$ plain form
5657 10851247 10744594 11083789 11184239 11411185 11177820 11334409 11330893 11407045 11437253 11818668
5647 11818668 11834741 11989080 12093339 12762533 12731175 12593957 13095319 13850108 13704194 13715966
5637 13715966 14049090 14604543 14558008 14715351 15280698 16040557 16048996 16287929 16245124 16800551
5627 16800551 17789266 17603119 17675707 18735969 18880894 19661138 20362271 20645395 21600833
5618 21600833 22407333 22962453 24141518 24693416 25687252 27254656 28277187 29420217 31538734
5609 31538734 32984235 35063871 37331854 40257905 42184235 44840643 47834587 50971376
5601 50971376 53396195 55773529 58919782 61315320 63050289 64552866 66102416 67049616
5593 67049616 68190545 69123531 69762059 70597953 71708427 72349097 73792467 75789421 77391740
$$ packed form
5657A0851247j06653L39195J00450K26946k33365J56589l516P6152L0208L81415
5647A1818668J6073J54339J04259O69194l1358j37218N01362P54789j45914J1772
5637A3715966L33124N55453m6535J57343N65347P59859Q439K38933m2805N55427
5627A6800551R88715j86147P2588J060262J44925P80244P01133K83124R55438
5618B1600833Q06500N55120J179065N51898R93836J567404J022531J143030K118517
5609C1538734J445501K079636K267983K926051J926330K656408K993944L136789
5601E0971376K424819K377334L146253K395538J734969J502577J549550R47200
5593F7049616J140929R32986O38528Q35894J110474O40670J443370J996954J602319
$$ plain form
5584 77391740 79916336 82359530 85428386 88653323 92476789 96275748 100936276 105118065
5576 105118065 109863934 114422711 118664859 123713190 128164040 132397029 135984053 139375081
5568 139375081 141551137 143532675 144388886 144118522 143842785 142731316 141024406 139473630
5560 139473630 137635079 136568703 135732034 135441376 135767678 135913662 137848272 140298146 142912021
5551 142912021 145246061 148241571 151239218 153881308 156738361 158391526 160396741 161132202
5543 161132202 161887147 161918229 161975185 161185588 161024782 159452060 159162025 157871933 155914881
5534 155914881 154931952 153302158 151939183 150832398 149760430 149223270 149040309 148650935 149040569
5525 149040569 149698620 150464026 151242364 152506427 154074470 154908515 156046474 157166997 157773495
$$ packed form
5584G7391740K524596K443194L068856L224937L823466L798959M660528M181789
5576A05118065M745869M558777M242148N048331M450850M232989L587024L391028
5568A39375081K176056J981538Q56211k70364k75737j111469j706910j550776
5560A39473630j838551j066376q36669k90658L26302J45984J934610K449874K613875
5551A42912021K334040K995510K997647K642090K857053J653165K005215P35461
5543A61132202P54945L1082N6956p89597j60806j572722k90035j290092j957052
5534A55914881r82929j629794j362975j106785j071968n37160j82961l89374L89634
5525A49040569O58051P65406P78338J264063J568043Q34045J137959J120523O06498
$$ plain form
5516 157773495 157791081 157135666 155912468 154721708 152092487 150116772 147317698 144276729
5508 144276729 140918318 137958082 134174365 129930583 126352757 123129704 120026474 116871817
5500 116871817 113319555 110539992 107328534 104619941 102417345 100181303 97400305 95360553
5492 95360553 93923775 91733728 89947276 87935614 86019787 84294284 82368146 80572095
5484 80572095 78482544 76284413 74024847 72104835 69939767 67785811 65520304 63284176
5476 63284176 61468561 59064698 57012884 54931629 53134532 51431040 49413295 48202085
5468 48202085 46607709 45115092 44195328 43784773 42388299 41626689 41252934 40134117 39793836
5459 39793836 39398103 38959905 38527711 38279367 38158979 37633156 37503784 37412279 37184187 36836182
$$ packed form
5516A57773495J7586o55415j223198j190760k629221j975715k799074l040969
5508A44276729l358411k960236l783717m243782l577826l223053l103230l154657
5500A16871817l552262k779563l211458k708593k202596k236042k780998k039752
5492I5360553j436778k190047j786452k011662j915827j725503j926138j796051
5484H0572095k089551k198131k259566j920012k165068k153956k265507k236128
5476F3284176j815615k403863k051814k081255j797097j703492k017745j211210
5468D8202085j594376j492617r19764m10555j396474p61610l73755j118817l40281
5459C9793836l95733m38198m32194k48344j20388n25823j29372r1505k28092l48005
$$ plain form
5449 36836182 36515354 36045248 35302419 35351586 34705965 34050015 33510805 33221113 32925388 32714322
5439 32714322 32933510 32776683 32540931 32795813 33038926 33539113 33413721 33888814 34700888
5430 34700888 35385381 36050353 36535271 37459233 38337074 39076224 40104476 41184602 41986209
5421 41986209 42756441 44056673 44872598 45831026 46797863 47861661 49160542 50289400 51340124
5412 51340124 53005834 53551146 54761307 55836713 57135601 58320447 59530608 60844854
5404 60844854 62215683 63231468 64702338 66225182 67435716 68839159 70987446 72317125
5396 72317125 74229581 75851004 77906467 79815169 81609284 83246890 84642843 86261078
5388 86261078 87633896 87799976 88475964 88736486 87941586 87505284 86714929 85601909 84313357
$$ packed form
5449C6836182l20828m70106p42829M9167o45621o55950n39210k89692k95725k11066
5439C2714322K19188j56827k35752K54882K43113N00187j25392M75093Q12074
5430C4700888O84493O64972M84918R23962Q77841P39150J028252J080126Q01607
5421D1986209P70232J300232Q15925R58428R66837J063798J298881J128858J050724
5412E1340124J665710N45312J210161J075406J298888J184846J210161J314246
5404F0844854J370829J015785J470870J522844J210534J403443K148287J329679
5396G2317125J912456J621423K055463J908702J794115J637606J395953J618235
5388H6261078J372818J66080O75988K60522p94900m36302p90355j113020j288552
$$ plain form
5379 84313357 83147256 82056741 79969199 78564849 76930232 75523074 73881605 72674827
5371 72674827 71020250 70190723 67892048 66912821 64888796 64291735 62298696 60956929 58779398
5362 58779398 57037963 55015309 53382191 51071887 49396524 47537230 45913263 44395165
5354 44395165 42208498 40672898 39695466 37991949 36572147 35449065 34765556 33661197
5346 33661197 32549847 31803567 31271195 30516650 30186718 29473765 29654064 29249638 29015915
5337 29015915 29174597 28896985 28457622 28639264 28380207 28769947 28828849 29073499 28978667 29490772
5327 29490772 29689185 30108625 30916003 31775826 32985577 34423075 36124441 37382068 40542956
5318 40542956 43197725 45427463 47996546 50725083 54257599 57570920 60584201 64070232
$$ packed form
5379H4313357j166101j090515k087542j404350j634617j407158j641469j206778
5371G2674827j654577q29527k298675r79227k024025n97061j993039j341767k177531
5362E8779398j741435k022654j633118k310304j675363j859294j623967j518098
5354D4395165k186667j535600r77432j703517j419802j123082o83509j104359
5346C3661197j111350p46280n32372p54545l29932p12953J80299m04426k33723
5337B9015915J58682k77612m39363J81642k59057L89740N8902K44650r4832N12105
5327B9490772J98413M19440Q07378Q59823J209751J437498J701366J257627L160888
5318D0542956K654769K229738K569083K728537L532516L313321L013281L486031
$$ plain form
5310 64070232 67067672 70457827 73230210 75439567 78289410 80209006 82761839 84336301
5302 84336301 85268241 85444825 85212462 84103151 82485618 81066024 79599396 77021016 74545212
5293 74545212 71320845 67913941 64623999 61468717 58762727 55036649 52100926 48817115
5285 48817115 45967749 42868737 39944085 36990946 34469918 31539077 29649582 27396129
5277 27396129 25766777 24255540 23446452 21956195 20597012 19995188 19204391 18483919 17611905
5268 17611905 16964330 16425508 15959179 15646179 15057266 14838961 13921526 13974162 13800115 13900580
5258 13900580 12829961 13129787 12595964 12583059 12114832 11623628 11144883 11226589 11174081 11133782
5248 11133782 10682714 10678254 10031274 10214592 10069666 9690108 9664614 9761399 9495985 9490325
$$ packed form
5310F4070232K997440L390155K772383K209357K849843J919596K552833J574462
5302H4336301R31940J76584k32363j109311j617533j419594j466628k578380k475804
5293G4545212l224367l406904l289942l155282k705990l726078k935723l283811
5285D8817115k849366l099012k924652k953139k521028k930841j889495k253453
5277B7396129j629352j511237q09088j490257j359183o01824p90797p20472q72014
5268A7611905o47575n38822m66329l13000n88913k18305r17435N2636j74047J00465
5258A3900580j070619K99826n33823j2905m68227m91204m78745Q1706n2508m0299
5248A1133782m51068m460o46980J83318j44926l79558k5494R6785k65414n660
$$ plain form
5238 9490325 9190741 8648976 9124619 9033764 8751139 8593380 8840470 8579768 8452223 8585006
5228 8585006 8123378 8236337 7956822 8213216 8062004 8176385 8057619 8328394 7960628 7812845
5218 7812845 7339206 7530850 7582065 8111847 7660389 7393777 7278631 7552006 7710251 7821223
5208 7821223 7389996 7373120 6982108 7217272 7209323 7439732 6440211 6649296 7150434 6705062
5198 6705062 6667790 6639889 6697668 6473591 5988878 6083884 6180214 6383249 5957395 5852787
5188 5852787 5736208 6080053 5814428 5391609 5208999 5324833 5093404 5257737 5182815 4935583
5178 4935583 5329101 5235599 4897305 4741265 5221537 4451539 4486499 4342974 4517851 4432261
5168 4432261 4007852 4220002 4184676 4489422 4373168 4005686 4132031 3807029 4009438 4100138
$$ packed form
5238I490325k99584n41765M75643r0855k82625j57759K47090k60702j27545J32783
5228H585006m61628J12959k79515K56394j51212J14381j18766K70775l67766j47783
5218G812845m73639J91644N1215N29782m51458k66612j15146K73375J58245J10972
5208G821223m31227j6876l91012K35164p949K30409r99521K09085N01138m45372
5198F705062l7272k7901N7779k24077m84713R5006R6330K03035m25854j04608
5188E852787j16579L43845k65625m22819j82610J15834k31429J64333p4922k47232
5178D935583L93518r3502l38294j56040M80272p69998L4960j43525J74877q5590
5168D432261m24409K12150l5326L04746j16254l67482J26345l25002K02409R0700
$$ plain form
5158 4100138 3795974 3873872 3603042 3668521 3806652 4031400 3879610 3493914 3793273 3907255
5148 3907255 3388061 3666023 3621214 3457667 3533400 3469682 3213546 3557258 4016057 3800019
5138 3800019 3625001 3493742 3710113 3165880 3774612 3269647 3533140 2892399 3024235 3476810
5128 3476810 3471678 3463713 3201262 2906385 3447554 3731009 3175339 3131487 2853510 2999379
5118 2999379 3158624 3342835 3254743 3143641 3212951 3294802 3192916 3364632 3456395 3024625
5108 3024625 3584384 3147836 3682390 3123722 3570896 2853305 3536248 3110017 3532378 3557033
5098 3557033 3204026 3458419 3266202 3356544 3219194 3283400 3492272 3835148 3121260 2984576
5088 2984576 3087948 3870589 3490169 3497475 3009555 3364026 3465296 3624433 3577214 3482405
$$ packed form
5158D100138l04164P7898k70830O5479J38131K24748j51790l85696K99359J13982
5148C907255n19194K77962m4809j63547P5733o3718k56136L43712M58799k16038
5138C800019j75018j31259K16371n44233O08732n04965K63493o40741J31836M52575
5128C476810n132p965k62451k94877N41169K83455n55670m3852k77977J45869
5118B999379J59245J84211q8092j11102O9310Q1851j01886J71716R1763m31770
5108C024625N59759m36548N34554n58668M47174p17591O82943m26231M22361K4655
5098C557033l53007K54393j92217R0342j37350O4206K08872L42876p13888j36684
5088B984576J03372P82641l80420P306m87920L54471J01270J59137m7219r4809
$$ plain form
5078 3482405 3773852 3526063 3378030 3241010 3743008 3470280 3390400 3938065 4099522 3955616
5068 3955616 3744751 3971214 3851871 4303631 4188145 4706009 4348057 3953530 4243560 4636638
5058 4636638 4249245 4671452 4532384 4679912 4391915 4451680 3940817 4226219 4482344 4794086
5048 4794086 4711948 4518511 4668471 5138476 4959923 4831554 4995165 5729510 5215381 5571532
5038 5571532 5331536 5546777 5998932 6367094 6293250 6540305 6444615 6459544 6520318 6244353
5028 6244353 6383567 6813181 6482266 6810581 6691461 6726059 6403332 6708686 6419036 7103115
5018 7103115 7253999 6945532 6963232 7304997 6862907 7009926 7216039 7445428 7689585 7428310
5008 7428310 7518719 7601333 7919862 7865699 8188108 8140143 8858910 8983582 9123672 9093594
$$ packed form
5078C482405K91447k47789j48033j37020N01998k72728p9880N47665J61457j43906
5068C955616k10865K26463j19343M51760j15486N17864l57952l94527K90030L93078
5058D636638l87393M22207j39068J47528k87997N9765n10863K85402K56125L11742
5048D794086q2138j93437J49960M70005j78553j28369J63611P34345n14129L56151
5038E571532k39996K15241M52155L68162p3844K47055r5690J4929O0774k75965
5028F244353J39214M29614l30915L28315j19120L4598l22727L05354k89650O84079
5018G103115J50884l08467J7700L41765m42090J47019K06113K29389K44157k61275
5008G428310R0409Q2614L18529n4163L22409m7965P18767J24672J40090l0078
$$ plain form
4998 9093594 9250371 9760990 9794038 9806711 10424044 10230031 10598756 11271889 11584097 12236935
4988 12236935 12471045 12634303 13459480 14311081 14990705 15546486 16347287 17109181 18022819
4979 18022819 18789518 19970609 20470033 21747772 22603664 23260472 23238448 24126741 24218466
4970 24218466 25007386 24840477 24920644 24878102 25290849 25169632 25830057 25947221 26893751 27636683
4960 27636683 27985794 28704583 29784577 30780615 32109002 33884311 35974628 38062497 40261823
4951 40261823 42393127 45003559 47444070 49512259 51305991 53511489 54253029 55368950
4943 55368950 56036940 56235220 56085895 55563437 54580101 53810407 53189317 51957656 51001321
4934 51001321 50522208 49775979 49566145 48862624 48801258 48929934 49858882 50795014 52055064
$$ packed form
4998I093594J56777N10619L3048J2673O17333j94013L68725O73133L12208O52838
4988A2236935K34110J63258Q25177Q51601O79624N55781Q00801P61894R13638
4979A8022819P66699J181091M99424J277739Q55892O56808k2024Q88293R1725
4970B4218466P88920j66909Q0167m2542M12747j21217O60425J17164R46530P42932
4960B7636683L49111P18789J079994R96038J328387J775309K090317K087869K199326
4951D0261823K131304K610432K440511K068189J793732K205498P41540J115921
4943E5368950O67990J98280j49325n22458r83336p69694o21090j231661r56335
4934E1001321m79113p46229k09834p03521o1366J28676R28948R36132J260050
$$ plain form
4925 52055064 53551866 55271407 58130381 60305210 62598615 64618301 66800787 69080390
4917 69080390 70764010 72590522 72967713 73012116 72270548 71022536 69545204 67773048 65507516
4908 65507516 63696323 61103252 58964064 57103730 54796601 53279507 52064035 50459470
4900 50459470 49922297 48922471 48222404 47809385 48045198 47814247 48380172 49084095 49634062
4891 49634062 50158123 51094658 51956362 52356070 52394926 52532035 52193076 50680359 49179491
4882 49179491 48047611 46848837 44554955 42919970 40794004 39155199 37939069 36076470
4874 36076470 34260117 33510359 32637378 30910586 30313523 29161857 28709037 28018260 27047162
4865 27047162 26365128 25857713 25392221 25310630 25435535 24844713 24633442 24556923 24531672 24329453
$$ packed form
4925E2055064J496802J719541K858974K174829K293405K019686K182486K279603
4917F9080390J683620J826512L77191M4403p41568j248012j477332j772156k265532
4908F5507516j811193k593071k139188j860334k307129j517094j215472j604565
4900E0459470n37173r99826p00067m13019K35813k30951N65925P03923N49967
4891D9634062N24061R36535Q61704L99708L8856J37109l38959j512717j500868
4882D9179491j131880j198774k293882j634985k125966j638805j216130j862599
4874C6076470j816353p49758q72981j726792n97063j151666m52820o90777r71098
4865B7047162o82034n07415m65492q1591J24905n90822k11271p6519k5251k02219
$$ plain form
4855 24329453 24006276 23101152 23097758 22142082 22051249 21307343 20284471 20159851 19831427 19101473
4845 19101473 18581387 18354153 17664736 17643916 17360210 16755003 17200479 16459502 16508128 16270625
4835 16270625 15927830 15709317 16089337 16367296 16059527 16057658 16398033 15977966 16815032 16542010
4825 16542010 16875219 16981329 17459265 17675058 17775386 18155095 18565932 18743611 19098501
4816 19098501 20146936 20181712 20654810 21137997 21735991 22430699 22915473 24003476 24791806
4807 24791806 25002456 25311861 26509132 27501222 27673363 28156476 29656032 30626720 31698047
4798 31698047 32099188 32806497 33751986 35079347 36242454 37339269 38104567 39776066 41090046
4789 41090046 42541705 44279871 46463907 48902617 51283897 53568603 56383795 59299583
$$ packed form
4855B4329453l23177r05124l394r55676r0833p43906j022872j24620l28424p29954
4845A9101473n20086k27234o89417k0820k83706o05207M45476p40977M8626k37503
4835A6270625l42795k18513L80020K77959l07769j869L40375m20067Q37066k73022
4825A6542010L33209J06110M77936K15793J00328L79709M10837J77679L54890
4816A9098501J048435L4776M73098M83187N97994O94708M84774J088003P88330
4807B4791806K10650L09405J197271R92090J72141M83113J499556R70688J071327
4798C1698047M01141P07309R45489J327361J163107J096815P65298J671499J313980
4789D1090046J451659J738166K184036K438710K381280K284706K815192K915788
$$ plain form
4781 59299583 63028579 66015238 68790160 72528624 76485208 79748575 83704988 86574237
4773 86574237 90052453 93447549 96986850 100339586 104127611 107435537 111522133 115748568
4765 115748568 120036743 124063899 128339281 131966229 135732970 139486541 143217864 146987889
4757 146987889 150505349 154467103 158147724 162522555 165907409 168704313 171021382 173347006
4749 173347006 174678508 175181534 174664317 173581611 172151305 170191460 167522618 164930449
4741 164930449 161237513 159272597 155994166 153502416 150065098 146863615 143510789 140462509
4733 140462509 136538547 133411259 129463493 126367839 123332796 119594426 116755318 113613496
4725 113613496 110261196 106999992 104202733 101020743 97576703 94111033 90200368 87153344
$$ packed form
4781E9299583L728996K986659K774922L738464L956584L263367L956413K869249
4773H6574237L478216L395096L539301L352736L788025L307926M086596M226435
4765A15748568M288175M027156M275382L626948L766741L753571L731323L770025
4757A46987889L517460L961754L680621M374831L384854K796904K317069K325624
4749A73347006J331502N03026n17217j082706j430306j959845k668842k592169
4741A64930449l692936j964916l278431k491750l437318l201483l352826l048280
4733A40462509l923962l127288l947766l095654l035043l738370k839108l141822
4725A13613496l352300l261204k797259l181990l444040l465670l910665l047024
$$ plain form
4717 87153344 83787653 80578543 77151514 74255722 71088849 68569169 65563154 63232772
4709 63232772 60697898 59100028 56962833 54714029 53439190 51461098 50105028 48719177
4701 48719177 47194834 45694519 44312267 43397592 41823606 40738585 39566225 38770018
4693 38770018 37647490 36553639 35566614 34202309 33435366 32986374 31569081 31304587 29720769
4684 29720769 28828531 28000085 27297800 26266011 25576388 24953574 24089582 23329194 23035218
4675 23035218 22493912 21538758 21367878 20622237 20176872 19824480 19109580 19020520 18779576 17929021
4665 17929021 18102421 16974402 17010509 16718105 16338299 16208545 15610663 15307588 14856403
4656 14856403 14433791 14112340 14123788 13587092 13129574 13226784 12956883 12467918 12374009 11951060
$$ packed form
4717H7153344l365691l209110l427029k895792l166873k519680l006015k330382
4709F3232772k534874j597870k137195k248804j274839j978092j356070j385851
4701D8719177j524343j500315j382252r14675j573986j085021j172360p96207
4693C8770018j122528j093851r87025j364305p66943m48992j417293k64494j583818
4684B9720769q92238q28446p02285j031789o89623o22814q63992p60388k93976
4675B3035218n41306r55154j70880p45641m45365l52392p14900q9060k40944q50555
4665A7929021J73400j128019L6107k92404l79806j29754n97882l03075m51185
4656A4856403m22612l21451J1448n36696m57518R7210k69901m88965r3909m22949
$$ plain form
4646 11951060 11965268 12185655 11584635 11289147 11341280 10851046 10685356 10595697 10347958 10516596
4636 10516596 9781924 9767927 9717805 10070758 9153264 9904956 9756831 9292431 9216190 9162053
4626 9162053 8980535 8840353 8677366 8402342 8467311 8293982 8532972 8305265 8790477 8242792
4616 8242792 8800947 8349750 8322987 8535705 8259113 8226530 7767634 8405023 7778398 8028518
4606 8028518 7438556 7470451 7316961 7506911 7724182 7379975 7029870 7245666 7387729 6938025
4596 6938025 7144953 7496920 6774358 6763323 7064639 7060224 7116069 6902213 7425843 7500926
4586 7500926 6921903 7493115 7678609 7493533 7410605 7881157 7244600 7812767 7948120 8218002
4576 8218002 8092129 8560773 8183176 8784085 8820931 8982979 9258612 9936083 10519995 10669576
$$ packed form
4646A1951060J4208K20387o01020k95488N2133m90234j65690q9659k47739J68638
4636A0516596p34672j3997n0122L52953r17494P51692j48125m64400p6241n4137
4626I162053j81518j40182j62987k75024O4969j73329K38990k27707M85212n47685
4616H242792N58155m51197k6763K12718k76592l2583m58896O37389o26625K50120
4606H028518n89962L1895j53490J89950K17271l44207l50105K15796J42063m49704
4596F938025K06928L51967p22562j1035L01316m415N5845k13856N23630P5083
4586G500926n79023N71212J85494j85076q2928M70552o36557N68167J35353K69882
4576H218002j25873M68644l77597O00909L6846J62048K75633O77471N83912J49581
$$ plain form
4566 10669576 11015474 11952532 12782557 14095198 15215146 16347607 17604211 18789586 20292010
4557 20292010 21604563 23147932 24266249 24632287 25759577 25238439 25283346 24318702 23874080
4548 23874080 22032831 21029069 20145909 19185573 17934363 17751727 17119192 16095428 16288792
4539 16288792 15796792 15499060 15804669 16287331 16587054 17290928 18001253 19031082 20427105
4530 20427105 21601402 22454783 23852064 24531433 25409670 25222378 25502142 24405145 24282522
4521 24282522 23086277 21761547 20496156 19585748 18805321 17281652 16472639 15310838 14612565
4512 14612565 14325998 13242292 12818440 12564774 12114940 11576009 11032931 10501132 10703272
4503 10703272 10357385 9641439 9152415 8873808 8621154 8572720 8483833 8368393 8119554 8179125
$$ packed form
4566A0669576L45898R37058Q30025J312641J119948J132461J256604J185375J502424
4557B0292010J312553J543369J118317L66038J127290n21138M4907r64644m44622
4548B3874080j841249j003762q83160r60336j251210j82636o32535j023764J93364
4539A6288792m92000k97732L05609M82662K99723P03874P10325J029829J396023
4530B0427105J174297Q53381J397281O79369Q78237j87292K79764j096997j22623
4521B4282522j196245j324730j265391r10408p80427j523669q09013j161801o98273
4512A4612565k86567j083706m23852k53666m49834n38931n43078n31799K02140
4503A0703272l45887p15946m89024k78607k52654m8434q8887j15440k48839N9571
$$ plain form
4493 8179125 7385115 7591855 7590797 7171811 7656888 7510715 8120957 7494018 7837817 7579766
4483 7579766 7661441 7798390 7409912 7327134 7533332 6956237 6506236 6643347 6276977 6613646
4473 6613646 5758797 5945351 5572035 5409601 4972701 5509261 5386497 5513466 4372493
4464 4372493 4447023 4708758 4586766 4161917 4500976 4414867 4687595 3906377 4381481 3957399
4454 3957399 3920574 4081838 3813514 3994922 3955982 4055030 3969498 3975282 3607794 3290139 3787179
4443 3787179 3386761 3202389 3048482 3758110 3613977 3730692 3335195 3635020 3088731 2793539
4433 2793539 2946063 3282898 3491717 3374305 2909230 3306696 3126533 3243851 3285746 3108315
4423 3108315 3470713 2988532 2443028 3267091 2927983 3004952 2752400 2998675 3188356 2853433
$$ packed form
4493H179125p94010K06740j058m18986M85077j46173O10242o26939L43799k58051
4483G579766Q1675J36949l88478q2778K06198n77095m50001J37111l66370L36669
4473F613646q54849J86554l73316j62434m36900N36560j22764J26969j140973
4464D372493P4530K61735j21992m24849L39059q6109K72728p81218M75104m24082
4454C957399l6825J61264k68324J81408l8940R9048q5532N784l67488l17655M97040
4443C787179m00418j84372j53907P09628j44133J16715l95497K99825n46289k95192
4433B793539J52524L36835K08819j17412m65075L97466j80163J17318M1895j77431
4423C108315L62398m82181n45504Q24063l39108P6969k52552K46275J89681l34923
$$ plain form
4413 2853433 2868285 3154577 3029273 3468263 2879652 3043616 3040319 3151481 3157580 3228993 3248587
4402 3248587 3390926 3099712 3388953 3230578 2751156 3426995 3541865 3721360 3354893 3388082
4392 3388082 3226453 3204633 3290205 3365932 3274752 3363715 3505781 3555554 3134224 2826576 3329620
4381 3329620 3569471 3655927 3295841 3397856 3735859 3297120 3061722 3787963 3573953 3746780
4371 3746780 3942582 3311335 4062879 3789051 3867513 3658533 3807779 3824842 4001409 3911726
4361 3911726 4380522 3937910 4413627 4232584 4030173 3906254 4548622 4733468 4592158 4492250
4351 4492250 4406365 4994673 4910357 4257095 4583936 4398500 4648407 4900042 4759633 4594432
4341 4594432 4729093 4267253 5031474 4927875 4735661 5184213 4975855 4713815 5481368 5297872
$$ packed form
4413B853433J4852K86292j25304M38990n88611J63964l297J11162O099P1413J9594
4402C248587J42339k91214K89241j58375m79422O75839J14870J79495l66467L3189
4392C388082j61629k1820Q5572P5727r1180Q8963J42066M9773m21330l07648N03044
4381C329620K39851Q6456l60086J02015L38003m38739k35398P26241k14010J72827
4371C746780J95802o31247P51544k73828P8462k08980J49246J7063J76567q9683
4361C911726M68796m42612M75717j81043k02411j23919O42368J84846j41310r9908
4351D492250q5885N88308q4316o53262L26841j85436K49907K51635j40409j65201
4341D594432J34661m61840P64221j03599j92214M48552k08358k62040P67553j83496
$$ plain form
4331 5297872 5725529 5922133 5969358 5471402 5828300 5628194 5980879 6079226 6150343 6342207
4321 6342207 6710027 6270173 6726443 6405983 6527810 6386889 6709309 7171589 7059318 7315223
4311 7315223 7705127 8056843 7739685 8305990 8565275 8414555 9363283 9727950 9790798 10206552
4301 10206552 10871859 10956724 11583360 11746607 12269966 12130479 12881494 12651603 12010510 11881353
4291 11881353 11637593 11058467 10677833 9662104 9454603 8700496 8155502 7445210 6775369
4282 6775369 6469473 6751339 5899309 5238285 5428222 5589466 4874404 5382747 4784250 4946650
4272 4946650 4595057 4665932 4180601 3959274 3986318 3948789 3833433 4076317 4067307 3945989
4262 3945989 3393204 3827600 3387574 3776386 4110578 3563199 3110426 3422666 3654866 3297309
$$ packed form
4331E297872M27657J96604M7225m97956L56898k00106L52685R8347P1117J91864
4321F342207L67820m39854M56270l20460J21827j40921L22420M62280j12271K55905
4311G315223L89904L51716l17158N66305K59285j50720R48728L64667O2848M15754
4301A0206552O65307Q4865O26636J63247N23359j39487P51015k29891o41093j29157
4291A1881353k43760n79126l80634j015729k07501p54107n44994p10292o69841
4282F775369l05896K81866q52030o61024J89937J61244p15062N08343n98497J62400
4272D946650l51593P0875m85331k21327K7044l7529j15356K42884r010j21318
4262C945989n52785M34396m40026L88812L34192n47379m52773L12240K32200l57557
$$ plain form
4252 3297309 3465951 3130165 2944766 3213318 3850931 3007538 3149210 3518760 3325160 3278230
4242 3278230 3069946 3025836 3236964 3794946 3221414 3670817 3512229 3392700 3124578 3752499
4232 3752499 3249031 3744814 2895151 3152987 3359772 2690142 3042828 3115085 2863594 2948855
4222 2948855 2540517 2554865 2842519 2744223 2584362 3235149 2637760 2727496 3244955 2970360
4212 2970360 3289188 3455496 3536292 3822975 3699122 3644152 3834628 3342972 3425492 3461637
4202 3461637 3890615 3086039 3005293 3141932 3285883 2514267 2984406 2596834 2749996 2499097
4192 2499097 2662340 2260329 2489977 2035491 2151781 2247075 1872493 2109388 2405729 2286371
4182 2286371 2807982 2351698 2662198 2908969 2835089 2353999 2447681 2508726 2520554 2593987
$$ packed form
4252C297309J68642l35786j85399K68552O37613q43393J41672L69550j93600m6930
4242C278230k08284m4110K11128N57982n73532M49403j58588j19529k68122O27921
4232C752499n03468M95783q49663K57836K06785o69630L52686P2257k51491Q5261
4222B948855m08338J4348K87654r8296j59861O50787n97389Q9736N17459k74595
4212B970360L18828J66308Q0796K86683j23853n4970J90476m91656Q2520L6145
4202C461637M28978q04576q0746J36639J43951p71616M70139l87572J53162k50899
4192B499097J63243m02011K29648m54486J16290R5294l74582K36895K96341j19358
4182B286371N21611m56284L10500K46771p3880m81090R3682O1045J1828P3433
$$ plain form
4172 2593987 2316771 2952420 2185940 1638332 2316654 1989994 1664698 1895631 1992532 1900288
4162 1900288 2179330 1594215 1271390 2090241 1844510 1924857 2066684 1735346 1970183 1505455
4152 1505455 1601991 1389179 1870489 1679673 1804505 1747541 1621235 1432357 1401172 1566685
4142 1566685 1784096 1373402 1352962 1494307 1875282 1557823 1306299 1967624 1629251 1678279
4132 1678279 1588982 1375018 1723022 2247003 1041728 1226444 1803645 1506974 1474417 1769815
4122 1769815 1525911 1720003 1405517 1177294 1526158 1315193 1477577 1441002 1754941 1235306
4112 1235306 1816644 976983 1357747 1244702 1619882 1560658 1565670 1201646 1386189 1652557
4102 1652557 1554509 1251556 1120281 1418554 1463271 1221010 1041326 1271609 1235269 1256221
$$ packed form
4172B593987k77216O35649p66480n47608O78322l26660l25296K30933R6901r2244
4162A900288K79042n85115l22825Q18851k45731Q0347J41827l31338K34837m64728
4152A505455R6536k12812M81310j90816J24832n6964j26306j88878l1185J65513
4142A566685K17411m10694k0440J41345L80975l17459k51524O61325l38373M9028
4132A678279q9297k13964L48004N23981j205275J84716N77201k96671l2557K95398
4122A769815k43904J94092l14486k28223L48864k10965J62384l6575L13939n19635
4112A235306N81338q39661L80764j13045L75180n9224N012l64024J84543K66368
4102A652557r8048l02953j31275K98273M4717k42261j79684K30283l6340K0952
$$ plain form
4092 1256221 1425925 1438506 970755 1194861 1396549 1557733 1412433 1609834 1285118 1484177
4082 1484177 1074170 1564332 1993270 1387803 1085701 1612156 1045068 1200009 1220672 985450
4072 985450 1446201 1389371 1227691 1667957 1279825 1300876 1481852 1716314 1504760 1713892
4062 1713892 1259325 1316905 1750278 1446462 1340179 1463012 1468496 1099489 1235593 1679078
4052 1679078 1579008 1902935 1205977 1359499 1636468 1543155 1595463 1828660 1962908 1865535
4042 1865535 1810522 2028192 1879664 2028528 1953397 1824571 1683045 1921799 1799745 1993501
4032 1993501 1941998 1977895 1823033 2111309 2269650 2396946 2017992 2419153 2210999 1570578
4022 1570578 2361413 2357307 2038104 2274040 2202129 2105994 2430450 2058437 1819411 2181549
$$ packed form
4092A256221J69704J2581m67751K24106K01688J61184j45300J97401l24716J99059
4082A484177m10007M90162M28938o05467l02102N26455n67088J54941K0663k35222
4072I85450M60751n6830j61680M40266l88132K1051J80976K34462k11554K09132
4062A713892m54567N7580M33373l03816j06283J22833N484l69007J36104M43485
4052A679078j00070L23927o96958J53522K76969r3313N2308K33197J34248r7373
4042A865535n5013K17670j48528J48864p5131j28826j41526K38754j22054J93756
4032A993501n1503L5897j54862K88276J58341J27296l78954M01161k08154o40421
4022A570578P90835m106l19203K35936p1911r6135L24456l72013k39026L62138
$$ plain form
4012 2181549 2388902 3075694 2690049 2559840 2622032 2877170 2946597 2663208 2447167 2615389
4002 2615389 2231328 2818110 2471908 2242015 1802597 2148111 2048647 2401557 1989601 2193580
3992 2193580 2396854 2323810 1880748 1900964 2119813 2381193 2237523 2241071 2529818 1989186
3982 1989186 2091608 2256301 2481002 2318522 2496892 2179597 2027636 2305233 2183366 2019198
3972 2019198 1742485 1950054 1797297 2203098 1418569 1935969 1650603 1623473 1678223 1570600
3962 1570600 1476514 1843435 1839114 1689129 1567723 1779057 1652022 1878606 1767288 1312932
3952 1312932 1099173 805157 1417588 1389095 1745898 1249768 1311478 1102983 1185751 1359961
3942 1359961 1117130 1332735 1388337 1138950 944923 1035118 835042 867751 988344 937311
$$ packed form
4012B181549K07353O86792l85645j30209O2192K55138O9427k83389k16041J68222
4002B615389l84061N86782l46202k29893m39418L45514r9464L52910m11956K03979
3992B193580K03274p3044m43062K0216K18849K61380j43670L548K88747n40632
3982A989186J02422J64693K24701j62480J78370l17295j51961K77597j21867j64168
3972B019198k76713K07569j52757M05801p84529N17400k85366k7130N4750j07623
3962A570600r4086L66921m321j49985j21406K11334j27035K26584j11318m54356
3952A312932k13759k94016O12431k8493L56803m96130O1710k08495Q2768J74210
3942A359961k42831K15605N5602k49387j94027R0195k00076L2709J20593n1033
$$ plain form
3932 937311 882912 1463503 1409661 955299 1063700 743294 531691 769602 861462 897113
3922 897113 644806 929628 1129154 967390 1191888 778905 737615 774103 966562 638058
3912 638058 956044 687716 561487 959820 689678 263185 690052 1064771 988349 656364
3902 656364 715811 740785 759629 822427 505316 748265 650121 593035 679774 389353 692156
3891 692156 535496 381178 566291 810658 614077 193275 733307 553547 189627 436767
3881 436767 768476 214516 368588 606879 315274 1142295 651747 699461 342393 701002
3871 701002 593747 728715 390765 6161 601807 521518 631119 432660 323256 258618
3861 258618 446300 193365 914675 552082 281160 273770 386195 623556 235433 47104
$$ packed form
3932I37311n4399N80591n3842m54362J08401l20406k11603K37911R1860L5651
3922H97113k52307K84822J99526j61764K24498m12983m1290L6488J92459l28504
3912F38058L17986k68328j26229L98333k70142m26493M26867L74719p6422l31985
3902F56364N9447K4974J8844O2798l17111K42949r8144n7086Q6739k90421L02803
3891F92156j56660j54318J85113K44367j96581m20802N40032j79760l63920K47140
3881D36767L31709n53960J54072K38291k91605Q27021m90548M7714l57068L58609
3871G01002j07255J34968l37950l84604N95646q0289J09601j98459j09404o4638
3861B58618J87682k52935P21310l62593k70922p390J12425K37361l88123j88329
$$ plain form
3851 47104 239049 310414 65667 442538 229786 300430 1172035 523176 384547 116105
3841 116105 759628 685394 1184514 337375 69643 147684 679013 240844 553194 260856
3831 260856 476300 616824 228903 499834 277030 308838 555875 437121 62746 357611
3821 357611 759411 -58236 313841 843192 298771 342809 761515 323532 341632 533148
3811 533148 398409 120868 481150 620972 456151 439152 591409 482501 493830 110615
3801 110615 -59728 435132 869220 399928 69835 206274 891991 216750 670695 394490
3791 394490 147515 967508 441668 470973 440933 172997 508912 435294 13798 530642
3781 530642 702093 367935 561346 676736 389890 684052 138656 270406 674419 725951
$$ packed form
3851D7104J91945P1365k44747L76871k12752P0644Q71605o48859j38629k68442
3841A16105O43523p4234M99120q47139k67732P8041N31329m38169L12350k92338
3831B60856K15444J40524l87921K70931k22804L1808K47037j18754l74375K94865
3821C57611M01800q17647L72077N29351n44421M4038M18706m37983J8100J91516
3811E33148j34739k77541L60282J39822j64821j6999J52257j08908J1329l83215
3801A10615j70343M94860M34088m69292l30093J36439O85717o75241M53945k76205
3791C94490k46975Q19993n25840K9305l0040k67936L35915p3618m21496N16844
3781E30642J71451l34158J93411J15390k86846K94162n45396J31750M04013N1532
$$ plain form
3771 725951 -47740 872332 729947 330018 282496 796863 322529 476101 381189 763270
3761 763270 515594 410372 279061 678895 479890 250616 249 228457 29182 803350
3751 803350 74426 126731 955619 238455 -169284 722061 528991 549235 230821 504896
3741 504896 401496 437597 216822 813458 477891 134256 756114 412285 501719 309717
3731 309717 411822 426547 530179 117225 385444 238202 43457 441218 650358 242182
3721 242182 428090 342288 519549 220795 218039 90733 370168 42394 413294 298178
3711 298178 253639 624012 721204 400073 626313 221990 422021 201803 492806 467953
3701 467953 103635 492805 731743 -27945 4912 193773 -209627 349097 241109 179802
$$ packed form
3771G25951p73691R20072j42385l99929m7522N14367m74334J53572r4912L82081
3761G63270k47676j05222j31311L99834j99005k29274k50367K28208j99275P74168
3751H03350p28924N2305Q28888p17164m07739Q91345j93070K0244l18414K74075
3741E04896j03400L6101k20775N96636l35567l43635O21858l43829Q9434j92002
3731C09717J02105J4725J03632m12954K68219j47242j94745L97761K09140m08176
3721B42182J85908q5802J77261k98754k756j27306K79435l27774L70900j15116
3711B98178m4539L70373R7192l21131K26240m04323K00031k20218K91003k4853
3701D67953l64318L89170K38938p59688L2857J88861m03400N58724j07988o1307
$$ plain form
3691 179802 304792 258885 356525 975103 320380 340910 376669 282880 705247 188121 335208
3680 335208 470984 725115 272534 755688 327421 264135 522063 468976 528456 733143
3670 733143 -84410 -39914 181052 634609 76631 229579 369627 366965 373135 274806 127287
3659 127287 114062 197431 473123 124838 697361 -185091 552298 -41015 229684 70365
3649 70365 378798 666506 536397 -64026 201765 125414 146069 500051 279599 30560
3639 30560 97988 236567 595800 21255 -140963 781767 74143 -46639 226191 245628
3629 245628 101593 141019 434602 -29572 225271 122977 -96210 187577 102449 122122
3619 122122 97532 -95741 146179 119913 157093 4330 349342 32436 533589 300528
$$ packed form
3691A79802J24990m5907R7640O18578o54723K0530L5759r3789M22367n17126J47087
3680C35208J35776K54131m52581M83154m28267o3286K57928n3087N9480K04687
3670G33143q17553M4496K20966M53557n57978J52948J40048k662O170r8329j47519
3659A27287j3225Q3369K75692l48285N72523q82452P37389n93313K70699j59319
3649G0365L08433K87708j30109o00423K65791p6351K0655L53982k20452k49039
3639C0560O7428J38579L59233n74545j62218R22730p07624j20782K72830J9437
3629B45628j44035L9426K93583m64174K54843j02294k19187K83787q5128J9673
3619A22122k4590j93273K41920k6266L7180j52763L45012l16906N01153k33061
$$ plain form
3609 300528 -29789 237648 410754 66307 -182477 408906 443222 304365 205322 323073
$$ packed form
3609C00528l30317K67437J73106l44447k48784N91383L4316j38857r9043J17751
$$ [...]
##END NTUPLES=NMR SPECTRUM
##END=
