##TITLE=abcd
##JCAMPDX= 6.0         $$ Bruker NMR JCAMP-DX V2.0
##DATA TYPE= NMR SPECTRUM
##DATA CLASS= NTUPLES
##ORIGIN= UXNMR, Bruker Analytische Messtechnik GmbH
##OWNER= root
$$ XWIN-NMR		Version 3.5
$$ Fri Jul 24 17:26:44 2026 Russian Standard Time (UT+4h)  servis@DPX200
##.OBSERVE FREQUENCY= 200.131235884673
##.OBSERVE NUCLEUS= ^1H
##.ACQUISITION MODE= SIMULTANEOUS
##.ACQUISITION SCHEME= undefined
##.AVERAGES= 32
##.DIGITISER RES= 18
##SPECTROMETER/DATA SYSTEM= spect
##.PULSE SEQUENCE= zg
##.SOLVENT NAME= MeOD
##.SHIFT REFERENCE= (INTERNAL, MeOD, 0, 16.4885)
##AUDIT TRAIL= $$ (NUMBER, WHEN, WHO, WHERE, WHAT)
$$ ##TITLE= Audit trail, XWIN-NMR		Version 3.5
$$ ##JCAMPDX= 5.01
$$ ##ORIGIN= Bruker BioSpin GmbH
$$ ##OWNER= servis
$$ F:\spectra/data/av/nmr/H1/1/pdata/1/auditp.txt
$$ ##AUDIT TRAIL=  $$ (NUMBER, WHEN, WHO, WHERE, WHAT)
(   1,<2026-07-24 17:25:42.57 +0400>,<servis>,<DPX200>,
      <created by zg, POWCHK disabled, PULCHK disabled
       configuration hash MD5:
       00 E9 B6 7A A2 85 ED C7 34 08 36 98 17 FE 4E 26
       data hash MD5: 32K
       44 65 12 C9 A2 09 17 D4 F5 15 B7 7B 56 44 A4 A6>)
(   2,<2026-07-24 17:25:56.04 +0400>,<servis>,<DPX200>,
      <Start of raw data processing
       efp BC_mod = 2 LB = 0.05 FT_mod = 6 PKNL = 1 PHC0 = -532.0226 PHC1 = 3.101563 SI = 16K 
       data hash MD5: 16K
       8E 9E 39 D0 10 2F 28 A5 F1 2F 0B 21 94 ED 05 B6>)
(   3,<2026-07-24 17:26:18.17 +0400>,<servis>,<DPX200>,
      <pk PHC0 = 115.0905 PHC1 = 0 
       data hash MD5: 16K
       7A BF 29 3B D6 E0 B6 7F C5 40 50 3C 89 DD AD 86>)
$$ ##END=
$$ 
$$ hash MD5
$$ 59 37 14 16 1E 32 08 92 8E 6B 2E E8 B0 1F 06 8A
##$RELAX= 
##$RELAX= 
##$RELAX= 
##$RELAX= 
##$RELAX= 
##$RELAX= 
##$RELAX= 
##$RELAX= 
$$ Bruker specific parameters
$$ --------------------------
##$DU= <F:\spectra>
##$EXPNO= 1
##$NAME= <H1>
##$PROCNO= 1
##$TYPE= <nmr>
##$USER= <av>
##$AMP= (0..31)
100 100 100 100 100 100 100 100 100 100 100 100 100 100 100 100 100 100 
100 100 100 100 100 100 100 100 100 100 100 100 100 100 
##$AQSEQ= 0
##$AQ_mod= 1
##$AUNM= <au_zg>
##$AUTOPOS= <>
##$BF1= 200.13
##$BF2= 200.13
##$BF3= 200.13
##$BF4= 200.13
##$BF5= 500.13
##$BF6= 500.13
##$BF7= 500.13
##$BF8= 500.13
##$BYTORDA= 1
##$CFDGTYP= 0
##$CFRGTYP= 5
##$CHEMSTR= <none>
##$CNST= (0..31)
1 1 145 1 1 1 1 1 1 1 1 1 1 1 1 1 1 1 1 1 1 1 1 1 1 1 1 1 1 1 1 1 
##$CPDPRG= <>
##$CPDPRG1= <>
##$CPDPRG2= <>
##$CPDPRG3= <>
##$CPDPRG4= <mlev>
##$CPDPRG5= <mlev>
##$CPDPRG6= <mlev>
##$CPDPRG7= <mlev>
##$CPDPRG8= <mlev>
##$CPDPRGB= <>
##$CPDPRGT= <>
##$D= (0..31)
0 2 0 0 0 0 0 0 0 0.06 0 0 0 0 0 0 0.0002 0 0 0 0 0 0 0 0 0 0 0 0 0 0 
0 
##$DATE= 1784899542
##$DBL= (0..7)
120 120 120 120 120 120 120 120 
##$DBP= (0..7)
150 150 150 150 150 150 150 150 
##$DBP07= 0
##$DBPNAM0= <>
##$DBPNAM1= <>
##$DBPNAM2= <>
##$DBPNAM3= <>
##$DBPNAM4= <>
##$DBPNAM5= <>
##$DBPNAM6= <>
##$DBPNAM7= <>
##$DBPOAL= (0..7)
0.5 0.5 0.5 0.5 0.5 0.5 0.5 0.5 
##$DBPOFFS= (0..7)
0 0 0 0 0 0 0 0 
##$DE= 6
##$DECBNUC= <off>
##$DECIM= 32
$$ [...]
##$SUBNAM4= <"">
##$SUBNAM5= <"">
##$SUBNAM6= <"">
##$SUBNAM7= <"">
##$SUBNAM8= <"">
##$SUBNAM9= <"">
##$SW= 20.6817932712277
##$SWIBOX= (0..15)
0 0 3 0 0 0 0 0 0 0 0 0 0 0 0 0 
##$SW_h= 4139.07284768212
##$TD= 32768
##$TD0= 1
##$TE= 0
##$TE2= 300
##$TE3= 300
##$TEG= 300
##$TL= (0..7)
0 120 120 120 120 120 120 120 
##$TP= (0..7)
150 150 150 150 150 150 150 150 
##$TP07= 0
##$TPNAME0= <>
##$TPNAME1= <>
##$TPNAME2= <>
##$TPNAME3= <>
##$TPNAME4= <>
##$TPNAME5= <>
##$TPNAME6= <>
##$TPNAME7= <>
##$TPOAL= (0..7)
0.5 0.5 0.5 0.5 0.5 0.5 0.5 0.5 
##$TPOFFS= (0..7)
0 0 0 0 0 0 0 0 
##$TUNHIN= 0
##$TUNHOUT= 0
##$TUNXOUT= 0
##$USERA1= <user>
##$USERA2= <user>
##$USERA3= <user>
##$USERA4= <user>
##$USERA5= <user>
##$V9= 5
##$VALIST= <valist>
##$VCLIST= <CCCCCCCCCCCCCCC>
##$VD= 0
##$VDLIST= <DDDDDDDDDDDDDDD>
##$VPLIST= <PPPPPPPPPPPPPPP>
##$VTLIST= <TTTTTTTTTTTTTTT>
##$WBST= 1024
##$WBSW= 30
##$XGAIN= (0..3)
0 0 0 0 
##$XL= 0
##$YL= 0
##$YMAX_a= 1198380
##$YMIN_a= -1507133
##$ZGOPTNS= <>
##$ZL1= 120
##$ZL2= 120
##$ZL3= 120
##$ZL4= 120
##$ABSF1= 0
##$ABSF2= 0
##$ABSG= 0
##$ABSL= 0
##$ALPHA= 0
##$AQORDER= 0
##$ASSFAC= 0
##$ASSFACI= 0
##$ASSFACX= 0
##$ASSWID= 0
##$AUNMP= <proc_1d>
##$AZFE= 0.1
##$AZFW= 0.1
##$BCFW= 0
##$BC_mod= 2
##$BYTORDP= 0
##$COROFFS= 0
##$CY= 18.4799938201904
##$DATMOD= 1
##$DC= 0
##$DFILT= <>
##$DTYPP= 0
##$F1P= 9.9274215381318
##$F2P= -0.165520771350173
##$FCOR= 1
##$FTSIZE= 16384
##$FT_mod= 6
##$GAMMA= 0
##$GB= 0
##$INTBC= 1
##$INTSCL= 4.127829e-11
##$ISEN= 128
##$LB= 0.05
##$LEV0= 0
##$LPBIN= 0
##$MAXI= 10000
##$MC2= 0
##$MEAN= 0
##$ME_mod= 0
##$MI= 50
##$NCOEF= 0
##$NC_proc= -2
##$NLEV= 6
##$NOISF1= 3.799351
##$NOISF2= 2.8
##$NSP= 0
##$NTH_PI= 0
##$NZP= 0
##$OFFSET= 16.48848
##$PC= 4
##$PHC0= -416.9321
##$PHC1= 3.101563
##$PH_mod= 1
##$PKNL= yes
##$PPARMOD= 0
##$PSCAL= 4
##$PSIGN= 0
##$REVERSE= no
##$SF= 200.130005582386
##$SI= 16384
##$SIGF1= 3
##$SIGF2= 2
##$SINO= 400
##$SIOLD= 16384
##$SREGLST= <1H.CDCl3>
##$SSB= 0
##$STSI= 16384
##$STSR= 0
##$SW_p= 4139.07284768211
##$SYMM= 0
##$S_DEV= 0
##$TDeff= 32768
##$TDoff= 0
##$TI= <>
##$TILT= no
##$TM1= 0
##$TM2= 0
##$TOPLEV= 0
##$USERP1= <user>
##$USERP2= <user>
##$USERP3= <user>
##$USERP4= <user>
##$USERP5= <user>
##$WDW= 1
##$XDIM= 16384
##$YMAX_p= 380527080
##$YMIN_p= -111481
$$ End of Bruker specific parameters
$$ ---------------------------------
##NTUPLES= NMR SPECTRUM
##VAR_NAME=  FREQUENCY,     SPECTRUM/REAL,   SPECTRUM/IMAG
##SYMBOL=    X,             R,               I
##VAR_TYPE=  INDEPENDENT,   DEPENDENT,       DEPENDENT
##VAR_FORM=  AFFN,          ASDF,            ASDF
##VAR_DIM=   16384,         16384,           16384
##UNITS=     HZ,            ARBITRARY UNITS, ARBITRARY UNITS
##FACTOR=    0.252644378177508, 1,           1
##FIRST=     3299.83951724647, 0,            0
##LAST=      -839.233330435636, 0,           0
##MIN=       -839.233330435636, -111481,     0
##MAX=       3299.83951724647, 380527080,    0
$$ Real data points
##PAGE= N=1
##DATA TABLE= (X++(R..R)), XYDATA
$$ [...]
$$ plain form
10888 -74239 -42628 -65775 -53870 -70936 -58413 -59294 -62381 -75993 -58305 -60906 -60990 -62352 -49873
10875 -49873 -63274 -68199 -61055 -63470 -59361 -43667 -63835 -67012 -56240 -71577 -56716 -66280 -61053
10862 -61053 -71030 -71691 -50884 -65195 -73401 -66643 -60907 -42132 -58282 -58805 -52705 -64324 -60442 -55553
10848 -55553 -64730 -82823 -65561 -53814 -49604 -49495 -82675 -52534 -51773 -64899 -62107 -65443 -53869
10835 -53869 -42736 -56156 -61639 -69015 -65294 -73331 -51784 -54353 -55699 -59181 -47630 -74943 -72604
10822 -72604 -63041 -72899 -45724 -59787 -70126 -67742 -59956 -56508 -72707 -45436 -60938 -56206 -62132
10809 -62132 -66911 -65310 -60645 -44984 -44543 -64589 -58268 -40340 -61375 -63221 -50321 -44369 -49330
10796 -49330 -56807 -61491 -57026 -60134 -63422 -58234 -66023 -53150 -53674 -61189 -51061 -52857 -68597 -50772
$$ packed form
10888g4239L1611k3147J1905j7066J2523q81l087j3612J7688k601q4j362J2479
10875d9873j3401m925P144k415M109J5694k0168l177J0772j5337J4861r564N227
10862f1053r977o61K0807j4311q206O758N736J8775j6150n23O100j1619L882M889
10848e5553r177j8093J7262J1747M210J09l3180L0141P61j3126K792l336J1574
10835e3869J1133j3420n483p376L721q037K1547k569j346l482J1551k7313K339
10822g2604R563r858K7175j4063j0339K384P786L448j6199K7271j5502M732n926
10809f2132m779J601M665J5661M41k0046O321J7928k1035j846J2900N952m961
10796d9330p477m684M465l108l288N188p789J2873n24p515J0128j796j5740J7825
$$ plain form
10782 -50772 -54891 -59370 -58404 -59933 -52904 -60125 -53904 -59137 -46918 -47701 -54084 -72775 -68138 -58037
10768 -58037 -45944 -59326 -49823 -64607 -68603 -61662 -50239 -63757 -45623 -55275 -62215 -69258 -57685
10755 -57685 -55013 -55298 -46831 -53602 -62353 -64904 -74287 -54662 -63125 -73033 -65613 -57185 -64517 -63132
10741 -63132 -78026 -67265 -57563 -57127 -72913 -72448 -48953 -63433 -64188 -72534 -66926 -55248 -55381 -67444
10727 -67444 -78970 -69074 -54882 -66767 -66231 -63246 -82192 -62633 -84806 -64598 -70350 -65468 -59096
10714 -59096 -66258 -69884 -55665 -77818 -63481 -51185 -51748 -63530 -62205 -46481 -49361 -65562 -62902
10701 -62902 -72751 -52403 -51511 -63062 -41929 -65255 -84452 -63849 -56927 -56292 -63608 -61729 -63333
10688 -63333 -54050 -45015 -68369 -56198 -43698 -36021 -59180 -54332 -56395 -50647 -30758 -60093 -59336
$$ packed form
10782e0772m119m479R66j529P029p221O221n233J2219p83o383j8691M637J0101
10768e8037J2093j3382R503j4784l996O941J1423j3518J8134r652o940p043J1573
10755e7685K672k85Q467o771q751k551r383J9625q463r908P420Q428p332J385
10741f3132j4894J0761R702M36j5786M65K3495j4480p55q346N608J1678j33j2063
10727f7444j1526R896J4192j1885N36K985j8946J9559k2173K0208n752M882O372
10714e9096p162l626J4219k2153J4337J2296n63j1782J325J5724k880j6201K660
10701f2902r849K0348Q92j1551K1133k3326j9197K0603O922O35p316J879j604
10688f3333R283R035k3354J2171J2500P677k3159M848k063N748J9889k9335P57
$$ plain form
10675 -59336 -59590 -49880 -58987 -60619 -75979 -49334 -48855 -60522 -58811 -52393 -52455 -49978 -41838 -59743
10661 -59743 -84756 -67028 -57287 -58332 -59900 -63237 -61674 -53201 -63538 -66573 -73536 -50858 -60035
10648 -60035 -80653 -58285 -72011 -55586 -55630 -52404 -55832 -52752 -59635 -59163 -55986 -52889 -64563 -41957
10634 -41957 -63169 -51803 -63618 -61774 -53860 -65955 -41553 -51188 -53760 -47406 -49007 -56561 -55975
10621 -55975 -68968 -63833 -59212 -52591 -67065 -59836 -63967 -54847 -65546 -45613 -70113 -68670 -69830
10608 -69830 -61880 -65851 -72737 -67697 -68768 -59656 -82130 -61349 -63297 -57677 -63973 -67919 -60347 -47447
10594 -47447 -57298 -68990 -70168 -54974 -54438 -54316 -65011 -57870 -55145 -54682 -60483 -52732 -50791 -52116
10580 -52116 -47317 -54521 -47744 -54614 -53989 -70612 -56116 -56848 -58619 -72522 -52530 -45190 -56777 -44574
$$ packed form
10675e9336k54R710r107j632j5360K6645M79j1667J711O418o2K477Q140j7905
10661e9743k5013J7728R741j045j568l337J563Q473j0337l035o963K2678r177
10648f0035k0618K2368j3726J6425m4L226l428L080o883M72L177L097j1674K2606
10634d1957k1212J1366j1815J844P914j2095K4402r635k572O354j601p554N86
10621e5975j2993N135M621O621j4474P229m131R120j0699J9933k4500J443j160
10608f9830P950l971o886N040j071R112k2474K0781j948N620o296l946P572J2900
10594d7447r851j1692j178J5194N36J22j0695P141K725M63n801P751J941j325
10580e2116M799p204O777o870O25j6623J4496p32j771j3903J9992P340j1587J2203
$$ plain form
10566 -44574 -64520 -65050 -54119 -72876 -46923 -61866 -58966 -52446 -72174 -59930 -65564 -35110 -61477
10553 -61477 -58958 -59884 -65536 -49948 -42824 -64163 -68187 -54328 -68590 -58433 -62739 -62056 -52061 -43622
10539 -43622 -51435 -59413 -52872 -57668 -53560 -62972 -76832 -69353 -54237 -44355 -64935 -56745 -54164 -58649
10525 -58649 -65791 -74979 -60165 -65118 -57067 -55305 -63497 -55844 -48673 -59132 -69666 -59365 -57718
10512 -57718 -49604 -56409 -63249 -56061 -66588 -58875 -52059 -49384 -61860 -67248 -49330 -67191 -68815
10499 -68815 -67699 -57980 -63010 -69627 -59203 -69833 -58969 -59565 -67451 -61971 -64368 -77976 -52164
10486 -52164 -56769 -49369 -51746 -58246 -71311 -69315 -55085 -61464 -52924 -69980 -57730 -46086 -61207
10473 -61207 -53395 -42124 -43638 -55306 -55925 -58376 -56151 -54060 -50574 -56257 -57237 -59988 -66134 -46090
$$ packed form
10566d4574j9946n30J0931j8757K5953j4943K900O520j9728J2244n634L0454k6367
10553f1477K519r26n652J5588P124k1339m024J3859j4262J0157m306O83R995Q439
10539d3622p813p978O541m796M108r412j3860P479J5116R882k0580Q190K581m485
10525e8649p142r188J4814m953Q051J762q192P653P171j0459j0534J0301J647
10512e7718Q114o805o840P188j0527P713O816K675j2476n388J7918j7861j624
10499f8815J116R719n030o617J0424j0630J0864n96p886N480k397j3608K5812
10486e2164m605P400k377o500j3065J996J4230o379Q540j7056J2250J1644j5121
10473f1207P812J1271j514j1668o19k451K225K091L486n683r80k751o146K0044
$$ plain form
10459 -46090 -56557 -72018 -58487 -62534 -61863 -80945 -73436 -53190 -63841 -60306 -60850 -42315 -66728
10446 -66728 -45551 -73066 -69991 -58657 -45224 -48346 -58704 -60104 -74201 -43666 -39659 -58939
10434 -58939 -62992 -55893 -63589 -62823 -59646 -56401 -72342 -54724 -73969 -53186 -74862 -55875 -67478
10421 -67478 -33128 -57078 -65620 -53381 -55014 -53344 -51727 -59078 -49531 -47269 -54204 -40740 -54387
10408 -54387 -34035 -63636 -52977 -64618 -58996 -63275 -30262 -58716 -48954 -57526 -47071 -57124
10396 -57124 -53625 -68590 -77553 -63720 -59700 -48041 -64246 -61151 -78902 -54225 -56176 -60379 -63940
10383 -63940 -52140 -50798 -48211 -81613 -48627 -76130 -40453 -70706 -52273 -58317 -40389 -43984
10371 -43984 -45364 -53499 -60371 -48467 -44863 -51451 -67390 -37011 -45735 -52139 -52144 -67076 -51196 -53499
$$ packed form
10459d6090j0467j5461J3531m047O71j9082P509K0246j0651L535n44J8535k4413
10446f6728K1177k7515L075J1334J3433l122j0358j400j4097L0535M007j9280
10434e8939m053P099p696P66L177L245j5941J7618j9245K0783k1676J8987j1603
10421f7478L4350k3950q542J2239j633J670J617p351R547K262o935J3464j3647
10408e4387K0352k9601J0659j1641N622m279L3013k8454R762q572J0455j0053
10396e7124L499j4965q963J3833M020J1659j6205L095j7751K4677j951m203l561
10383f3940J1800J342K587l3402L2986k7503L5677l0253J8433o044J7928l595
10371d3984j380q135o872J1904L604o588j5939L0379q724o404nj4932J5880k303
$$ plain form
10357 -53499 -62228 -68589 -61901 -56160 -61515 -53948 -48049 -59829 -51546 -59945 -58165 -56692 -52400 -62546
10343 -62546 -72932 -61914 -56049 -64470 -43555 -73549 -59486 -55699 -66067 -67899 -51918 -61949
10331 -61949 -58280 -57215 -53146 -58136 -65526 -76200 -75812 -64854 -60943 -54301 -64954 -60567 -76864 -56522
10317 -56522 -68056 -67029 -63828 -51892 -48847 -65655 -47397 -69780 -47747 -52790 -63537 -74156
10305 -74156 -63915 -75314 -57527 -59141 -54189 -45332 -49412 -47256 -56456 -60713 -58690 -43181 -63446
10292 -63446 -43288 -68088 -63808 -54014 -68404 -73304 -53302 -73752 -51725 -65259 -54612 -58866
10280 -58866 -62798 -67873 -58711 -60436 -63074 -79180 -66046 -48286 -39162 -41665 -56644 -52430 -64649
10267 -64649 -48536 -60823 -57650 -55600 -42128 -44734 -64233 -75190 -50120 -59288 -59315 -49318 -56886
$$ packed form
10357e3499q729o361O688N741n355P567N899j1780Q283q399J780J473M292j0146
10343f2546j0386J1018N865q421K0915k9994J4063L787j0368j832J5981j0031
10331f1949L669J065M069m990p390j0674L88J0958L911O642j0653M387j6297K0342
10317e6522j1534J027L201J1936L045j6808J8258k2383K2033n043j0747j0619
10305g4156J0241j1399J7787j614M952Q857m080K156r200m257K023J5509k0265
10292f3446K0158k4800M280R794j4390m900K0002k0450K2027j3534J0647m254
10280e8866l932n075R162j725k638j6106J3134J7760R124k503j4979M214j2219
10267f4649J6113j2287L173K050J3472k606j9499j0957K5070r168k7R997p568
$$ plain form
10254 -56886 -44482 -64403 -54199 -46959 -49630 -49250 -56826 -48046 -51120 -65840 -47658 -50144 -55543
10241 -55543 -47930 -58900 -45365 -47986 -57109 -34110 -47012 -50362 -69780 -56621 -51563 -51319 -43557
10228 -43557 -69936 -69861 -61764 -66487 -65147 -44420 -59145 -57782 -50203 -55003 -77175 -55349 -62117 -71178
10214 -71178 -56072 -61476 -52258 -52105 -59755 -54495 -54584 -58554 -76971 -67823 -58059 -69867 -73839 -59690
10200 -59690 -69970 -61047 -59270 -58193 -69271 -65725 -52036 -56308 -66097 -70054 -71580 -52542 -70703
10187 -70703 -74191 -48657 -57123 -52516 -60448 -66677 -51500 -70140 -53616 -69209 -63802 -65624 -74098
10174 -74098 -45921 -43529 -49428 -56210 -45597 -48793 -65311 -60591 -51502 -63171 -78606 -58705 -54197
10161 -54197 -57067 -49917 -57464 -47230 -50644 -72273 -53293 -51405 -38268 -55958 -52913 -73688 -53902
$$ packed form
10254e6886J2404j9921J0204P240k671L80p576Q780l074j4720J8182k486n399
10241e5543P613j0970J3535k621r123K2999j2902l350j9418J3159N058K44P762
10228d3557k6379P5Q097m723J340K0727j4725J363P579m800k2172K1826o768r061
10214g1178J5106n404R218J53p650N260q9l970j8417R148R764j1808l972J4149
10200e9690j0280Q923J777J077j1078L546J3689m272r789l957j526J9038j8161
10187g0703l488K5534q466M607p932o229J5177j8640J6524j5593N407j822q474
10174g4098K8177K392n899o782J0613l196j6518M720R089j1669j5435J9901M508
10161e4197k870P150p547J0234l414k1629J8980J888J3137j7690L045k0775J9786
$$ plain form
10148 -53902 -62453 -50532 -59263 -64111 -33935 -43045 -47583 -50883 -63981 -51624 -53112 -64361 -57088
10135 -57088 -54369 -37372 -52829 -54944 -51398 -62266 -59248 -60326 -73872 -48190 -55613 -51566 -53279
10122 -53279 -53867 -75246 -32599 -46509 -62623 -67912 -51642 -51089 -59741 -47058 -57084 -49195 -59193
10109 -59193 -47648 -62664 -64530 -44817 -61191 -55589 -56696 -56220 -51330 -59148 -51449 -62278 -50876
10096 -50876 -59506 -62408 -45838 -43233 -61187 -50920 -59127 -56305 -79287 -74478 -61114 -71084 -47619
10083 -47619 -70066 -47049 -58618 -66527 -58823 -67521 -62544 -54009 -43674 -63198 -44553 -61232 -61057
10070 -61057 -50657 -47526 -55892 -64277 -60504 -49581 -52802 -51453 -63065 -57444 -59968 -52168 -58790 -70448
10056 -70448 -58204 -53721 -48841 -57814 -53431 -57939 -62797 -49600 -67221 -54117 -47429 -66198 -58415
$$ packed form
10148e3902q551J1921q731m848L0176r110m538l300j3098J2357j488j1249P273
10135e7088K719J6997j5457k115L546j0868L018j078j3546K5682p423M047j713
10122e3279n88k1379M2647j3910j6114n289J6270N53q652J2683j0026P889r998
10109e9193J1545j5016j866J9713j6374N602j107M76M890p818P699j0829J1402
10096e0876q630k902J6570K605j7954J0267q207K822k2982M809J3364r970K3465
10083d7619k2447K3017j1569p909P704q698M977Q535J0335j9524J8645j6679J75
10070f1057J0400L131q366q385L773J0923l221J349j1612N621k524P800o622j1658
10056g0448J2244M483M880q973M383m508m858J3197j7621J3104O688j8769P783
$$ plain form
10043 -58415 -50885 -51402 -42802 -61950 -56456 -64476 -54812 -46569 -48743 -46006 -47377 -65001 -44245 -60058
10029 -60058 -61060 -52888 -66560 -43339 -38625 -44692 -63654 -67487 -50743 -55761 -64229 -68656 -76467
10016 -76467 -66457 -61557 -72284 -50657 -52904 -61285 -48782 -66879 -71311 -56617 -61055 -51749 -50566
10003 -50566 -66006 -67559 -47384 -44597 -57552 -60988 -61977 -44183 -60129 -49054 -51941 -45809 -56771
9990 -56771 -48751 -61857 -60705 -49381 -55056 -57188 -62817 -52692 -61630 -53680 -40172 -38440 -55695
9977 -55695 -60248 -69447 -42707 -48889 -26965 -62707 -36278 -47083 -46542 -52437 -63697 -55654 -38257
9964 -38257 -58479 -45925 -54572 -61709 -57930 -31019 -43806 -63149 -50756 -43185 -40395 -54169 -56452
9951 -56452 -68635 -45183 -45630 -56249 -53061 -58362 -54830 -58490 -66676 -63987 -50406 -48808 -52163 -53481
$$ packed form
10043e8415P530n17Q600j9148N494q020R664Q243k174K737j371j7624K0756j5813
10029f0058j002Q172j3672K3221M714o067j8962l833J6744n018q468m427p811
10016g6467J0010M900j0727K1627k247q381J2503j8097m432J4694m438R306J183
10003e0566j5440j553K0175K787j2955l436r89J7794j5946J1075k887O132j0962
9990e6771Q020j3106J152J1324n675k132n629J0125q938P950J3508J732j7255
9977e5695m553r199K6740o182K1924l5742K6429j0805N41n895j1260Q043J7397
9964c8257k0222J2554q647p137L779K6911j2787j9343J2393P571K790j3774k283
9951e6452j2183K3452m47j0619L188n301L532l660q186K689J3581J598l355j318
$$ plain form
9937 -53481 -67270 -40490 -37370 -45626 -50682 -63210 -56644 -61280 -60380 -57269 -47948 -45725 -55771 -60860
9923 -60860 -56188 -52117 -43921 -37790 -56586 -57644 -69960 -50301 -45713 -39950 -54740 -40545 -59916
9910 -59916 -68403 -54042 -46038 -54446 -55122 -43226 -46902 -55329 -50172 -58187 -50355 -57945 -53534 -54660
9896 -54660 -48508 -53692 -60270 -48789 -63179 -63116 -49034 -58470 -47195 -55252 -62054 -65342 -63284 -36602
9882 -36602 -64850 -49803 -58612 -72775 -46228 -58573 -43487 -46097 -50587 -60811 -56023 -50197 -30660
9869 -30660 -44890 -55737 -68430 -63230 -51456 -57183 -51857 -41041 -57100 -49621 -65661 -50903 -49684
9856 -49684 -67343 -51096 -46928 -49125 -57855 -34839 -35245 -45637 -47113 -53853 -46801 -38086 -40208 -43727
9842 -43727 -53341 -62113 -61446 -56391 -48154 -62178 -41021 -32658 -47857 -55248 -55532 -57075 -51240 -71749
$$ packed form
9937e3481j3789K6780L120q256n056j2528O566m636R00L111R321K223j0046n089
9923f0860M672M071Q196O131j8796j058j2316J9659M588N763j4790J4195j9371
9910e9916q487J4361Q004q408o76J1896l676q427N157q015P832p590M411j126
9896e4660O152n184o578J1481j4390O3J4082r436J1275q057o802l288K058K6682
9882c6602k8248J5047q809j4163K6547j2345J5086k610m490j0224M788N826J9537
9869c0660j4230j0847j2693N200J1774n727N326J0816j6059P479j6040J4758J219
9856d9684j7659J6247M168k197q730K3016m06j0392j476o740P052Q715k122l519
9842d3727r614q772O67N055Q237j4024K1157Q363j5199p391k84j543N835k0509
$$ plain form
9828 -71749 -57160 -62115 -62154 -62025 -55760 -51884 -56127 -51610 -44378 -48625 -69227 -42549 -69211 -50123
9814 -50123 -41184 -26015 -47818 -43488 -58531 -50794 -52145 -39200 -52952 -55424 -49095 -56629 -56427 -54742
9800 -54742 -46612 -40929 -50706 -45950 -38296 -67183 -63848 -45385 -52818 -62776 -49791 -72117 -50912
9787 -50912 -59233 -41885 -40493 -59237 -59773 -51151 -51904 -58554 -51039 -50751 -38077 -58759 -48930 -51151
9773 -51151 -49048 -46704 -55533 -45178 -47495 -49440 -41886 -55290 -55493 -51579 -64442 -53581 -36197 -47582
9759 -47582 -50395 -54348 -56118 -56640 -51679 -42969 -50816 -57959 -40075 -55564 -47691 -45962 -48681 -41813
9745 -41813 -49300 -35850 -25778 -10657 4166 9131 -1281 -5548 -3946 -7685 -14163 -31555 -32621
9732 -32621 -42626 -32931 -37190 -50684 -39824 -37101 -48532 -46871 -55059 -53933 -50979 -56305 -39014
$$ packed form
9828g1749J4589m955l9J29O265L876m243M517P232m247k0602K6678k6662J9088
9814e0123Q939J5169k1803M330j5043P737j351J2945j3752k472O329p534K02J685
9800e4742Q130N683r777M756P654k8887L335J8463p433r958J2985k2326K1205
9787e0912q321J7348J392j8744n36Q622p53o650P515K88J2674k0682R829k221
9773e1151K103K344q829J0355k317j945P554j3404k03L914j2863J0861J7384j1385
9759d7582k813l953j770n22M961Q710p847p143J7884j5489P873J729k719O868
9745d1813p487J3450J0072J5121J4823M965j0412m267J602l739o478j7392j066
9732c2621j0005R695m259j3494J0860K723j1431J661q188J126K954n326J7291
$$ plain form
9719 -39014 -60412 -64690 -38493 -56977 -48859 -48210 -44131 -51694 -62970 -60530 -30303 -46645 -44333
9706 -44333 -51711 -65870 -30070 -50789 -55993 -48009 -68385 -45484 -34591 -55391 -36303 -62272
9694 -62272 -61471 -63418 -48792 -57348 -47287 -62439 -52599 -55845 -64113 -53637 -73659 -46517 -53962
9681 -53962 -63420 -58637 -61146 -56520 -53987 -53866 -72656 -60399 -61520 -53379 -64808 -35347 -50128 -59137
9667 -59137 -51457 -67156 -43239 -59516 -62200 -46224 -43098 -46821 -50760 -51078 -48244 -45142 -59339 -38767
9653 -38767 -55346 -45130 -41801 -51044 -58984 -39507 -48081 -47315 -59526 -55817 -42524 -49913 -40782 -36535
9639 -36535 -49285 -22661 -48111 -45048 -45599 -50154 -48585 -55927 -56654 -48860 -47022 -51484 -36243 -52988
9625 -52988 -29887 -49219 -49381 -41456 -36098 -36712 -24075 -52003 -50455 -34744 -27266 -36954 -45284 -19283
$$ packed form
9719c9014k1398m278K6197j8484Q118O49M079p563j1276K440L0227j6342K312
9706d4333p378j4159L5800k0719n204P984k0376K2901J0893k0800J9088k5969
9694f2272Q01j947J4626q556J0061j5152R840l246q268J0476k0022K7142p445
9681e3962r458M783k509M626K533J21j8790J2257j121Q141j1429K9461j4781r009
9667e9137P680j5699K3917j6277k684J5976L126l723l939l18K834L102j4197K0572
9653c8767j6579J0216L329r243p940J9477q574P66j2211L709J3293p389R131M247
9639c6535j2750K6624k5450L063n51m555J569p342p27P794J838m462J5241j6745
9625e2988K3101j9332j62P925N358o14J2637k7928J548J5711P478r688q330K6001
$$ plain form
9611 -19283 -34849 -31591 -34074 -31189 -19461 -19867 -36074 -30983 -37960 -25546 -18599 -31203 -33373 -25568
9597 -25568 -37122 -17418 -12896 -3863 -5013 49170 74746 94060 109524 103958 80003 56274 34466
9584 34466 2357 -15045 -3366 -13459 -5248 -8751 -19595 -29662 -38857 -27399 -25857 -34479 -21552
9571 -21552 -39650 -26877 -24624 -23851 -30248 -35672 -30832 -32596 -52938 -35206 -33649 -24291 -20380 -38880
9557 -38880 -46735 -41675 -24464 -25381 -42488 -40833 -34390 -35791 -26073 -46099 -36268 -31146 -31146 -48173 -48051
9542 -48051 -45383 -43478 -49326 -42023 -47392 -33358 -37371 -35108 -26933 -42000 -35901 -53727 -28770 -37811
9528 -37811 -31847 -30566 -34825 -35953 -49951 -48778 -25426 -35640 -40969 -30174 -29782 -29720 -32239 -30602
9514 -30602 -34480 -53271 -23596 -27449 -43956 -9883 -35411 -34905 -42213 -31531 -36834 -22568 -29826
$$ packed form
9611a9283j5566L258k483K885J1728m06j6207N091o977J2414O947j2604k170P805
9597b5568j1554J9704M522R033j150N4183K5576J9314J5464n566k3955k3729k1808
9584C4466l2109j7402J1679j0093Q211l503j0844j0067r195J1458J542q622J2927
9571b1552j8098J2773K253P73o397n424M840j764k0342J7732J557R358L911j8500
9557c8880p855N060J7211r17j7107J655O443j401R718k0026R831N122%j7027J22
9542d8051K668J905n848P303n369J4034m013K263Q175j5067O099j7826K4957r041
9528c7811N964J281m259j128j3998J173K3352j0214n329J0795L92O2k519J637
9514c0602l878j8791K9675l853j6507L4073k5528N06p308J0682n303J4266p258
$$ plain form
9501 -29826 -42267 -39871 -38013 -41233 -50970 -38041 -55082 -44556 -54799 -39657 -44001 -42564 -28610
9488 -28610 -35539 -40648 -42676 -47416 -31768 -63318 -34354 -28351 -37353 -41334 -23770 -28101 -18336 -30313
9474 -30313 -35752 -27044 -28589 -28342 -26072 -24479 -22131 -12305 -31637 -21970 -22274 -26920 -13513 -12798 -31473
9459 -31473 -16854 -28884 -15461 -30481 -31623 -17626 -32980 -25149 -35627 -37267 -27680 -26461 -30832
9446 -30832 -32469 -21674 -38458 -26092 -23568 -19668 -43390 -25448 -31655 -26094 -26526 -17023 -17309 -16829
9432 -16829 -20602 -25828 -36244 -10058 -18422 -25408 -19169 -30275 -35733 -26440 -27683 -27620 -21634 -13198
9418 -13198 -37564 -39115 -15041 -31267 -11717 -20064 -15965 -11621 -25107 -25370 -14014 -8935 -17937
9405 -17937 -24727 -31823 -18249 -611 -6700 -12523 -768 -12013 -5654 -2284 1033 -4817 9722
$$ packed form
9501b9826j2441K396J858l220r737J2929j7041J0526j0243J5142m344J437J3954
9488b8610o929n109k028m740J5648l1550K8964O003r002l981J7564m331R765j1977
9474c0313n439Q708j545K47K270J593K348R826j9332R667l04m646J3407P15j8675
9459c1473J4619j2030J3423j5020j142J3997j5354P831j0478j640R587J219m371
9446c0832j637J0795j6784J2366K524L900k3722J7942o207N561m32R503k86M80
9432a6829l773n226j0416K6186q364o986O239j1106n458R293j243O3N986Q436
9418a3198k4366j551K4074j6226J9550q347M099M344j3486k63J1356N079r002
9405a7937o790p096J3574J7638o089n823J1755j1245O359L370L317n850J4539
$$ plain form
9392 9722 -4498 2042 -26056 270 508 -7340 -4604 -229 -17805 -4822 -6786 5455 4775 10271
9378 10271 7192 1903 5627 156 6511 18869 30299 32289 36935 6335 17491 25722 34295 5234
9364 5234 34726 27382 9185 33184 27491 32405 36692 44632 50400 40783 36940 43969 47743 57380
9350 57380 46061 54723 49884 57790 44043 53471 51037 72015 60125 75987 72019 69535 78504
9337 78504 83831 80663 82461 94694 84466 100092 119387 111363 118888 119385 136352 116639 134367
9324 134367 147323 149653 167681 167361 171431 172450 197703 209322 234078 275037 283412 317902 343033
9311 343033 366586 391267 402571 414397 414404 430797 449279 490391 538292 569495 606735 630328
9299 630328 660669 725454 764541 841899 907799 971233 1025554 1037123 1038307 1008796 990613 978423
$$ packed form
9392I722j4220O540k8098K6326K38p848K736M375j7576J2983j964J2241o80N496
9378A0271l079n289L724n471O355J2358J1430J990M646l0600J1156Q231Q573k9061
9364E234K9492p344j8197K3999n693M914M287P940N768r617l843P029L774R637
9350E7380j1319Q662m839P906j3747R428k434K0978j1890J5862l968k484Q969
9337G8504N327l168J798J2233j0228J5626J9295q024P525M97J6967j9713J7728
9324A34367J2956K330J8028l20M070J019K5253J1619K4756M0959Q375L4490K5131
9311C43033K3553K4681J1304J1826PJ6393J8482M1112M7901L1203L7240K3593
9299F30328L0341O4785L9087P7358O5900O3434N4321J1569J184k9511j8183j2190
$$ plain form
9287 978423 993296 1026575 1070820 1137633 1219514 1253773 1305303 1339907 1411593 1503086 1606038
9276 1606038 1678345 1798566 1919675 2092930 2336464 2608316 2889287 3137371 3355022 3464654
9266 3464654 3491621 3472438 3378093 3257184 3131315 3092256 3142738 3335558 3616928 3959172
9256 3959172 4271037 4441158 4466718 4316195 4036322 3647508 3252932 2868268 2577017 2346857
9246 2346857 2246506 2229605 2227046 2238465 2206521 2140663 2042584 1917546 1792384 1670849 1542137
9235 1542137 1433872 1318300 1232224 1135693 1092415 1090221 1164917 1210796 1229531 1211861 1156389
9224 1156389 1057368 965499 847953 767425 681853 627108 585757 539319 502077 481249 455264
9213 455264 440524 413590 372947 372631 343766 339676 319376 325898 315051 294597 299771 292803 281521
$$ packed form
9287I78423J4873L3279M4245O6813Q1881L4259N1530L4604P1686R1493J02952
9276A606038P2307J20221J21109J73255K43534K71852K80971K48084K17651J09632
9266C464654K6967j9183r4345j20909j25869l9059N0482J92820K81370L42244
9256C959172L11865J70121K5560j50523k79873l88814l94576l84664k91251k30160
9246B346857j00351j6901k559J1419l1944o5858r8079j25038j25162j21535j28712
9235A542137j08265j15572q6076r6531m3278k194P4696M5879J8735j7670n5472
9224A156389r9021r1869j17546q0528q5572n4745m1351m6438l7242k0828k5985
9213D55264j4740k6934m0643l16k8865m090k0300O522j0847k0454N174o968j1282
$$ plain form
9200 281521 278293 267192 270184 245844 249303 255072 241690 242950 233296 220142 230249 222167 212083
9187 212083 202215 209031 207136 211267 216815 176468 177901 198177 186416 180587 186210 165856 183985
9174 183985 174173 147248 161372 163997 161857 146364 156843 142134 147038 143494 133424 137252 128265
9161 128265 125953 124300 137635 145093 133236 121654 134486 124003 121626 114308 109116 122543 109727
9148 109727 122766 112471 116524 124710 122111 124150 117388 110681 119932 109458 116447 119459 121429 115527
9134 115527 125710 126815 125662 119257 110014 109363 124938 120136 108312 118445 127462 122242 107870
9121 107870 114628 109684 127969 123800 136457 120773 126172 126359 125521 117981 119019 122974 127126 132162
9107 132162 118271 122138 137456 123322 131252 123930 121338 122987 117952 134169 128602 115716 122011
$$ packed form
9200B81521l228j1101K992k4340L459N769j3382J260r654j3154J0107q082j0084
9187B12083r868O816j895M131N548m0347J433K0276j1761n829N623k0354J8129
9174A83985r812k6925J4124K625k140j5493J0479j4709M904l544j0070L828q987
9161A28265k312j653J3335P458j1857j1582J2832j0483k377p318n192J3427j2816
9148A09727J3039j0295M053Q186k599K039o762o707R251j0474O989L012J970n902
9134A15527J0183J105j153o405r243o51J5575m802j1824J0133R017n220j4372
9121A07870O758m944J8285m169J2657j5684N399J87q38p540J038L955M152N036
9107A32162j3891L867J5318j4134P930p322k592J649n035J6217n567j2886O295
$$ plain form
9094 122011 137250 106926 114065 120769 119178 116825 109001 111527 130863 136824 122635 113816 148363
9081 148363 122838 119776 127884 135567 136529 143446 139584 141131 153723 154157 157344 153878 156086 151849
9067 151849 172141 165847 169541 163838 179850 170486 192725 177746 185733 204969 209198 210760 223267
9054 223267 202308 227134 224788 248140 242812 252647 270211 257947 292496 283462 304019 304702 298731
9041 298731 305881 331551 351251 345363 369629 376574 384706 379063 394077 400764 398515 409135 413307
9028 413307 417893 419410 421808 430587 426484 447882 426635 432438 423782 450063 428074 420376 441598
9015 441598 408993 412430 431284 410682 403551 387815 383550 372955 378785 369972 360913 356334 325262
9002 325262 335923 310347 310361 308326 312422 289929 271524 271428 277274 260443 254260 239120 227657 214947
$$ packed form
9094A22011J5239l0324P139O704j591k353p824K526J9336N961j4189q819L4547
9081A48363k5525l062Q108P683R62O917l862J547J2592M34L187l466K208m237
9067A51849K0292o294L694n703J6012r364K2239j4979P987J9236M229J562J2507
9054B23267k0959K4826k346K3352n328R835J7564j2264L4549r034K0557O83n971
9041B98731P150K5670J9700n888K4266O945Q132n643J5014O687k249J0620M172
9028D13307M586J517K398Q779m103K1398k1247N803q656K6281k1989p698K1222
9015D41598l2605L437J8854k0602p131j5736m265j0595N830q813r059m579l1072
9002C25262J0661k5576J4k035M096k2493j8405r6N846j6831o183j5140j1463j2710
$$ plain form
8988 214947 236157 224972 209423 202053 199214 198937 191565 181626 181569 177363 161494 149582 139817 148939
8974 148939 149176 144377 146440 140306 130164 123636 127684 111806 117062 106353 104124 92496 89888 102255
8960 102255 105100 88626 94371 102088 109170 98544 69204 69664 80394 82333 71081 84927 81855
8947 81855 76121 64386 64910 58131 69613 61605 46581 40556 51808 57598 60797 49545 42426 28112
8933 28112 34800 37058 27712 50530 44246 39170 42813 32817 20659 42133 40537 28806 24160 26581
8919 26581 34504 44280 45928 43641 29156 24447 35798 37787 23768 38336 38953 31252 26489 20497
8905 20497 21767 34127 38601 20333 22168 32725 30557 30105 18494 8737 9720 15503 14800 15895
8891 15895 17686 3879 9412 18922 11768 2271 13945 15647 -5532 14712 4494 13262 -5481
$$ packed form
8988B14947K1210j1185j5549p370k839k77p372r939n7m206j5869j1912r765R122
8974A48939K37m799K063o134j0142o528M048j5878N256j0709k229j1628k608J2367
8960A02255K845j6474N745P717P082j0626k9340M60J0730J939j1252J3846l072
8947H1855n734j1735N24o779J1482q008j5024o025J1252N790L199j1252p119j4314
8933B8112O688K258r346K2818o284n076L643r996j2158K1474j596j1731m646K421
8919B6581P923R776J648k287j4485m709J1351J989j4019J4568O17p701m763n992
8905B0497J270J2360M474j8268J835J0557k168m52j1611r757R83N783p03J095
8891A5895J791j3807N533R510p154r497J1674J702k1179K0244j0218Q768j8743
$$ plain form
8878 -5481 16818 593 5762 6996 4382 2950 7895 10137 223 -4823 14183 -2964 16519 4269
8864 4269 -3178 7632 -1341 1961 15713 18884 441 15272 -447 -2766 6033 11003 -4819
8851 -4819 12286 18443 1615 11423 8653 5800 11718 -4114 10297 1706 8941 10427 -886 -11597
8837 -11597 -2228 -5243 -9737 -10760 -10048 -13420 -8229 -19482 -14106 -21434 -14556 -25279 -24693 -11716
8823 -11716 -21529 -30634 -32209 -12995 -24737 -18968 -27819 -29066 -27788 -19452 -16277 -3191 -19151 -8498
8809 -8498 -9984 -3388 -11029 -15399 -18658 -27242 -18831 -2849 -13692 -1107 -423 -12924 5490 -8155
8795 -8155 -11690 -12777 -9164 -34053 1375 -16973 -4802 -7712 -23886 13383 -20668 -13936 -13054
8782 -13054 -6666 -14571 -20135 -14560 -9793 -23254 -11400 -9556 -21728 -24952 -15933 -24994 -23904 -17627
$$ packed form
8878e481K2299j6225N169J234k614j432M945K242r914n046J9006j7147J9483j2250
8864D269p447J0810q973L302J3752L171j8443J4831j5719k319Q799M970j5822
8851d819J7105O157j6828R808k770k853N918j5832J4411q591P235J486j1313j0711
8837a1597R369l015m494j023P12l372N191j1253N376p328O878j0723N86J2977
8823a1716r813r105j575J9214j1742N769q851j247J278Q336L175J3086j5960J0653
8809h498j486O596p641m370l259q584Q411J5982j0843J2585O84j2501J8414j3645
8795h155l535j087L613k4889L5428j8348J2171k910j6174L7269l4051O732Q82
8782a3054O388p905n564N575M767j3461J1854J844j2172l224R019r061J090O277
$$ plain form
8768 -17627 -13836 -29461 -35380 -22696 -18402 -13389 -13212 -4797 -3726 -6015 -15786 -19884 -16477 -18886
8754 -18886 -14401 -14859 -12849 1490 -6939 450 -4317 -12758 -14385 -9911 -21099 -24726 -22739 -1623
8740 -1623 -24699 852 -13868 15715 -5496 -266 -17947 -13229 -8794 -5758 -13759 -3481 -3997
8727 -3997 -29147 -22117 -9254 -10917 -8231 6150 -11591 -22993 -11836 1786 -11490 -17548 -20357
8714 -20357 -9662 -8129 -17476 -19629 -345 140 -14851 -23720 -10080 9541 6895 -6097 -4943
8701 -4943 -11393 -288 9847 -1475 -9990 -5357 -4150 -17831 10487 -10183 -2222 -28437 -13538
8688 -13538 -21258 -4913 -7685 -5614 -12867 6185 -24695 -30840 -26615 -16149 -23447 -39919 -27639
8675 -27639 -21768 -10680 -18954 -10937 -13288 16311 -21890 -18903 -17970 -26480 -12577 -14244 -18880 -11565
$$ packed form
8768a7627L791j5625n919J2684M294N013J77Q415J071k289r771m098L407k409
8754a8886M485m58K010J4339q429P389m767q441j627M474j1188l627J987K1116
8740a623k3076K5551j4720K9583k1211N230j7681M718M435L036q001J0278n16
8727c997k5150P030J2863j663K686J4381j7741j1402J1157J3622j3276o058k809
8714b0357J0695J533r347k153J9284M85j4991q869J3640J9621k646j2992J154
8701d943o450J1105J0135j1322q515M633J207j3681K8318k0670P961k6215J4899
8688a3538p720J6345k772K071p253J9052l0880o145M225J0466p298j6472J2280
8675b7639N871J1088q274Q017k351K9599l8201K987R33q510J3903j667m636P315
$$ plain form
8661 -11565 -8354 -18447 -3294 908 -11851 -12211 -8963 -2079 -23614 -16870 -18493 -20518 -16448 -21271
8647 -21271 6029 -11844 -8529 -9512 1024 -8697 -4797 -8559 -3660 -17368 -21859 -9395 -27057
8634 -27057 -13727 -19899 -11123 -20961 -25204 -16723 -12455 -28701 -21843 -20616 -19689 -1047 -3555 -18867
8620 -18867 -13778 -7723 -221 -8374 -19940 -503 -19780 -12498 -10119 -13416 -3996 -11515 6221 -1233
8606 -1233 -23012 -11531 3049 -12276 -7078 4558 -14537 -12661 -11939 -2033 -17172 -1796 -12268
8593 -12268 -17041 -4035 -15330 -22 -16859 -13626 -2803 -14035 -4567 -3803 4379 6995 3697
8580 3697 -5249 3103 3312 -742 2238 884 -8900 9219 -904 -9618 1112 9196 -9002 -19447
8566 -19447 -22194 -14267 -2691 262 -18052 -18091 -3631 -24486 -10951 -13901 -251 -7025 -11074 -13101
$$ packed form
8661a1565L211j0093J5153M202j2759l60L248O884k1535O744j623k025M070m823
8647b1271K7300j7873L315r83J0536r721L900l762M899j3708m491J2464j7662
8634b7057J3330o172Q776r838m243Q481M268j6246O858J227R27J8642k508j5312
8620a8867N089O055P502q153j1566J9437j9277P282K379l297R420p519J7736p454
8606a233k1779J1481J4580j5325N198J1636j9095J876P22R906j5139J5376j0472
8593a2268m773J3006j1295J5308j6837L233J0823j1232R468P64Q182K616l298
8580C697q946Q352K09m054K980j354r784J8119j0123q714J0730Q084j8198j0445
8566a9447k747P927J1576K953j8314l9J4460k0855J3535k950J3650o774m049k027
$$ plain form
8552 -13101 -14634 -12732 -19933 -14393 -4926 -20679 -16491 -13559 -12674 -26275 -14171 -12176 -21737 -11506
8538 -11506 -16384 -28518 -23167 -7946 -16160 -8176 -59214 95714 -13270 9007 -15543 -18582
8526 -18582 -11004 2342 -4689 -3565 -8520 -16347 -12682 4142 -7922 -20343 -17395 3394 -7261
8513 -7261 -13106 -4641 -3046 -8763 -18147 -6036 -630 -1380 -8610 -17196 5809 -18164 -21916 -16158
8499 -16158 -12860 -26979 -18655 -21599 -18064 -2823 -13569 -14933 -7740 -27300 -35848 -13313 -20559
8486 -20559 -23150 2938 -4101 -8454 -26614 -3565 1826 3766 5853 -4976 -12551 -14514 -9036 -5758
8472 -5758 -4160 -10836 -8570 -10907 3661 -14548 -2904 -1834 8743 -4812 -24077 -16638 6342
8459 6342 2479 -20717 1418 -3007 -10150 -16598 -21275 -17996 -2160 -12813 -16448 -16768 -19263 -26309
$$ packed form
8552a3101j533J902p201N540R467j5753M188K932Q85j3601J2104J995r561J0231
8538a1506m878j2134N351J5221q214P984n1038J54928j08984K2277k4550l039
8526a8582P578J3346p031J124m955p827L665J6824j2064j2421K948K0789j0655
8513g261n845Q465J595n717r384J2111N406p50p230q586K3005k3973l752N758
8499a6158L298j4119Q324k944L535J5241j0746j364P193j9560q548K2535p246
8486b0559k591K6088p039m353j8160K3049N391J940K087j0829p575j963N478L278
8472e758J598o676K266k337J4568j8209J1644J070J0577j3555j9265P439K2980
8459F342l863k3196K2135m425p143o448m677L279J5836j0653l635l20k495p046
$$ plain form
8445 -26309 -23509 -18433 -16885 -7334 922 -20099 -22262 -23686 -15688 -27750 -18375 -18210 -12759 -32028
8431 -32028 -31789 -16871 -33655 -19762 -43019 -29877 -19249 -18949 -33203 -32128 -35650 -28856 -25317
8418 -25317 -21471 -28818 -12213 -14438 -1831 -19448 -14502 -27578 -18887 -18170 -26991 -30200 -8698 -11625
8404 -11625 -30451 -17810 -8073 -7101 -18052 -26882 -23348 -18979 -7253 -18038 -21030 -1981 -16829
8391 -16829 -7124 -19789 -25488 -22261 -21474 -21606 -23598 -6463 -229 -19394 -22443 -8345 -13463 -6660
8377 -6660 -29010 -8727 -13970 -14331 -18730 -24737 1431 -353 -7830 7160 2710 -1557 -7795 -6629
8363 -6629 -12771 10062 -1941 -10721 -21067 -9689 -5867 -4887 12427 -15720 -4916 6574 -2991
8350 -2991 -25830 -3675 -14802 -5450 -12600 -16044 -11515 -14697 -22155 -12215 -6940 -18591 -22857 -10488
$$ packed form
8445b6309K800N076J548R551Q256k1021k163j424P998j2062R375J65N451j9269
8431c2028K39J4918j6784J3893k3257J3142J0628L00j4254J075l522O794L539
8418b5317L846p347J6605k225J2607j7617M946j3076Q691P17q821l209K1502k927
8404a1625j8826J2641R737R72j0951q830L534M369J1726j0785k992J9049j4848
8391a6829R705j2665n699L227P87j32j992J7135O234j9165l049J4098n118O803
8377f660k2350K0283n243l61m399o007K6168j784p477J4990m450m267o238J166
8363f629o142K2833j2003q780j0346J1378L822R80J7314k8147J0804J1490r565
8350b991k2839K2155j1127R352p150l444M529l182p458R940N275j1651m266J2369
$$ plain form
8336 -10488 -18022 -25236 -31847 -18604 -5234 -19912 -14154 -30343 -359 -12863 -16232 -17325 -17669
8323 -17669 -15393 -36693 -24663 -15970 -19032 -18953 -26324 -20746 -20497 -29508 -19114 -14749 -24027 -23307 -33220
8308 -33220 -23286 -30479 -20189 -7627 -14249 -42507 -25215 -29010 -24770 -35473 -32701 -38268 -25450
8295 -25450 -60492 -55578 -28299 -34151 -23380 -35190 -25248 -28574 -22966 -31476 -31593 -26343 -28755 -25181
8281 -25181 -21463 -25263 -23989 -10579 -10088 -21814 -15956 -30966 -4626 -26203 -33888 -43135 -36370 -17343
8267 -17343 -22263 10420 -20522 -433 -10331 15008 -20292 -2285 -22149 -3461 -8019 -8123 -2506
8254 -2506 -1637 3621 1900 9645 -2988 -9854 -8549 1170 -8505 -10409 -12834 2394 3596 11125 -8167
8239 -8167 10315 -11886 4068 -5042 13444 -3999 -14123 -11449 6348 5823 -4132 -3901 -16574
$$ packed form
8336a0488p534p214o611J3243J3370j4678N758j6189K9984j2504l369j093l44
8323a7669K276k1300J2030Q693l062P9p371N578K49r011J0394M365r278P20r913
8308c3220R934p193J0290J2562o622k8258J7292l795M240j0703K772n567J2818
8295b5450l5042M914K7279n852J0771j1810R942l326N608q510j17N250k412L574
8281b5181L718l800J274J3410M91j1726N858j5010K6340k1577p685r247O765J9027
8267a7343m920L2683l0942K0089r898K5339l5300J8007j9864J8688m558j04N617
8254b506Q69N258j721P745j2633o866J305R719r675j904k425J5228J202P529j9292
8239h167J8482k2201J5954r110J8486j7443j0124K674J7797n25r955K31j2673
$$ plain form
8226 -16574 -19086 -30822 -24660 -18326 -25735 -25725 -25932 -41912 -1822 -24780 -8551 -11457 -5977 1821
8212 1821 -14415 -15066 -25816 -14430 -622 -12693 -17819 -13151 -9340 -10538 -5244 -22522 -16692 -7137
8198 -7137 -22954 -19657 -20033 -14786 -22126 -33669 63203 26538 -8844 4899 20793 -9245 14940
8185 14940 -7735 -11432 -13021 -23545 -8931 -19591 -23961 -20685 -15264 -6004 -7979 -23083 -12334
8172 -12334 -11084 -24106 -23752 -24452 -16499 -21295 -15827 -12404 -37483 -11394 -21364 -16957 -26261 -30590
8158 -30590 -27308 -18381 -20236 -46926 -26064 -14696 127 -21992 -19400 -20295 -1436 -19273 -26093
8145 -26093 -27503 -15647 -18831 -12398 -11679 -5121 -842 7016 9567 2361 2455 -15021 3325 -28406
8131 -28406 -16455 -10814 -16096 -16340 -4667 -8134 1035 -788 -5501 -13657 -13269 -10916 -9944 -15327 525
$$ packed form
8226a6574k512j1736O162O334p409J0k07j5980M0090k2958J6229k906N480P798
8212A821j6236o51j0750J1386J3808j2071n126M668L811j198N294j7278N830R555
8198g137j5817L297l76N247p340j1543R6872l6665l5382J3743J5894l0038K4185
8185A4940k2675l697j589j0524J4614j0660m370L276N421R260j975j5104J0749
8172a2334J250j3022L54p00P953m796N468L423k5079K6089r970M407r304m329
8158c0590L282Q927j855k6690K0862J1368J4823k2119K592q95J8859j7837o820
8145b6093j410J1856l184O433P19O558M279P858K551p206R4j7476J8346l1731
8131b8406J1951N641n282k44J1673l467R169j823m713q156L88K353R72n383J5852
$$ plain form
8116 525 -5703 11236 0 -8429 4985 14756 -379 -7896 -10897 -13988 -3985 -13207 -5078 -32825
8102 -32825 4043 2144 16442 11409 5775 -2171 -7530 -4109 12580 -4771 3612 -6134 1552 -13616
8088 -13616 1221 3877 7705 12856 -8926 -506 -23657 -2823 -2443 21218 -10148 -5070 5664
8075 5664 17210 4985 5367 -2478 147 -9617 -15520 2058 2173 -4684 24131 10642 1847 1512
8061 1512 12190 15791 16101 1224 -24567 -8758 -1637 -638 -22461 -8762 2913 -7351 -8002 -6381
8047 -6381 -8252 -21596 -2119 -17229 -20834 -23745 -5352 -119 -18290 -25136 -27273 3769 -14842
8034 -14842 -4969 4595 -1159 -13314 -10504 -1194 -23140 -28917 -22281 -10788 -22766 -1366 -16627
8021 -16627 -20561 -14228 -14566 -23296 -15707 -11962 -6369 -19585 -21078 -26518 -15713 -10433 -11806 -15470
$$ packed form
8116E25o228J6939j1236q429J3414R771j5135p517l001l091J0003r222Q129k7747
8102c2825L6868j899J4298n033n634p946n359L421J6689j7351Q383r746P686j5168
8088a3616J4837K656L828N151k1782Q420k3151K0834L80K3661l1366N078J0734
8075E664J1546j2225L82p845K625r764n903J7578J15o857K8815j3489q795l35
8061A512J0678L601L10j4877k5791J5809P121R99k1823J3699J1675j0264o51J621
8047f381j871j3344J9477j5110l605k911J8393N233j8171o846k137L1042j8611
8034a4842R873R564n754j2155K810R310k1946n777O636J1493j1978K1400j5261
8021a6627l934O333l38q730P589L745N593j3216j493n440J0805N280j373l664
$$ plain form
8007 -15470 -16837 -24323 -11084 -13851 -17592 -27896 -35367 -21154 -25373 -31809 -18725 -12270 -17306 -23266
7993 -23266 -22209 -11500 -24403 -14854 1666 -9731 -13417 5368 -12116 -5196 -3611 -8154 -6574
7980 -6574 -14793 -1005 -4050 85 -12209 8822 -5621 4207 -15042 5575 -10021 -8625 -7136
7967 -7136 22287 7376 -3896 4934 10463 11001 -15757 4444 9704 13871 -16258 -10043 17686
7954 17686 -9348 6111 -8165 1644 9758 -12351 4156 13048 19810 11384 22961 10102 24041
7941 24041 23341 24035 16005 6104 26441 1679 19358 8298 2567 -2878 11621 -159 -11757
7928 -11757 21498 14397 14712 23052 29006 22737 19364 14539 23578 11334 18585 7777 3000 6804
7914 6804 17848 3005 1222 -3082 6838 -4969 4486 -28458 -27321 2010 1695 -13684 -32586
$$ packed form
8007a5470j367p486J3239k767l741j0304p471J4213m219o436J3084O455n036n960
7993b3266J057J0709j2903R549J6520j1397l686J8785j7484O920J585m543J580
7980f574q219J3788l045M135j2294K1031j4443R828j9249K0617j5596J396J489
7967g136K9423j4911j1272Q830N529N38k6758K0201N260M167l0129O215K7729
7954A7686k7034J5459j4276R809Q114k2109J6507Q892O762q426J1577j2859J3939
7941B4041p00O94q030r901K0337k4762J7679j1060n731n445J4499j1780j1598
7928a1757L3255p101L15Q340N954o269l373m825R039j2244P251j0808m777L804
7914F804J1044j4843j783m304R920j1807R455l2944J137K9331l15j5379j8902
$$ plain form
7901 -32586 -19485 -7918 -4821 -15973 -21662 -11834 -9606 -11783 -20418 -21112 -15773 -6331 -13653 -30099
7887 -30099 -26065 -9761 -9318 -14433 -23223 -13556 -14471 -23913 -10518 -6651 -19588 -7085 -19204 -9130
7873 -9130 -1913 -2415 -2431 -5648 -7539 -1448 4123 -15723 7492 -1048 -2335 -8018 -1903 -3079 -5731
7858 -5731 -5598 10299 -3299 15629 14385 53500 -105085 -12482 2357 10339 11575 -1281 -18532
7845 -18532 7163 5932 -7623 24921 -4624 11485 4979 -8824 -8912 1539 8146 16530 -13013
7832 -13013 -2031 -8939 14261 17407 12081 7264 20336 16031 7082 9713 16187 7800 24111 -5678
7818 -5678 13025 7162 31817 22557 23434 39115 6981 24893 45821 36513 29465 18140 24450
7805 24450 31320 29426 45868 28360 19352 43050 30282 29329 24882 26610 32740 19935 12336 20403
$$ packed form
7901c2586J3101J1567L097j1152n689R828K228k177q635o94N339R442p322j6446
7887c0099M034J6304M43n115q790R667r15r442J3395L867j2937J2503j2119J0074
7873i130P217n02j6l217j891O091N571j9846K3215q540j287n683O115j176k652
7858e731J33J5897j3598J8928j244L9115j58585R2603J4839P982J236j2856j7251
7845a8532K5695j231j3555L2544k9545J6109o506j3803q8J0451O607Q384k9543
7832a3013J0982o908K3200L146n326m817J3072m305q949K631O474q387J6311k9789
7818e678J8703n863K4655r260Q77J5681l2134J7912K0928r308p048j1325O310
7805B4450O870j894J6442j7508r008K3698j2768r53m447J728O130j2805p599Q067
$$ plain form
7791 20403 25336 17600 22049 15043 27003 -224 21578 -3095 4827 17229 14450 12403 2090
7778 2090 7045 1871 17444 6226 9323 10396 5859 13870 10182 -4121 15350 6845 21555 13850
7764 13850 19074 8874 19585 17318 28477 20150 20722 25279 4717 28207 23919 35912 23836
7751 23836 36231 46238 13033 44722 27512 22115 28364 32016 28160 40297 49878 34200 53901
7738 53901 46107 31846 47837 40526 38947 32254 46950 54923 44327 41575 38830 35209 35947 31632
7724 31632 46050 33613 43634 65314 43796 29928 47906 23257 42867 39878 25275 36284
7712 36284 38693 42458 45138 41249 41675 40871 35631 41625 38565 33648 61035 53097 44768 52776 35789
7697 35789 57093 33686 48587 36712 47583 47156 48513 42635 56531 32801 52525 56915 54087
$$ packed form
7791B0403M933p736M449p006J1960k7227K1802k4673P922J2402k779k047j0313
7778B090M955n174J5573j1218L097J073m537Q011l688j4303J9471q505J4710p705
7764A3850N224j0200J0711k267J1159q327N72M557k0562K3490m288J1993j2076
7751B3836J2395J0007l3205L1689j7210n397O249L652l856J2137R581j5678J9701
7738E3901p794j4261J5991p311j579o693J4696P973j0596k752k745l621P38m315
7724C1632J4418j2437J0021K1680k1518j3868J7978k4649J9610k989j4603J1009
7712C6284K409L765K680l889M26q04n240N994l060m917K7387p938q329Q008j6987
7697C5789K1304k3407J4901j1875J0871m27J357n878J3896k3730J9724M390k828
$$ plain form
7684 54087 49573 58328 72648 59382 53935 50508 67266 61137 73887 67242 58240 59924 70776
7671 70776 66509 65755 57447 52793 57181 77685 64580 69958 77415 73260 63759 77045 74268 79620
7657 79620 75783 86195 75992 80901 87255 101394 95872 93834 87514 79078 92331 94135 80473
7644 80473 96409 106834 99170 105273 94935 90704 84876 94277 103340 93268 93700 109222 119233
7631 119233 123793 92540 130712 120456 121749 107436 124080 137721 137385 100043 123559 116288 117885
7618 117885 116591 125893 119479 120512 134664 140282 153547 146009 156759 139403 140295 141341 143377 148567
7604 148567 140217 148393 166681 176696 177025 164794 139003 179093 167005 162975 160834 161485 180607
7591 180607 148087 155499 151061 158047 180909 164127 169948 162714 164237 177397 193495 176535 178611
$$ packed form
7684E4087m514Q755J4320j3266n447l427J6758o129J2750o645r002J684J0852
7671G0776m267p54q308m654M388K0504j3105N378P457m155r501J3286k777N352
7657G9620l837J0412j0203M909O354J4139n522k038o320q436J3253J804j3662
7644H0473J5936J0425p664O103j0338m231n828R401R063j0072M32J5522J0011
7631A19233M560l1253L8172j0256J293j4313J6644J3641l36l7342K3516p271J597
7618A17885j294R302o414J033J4152N618J3265p538J0750j7356Q92J046K036N190
7604A48567q350Q176J8288J0015L29j2231k5791M0090j2088m030k141O51J9122
7591A80607l2520P412m438O986K2862j6782N821p234J523J3160J6098j6960K076
$$ plain form
7578 178611 179646 186532 172263 165927 182913 184182 190546 193444 166572 184441 176095 183893 187836
7565 187836 178744 197701 198086 195835 196094 192284 196944 227768 215910 211032 226673 221712 219595 228994
7551 228994 226488 242845 233703 235773 233524 253457 256495 260712 260563 262977 262348 290397 284721 288850
7537 288850 289697 295547 332993 308395 320858 319631 330186 320110 323109 307182 332977 322557 331327
7524 331327 336073 336809 339542 339178 349239 357830 350588 339794 360253 361023 353960 366297 386733 391507
7510 391507 383347 391996 434236 392470 416231 428613 418779 418407 425814 419959 426755 421355 428043 426071
7496 426071 439297 430394 434504 456592 451057 467200 468281 481787 489222 485723 508153 512507 506389
7483 506389 523160 528524 536738 540864 545128 535488 536274 558076 555713 564492 580389 580275 593445 597076
$$ packed form
7578A78611J035O886j4269o336J6986J269O364K898k6872J7869q346P798L943
7565A87836r092J8957L85k251K59l810M660L0824j1858m878J5641m961k117R399
7551B28994k506J6357r142K070k249J9933L038M217j49K414o29K8049n676M129
7537B88850Q47N850L7446k4598J2463j227J0555j0076K999j5927K5795j0420Q770
7524C31327M746P36K733l64J0061Q591p242j0794K0459P70p063J2337K0436M774
7510C91507q160Q649M2240m1766K3761J2382r834l72P407n855O796n400O688j972
7496D26071J3226q903M110K2088n535J6143J081J3506P435l499K2430M354o118
7483E06389J6771N364Q214M126M264r640P86K1802k363Q779J5897j14J3170L631
$$ plain form
7469 597076 617114 618902 626944 630700 659874 656269 662263 677975 689047 686770 695062 721500 725906
7456 725906 731494 739930 755287 750892 749799 766433 754186 783406 775316 796394 803567 792817 826091
7443 826091 832210 827314 828921 859575 862524 872727 880977 901711 923881 937590 937795 959396 981378
7430 981378 1002007 995494 1016097 1022747 1039797 1047670 1076767 1088857 1111371 1139700 1160117 1158827
7418 1158827 1175457 1211077 1202215 1222917 1227527 1245960 1271202 1271230 1292109 1303494 1328830 1334371 1346709
7405 1346709 1362637 1393401 1394866 1410122 1424323 1450640 1466282 1489289 1503282 1519566 1526393 1552035
7393 1552035 1549452 1581067 1602727 1623276 1639506 1674843 1687910 1722697 1760156 1788019 1819358 1828529
7381 1828529 1870230 1903712 1909323 1938801 1953909 2000601 2013073 2045566 2064811 2104184 2133107 2154876
$$ packed form
7469E97076K0038J788Q042L756K9174l605N994J5712J1072k277Q292K6438M406
7456G25906N588Q436J5357m395j093J6634j2247K9220q090K1078P173j0750L3274
7443H26091O119m896J607L0654K949J0203Q250K0734K2170J3709K05K1601K1982
7430I81378K0629o513K0603O650J7050P873K9097J2090K2514K8329K0417j290
7418A158827J6630L5620q862K0702M610J8433K5242K8K0879J1385K5336N541J2338
7405A346709J5928L0764J465J5256J4201K6317J5642K3007J3993J6284O827K5642
7393A552035k583L1615K1660K0549J6230L5337J3067L4787L7459K7863L1339R171
7381A828529M1701L3482N611K9478J5108M6692J2472L2493J9245L9373K8923K1769
$$ plain form
7369 2154876 2167106 2194695 2223044 2234473 2266703 2289595 2307814 2366264 2389212 2447825 2477088
7358 2477088 2560182 2596228 2640600 2729624 2774448 2864032 2920351 2973298 3038662 3108454 3177043
7347 3177043 3244504 3308147 3382108 3461137 3505583 3561684 3625976 3711310 3778445 3841950 3906201
7336 3906201 3986285 4047155 4124520 4184385 4252714 4314090 4389846 4435311 4492053 4549777 4611170
7325 4611170 4681570 4747051 4808080 4861231 4925821 5010982 5067860 5164578 5255824 5338097 5432166
7314 5432166 5560340 5693269 5851245 6020056 6155122 6303134 6464721 6619778 6755986 6882949
7304 6882949 6996926 7108847 7237679 7339618 7455013 7579836 7711101 7854916 8040575 8190939
7294 8190939 8364288 8549695 8722013 8916136 9131000 9341615 9533084 9756571 9997034 10224039
$$ packed form
7369B154876J2230K7589K8349J1429L2230K2892J8219N8450K2948N8613K9263
7358B477088Q3094L6046M4372Q9024M4824Q9584N6319N2947O5364O9792O8589
7347C177043O7461O3643P3961P9029M4446N6101O4292Q5334O7135O3505O4251
7336C906201Q0084O0870P7365N9865O8329O1376P5756M5465N6742N7724O1393
7325D611170P0400O5481O1029N3151O4590Q5161N6878R6718R1246Q2273R4069
7314E432166J28174J32929J57976J68811J35066J48012J61587J55057J36208J26963
7304F882949J13977J11921J28832J01939J15395J24823J31265J43815J85659J50364
7294H190939J73349J85407J72318J94123K14864K10615J91469K23487K40463K27005
$$ plain form
7284 10224039 10447410 10708984 10979019 11265468 11581977 11891480 12230525 12571868 12947125
7275 12947125 13336312 13722906 14138269 14553060 14981533 15438666 15903498 16403370 16905112
7266 16905112 17471029 18025324 18628942 19260072 19953564 20690251 21468971 22301392 23196998
7257 23196998 24132986 25157330 26240823 27436730 28713633 30126544 31676428 33373607
7249 33373607 35230413 37316051 39628741 42244252 45192061 48527740 52367528 56767455
7241 56767455 61812706 67648403 74442807 82361177 91722139 102921331 116504334 133132931
7233 133132931 153713142 179144345 210055761 246041515 285026100 322828379 354177430
7226 354177430 374334028 380527080 372578937 352508097 323865837 290621372 256334199
$$ packed form
7284A0224039K23371K61574K70035K86449L16509L09503L39045L41343L75257
7275A2947125L89187L86594M15363M14791M28473M57133M64832M99872N01742
7266A6905112N65917N54295O03618O31130O93492P36687P78720Q32421Q95606
7257B3196998R35988J024344J083493J195907J276903J412911J549884J697179
7249C3373607J856806K085638K312690K615511K947809L335679L839788M399927
7241E6767455N045251N835697O794404P918370R360962J1199192J3583003J6628597
7233A33132931K0580211K5431203L0911416L5985754L8984585L7802279L1349051
7226C54177430K0156598O193052p948143k0070840k8642260l3244465l4287173
$$ plain form
7219 256334199 223647203 194141251 168463292 146640352 128358948 113160214 100572579
7212 100572579 90137483 81461021 74181689 68055038 62815001 58291632 54376306 50948893
7204 50948893 47888263 45178120 42717033 40540040 38537723 36721286 35043710 33484307
7196 33484307 32063547 30729415 29502953 28380617 27341881 26341989 25428687 24574779 23788906
7187 23788906 23000791 22259378 21575112 20874865 20213832 19637732 19052732 18519687 18019280
7178 18019280 17551136 17149959 16769664 16478953 16253270 16063513 15872173 15588258 15246933
7169 15246933 14836787 14390236 13963673 13551792 13121269 12769660 12468581 12197924 11945790
7160 11945790 11717091 11540563 11403200 11257255 11102282 10979458 10887477 10806396 10690222 10493954
$$ packed form
7219B56334199l2686996k9505952k5677959k1822940j8281404j5198734j2587635
7212A00572579j0435096q676462p279332o126651n240037m523369l915326l427413
7204E0948893l060630k710143k461087k176993k002317j816437j677576j559403
7196C3484307j420760j334132j226462j122336j038736r99892r13302q53908p85873
7187B3788906p88115p41413o84266p00247o61033n76100n85000n33045n00407
7178A8019280m68144m01177l80295k90711k25683j89757j91340k83915l41325
7169A5246933m10146m46551m26563m11881m30523l51609l01079k70657k52134
7160A1945790k28699j76528j37363j45945j54973j22824r1981q1081j16174j96268
$$ plain form
7150 10493954 10257985 9986472 9699558 9451852 9202584 8934209 8693553 8482636 8282297
7141 8282297 8119426 7955776 7818866 7678206 7562240 7485721 7485204 7512350 7610319 7613599 7549017
7130 7549017 7381214 7140178 6861797 6578919 6284712 6015273 5760795 5561645 5353600 5201114
7120 5201114 5054275 4915336 4770418 4647211 4561052 4448922 4350072 4270889 4179134 4094389
7110 4094389 4007449 3924935 3870560 3782900 3712252 3624156 3567435 3492274 3415104 3352098 3287113
7099 3287113 3232440 3174645 3138430 3086889 3046661 2996714 2957423 2916002 2867060 2817954 2768439
7088 2768439 2731703 2653833 2603859 2542851 2490339 2430907 2377476 2327045 2264475 2208480 2151367
7077 2151367 2111273 2048932 2000001 1984759 1954112 1902086 1871528 1853210 1840224 1804753 1782283
$$ packed form
7150A0493954k35969k71513k86914k47706k49268k68375k40656k10917k00339
7141H282297j62871j63650j36910j40660j15966p6519n17K7146R7969L280o4582
7130G549017j67803k41036k78381k82878k94207k69439k54478j99150k08045j52486
7120E201114j46839j38939j44918j23207q6159j12130r8850p9183r1755q4745
7110D094389q6940q2514n4375q7660p0648q8096n6721p5161p7170o3006o4985
7099C287113n4673n7795l6215n1541m0228m9947l9291m1421m8942m9106m9515
7088B768439l6736p7870m9974o1008n2512n9432n3431n0431o2570n5995n7113
7077B151367m0094o2341m8931j5242l0647n2026l0558j8318j2986l5471k2470
$$ plain form
7066 1782283 1760458 1738976 1697375 1686826 1645016 1622314 1600010 1569716 1558375 1513155 1484028
7055 1484028 1467210 1438366 1415660 1350266 1361539 1321065 1302050 1292702 1258873 1221242 1212832 1194409
7043 1194409 1187634 1161737 1128895 1096884 1062153 1055215 1015921 993461 968221 963733 915891 892477
7031 892477 887537 865583 869049 847501 828030 818564 798523 778085 766657 766120 755272 741596 746679
7018 746679 742644 757195 809759 830369 813903 797785 761687 745453 712659 671186 654917 609297
7006 609297 620265 591230 581596 568257 547575 535285 543521 529845 509408 524301 515018 481356
6994 481356 495700 479181 471219 459275 473889 433672 454911 425964 397920 380745 396774 391292
6982 391292 380428 387819 361473 367576 347956 352488 350438 350994 329620 344041 322697 305822 295134
$$ packed form
7066A782283k1825k1482m1601j0549m1810k2702k2304l0294j1341m5220k9127
7055A484028j6818k8844k2706o5394J1273m0474j9015r348l3829l7631q410j8423
7043A194409o775k5897l2842l2011l4731o938l9294k2460k5240m488m7842k3414
7031H92477m940k1954L466k1548j9471r466k0041k0438j1428n37j0848j3676N083
7018G46679m035J4551N2564K0610j6466j6118l6098j6234l2794m1473j6269m5620
7006F09297J0968k9035r634j3339k0682j2290Q236j3676k0437J4893r283l3662
6994D81356J4344j6519p962j1944J4614m0217K1239k8947k8044j7175J6029n482
6982C91292j0864P391k6346O103j9620M532k050N56k1374J4421k1344j6875j0688
$$ plain form
6969 295134 317401 299012 268057 296962 284499 256652 263515 256462 257707 249602 242945 237682 228690
6956 228690 225128 211648 213395 212397 215781 217940 230666 194678 204959 224127 209723 215750 204129
6943 204129 199235 184520 187150 186092 190971 190507 192703 182211 166129 168740 181770 166639 168241
6930 168241 157257 167141 152647 161628 150563 153605 161434 149785 131937 141335 122996 129943 129033
6917 129033 112204 114049 104234 96761 91931 99049 103397 96792 85131 96886 99648 101882 89007
6904 89007 86653 90950 90930 79474 98540 80407 71869 83030 65890 53384 53395 77714 68328 53453
6890 53453 43599 37408 54727 60607 35394 44852 57401 62593 61237 73815 71574 52906 79816
6877 79816 92320 78451 72252 77862 82609 72672 76840 81449 95811 99439 73068 83433 82582 94791
$$ packed form
6969B95134K2267j8389l0955K8905j2463k7847O863p053J245q105o657n263q992
6956B28690l562j3480J747r98L384K159J2726l5988J0281J9168j4404O027j1621
6943B04129m894j4715K630j058M879m64K196j0492j6082K611J3030j5131J602
6930A68241j0984R884j4494Q981j1065L042P829j1649j7848R398j8339O947r10
6917A29033j6829J845r815p473m830P118M348o605j1661J1755K762K234j2875
6904H9007k354M297k0j1456J9066j8133q538J1161j7140j2506J1K4319r386j4875
6890E3453r854o191J7319N880k5213R458J2549N192j356J2578k241j8668K6910
6877G9816J2504j3869o199N610M747r937M168M609J4362L628k6371J0365q51J2209
$$ plain form
6863 94791 66288 82871 86913 72347 70382 76681 78909 80919 77101 74191 74375 81891 80422 75895
6849 75895 82743 65211 71128 78668 63544 57705 69052 76908 84555 60161 72046 70572 79836
6836 79836 67438 61981 44908 54896 62554 57706 59834 80689 88266 72320 70083 56617 66716
6823 66716 90282 86591 66747 46042 53885 57235 53558 52058 56835 70147 62390 53914 60321 55868
6809 55868 60487 70201 72220 59348 53961 62368 59255 65101 71024 71789 66455 65624 61028 61732 43415
6794 43415 52005 63357 62513 71037 67767 69604 57930 68324 68680 51358 44950 49660 65410 59270
6780 59270 60320 73794 50924 80196 74558 60193 51788 66694 58567 72125 44601 60660 66524
6767 66524 66308 72998 79432 97448 94108 99395 97225 89213 112973 98888 109648 106592 108012 113891
$$ packed form
6863I4791k8503J6583M042j4566j965O299K228K010l818k910J84P516j469m527
6849G5895O848j7532N917P540j5124n839J1347P856P647k4394J1885j474R264
6836G9836j2398n457j7073R988P658m848K128K0855P577j5946k237j3466J0099
6823F6716K3566l691j9844k0705P843L350l677j500M777J3312p757q476O407m453
6809E5868M619R714K019j2872n387Q407l113N846N923P65n334q31m596P04j8317
6794D3415Q590J1352q44Q524l270J837j1674J0394L56j7322o408M710J5750o140
6780E9270J050J3474k2870K9272n638j4365q405J4906q127J3558k7524J6059N864
6767F6524k16O690O434J8016l340N287k170q012K3760j4085J0760l056J420N879
$$ plain form
6753 113891 120961 126226 128483 132896 144717 144883 157653 151566 166606 163657 159292 177341 188552
6740 188552 197926 212110 222907 217886 228044 239482 260995 287910 303957 331116 375751 396906
6728 396906 453134 523883 587542 653890 730977 830417 975505 1167417 1442850 1883121 2599796
6717 2599796 3536744 4527391 5310074 5730970 5711137 5298142 4678631 3901677 3167506 2541167
6707 2541167 2030332 1614480 1324417 1096935 926796 817267 718390 604515 559594 507274
6697 507274 447554 418834 393622 377331 347872 357648 323016 299474 289763 278712 247863 246029
6685 246029 223492 222812 203903 190338 192489 163838 187088 166630 164155 153431 151895 133885 130328
6672 130328 139261 138908 136174 126966 116152 122416 118190 122254 103499 103116 108794 123823 105049 97517
$$ packed form
6753A13891P070N265K257M413J1821J66J2770o087J5040k949m365J8049J1211
6740A88552R374J4184J0797n021J0158J1438K1513K6915J6047K7159M4635K1155
6728C96906N6228P0749O3659O6348P7087R9440J45088J91912K75433M40271P16675
6717B599796R36948R90647P82683M20896j9833m12995o19511p76954p34171o26339
6707B541167n10835m15852k90063k27482j70139j09529r8877j13875m4921n2320
6697E07274n9720k8720k5212j6291k9459R776l4632k3542r711j1051l0849j834
6685B46029k2537o80j8909j3565K151k8651K3250k0458k475j0724j536j8010l557
6672A30328Q933l53k734r208j0814O264m226M064j8755l83N678J5029j8774p532
$$ plain form
6658 97517 91771 108401 110377 101677 82293 94338 103418 103712 89489 96128 86336 65030 80016
6645 80016 64875 76986 65549 91148 67770 64614 59361 67401 47435 50152 35552 27286 32934
6632 32934 31467 34440 34909 25251 23125 23603 27246 31226 12514 13137 18196 36347 24341 23133 26559
6617 26559 15530 25414 23214 32088 23113 23031 33524 36289 31594 11374 16775 36058 16005 16942
6603 16942 23923 16489 33938 27023 8981 8855 378 -3729 -219 6380 4485 11581 5279 -2146
6589 -2146 6911 21231 9685 4870 10087 -15816 -3788 7249 4430 -237 -17714 -4235 -10172
6576 -10172 -14278 -10596 -16388 -20353 -15235 -13955 -22647 -7546 -13943 -8921 2551 -10741 -2324 -13917
6562 -13917 -5807 -7795 -4222 -10624 -5472 -22176 -24209 -11313 -11962 -9861 -15928 -11477 -4213 1504
$$ packed form
6658I7517n746J6630J976q700j9384J2045R080K94j4223O639r792k1306J4986
6645H0016j5141J2111j1437K5599k3378l156n253Q040j9966K717j4600q266N648
6632C2934j467K973M69r658k126M78L643L980j8712O23N059J8151j2006j208L426
6617B6559j1029R884k200Q874q975q2J0493K765m695k0220N401J9283k0053R37
6603A6942O981p434J7449o915j8042j26q477m107L510O599j895P096o302p425
6589b146R057J4320j1546m815N217k5903J2028J1037k819m667j7477J3479n937
6576a0172m106L682n792l965N118J280q692J5101o397N022J1472j3292Q417j1593
6562a3917Q110j988L573o402N152j6704k033J2896o49K101o067M451P264N717
$$ plain form
6548 1504 -3142 6526 -15619 3998 -11937 1733 -1662 3102 5614 -4217 6427 4519 7584 4837
6534 4837 905 2900 13559 -25 5912 -13156 5356 5017 7009 3661 7348 -5166 -2102 -2259
6520 -2259 2746 -18877 -10398 -1907 -7197 -287 -8892 -10862 -1610 6372 2603 4480 -2447 -5139 -11995
6505 -11995 -2859 -29487 -1328 4436 -2250 -6717 -8657 -17848 2459 -7390 -3375 -16372 -7722 2741
6491 2741 -6483 2297 -8191 -3226 32 1086 -20152 -15753 -21439 2173 -24920 -3001 -29383
6478 -29383 -9668 -23807 -16753 -26803 -18020 -16348 -8572 -28184 -17537 -15638 -15326 -31180 -43264
6465 -43264 -24099 -21790 -18144 -21102 -14833 -32669 -13858 -15999 -32859 -30226 -22233 -29832 -22321 -30230
6451 -30230 -27671 -22706 -21957 -46592 -38952 -27527 -19381 -29848 -20961 -20054 -21864 -28320 -23594 -38021
$$ packed form
6548A504m646R668k2145J9617j5935J3670l395M764K512r831J0644j908L065k747
6534D837l932J995J0659j3584N937j9068J8512l39J992l348L687j2514L064j57
6520b259N005k1623Q479Q491n290O910q605j970R252P982l769J877o927k692o856
6505a1995R136k6628K8159N764o686m467j940r191K0307r849M015j2997Q650J0463
6491B741r224Q780j0488M965L258J054k1238M399n686K3612k7093K1919k6382
6478b9383J9715j4139P054j0050Q783J672P776j9612J0647J899L12j5854j2084
6465d3264J9165K309L646k958O269j7836J8811k141j6860K633P993p599P511p909
6451c0230K559M965P49k4635P640J1425Q146j0467Q887R07j810o456M726j4427
$$ plain form
6437 -38021 -15627 -23887 -24323 -19587 -14327 -10142 -15459 -2165 17413 -4323 30003 12846 2628
6424 2628 -5310 -3603 -6230 -4694 -1383 -3471 -20454 -11506 -37551 -12999 3030 1919 -2369 -11835
6410 -11835 -13754 -15560 -4212 -3964 2259 -3727 -4048 -4872 -8618 -6096 14192 -7438 -1796 -9616 2260
6395 2260 -504 1515 293 -4978 -6115 10929 1485 -2941 25987 7813 5074 -5865 -14329 -5735
6381 -5735 6248 4856 1914 -11973 1698 13392 14439 13222 7231 11657 -3816 -2749 -4055 -1972
6367 -1972 4813 1094 -7554 12617 4933 803 -5933 7091 -5313 1995 -5932 -7104 9103 6861
6353 6861 -1253 19841 -8199 19459 17589 2699 -16175 -15513 5639 1912 -4377 -4270 -14770 -5121
6339 -5121 4110 -15711 8048 -7533 340 -8363 -19041 -22193 -6125 -10149 -4109 -23126 -570
$$ packed form
6437c8021K2394q260m36M736N260M185n317J3294J9578k1736L4326j7157j0218
6424B628p938J707k627J536L311k088j6983Q948k6045K4552J6029j111m288r466
6410a1835j919j806J1348K48O223n986l21q24l746K522K0288k1630N642p820J1876
6395B260k764K019j222n271j137J7044r444m426K8928j8174k739j0939q464Q594
6381e735J1983j392k942j3887J3671J1694J047j217n991M426j5473J067j306K083
6367a972O785l719q648K0171p684m130o736J3024j2404P308p927j172J6207k242
6353F861q114K1094k8040K7658j870j4890j8874O62K1152l727o289J07j0500R649
6339e121R231j9821K3759j5581P873q703j0678l152J6068m024O040j9017K2556
$$ plain form
6326 -570 -17885 -9997 -6563 -12587 1369 -332 -7769 4404 -5974 -11920 -9034 -21118 -3841 -2438
6312 -2438 3283 -27294 -13889 -12777 -6923 -7782 -28707 -10468 192 -27900 -35303 -36446 -24048
6299 -24048 -33052 -12690 -9211 -25295 -28323 -27271 -29618 -24968 -20041 -15948 -9830 -33901 -39206 -25359
6285 -25359 -27493 -14440 -11848 -20688 -23558 -25864 -12135 -27139 -11296 -19325 -7650 -13155 -20343
6272 -20343 -25397 -13671 -8294 -1131 -27387 -10286 -7150 -2326 373 -8272 -10019 -5222 -12895 10502
6258 10502 1542 6691 1128 -6742 -10053 -7876 2376 -2892 12140 8995 -15549 -1504 -13170
6245 -13170 3732 17507 21046 19278 8701 31486 25363 37532 37505 53537 40409 67923 52618
6232 52618 52994 58115 64518 59364 75094 74496 86484 83546 68921 74804 63385 73244 77923 75910
$$ packed form
6326e70j7315P888L434o024J3956j701p437J2173j0378n946K886j2084J7277J403
6312b438N721l0577J3405J112N854q59k0925J8239J0660k8092p403j143J2398
6299b4048r004K0362L479j6084l028J052k347M650M927M093O118k4071n305J3847
6285b5359k134J3053K592q840k870k306J3729j5004J5843q029J1675n505p188
6272b0343n054J1726N377P163k6256J7101L136M824K699q645j747M797p673K3397
6258A0502q960N149n563p870l311K177J0252n268J5032l145k4544J4045j1666
6245a3170J6902J3775L539j768j0577K2785o123J2169k7J6032j3128K7514j5305
6232E2618L76N121O403n154J5730n98J1988k938j4625N883j1419R859M679k013
$$ plain form
6218 75910 73561 68729 63726 69648 59412 52933 66807 70078 50041 40658 38791 65921 38358
6205 38358 39255 39419 50344 48389 53336 54496 44502 51629 48332 42693 38979 47536 49705 43912 42020
6190 42020 41973 40079 60364 27839 56809 41900 37272 33943 35657 35059 40485 45373 33533 36869
6176 36869 34072 59802 68124 49314 46400 46006 50917 50659 55270 42809 54122 68365 54168 54613
6162 54613 55444 68959 83088 67849 73956 85525 76158 63349 81432 83027 91367 88824 100427
6149 100427 88558 89357 110183 107210 108366 112523 113999 128529 116073 127463 131824 154671 154297
6136 154297 156131 138044 154131 155850 194097 194863 201950 198568 201372 213787 236733 258365 269759
6123 269759 317588 348129 374504 447708 522164 648303 827623 1093890 1364200 1580104 1695292
$$ packed form
6218G5910k349m832n003N922j0236o479J3874L271k0037r383j867K7130k7563
6205C8358Q97J64J0925j955M947J160r994P127l297n639l714Q557K169n793j892
6190D2020m7j894K0285l2525K8970j4909m628l329J714n98N426M888j1840L336
6176C6869k797K5730Q322j8810k914l94M911k58M611j2461J1313J4243j4197M45
6162E4613Q31J3515J4129j5239O107J1569r367j2809J8083J595Q340k543J1603
6149A00427j1869P99K0826k973J156M157J476J4530j2456J1390M361K2847l74
6136A54297J834j8087J6087J719L8247P66P087l382K804J2415K2946K1632J1394
6123B69759M7829L0541K6375P3204P4456J26139J79320K66267K70310K15904J15188
$$ plain form
6112 1695292 1701324 1634268 1492010 1339928 1226862 1122624 1080608 1056471 1053255 1054162 1107705
6101 1107705 1180590 1264849 1327327 1395176 1494836 1648782 1815954 1939560 2003942 1997196 1953420
6090 1953420 1886727 1784555 1659505 1540262 1435823 1357708 1263666 1177509 1107003 1062322 1020470
6079 1020470 1011605 1055512 1175006 1343211 1542393 1677970 1730410 1676234 1545168 1370325
6069 1370325 1181956 996639 855667 728747 647105 549244 509806 454912 425993 410438 389771
6058 389771 374206 362917 350028 315877 329967 300951 309991 304271 293294 297709 289481 279969 273741
6045 273741 282912 286327 280692 270819 274925 271973 277911 278069 287031 278103 276842 288819 276752 285585
6031 285585 290460 299647 294190 292102 293621 306167 303817 323828 304979 319093 327502 339436 337004
$$ packed form
6112A695292O032o7056j42258j52082j13066j04238m2016k4137l216R07N3543
6101A107705P2885Q4259O2478O7849R9660J53946J67172J23606O4382o746m3776
6090A953420o6693j02172j25050j19243j04439p8115r4042q6157p0506m4681m1852
6079A020470q865M3907J19494J68205J99182J35577N2440n4176j31066j74843
6069A370325j88369j85317j40972j26920q1642r7861l9438n4894k8919j5555k0667
6058C89771j5565j1289j2889l4151J4090k9016R040n720j0977M415q228r512o228
6045B73741R171L415n635r873M106k952N938J58Q962q928j261J1977j2067Q833
6031B85585M875R187n457k088J519J2546k350K0011j8849J4114Q409J1934k432
$$ plain form
6018 337004 337047 349718 351537 362014 352831 359638 377749 358398 382714 384770 374577 402742 409671
6005 409671 409633 403046 425973 443455 457147 459131 483504 485807 504144 516686 523654 558154 556094
5992 556094 582689 588341 617786 634202 664270 666537 696792 743118 772566 806412 854532 875861
5980 875861 909739 951752 983337 1041256 1123179 1212583 1300919 1393304 1500239 1649013 1857049
5969 1857049 2215704 2829095 3631035 4388333 4875546 5140932 5408121 5886986 6842744 7946667
5959 7946667 8701942 9021933 9045493 9087389 9711975 10852745 11910488 12257725 12059667 11489342
5949 11489342 10799870 10590316 10571921 10345215 9847883 9128613 8297661 7593577 7107243 6731462
5939 6731462 6210053 5656384 5041757 4345733 3686411 3083373 2586116 2193086 1910969 1707106
$$ packed form
6018C37004M3J2671J819J0477r183O807J8111j9351K4316K056j0193K8165O929
6005D09671l8o587K2927J7482J3692J984K4373K303J8337J2542O968L4500k060
5992E56094K6595N652K9445J6416L0068K267L0255M6326K9448L3846M8120K1329
5980H75861L3878M2013L1585N7919Q1923Q9404Q8336R2385J06935J48774K08036
5969A857049L58655O13391Q01940P57298M87213K65386K67189M78865R55758J103923
5959G946667P55275L19991K3560M1896O24586J140770J057743L47237j98058n70325
5949A1489342o89472k09554j8395k26706m97332p19270q30952p04084m86334l75781
5939F731462n21409n53669o14627o96024o59322o03038m97257l93030k82117k03863
$$ plain form
5929 1707106 1553624 1450695 1333429 1252950 1168157 1124492 1081575 1040660 1002108 954183 934082
5918 934082 903019 892140 841687 830817 794253 780800 756119 737202 711456 687308 695016 683746
5906 683746 656209 645501 630118 607222 590938 560529 577857 541834 534937 527031 503637 491786
5894 491786 491989 486909 477280 477242 458931 447353 423202 430133 439564 421260 412249 415953 410828 421885
5880 421885 404285 398680 410852 420376 411633 383457 394766 386933 387896 381532 358939 367261 356544
5867 356544 348745 341305 331998 326465 303295 327315 305603 298456 291634 306857 305961 299406 289686 288647
5853 288647 306620 288933 294163 288772 299690 298494 303182 299455 265053 279011 288059 290063 278421
5840 278421 263396 267749 252632 253965 244311 223337 231356 240665 242763 240587 230001 236277 245369
$$ packed form
5929A707106j53482j02929j17266q0479q4793m3665m2917m0915l8552m7925k0101
5918I34082l1063j0879n0453j0870l6564j3453k4681j8917k5746k4148P708j1270
5906F83746k7537j0708j5383k2896j6284l0409J7328l6023o897p906k3394j1851
5894D91786K03n080r629l8j8311j1578k4151O931R431j8304r011L704n125J1057
5880D21885j7600n605J2172R524q743k8176J1309p833R63o364k2593Q322j0717
5867C56544p799p440r307n533k3170K4020k1712p147o822J5223q96o555r720j039
5853B88647J7973j7687N230n391J0918j196M688l727l4402J3958R048K004j1642
5840B78421j5025M353j5117J333r654k0974Q019R309K098k176j0586O276R092
$$ plain form
5827 245369 265127 246879 245038 241824 249419 255781 254366 251200 255102 243275 251970 252610 246100 251043
5813 251043 226325 262121 248570 247359 254554 260470 259321 249641 252582 272868 255296 266932 276936
5800 276936 262205 273602 264825 269353 281620 299598 302042 302846 298635 299198 310577 320625 321961
5787 321961 322394 325554 319887 349948 350102 356180 393815 385415 405219 447573 463383 475282 511835
5774 511835 546012 593787 643437 687824 794081 907423 1059722 1222604 1439482 1661495
5764 1661495 1914021 2139651 2339685 2460868 2520460 2509685 2437230 2315217 2133422 1955462
5754 1955462 1777101 1611790 1460863 1364586 1275637 1224427 1168415 1161424 1171499 1168804 1206604
5743 1206604 1239293 1331539 1428648 1564673 1769240 2031110 2373161 2764052 3173083 3600416
$$ packed form
5827B45369J9758j8248j841l214P595O362j415l166L902j1827Q695O40o510M943
5813B51043k4718L5796j3551j211P195N916j149r680K941K0286j7572J1636J0004
5800B76936j4731J1397q777M528J2267J7978K444Q04m211N63J1379J0048J336
5787C21961M33L160n667L0061J54O078L7635q400J9804M2354J5810J1899L6553
5774E11835L4177M7775M9650M4387J06257J13342J52299J62882K16878K22013
5764A661495K52526K25630K00034J21183N9592j0775p2455j22013j81795j77960
5754A955462j78361j65311j50927r6277q8949n1210n6012o991J0075k695L7800
5743A206604L2689R2246R7109J36025K04567K61870L42051L90891M09031M27333
$$ plain form
5733 3600416 3989140 4317590 4528369 4673552 4697364 4583708 4389999 4107124 3761386 3398113
5723 3398113 3025662 2660824 2334253 2070538 1843944 1645831 1505219 1400751 1337599 1304544
5713 1304544 1285211 1286836 1316579 1350998 1409333 1490338 1638875 1779377 1975874 2208808 2457173
5702 2457173 2715771 2938011 3084561 3145849 3109848 2980837 2779362 2530602 2266751 1972677
5692 1972677 1697443 1483438 1293398 1154734 1008399 923421 829114 762383 715850 665384
5682 665384 644703 625037 599934 574269 553662 533306 524484 516964 506290 512643 507015 482945
5670 482945 459901 458154 447728 435325 424290 410801 410521 405039 393684 393437 370264 369736 375073
5657 375073 366271 356713 345082 339478 331816 325791 326446 335593 349390 327374 316035 322711 323335 333997
$$ packed form
5733C600416L88724L28450K10779J45183K3812j13656j93709k82875l45738l63273
5723C398113l72451l64838l26571k63715k26594j98113j40612j04468o3152l3055
5713A304544j9333J625K9743L4419N8335Q1005J48537J40502J96497K32934K48365
5702B457173K58598K22240J46550O1288l6001j29011k01475k48760k63851k94074
5692A972677k75234k14005j90040j38664j46335q4978r4307o6731m6533n0466
5682F65384k0681j9666k5103k5665k0607k0356q822p520j0674O353n628k4070
5670D82945k3044j747j0426j2403j1035j3489k80n482j1355k47k3173n28N337
5657C75073q802r558j1631n604p662o025O55R147J3797k2016j1339O676O24J0662
$$ plain form
5643 333997 345690 329236 342649 339741 332402 323928 332300 346331 352667 347437 342181 337146 348697
5630 348697 347395 357058 361001 364559 367527 375288 360140 371132 393481 418825 394564 404188 407392
5617 407392 415081 439076 453538 457673 489377 501088 512573 539572 553275 569374 602062 655313
5605 655313 675238 724269 766691 845759 949935 1062975 1178363 1343863 1531306 1752827
5595 1752827 1949310 2160442 2374514 2523768 2624878 2647429 2639357 2549266 2439984 2315523
5585 2315523 2181976 2044382 1932213 1856989 1804092 1777460 1788151 1816495 1884262 1962714 2107759
5574 2107759 2277043 2459792 2718657 3016882 3364166 3739066 4131609 4561663 4999988 5373781
5564 5373781 5748841 5997644 6189074 6258591 6181501 6025778 5772761 5525303 5237291 4971258
$$ packed form
5643C33997J1693j6454J3413k908p339q474Q372J4031O336n230n256n035J1551
5630C48697j302R663L943L558K968P761j5148J0992K2349K5344k4261R624L204
5617D07392P689K3995J4462M135L1704J1711J1485K6999J3703J6099L2688N3251
5605F55313J9925M9031M2422P9068J04176J13040J15388J65500J87443K21521
5595A752827J96483K11132K14072J49254J01110K2551q072r0091j09282j24461
5585B315523j33547j37594j12169p5224n2897k6632J0691K8344O7767P8452J45045
5574B107759J69284J82749K58865K98225L47284L74900L92543M30054M38325L73793
5564E373781L75060K48803J91430O9517p7090j55723k53017k47458k88012k66033
$$ plain form
5554 4971258 4758360 4612876 4494695 4441227 4433974 4444375 4535128 4638505 4734146 4870084 4986860
5543 4986860 5124836 5247860 5357709 5484131 5624697 5798137 5962830 6112963 6216587 6263886
5533 6263886 6237467 6132828 5968973 5723156 5430994 5130209 4819557 4498189 4230312 3976209
5523 3976209 3735961 3524094 3333294 3140979 2956886 2755981 2616819 2462217 2293584 2125835
5513 2125835 1991628 1855604 1747856 1620492 1498881 1392994 1305471 1222938 1149510 1057882
5503 1057882 1016190 974073 924494 887196 831336 807627 791233 768354 727172 696910 684293
5492 684293 665349 641252 626646 574978 576568 562362 528874 524024 498825 491629 490611 455783
5480 455783 420646 411045 416199 413908 397986 390484 381721 367683 361067 339180 350083 344471 333072
$$ packed form
5554D971258k12898j45484j18181n3468p253J0401R0753J03377R5641J35938J16776
5543D986860J37976J23024J09849J26422J40566J73440J64693J50133J03624M7299
5533F263886k6419j04639j63855k45817k92162l00785l10652l21368k67877k54103
5523C976209k40248k11867j90800j92315j84093k00905j39162j54602j68633j67749
5513B125835j34207j36024j07748j27364j21611j05887q7523q2533p3428r1628
5503A057882m1692m2117m9579l7298n5860k3709j6394k2879m1182l0262j2617
5492F84293j8944k4097j4606n1668J590j4206l3488m850k5199p196j018l4828
5480D55783l5137r601N154k291j5922p502q763j4038o616k1887J0903n612j1399
$$ plain form
5467 333072 320751 301308 304458 282511 294078 294258 279607 272638 244872 244864 244385 241465 239265 230035
5453 230035 230195 203126 222613 239408 203712 206952 194842 190418 191197 185860 196428 195099 177826
5440 177826 173954 155126 175787 171283 167497 196342 167029 170217 172574 167952 173692 167446 160675
5427 160675 149075 153158 145064 143213 153522 155878 149858 136513 123656 123294 120305 122435 130694 121890
5413 121890 135262 116560 140621 123124 113214 130960 133051 106703 121044 121460 139693 126113
5401 126113 134378 150871 137762 136338 136021 131826 131222 130864 137868 127696 113097 117957 116118 120616
5387 120616 130408 127536 120484 143314 119278 129899 144732 152527 158818 144734 155677 136487 129942
5374 129942 151473 138253 155444 151974 138914 148733 151830 145889 153682 147590 141204 159013 151094
$$ packed form
5467C33072j2321j9443L150k1947J1567J80j4651o969k7766qm79k920k200r230
5453B30035J60k7069J9487J6795l5696L240j2110m424P79n337J0568j329j7273
5440A77826l872j8828K0661m504l786K8845k9313L188K357m622N740o246o771
5427A60675j1600M083q094j851J0309K356o020j3345j2857l62k989K130Q259q804
5413A21890J3372j8702K4061j7497r910J7746K091k6348J4341M16J8233j3580
5401A26113Q265J6493j3109j424l17m195o04l58P004j0172j4599M860j839M498
5387A20616R792k872p052K2830k4036J0621J4833P795O291j4084J0943j9190o545
5374A29942K1531j3220J7191l470j3060R819L097n941P793o092o386J7809p919
$$ plain form
5361 151094 152794 161521 156587 161751 162471 149133 151002 147656 171028 189325 169133 179291 188698
5348 188698 202527 202249 194956 208627 226022 212615 233930 231430 233746 262046 282554 277564 281790
5335 281790 300972 315113 320097 317094 337289 367197 382137 370577 381467 400732 438769 454368
5323 454368 456333 485637 516886 540081 566985 582371 618337 683822 736654 783308 845305 927921
5311 927921 1031786 1115695 1196464 1307396 1415111 1546942 1670584 1772419 1859775 1957549
5301 1957549 2018531 2072413 2137426 2201013 2258789 2318098 2386342 2419942 2485256 2547199 2616668
5290 2616668 2695483 2801260 2909896 3057011 3192622 3359766 3510009 3668359 3786454 3849146
5280 3849146 3911434 3922118 3902575 3810256 3717982 3569506 3435795 3251830 3092710 2934502
$$ packed form
5361A51094J700Q727m934N164P20j3338J869l346K3372J8297k0192J0158R407
5348A88698J3829k78p293J3671J7395j3407K1315k500K316K8300K0508m990M226
5335B81790J9182J4141M984l003K0195K9908J4940j1560J0890J9265L8037J5599
5323D54368J965K9304L1249K3195K6904J5386L5966O5485N2832M6654O1997Q2616
5311I27921J03865Q3909Q0769J10932J07715J31831J23642J01835Q7356R7774
5301A957549O0982N3882O5013O3587N7776N9309O8244L3600O5314O1943O9469
5290B616668P8815J05777J08636J47115J35611J67144J50243J58350J18095O2692
5280C849146O2288J0684j9543r2319r2274j48476j33711j83965j59120j58208
$$ plain form
5270 2934502 2785966 2655394 2516998 2385576 2290229 2252886 2191426 2172315 2124330 2125904 2129860
5259 2129860 2150214 2151539 2119947 2087064 2056896 1987865 1900717 1782778 1678218 1556688 1449016
5248 1449016 1307800 1202158 1097365 1028479 929074 862900 796268 739303 698370 655958 603655
5237 603655 577201 543097 508558 505093 460792 451272 434973 422471 417205 374738 375351 373713 370186
5224 370186 363587 357346 354313 362762 341508 345792 318185 317868 300287 313373 294131 297957 272244
5211 272244 273929 283530 280837 263854 261109 260405 269571 264614 257392 262610 259393 293989 260817 272103
5197 272103 254659 251191 277194 288056 279901 290730 279923 305796 284233 279037 306774 309082
5185 309082 334539 313384 328209 337889 350535 381141 403103 425727 476193 533928 635263 706220
$$ packed form
5270B934502j48536j30572j38396j31422r5347l7343o1460j9111m7985J574L956
5259B129860K0354J325l1592l2883l0168o9031q7148j17939j04560j21530j07672
5248A449016j41216j05642j04793o8886r9405o6174o6632n6965m0933m2412n2303
5237F03655k6454l4104l4539l465m4301r520j6299j2502n266m2467O13j638l527
5224C70186o599o241l033Q449k1254M284k7607l17j7581J3086j9242L826k5713
5211B72244J685R601k693j6983k745p04R166m957p222N218l217L4596l3172J1286
5197B72103j7444l468K6003J0862q155J0829j0807K5873k1563n196K7737K308
5185C09082K5457k1155J4825R680J2646L0606K1962K2624N0466N7735J01335P0957
$$ plain form
5173 706220 834795 927889 1035687 1115538 1141983 1136051 1077514 1020140 956707 909021 831076
5162 831076 784960 751412 733053 727033 743498 731734 723634 725637 751627 767101 775354 836778
5150 836778 905141 1003914 1139422 1285964 1464337 1640911 1817449 2028932 2238187 2498859
5140 2498859 2715811 2862468 2876743 2803357 2625011 2417410 2168084 1961837 1749441 1612593
5130 1612593 1500841 1412621 1340154 1281183 1257878 1228144 1210402 1191027 1220189 1272473 1384560
5119 1384560 1484934 1627675 1759355 1955057 2171745 2426910 2686996 2987576 3230085 3435469
5109 3435469 3550619 3546190 3413786 3171791 2896503 2570589 2267079 1997800 1772927 1594229
5099 1594229 1455329 1328523 1270992 1234507 1210869 1168440 1159544 1141822 1133125 1126966 1155394 1177222
$$ packed form
5173G06220J28575R3094J07798P9851K6445n932n8537n7374o3433m7686p7945
5162H31076m6116l3548j8359o020J6465j1764q100K003K5990J5474Q253O1424
5150H36778O8363R8773J35508J46542J78373J76574J76538K11483K09255K60672
5140B498859K16952J46657J4275p3386j78346k07601k49326k06247k12396j36848
5130A612593j11752q8220p2467n8971k3305k9734j7742j9375K9162N2284J12087
5119A384560J00374J42741J31680J95702K16688K55165K60086L00580K42509K05384
5109C435469J15150m429j32404k41995k75288l25914l03510k69279k24873j78698
5099A594229j38900j26806n7531l6485k3638m2429q896j7722q697o159K8428K1828
$$ plain form
5087 1177222 1247425 1395721 1554448 1743437 1927553 2103164 2230896 2320941 2314694 2254411
5077 2254411 2131984 1947869 1730511 1515683 1326817 1166695 1019314 934328 835665 772458
5067 772458 737050 670486 652181 634385 614276 574804 558876 530925 510634 491911 521228 522875
5055 522875 568211 604525 652535 706465 724861 765823 753905 730689 684438 646039 589265 532093
5043 532093 454520 435656 380902 359026 310291 287287 272020 251945 257953 239597 219785 200445
5031 200445 197588 219224 209798 185380 203513 189994 188226 175865 188837 174326 193840 186417
5019 186417 200379 177906 188307 159468 170251 156889 152370 134929 148591 135231 125289 124429
5007 124429 143376 129083 139246 125132 110197 152655 113288 125693 100273 115958 124122 117196
$$ packed form
5087A177222P0203J48296J58727J88989J84116J75611J27732R0045o247o0283
5077B254411j22427j84115k17358k14828j88866j60122j47381q4986r8663o3207
5067G72458l5408o6564j8305j7796k0109l9472j5928k7951k0291j8723K9317J647
5055E22875M5336L6314M8010N3930J8396M0962j1918k3216m6251l8399n6774n7172
5043E32093p7573j8864n4754k1876m8735k3004j5267k0075O008j8356j9812j9340
5031B00445k857K1636r426k4418J8133j3519j768j2361J2972j4511J9514p423
5019A86417J3962k2473J0401k8839J0783j3362m519j7441J3662j3360r942q60
5007A24429J8947j4293J0163j4114j4935M2458l9367J2405k5420J5685Q164o926
$$ plain form
4995 117196 115888 123317 117094 116880 108904 100388 107625 100925 102417 101736 104880 83411 89812 86263 110469
4980 110469 89472 102663 91132 74404 91453 90422 92780 90911 87499 83182 83023 73524 74338 91846
4966 91846 89084 79491 76238 80217 84533 76784 93543 71198 81085 109388 98451 90219 93218 103964
4952 103964 117621 101313 103469 103874 110029 114604 109493 117379 118234 126210 150686 132398 134829 136852
4938 136852 174384 192240 212002 228868 232141 215062 232610 214466 222218 237931 227873 202990
4926 202990 205257 206758 208399 183552 186200 175349 186150 181415 186832 183363 209199 216134 217759
4913 217759 240254 260715 284689 312453 306619 310402 309874 313466 286720 286738 296815 303921 310566 299463
4899 299463 311812 338212 336647 344548 346685 372610 406071 420027 446148 462849 495036 530565
$$ packed form
4995A17196j308P429o223k14p976q516P237o700J492o81L144k1469O401l549K4206
4980A10469k0997J3191j1531j6728J7049j031K358j869l412m317j59r499Q14J7508
4966I1846k762r593l253L979M316p749J6759k2345R887K8303j0937q232K999J0746
4952A03964J3657j6308K156M05O155M575n111P886Q55P976K4476j8288K431K023
4938A36852L7532J7856J9762J6866L273j7079J7548j8144P752J5713j0058k4883
4926B02990K267J501J641k4847K648j0851J0801m735N417l469K5836O935J625
4913B17759K2495K0461K3974K7764n834L783n28L592k6746J8J0077P106O645j1103
4899B99463J2349K6400j565P901K137K5925L3461J3956K6121J6701L2187L5529
$$ plain form
4887 530565 535405 560703 581871 623873 660699 684143 712562 751031 789539 825563 838846 847100
4875 847100 882551 913631 960523 971601 1023845 1045296 1072342 1070684 1082142 1103796 1104590 1126652
4863 1126652 1155978 1186534 1208104 1267461 1325194 1420540 1524580 1631187 1739069 1877095 2028102
4852 2028102 2211679 2406419 2605712 2799741 2994827 3178891 3323544 3410909 3506867 3570272
4842 3570272 3608511 3661709 3755220 3922522 4158229 4501455 4858993 5173299 5412612 5538106
4832 5538106 5557619 5531998 5483956 5493109 5570092 5706656 5965078 6314349 6708341 7037061 7322705
4821 7322705 7481807 7534905 7435899 7205401 6889899 6559234 6199468 5902969 5653552 5514238
4811 5514238 5487446 5526434 5544394 5481455 5331758 5122826 4841768 4550465 4250206 4021023
$$ packed form
4887E30565M840K5298K1168M2002L6826K3444K8419L8469L8508L6024J3283Q254
4875H47100L5451L1080M6892J1078N2244K1451K7046j658J1458K1654P94K2062
4863A126652K9326L0556K1570N9357N7733R5346J04040J06607J07882J38026J51007
4852B028102J83577J94740J99293J94029J95086J84064J44653Q7365R5958O3405
4842C570272L8239N3198R3511J67302K35707L43226L57538L14306K39313J25494
4832E538106J9513k5621m8042R153P6983J36564K58422L49271L93992L28720K85644
4821G322705J59102N3098r9006k30498l15502l30665l59766k96499k49417j39314
4811E514238k6792L8988J7960o2939j49697k08932k81058k91303l00259k29183
$$ plain form
4801 4021023 3816928 3659922 3551999 3472525 3422673 3357364 3263004 3133053 2975794 2808856
4791 2808856 2618118 2411156 2249847 2080025 1940814 1793287 1659647 1521792 1434796 1346095
4781 1346095 1261655 1188591 1129117 1098023 1055626 1025753 1001095 984810 983963 953038 937525 920502
4769 920502 898552 882241 859441 811599 791423 768138 728742 696905 664435 632182 610718 577508
4757 577508 552417 532934 511388 497453 486278 469582 449957 438107 416590 393892 376110 356700
4745 356700 347155 332128 307744 306815 289324 286146 271215 269770 262687 251527 260229 231807 222543
4732 222543 227358 234875 224503 208661 191123 195814 215563 191368 194990 186643 181788 163150 166656
4719 166656 165456 158593 166447 170702 145937 152350 151613 162376 148637 139416 141803 128954 115706
$$ packed form
4801D021023k04095j57006j07923p9474m9852o5309r4360j29951j57259j66938
4791B808856j90738k06962j61309j69822j39211j47527j33640j37855q6996q8701
4781A346095q4440p3064n9474l1094m2397k9873k4658j6285q47l0925j5513j7023
4769I20502k1950j6311k2800m7842k0176k3285l9396l1837l2470l2253k1464l3210
4757E77508k5091j9483k1546j3935j1175j6696j9625j1850k1517k2698j7782j9410
4745C56700r545j5027k4384r29j7491l178j4931j445p083j1160Q702k8422r264
4732B22543M815P517j0372j5842j7538M691J9749k4195L622q347m855j8638L506
4719A66656j200o863P854M255k4765O413p37J0763j3739r221K387j2849j3248
$$ plain form
4706 115706 118388 130958 117946 131448 130120 115800 114987 112530 103643 91401 110165 106032 97604
4693 97604 97900 95820 109864 103854 99921 86518 107956 91693 101712 107438 88138 77987 76353
4680 76353 86519 86733 87043 90802 80001 81438 80226 65082 74050 77003 63819 67278 55240 69098
4666 69098 73034 62625 61506 68164 61088 81892 81432 50976 71401 69699 68408 63388 61653 66682
4652 66682 67401 60970 54042 51238 57099 58757 55090 62570 46398 54326 44648 65433 52851 70495
4638 70495 57590 47619 47541 55181 52068 56178 39693 56970 60310 60904 33559 61729 42020 66732
4624 66732 55388 45357 43703 71605 50355 47015 46879 49437 63160 42334 62061 60930 66022
4611 66022 71596 42145 51664 64114 72578 76639 62601 66160 80927 64284 83245 81054 84892
$$ packed form
4706A15706K682J2570j3012J3502j328j4320q13k457q887j2242J8764m133q428
4693I7604K96k080J4044o010l933j3403K1438j6263J0019N726j9300j0151j634
4680G6353J0166K14L10L759j0801J437j212j5144Q968K953j3184L459j2038J3858
4666F9098L936j0409j119O658p076K0804m60l0456K0425j702j291n020j735N029
4652F6682P19o431o928k804N861J658l667P480j6172P928r678K0785j2582J7644
4638G0495j2905r971p8P640l113M110j6485J7277L340N94k7345K8170j9709K4712
4624F6732j1344j0031j654K7902k1250l340j36K558J3723k0826J9727j131N092
4611F6022N574k9451R519J2450Q464M061j4038L559J4767j6643J8961k191L838
$$ plain form
4598 84892 107383 80197 85838 82810 84223 95198 85694 101245 87626 71801 82039 66846 70489
4585 70489 90373 82708 82533 75748 88498 73051 83380 76573 87101 80276 91594 84471 92677
4572 92677 98022 88534 75896 99554 83903 87534 84630 82226 94938 93019 93458 85410 79455 66930
4558 66930 88909 69148 92197 81722 91329 83592 80945 80043 77991 86886 93150 79656 67987
4545 67987 78131 66707 74364 66387 62050 79690 64675 75344 61341 54279 67002 59651 67089
4532 67089 68566 53984 65953 43434 63040 56608 44899 55526 45163 52805 50632 44739 54106
4519 54106 49335 29929 53751 47801 29514 37873 47245 17099 31054 32259 36447 39621 39963 40925
4505 40925 28526 29116 25322 5022 30643 37181 27115 40286 27980 25173 24445 37192 36577 22020
$$ packed form
4598H4892K2491k7186N641l028J413J0975r504J5551j3619j5825J0238j5193L643
4585G0489J9884p665j75o785J2750j5447J0329o807J0528o825J1318p123Q206
4572I2677N345r488j2638K3658j5651L631k904k404J2712j919M39q048n955j2525
4558F6930K1979j9761K3049j0475R607p737k647r02k052Q895O264j3494j1669
4545F7987J0144j1424P657p977m337J7640j5015J0669j4003p062J2723p351P438
4532F7089J477j4582J1969k2519J9606o432j1709J0627j0363P642k173n893R367
4519E4106m771j9406K3822n950j8287Q359R372l0146J3955J205M188L174L42R62
4505D0925j2399N90l794k0300K5621O538j0066J3171j2306k807p28J2747o15j4557
$$ plain form
4491 22020 24610 43150 23212 39216 39002 25817 29107 21743 14350 15725 18997 25405 25293 39936
4477 39936 17828 27804 29502 10813 23274 41507 34978 31897 18374 13372 16228 10851 33639
4464 33639 26640 34466 23910 20197 29510 48413 22836 13096 34723 24269 44162 23843 13353
4451 13353 18600 43782 40552 38765 35157 40579 50523 42941 51349 39077 46554 37867 28889 48122
4437 48122 42377 53577 53305 37360 42699 55529 45226 35820 38849 58161 57521 33173 60812
4424 60812 40569 57537 60188 58536 55980 61261 69078 61500 64221 70862 62589 76036 71535 61575
4410 61575 70678 72241 80816 77974 78791 70264 73195 65637 64601 88578 99324 102687 108180 83945
4396 83945 110315 103146 105155 113271 111431 117788 127466 128247 121882 139557 137807 147052 131775 152018
$$ packed form
4491B2020K590J8540j9938J6004k14j3185L290p364p393J375L272O408j12J4643
4477C9936k2108R976J698j8689J2461J8233o529l081j3523n002K856n377K2788
4464C3639o999P826j0556l713R313J8903k5577r740K1627j0454J9893k0319j0490
4451A3353N247K5182l230j787l608N422R944p582Q408j2272P477q687q978J9233
4437D8122n745J1200k72j5945N339J2830j0303r406L029J9312o40k4348K7639
4424F0812k0243J6968K651j652k556N281P817p578K721O641q273J3447m501r960
4410F1575R103J563Q575k842Q17q527K931p558j036K3977J0746L363N493k4235
4396H3945K6370p169K009Q116j840O357R678P81o365J7675j750R245j5277K0243
$$ plain form
4382 152018 146785 170714 163790 172240 184102 166705 162198 187759 193914 203657 215741 217332 223688
4369 223688 233898 263957 267611 254714 260415 272757 290732 315796 322108 326396 340109 349129 360784
4356 360784 386301 400793 387099 420649 445078 451896 481127 504248 529310 535704 542164 550771
4344 550771 543750 527852 502636 481596 439282 396354 353225 325859 317366 265398 269366 241069
4332 241069 235326 215466 225114 199003 209950 191554 192290 179636 218421 221454 203311 198899 190995
4319 190995 177595 177385 156930 158707 141646 147476 145417 129684 143040 132006 142614 134898 113051
4306 113051 114820 129037 125970 142020 141970 131969 134330 148540 116863 133511 109858 101222 86483
4293 86483 79585 105407 78987 83269 85365 74183 65422 64501 65197 82236 59132 56334 61095 53204
$$ packed form
4382A52018n233K3929o924Q450J1862j7397m507K5561O155R743J2084J591O356
4369B23688J0210L0059L654j2897N701J2342J7975K5064O312M288J3713R020J1655
4356C60784K5517J4492j3694L3550K4429O818K9231K3121K5062O394O460Q607
4344E50771p021j5898k5216k1040m2314m2928m3129k7366q493n1968L968k8297
4332B41069n743j9860R648k6111J0947j8396P36j2654L8785L033j8143m412p904
4319A90995j3400k10k0455J777j7061N830k059j5733J3356j1034J0608p716k1847
4306A13051J769J4217l067J6050n0j0001K361J4210l1677J6648k3653q636j4739
4293H6483o898K5822k6420M282K096j1182q761r21O96J7039k3104k798M761p891
$$ plain form
4279 53204 28695 45285 39106 36612 37980 43617 42958 36963 39076 48414 50423 50647 37318 35796
4265 35796 50708 46586 52155 26567 45946 37797 35856 34729 37060 24350 41010 27838 31942
4252 31942 27029 27204 22433 43015 30328 20272 33853 31239 13249 33424 32673 15572 23764
4239 23764 14249 38680 24279 14606 27204 43287 37988 44687 46548 52139 63478 50095 34684
4226 34684 35297 32106 27785 33827 31896 26729 31336 35481 25537 9159 34235 17176 20936 15769
4212 15769 3378 21073 23917 14028 33501 33652 48161 38006 38457 48130 28870 31969 25887 42993
4198 42993 31634 18299 23186 25381 8378 15583 22104 12122 12412 13742 -1602 4800 898 12622
4184 12622 3566 3695 5764 -790 1833 6404 -7372 7060 -381 4194 7343 10692 17286 10500
$$ packed form
4279E3204k4509J6590o179k494J368N637o59n995K113R338K009K24j3329j522
4265C5796J4912m122N569k5588J9379q149j941j127K331j2710J6660j3172M104
4252C1942m913J75m771K0582j2687j0056J3581k614j7990K0175p51j7101Q192
4239B3764r515K4431j4401r673J2598J6083n299O699J861N591J1339j3383j5411
4226C4684O13l191m321O042j931n167M607M145r944j6378K5076j7059L760n167
4212A5769j2391J7695K844r889J9473J51J4509j0155M51R673j9260L099o082J7106
4198D2993j1359j3335M887K195j7003P205O521r982K90J330j5344O402l902J1724
4184A2622r056J29K069o554K623M571j3776J4432p441M575L149L349O594o786
$$ plain form
4170 10500 17684 5609 -3033 -5952 3969 -3783 19216 -1899 12229 4460 21224 5283 -14467
4157 -14467 -1870 8009 9684 4123 9236 -10109 2328 -7256 -2273 2306 -13166 -6005 6472
4144 6472 6748 5342 -15113 -663 13075 3794 4660 -5604 -6567 -5145 12976 11703 11679 11193 30235
4129 30235 18635 19035 13201 19555 14876 25687 8268 1778 11285 8933 14077 24972 -6203 18974
4115 18974 19035 40132 32453 29767 33631 45083 21520 23200 17180 30272 43194 41635 24272 46460
4101 46460 42619 58902 59011 53713 53254 51851 73641 52644 82704 62544 82120 83038 59889 58973
4087 58973 62319 67141 67104 77212 67564 74970 72744 94105 83441 70530 84307 81752 92793 84485
4073 84485 67954 103600 109223 115600 108725 97855 114569 141817 139056 132843 134366 144062 128377
$$ packed form
4170A0500P184j2075q642k919R921p752K2999k1115J4128p769J6764j5941j9750
4157a4467J2597R879J675n561N113j9345J2437r584M983M579j5472P161J2477
4144F472K76j406k0455J4450J3738r281Q66j0264r63J422J8121j273k4m86J9042
4129C0235j1600M00n834O354m679J0811j7419o490R507k352N144J0895l1175K5177
4115A8974O1K1097p679k686L864J1452k3563J680o020J3092J2922j559j7363K2188
4101D6460l841J6283J09n298m59j403K1790k0997L0060k0160J9576R18k3149r16
4087E8973L346M822l7J0108r648P406k226K1361j0664j2911J3777k555J1041q308
4073H4485j6531L5646N623O377o875j0870J6714K7248k761o213J523R696j5685
$$ plain form
4060 128377 132713 130730 125376 140116 125947 141899 133938 144065 155567 147942 172794 155109 162609
4047 162609 142632 144219 151881 175546 174215 174603 189916 183329 187834 193726 206047 199162 207302 215304
4033 215304 200989 194862 191226 201685 185968 173532 170607 186063 174255 178040 175726 175303 175016
4020 175016 174747 162666 161149 167564 156729 164752 160702 153593 153053 141820 141070 136993 145675 134083
4006 134083 141786 131910 114308 110988 118947 122853 118545 109963 123299 99320 96317 107601 97082
3993 97082 103259 91196 90785 68155 69348 49793 59725 59104 67276 67713 59980 50783 55353 62114 46662
3978 46662 40322 48190 39907 42152 29307 31545 37326 27113 27966 5048 17297 13940 22955 14152
3964 14152 17031 9691 16272 8062 8537 561 19304 20175 9237 -1120 -4582 12236 4144 2950
$$ packed form
4060A28377M336j983n354J4740j4169J5952p961J0127J1502p625K4852j7685P500
4047A62609j9977J587P662K3665j331L88J5313o587M505N892J2321o885Q140Q002
4033B15304j4315o127l636J0459j5717j2436k925J5456j1808L785k314m23k87
4020A75016k69j2081j517O415j0835Q023m050p109n40j1233p50m077Q682j1592
4006A34083P703r876j7602l320P959L906m308q582J3336k3979l003J1284j0519
3993I7082O177j2063m11k2630J193j9555R932o21Q172M37p733r197M570O761j5452
3978D6662o340P868q283K245j2845K238N781j0213Q53k2918J2249l357R015q803
3964A4152K879p340O581q210M75p976J8743Q71j0938j0357l462J6818q092j194
$$ plain form
3950 2950 -6864 -2493 -1385 13054 -2160 1003 -9830 -1777 -4092 -15555 -3539 -2491 356 -1681
3936 -1681 -20315 -7123 1285 -10428 -9715 -22142 -6625 1194 -16745 -13561 -6541 -256 -7424 -12348
3922 -12348 -10961 -27596 -16898 -7143 -15151 -31945 -28986 -9312 -23738 -7292 -4873 -15836 -29848
3909 -29848 -36746 -12468 -24733 -26891 -17611 -23095 -23546 -26423 -35617 -23627 -18419 -31349 -25724 -40566
3895 -40566 -38490 -22295 -27771 -19194 -32213 -33267 -40560 -48628 -5483 -15427 -30427 -20265 -28807
3882 -28807 -22893 -37351 -37232 -28141 -45391 -28047 -28199 -38135 -36978 -34084 -23064 -56967 -49232 -44318
3868 -44318 -33518 -53836 -33730 -44645 -30890 -37456 -44979 -19967 -38932 -30728 -40727 -29842 -38954
3855 -38954 -33173 -36596 -34960 -35570 -54269 -34995 -59694 -46595 -40767 -45729 -49704 -44927 -45145 -50033
$$ packed form
3950B950r814M371J108J4439j5214L163j0833Q053k315j1463J2016J048K847k037
3936a681j8634J3192Q408j1713P13j2427J5517P819j7939L184P020O285p168m924
3922a2348J387j6635J0698R755q008j6794K959J9674j4426J6446K419j0963j4012
3909b9848o898K4278j2265k158R280n484m51k877r194J1990N208j2930N625j4842
3895d0566K076J6195n476Q577j3019j054p293q068M3145r944j5000J0162q542
3882b8807N914j4458J19R091j7250J7344j52r936J157K894J1020l3903P735M914
3868d4318J0800k0318K0106j0915J3755o566p523K5012j8965Q204r999J0885r112
3855c8954N781l423J636o10j8699J9274k4699J3099N828m962l975M777k18m888
$$ plain form
3841 -50033 -48404 -50707 -50936 -39309 -34815 -51773 -39436 -54097 -21395 -38741 -50593 -52154 -29378
3828 -29378 -51888 -44841 -50024 -26110 -37298 -17705 -28743 -51585 -51946 -44151 -25812 -53230 -35155
3815 -35155 -45839 -40127 -37342 -38871 -29048 -27791 -50555 -39772 -42160 -43068 -54578 -44720 -54033 -36222
3801 -36222 -44699 -50887 -34757 -40080 -33389 -42760 -29482 -38020 -36401 -32906 -31176 -36444 -40534 -55668
3787 -55668 -19867 -44714 -31143 -43801 -31632 -35867 -43732 -48359 -40762 -31360 -38672 -26197 -46729
3774 -46729 -38096 -43000 -25967 -59440 -64907 -63727 -24202 -31027 -42731 -46954 -34702 -35139 -49692
3761 -49692 -30617 -43131 -54908 -34745 -25669 -32288 -44316 -44379 -38026 -48050 -40622 -47834 -32246
$$ packed form
3841e0033J629k303k29J1627M494j6958J2337j4661L2702j7346j1852j561K2776
3828b9378k2510P047n183K3914j1188J9593j1038k2842l61P795J8339k7418J8075
3815c5155j0684N712K785j529R823J257k2764J0783k388r08j1510R858r313J7811
3801c6222q477o188J6130n323O691r371J3278q538J619L495J730n268m090j5134
3787e5668L5801k4847J3571j2658J2169m235p865m627P597R402p312J2475k0532
3774d6729Q633m904J7033l3473n467J180L9525o825j1704m223J2252m37j4553
3761d9692J9075j2514j1777K0163R076o619j2028o3O353j0024P428p212J5588
$$ [...]
##END NTUPLES=NMR SPECTRUM
##END=
