##TITLE=abcd
##JCAMPDX= 6.0         $$ Bruker NMR JCAMP-DX V2.0
##DATA TYPE= NMR SPECTRUM
##DATA CLASS= NTUPLES
##ORIGIN= UXNMR, Bruker Analytische Messtechnik GmbH
##OWNER= root
$$ XWIN-NMR		Version 3.5
$$ Thu Jul 23 19:22:24 2026 Russian Standard Time (UT+4h)  servis@DPX200
##.OBSERVE FREQUENCY= 200.131235884673
##.OBSERVE NUCLEUS= ^1H
##.ACQUISITION MODE= SIMULTANEOUS
##.ACQUISITION SCHEME= undefined
##.AVERAGES= 32
##.DIGITISER RES= 18
##SPECTROMETER/DATA SYSTEM= spect
##.PULSE SEQUENCE= zg
##.SOLVENT NAME= MeOD
##.SHIFT REFERENCE= (INTERNAL, MeOD, 0, 16.4885)
##AUDIT TRAIL= $$ (NUMBER, WHEN, WHO, WHERE, WHAT)
$$ ##TITLE= Audit trail, XWIN-NMR		Version 3.5
$$ ##JCAMPDX= 5.01
$$ ##ORIGIN= Bruker BioSpin GmbH
$$ ##OWNER= servis
$$ F:\spectra/data/av/nmr/H1/1/pdata/1/auditp.txt
$$ ##AUDIT TRAIL=  $$ (NUMBER, WHEN, WHO, WHERE, WHAT)
(   1,<2026-07-23 19:21:28.17 +0400>,<servis>,<DPX200>,
      <created by zg, POWCHK disabled, PULCHK disabled
       configuration hash MD5:
       00 E9 B6 7A A2 85 ED C7 34 08 36 98 17 FE 4E 26
       data hash MD5: 32K
       71 2F FF 3E 8C 36 FF 33 8C 95 CC 3B 9F 3D 52 0C>)
(   2,<2026-07-23 19:21:29.79 +0400>,<servis>,<DPX200>,
      <Start of raw data processing
       efp BC_mod = 2 LB = 0.05 FT_mod = 6 PKNL = 1 PHC0 = -416.59 PHC1 = 3.101563 SI = 16K 
       data hash MD5: 16K
       74 8B 7C EE 04 92 98 FC 62 0B C6 F2 60 A1 24 9E>)
(   3,<2026-07-23 19:21:49.82 +0400>,<servis>,<DPX200>,
      <pk PHC0 = -115.4326 PHC1 = 0 
       data hash MD5: 16K
       BA B2 B5 EE 42 38 EA E3 85 85 0B D2 51 7A 5C 82>)
$$ ##END=
$$ 
$$ hash MD5
$$ 68 E7 EF B3 3B A2 42 ED 17 2F 41 8A E6 2D 89 87
##$RELAX= 
##$RELAX= 
##$RELAX= 
##$RELAX= 
##$RELAX= 
##$RELAX= 
##$RELAX= 
##$RELAX= 
$$ Bruker specific parameters
$$ --------------------------
##$DU= <F:\spectra>
##$EXPNO= 1
##$NAME= <H1>
##$PROCNO= 1
##$TYPE= <nmr>
##$USER= <av>
##$AMP= (0..31)
100 100 100 100 100 100 100 100 100 100 100 100 100 100 100 100 100 100 
100 100 100 100 100 100 100 100 100 100 100 100 100 100 
##$AQSEQ= 0
##$AQ_mod= 1
##$AUNM= <au_zg>
##$AUTOPOS= <>
##$BF1= 200.13
##$BF2= 200.13
##$BF3= 200.13
##$BF4= 200.13
##$BF5= 500.13
##$BF6= 500.13
##$BF7= 500.13
##$BF8= 500.13
##$BYTORDA= 1
##$CFDGTYP= 0
##$CFRGTYP= 5
##$CHEMSTR= <none>
##$CNST= (0..31)
1 1 145 1 1 1 1 1 1 1 1 1 1 1 1 1 1 1 1 1 1 1 1 1 1 1 1 1 1 1 1 1 
##$CPDPRG= <>
##$CPDPRG1= <>
##$CPDPRG2= <>
##$CPDPRG3= <>
##$CPDPRG4= <mlev>
##$CPDPRG5= <mlev>
##$CPDPRG6= <mlev>
##$CPDPRG7= <mlev>
##$CPDPRG8= <mlev>
##$CPDPRGB= <>
##$CPDPRGT= <>
##$D= (0..31)
0 2 0 0 0 0 0 0 0 0.06 0 0 0 0 0 0 0.0002 0 0 0 0 0 0 0 0 0 0 0 0 0 0 
0 
##$DATE= 1784820087
##$DBL= (0..7)
120 120 120 120 120 120 120 120 
##$DBP= (0..7)
150 150 150 150 150 150 150 150 
##$DBP07= 0
##$DBPNAM0= <>
##$DBPNAM1= <>
##$DBPNAM2= <>
##$DBPNAM3= <>
##$DBPNAM4= <>
##$DBPNAM5= <>
##$DBPNAM6= <>
##$DBPNAM7= <>
##$DBPOAL= (0..7)
0.5 0.5 0.5 0.5 0.5 0.5 0.5 0.5 
##$DBPOFFS= (0..7)
0 0 0 0 0 0 0 0 
##$DE= 6
##$DECBNUC= <off>
##$DECIM= 32
$$ [...]
##$SUBNAM4= <"">
##$SUBNAM5= <"">
##$SUBNAM6= <"">
##$SUBNAM7= <"">
##$SUBNAM8= <"">
##$SUBNAM9= <"">
##$SW= 20.6817932712277
##$SWIBOX= (0..15)
0 0 3 0 0 0 0 0 0 0 0 0 0 0 0 0 
##$SW_h= 4139.07284768212
##$TD= 32768
##$TD0= 1
##$TE= 0
##$TE2= 300
##$TE3= 300
##$TEG= 300
##$TL= (0..7)
0 120 120 120 120 120 120 120 
##$TP= (0..7)
150 150 150 150 150 150 150 150 
##$TP07= 0
##$TPNAME0= <>
##$TPNAME1= <>
##$TPNAME2= <>
##$TPNAME3= <>
##$TPNAME4= <>
##$TPNAME5= <>
##$TPNAME6= <>
##$TPNAME7= <>
##$TPOAL= (0..7)
0.5 0.5 0.5 0.5 0.5 0.5 0.5 0.5 
##$TPOFFS= (0..7)
0 0 0 0 0 0 0 0 
##$TUNHIN= 0
##$TUNHOUT= 0
##$TUNXOUT= 0
##$USERA1= <user>
##$USERA2= <user>
##$USERA3= <user>
##$USERA4= <user>
##$USERA5= <user>
##$V9= 5
##$VALIST= <valist>
##$VCLIST= <CCCCCCCCCCCCCCC>
##$VD= 0
##$VDLIST= <DDDDDDDDDDDDDDD>
##$VPLIST= <PPPPPPPPPPPPPPP>
##$VTLIST= <TTTTTTTTTTTTTTT>
##$WBST= 1024
##$WBSW= 30
##$XGAIN= (0..3)
0 0 0 0 
##$XL= 0
##$YL= 0
##$YMAX_a= 264511
##$YMIN_a= -340574
##$ZGOPTNS= <>
##$ZL1= 120
##$ZL2= 120
##$ZL3= 120
##$ZL4= 120
##$ABSF1= 0
##$ABSF2= 0
##$ABSG= 0
##$ABSL= 0
##$ALPHA= 0
##$AQORDER= 0
##$ASSFAC= 0
##$ASSFACI= 0
##$ASSFACX= 0
##$ASSWID= 0
##$AUNMP= <proc_1d>
##$AZFE= 0.1
##$AZFW= 0.1
##$BCFW= 0
##$BC_mod= 2
##$BYTORDP= 0
##$COROFFS= 0
##$CY= 18.4799938201904
##$DATMOD= 1
##$DC= 0
##$DFILT= <>
##$DTYPP= 0
##$F1P= 9.9274215381318
##$F2P= -0.165520771350173
##$FCOR= 1
##$FTSIZE= 16384
##$FT_mod= 6
##$GAMMA= 0
##$GB= 0
##$INTBC= 1
##$INTSCL= 4.127829e-11
##$ISEN= 128
##$LB= 0.05
##$LEV0= 0
##$LPBIN= 0
##$MAXI= 10000
##$MC2= 0
##$MEAN= 0
##$ME_mod= 0
##$MI= 50
##$NCOEF= 0
##$NC_proc= -6
##$NLEV= 6
##$NOISF1= 3.799351
##$NOISF2= 2.8
##$NSP= 0
##$NTH_PI= 0
##$NZP= 0
##$OFFSET= 16.48848
##$PC= 4
##$PHC0= -532.0226
##$PHC1= 3.101563
##$PH_mod= 1
##$PKNL= yes
##$PPARMOD= 0
##$PSCAL= 4
##$PSIGN= 0
##$REVERSE= no
##$SF= 200.130005582386
##$SI= 16384
##$SIGF1= 3
##$SIGF2= 2
##$SINO= 400
##$SIOLD= 16384
##$SREGLST= <1H.CDCl3>
##$SSB= 0
##$STSI= 16384
##$STSR= 0
##$SW_p= 4139.07284768211
##$SYMM= 0
##$S_DEV= 0
##$TDeff= 32768
##$TDoff= 0
##$TI= <>
##$TILT= no
##$TM1= 0
##$TM2= 0
##$TOPLEV= 0
##$USERP1= <user>
##$USERP2= <user>
##$USERP3= <user>
##$USERP4= <user>
##$USERP5= <user>
##$WDW= 1
##$XDIM= 16384
##$YMAX_p= 443012904
##$YMIN_p= -715218
$$ End of Bruker specific parameters
$$ ---------------------------------
##NTUPLES= NMR SPECTRUM
##VAR_NAME=  FREQUENCY,     SPECTRUM/REAL,   SPECTRUM/IMAG
##SYMBOL=    X,             R,               I
##VAR_TYPE=  INDEPENDENT,   DEPENDENT,       DEPENDENT
##VAR_FORM=  AFFN,          ASDF,            ASDF
##VAR_DIM=   16384,         16384,           16384
##UNITS=     HZ,            ARBITRARY UNITS, ARBITRARY UNITS
##FACTOR=    0.252644378177508, 1,           1
##FIRST=     3299.83951724647, 0,            0
##LAST=      -839.233330435636, 0,           0
##MIN=       -839.233330435636, -715218,     0
##MAX=       3299.83951724647, 443012904,    0
$$ Real data points
##PAGE= N=1
##DATA TABLE= (X++(R..R)), XYDATA
$$ [...]
10485i6556r176O237L8702o3414J577K1595k7578o5547J09930j6587K8420j5866
10473h8263n4023n0946J02413o0106P3332r6577N2424l6551K1609J258J5547m0554
10461a60437P7805n6561n0484P5513n0941m1601J01356o9137K7456p446J9684
10450a34793m9021N9021O812J7384q9181K3327r0271N5055O7196j5031K2320N8939
10438f8243j47788K6285P1477n5742P7667Q277k6399k7991Q4909l7639l1755M160
10426a22782l9297L0747J8851L4750l5996k2112k4514J9532J2305L5344j5793
10415a08965K8150k8516r614L6730J4174k8760k73m3428l2242L0121n521K2840
10403a25304o3896O2503O492j760j8239l7023Q0200M0476o066j11488N1287M669
$$ plain form
10485 -96556 -105732 -99495 -60793 -124207 -122630 -101035 -128613 -194160 -84230 -100817 -72397 -88263
10473 -88263 -142286 -193232 -90819 -150925 -77593 -174170 -121746 -158297 -136688 -135430 -119883 -160437
10461 -160437 -82632 -139193 -189677 -114164 -165105 -206706 -105350 -174487 -147031 -154477 -134793
10450 -134793 -183814 -124793 -117981 -100597 -189778 -166451 -256722 -201667 -134471 -149502 -127182 -68243
10438 -68243 -216031 -189746 -118269 -174011 -96344 -88067 -114466 -142457 -57548 -95187 -126942 -122782
10426 -122782 -162079 -131332 -112481 -77731 -113727 -135839 -160353 -140821 -128516 -93172 -108965
10415 -108965 -80815 -109331 -118945 -82215 -68041 -96801 -97074 -140502 -172744 -142623 -148144 -125304
10403 -125304 -189200 -126697 -120205 -121965 -140204 -177227 -97027 -56551 -62617 -174105 -122818 -118149
10391a18149m8740Q0756m6160N5941j30181O1343n9463Q9881O730J3739m9764
10380a44067N0991l0159L407q2561R0537L3302l2122l1780m957M4198n3155n7848
10368b14214J66805m9861K550j4612k0904Q5192j2341p1536k3441J5823k2426
10357a58965K0968J0888k3017K2398l5588p863k2961Q9410j005o8140L8705j0221
10345a45391J4952j9833M2749p7275R8452m9850k8754L4066N5989m0114o3383
10334a78392K7373M2844L0088k1198l1388N1151L6930q9593J5356j082L704L99
10322a13808k4664M5514p2483J09068j59498P7279n07N3306j27086J20733o76
10311i2822J6281q0032p456M3781r255P4856q4937l1119O8378j0114j9806k1929
$$ plain form
10391 -118149 -166889 -86133 -132293 -76352 -206533 -145190 -204653 -114772 -108042 -94303 -144067
10380 -144067 -93076 -123235 -119828 -202389 -111852 -78550 -110672 -142452 -147409 -103211 -156366 -214214
10368 -214214 -47409 -97270 -94720 -109332 -130236 -45044 -57385 -128921 -152362 -136539 -158965
10357 -158965 -137997 -127109 -150126 -127728 -163316 -171179 -194140 -104730 -105735 -173875 -135170 -145391
10345 -145391 -130439 -150272 -107523 -184798 -86346 -136196 -164950 -130884 -74895 -115009 -178392
10334 -178392 -151019 -108175 -78087 -99285 -130673 -79522 -42592 -132185 -116829 -117911 -114207 -113808
10322 -113808 -138472 -92958 -165441 -56373 -215871 -138592 -139099 -85793 -212879 -92146 -92822
10311 -92822 -76541 -156573 -164029 -120248 -129503 -54647 -139584 -170703 -102325 -112439 -132245 -154174
10299a54174N7775q3784M4413l339l4482M7481m8484M2477j485O3330p0752o3948
10287b04972R9129m0310J1284K3250j7073l481L9690o7445O9093L4069j34275
10276a91041j7683J33020l4681j2661k706n0342Q1067j8824k557p2983M7193J2474
10264a29724j8823L4667M770k0471j938j2221J752O4296m8448j1504O5570o4628
10252a36702P2795q0033r029j8876N6573k2303O4007l9602L9892j10498Q6146
10241i7630r2724R9731M259j5999p5817J37138l2774j07309N4320K8879k7766
10230a25692q490J2578K1997q1677Q9209p2321J28945r9219P921j3030L6926k1472
10218a24325J1196m7484J10943m2870K1302k5566J4221l9461k026J2000K6286
$$ plain form
10299 -154174 -96399 -180183 -135770 -139109 -173591 -126110 -174594 -132117 -133602 -70272 -141024 -204972
10287 -204972 -105843 -146153 -134869 -111619 -128692 -132173 -92483 -159928 -90835 -56766 -191041
10276 -191041 -208724 -75704 -110385 -123046 -125752 -176094 -95027 -113851 -116408 -189391 -142198 -129724
10264 -129724 -148547 -113880 -109110 -129581 -131519 -143740 -141988 -77692 -126140 -137644 -72074 -136702
10252 -136702 -63907 -143940 -152969 -171845 -115272 -137575 -73568 -113170 -73278 -183776 -97630
10241 -97630 -190354 -90623 -86364 -102363 -178180 -41042 -73816 -181125 -126805 -97926 -125692
10230 -125692 -134182 -121604 -99607 -181284 -92075 -164396 -35451 -134670 -126749 -139779 -102853 -124325
10218 -124325 -113129 -160613 -49670 -92540 -71238 -96804 -82583 -122044 -124070 -112070 -85784
10207h5784K5130n7510J5895j2592r270M9639r7882P7058j9456M2720j19926R1865
10195a00113l2142k535K9069O5690j00958l643L2528n2509R618J05977k5932p4085
10183a49035k7208O3148j01141N5322M199K584j7559O7349n6830k6278J6467K0250
10171a48732J042l4779L7205L4014O1407j11766L3838M8404j0700p6166L6693
10160a29540j8156N0443k1431O9890k7821p872m4985L044L5746m9294o6220J09404
10148i6792J6770K5589m7981M099l2851J7734k5935O7602r7517N1629j13878O4759
10136a66772P1208J9978p5737N6903n8601N8310j185r996j9261J7558l949N8868
10124e2676r7514K4252k2967p896Q1949J4078p0344K968N342Q367K9390N2886
$$ plain form
10207 -85784 -60654 -118164 -102269 -114861 -124131 -74492 -172374 -95316 -114772 -72052 -191978 -100113
10195 -100113 -132255 -134790 -105721 -40031 -140989 -144632 -112104 -164613 -154995 -49018 -74950 -149035
10183 -149035 -176243 -113095 -214236 -158914 -154715 -152131 -169690 -102341 -159171 -185449 -168982 -148732
10171 -148732 -147690 -182469 -145264 -111250 -49843 -161609 -127771 -79367 -90067 -166233 -129540
10160 -129540 -147696 -97253 -118684 -48794 -76615 -84487 -129472 -126428 -90682 -139976 -206196 -96792
10148 -96792 -80022 -54433 -102414 -98315 -131166 -113432 -139367 -71765 -169282 -117653 -231531 -166772
10136 -166772 -95564 -75586 -151323 -94420 -153021 -94711 -95896 -105892 -125153 -107595 -111544 -52676
10124 -52676 -150190 -125938 -148905 -156801 -74852 -60774 -131118 -128150 -122808 -114441 -85051 -32165
10112c2165p1392k9603N5001P3694j23918l1656r031K8697O4791R061j0128j8865
10100i5514l2226k6942J9723R9345j14006m8125R4155o41K3626j7527k7560l860
10088a29552L3718j0599j3613k3255P8607k8487q8646O9936J9971m1173j6519
10077a49612P6632k3527m6829P460n7354J22315p4001J01862p4141P0279q7936
10066a34852N5103J6309j08806l8978M8222r430J3265K2775L0226p7721J35371
10055d8516j4201o4206l6524L5395m6263J17138K6494q7624M524L4754o6119j9606
10043a64754K069R8573o6212M3438n708L2236J0970m2257j5531L3684k924J5708
10031f0708j01747L2658n7065J00492l9187O8716q8183R2882l4866m7063O0361
$$ plain form
10112 -32165 -103557 -133160 -78159 -4465 -128383 -160039 -169070 -140373 -75582 -66521 -76649 -95514
10100 -95514 -127740 -154682 -134959 -35614 -149620 -197745 -103590 -104231 -80605 -98132 -125692 -129552
10088 -129552 -95834 -106433 -120046 -143301 -64694 -93181 -181827 -111891 -91920 -133093 -149612
10077 -149612 -72980 -96507 -143336 -135876 -193230 -70915 -144916 -43054 -117195 -46916 -134852
10066 -134852 -79749 -63440 -172246 -211224 -163002 -172432 -159167 -136392 -106166 -183887 -48516
10055 -48516 -62717 -126923 -163447 -128052 -174315 -57177 -30683 -118307 -113783 -79029 -145148 -164754
10043 -164754 -162685 -64112 -130324 -86886 -92594 -60358 -49388 -91645 -107176 -73492 -76416 -60708
10031 -60708 -162455 -129797 -186862 -86370 -125557 -56841 -145024 -52142 -87008 -134071 -73710
10020g3710n7411M8660n1447P1567K1937q0696J0177K4791N321Q124m4277j0149
10008a27113l2243L2007J33229q8856q8009L6415K0105K7822K4664n4517j8310
9997a34806L4621o2535L2198L7357L959m9246j0948J30774m7330n4568K1148n764
9985a05140j4135M703N74j3570L8487k2204N2863l9353j0785n2548R1385m6610
9973a16333K6395K7430R715k2236M3166l6412j1264M0728j07240m684J07215m0365
9961h3885m7632M2717L3898m9180L1449n1776L9256N7415k5900q5103Q7051o9896
9949a21586m9461R615P5368j8568q787R931l5625L4624n296L078K4236M39n1482
9936a33514N1556J4620n2618K2881k4628j7359M6992R2542j13642L0084j0166
$$ plain form
10020 -73710 -131121 -82461 -133908 -62341 -40404 -121100 -110923 -86132 -80811 -72687 -116964 -127113
10008 -127113 -159356 -127349 5880 -82976 -170985 -134570 -114465 -86643 -61979 -116496 -134806
9997 -134806 -100185 -162720 -130522 -93165 -89206 -138452 -149400 -18626 -65956 -120524 -99376 -105140
9985 -105140 -119275 -114572 -113998 -127568 -89081 -111285 -58422 -97775 -108560 -161108 -69723 -116333
9973 -116333 -89938 -62508 -52793 -75029 -31863 -68275 -79539 -38811 -146051 -150735 -43520 -83885
9961 -83885 -131517 -88800 -54902 -104082 -72633 -124409 -85153 -27738 -53638 -138741 -51690 -121586
9949 -121586 -171047 -161432 -86064 -104632 -113419 -103488 -139113 -104489 -109785 -106707 -82471 -82032 -133514
9936 -133514 -81958 -67338 -119956 -97075 -121703 -139062 -92070 472 -113170 -83086 -93252
9925i3252k4502J0411N078j1821k6074P1182m4799J5113K9505n1775J3886L1050
9913g5998l8840L2327l1750l2297j9687J06419n6164j2835L984L0055Q0455p3769
9901h8100L7612J4507n5767L944l6830P9228q1782J09743j05395Q1464n4690J8494
9889g7572n0215K8849l1109N6950M330p9641N0158J1931N812j6714P5373q3956
9877a05804J1839P805L2427P212j4085L7305p0091M8956k5151K864o469L5214
9865c7978m7943K5537K7962n2590J0149o3183L2879K8347M0926l1582n0303l4600
9853a52379O3195N4661p0282k9138L4921J143o0282Q8744r3575L4627L3776k1219
9841a15808j5921J4375O7926j32590M0330O643J07605p0974J6972l7279J0332
$$ plain form
9925 -93252 -117754 -107343 -102265 -114086 -140160 -68978 -113777 -98664 -69159 -120934 -107048 -75998
9913 -75998 -114838 -82511 -114261 -146558 -166245 -59826 -115990 -128825 -124841 -94786 -14331 -88100
9901 -88100 -50488 -35981 -91748 -87804 -124634 -45406 -127188 -17445 -122840 -41376 -96066 -77572
9889 -77572 -127787 -98938 -130047 -73097 -68767 -148408 -98250 -86319 -80507 -97221 -21848 -105804
9877 -105804 -93965 -86160 -53733 -46521 -60606 -23301 -93392 -44436 -69587 -66723 -73192 -37978
9865 -37978 -85921 -60384 -32422 -85012 -74863 -138046 -105167 -76820 -35894 -67476 -117779 -152379
9853 -152379 -89184 -34523 -104805 -133943 -99022 -97879 -158161 -69417 -162992 -128365 -94589 -115808
9841 -115808 -131729 -117354 -49428 -182018 -141688 -135045 -27440 -98414 -81442 -118721 -108389
9830a08389l5101O3590k3549R3760p3109l7095r880P8386l6757k674K0383J3128
9818e7307o3904K2170M8833L111N996J9973p3549O0968p826Q24n8195J5407p8
9805h3577O6438n1093L6609P853p2931M6295L730l6820J01874j60293P8373n50
9793f4092L9485r4333L2218j13469J06314n1677Q2012m7426L5900o2617N8389
9782g9296r0246J29714j80331J52357p2706J03924j05674k4493p4029J23569O8299
9771d8912p9849M2458O178m486n7534N5698j1473J426N2625p3282P5466J4994
9759b6691M2873j13327M0181j69M2424o7126N9436j25055J05831K0153j2711o0388
9747i4569L7088R0934j72938K11897p035L803P9548M675j6269r84n3920o5220
$$ plain form
9830 -108389 -143490 -79900 -103449 -9689 -82798 -119893 -129773 -51387 -88144 -90818 -70435 -57307
9818 -57307 -121211 -99041 -50208 -47097 -41101 -21128 -94677 -33709 -41535 -40711 -98906 -83499 -83577
9805 -83577 -17139 -68232 -31623 -23770 -96701 -50406 -46676 -83496 18378 -141915 -63542 -64092
9793 -64092 -24607 -118940 -86722 -200191 -93877 -145554 -63542 -110968 -75068 -137685 -79296
9782 -79296 -169542 -39828 -220159 -67802 -140508 -36584 -142258 -166751 -240780 -117211 -48912
9771 -48912 -128761 -86303 -80125 -84611 -142145 -86447 -97920 -96494 -43869 -117151 -41685 -26691
9759 -26691 16182 -97145 -56964 -57133 -14709 -81835 -22399 -147454 -41623 -21470 -34181 -94569
9747 -94569 -57481 33453 -139485 72412 65377 69180 148728 153403 137134 136150 82230 17010
9735A7010j367n6839J3217j64255Q2732O6349J1549l5672n0200j4542q040N9136
9723h0922k3578Q1950j20170P0712j1821O9143o7376j1340k747k3660L1070l677
9711i2416j5127k7303L2992J7356R523P7258l185j3921o6356L0772L9941k5370
9699c5836M4352m7484m8432R8636l953q8294P3722l703n5415Q845Q2676j10764
9687h5650J22690j19505O6322j1836k825k8284l9567O4637k7118P328o4959N1625
9675f7142k21J2396j20407K7941O4971Q448L1613r3720N7692P9616p8853m3412
9663a21078P9171k8997P025m7416J01992j12096J5184L0068o9139P7520k2181
9652h9947k2014L9712P9523n4308o6122J28162j07831J5461j2090O4157M4660
$$ plain form
9735 17010 15643 -41196 -27979 -192234 -109502 -43153 -31604 -67276 -117476 -132018 -140058 -80922
9723 -80922 -104500 -22550 -142720 -72008 -83829 -14686 -82062 -93402 -96149 -119809 -88739 -92416
9711 -92416 -107543 -134846 -101854 -84498 -74975 2283 -902 -14823 -81179 -50407 -10466 -35836
9699 -35836 8516 -38968 -87400 11236 7283 -81011 -7289 -10992 -66407 -57562 25114 -85650
9687 -85650 37040 -82465 -16143 -27979 -30804 -59088 -98655 -34018 -61136 -53808 -118767 -67142
9675 -67142 -67363 -54967 -175374 -147433 -82462 -74014 -42401 -136121 -78429 1187 -77666 -121078
9663 -121078 -41907 -70904 -63879 -111295 -9303 -121399 -106215 -76147 -145286 -67766 -89947
9652 -89947 -111961 -72249 7274 -47034 -113156 15006 -92825 -77364 -89454 -25297 19363
9641A9363k4318r1981K8634Q2789q389j8385k9793n7317J15534o2544J0894J5768
9629a9745P3922o4549m4525J9409p128j8542P8636j35953Q1540k1235J05227q4773
9617c7716L9718L8420m5603k5914n4376J00356l3392j608J7414j9210M241M927
9605a2743j8436M6187l920k5732Q815N5305O9791j00958M9981J6349J5298p285
9593I2652J15564M3991J27809K1608K7507n6008n0817p3122j4927j03746P921
9582A38432n6725K782Q966n8387J470Q1035n6222n8089O754Q3997l5634j4513
9570D3866k6129N3681j8195M649O401p8770J31675r5893o551J7619j0919K2044
9558D3478r5431Q8841k634l4943J9131M6230n8483J5945K4956m9072K0734p3399
$$ plain form
9641 19363 -4955 -96936 -68302 14487 6098 -12287 -42080 -99397 16137 -46407 -35513 -19745
9629 -19745 54177 -10372 -54897 -35488 -42616 -61158 17478 -118475 -36935 -58170 47057 -37716
9617 -37716 2002 40422 -5181 -31095 -85471 14885 -18507 -20115 -2701 -21911 -17670 -12743
9605 -12743 -31179 15008 11088 -14644 -5829 49476 119267 18309 68290 84639 99937 92652
9593 92652 208216 252207 380016 401624 429131 373123 322306 249184 234257 130511 138432
9582 138432 81707 84489 93455 35068 36538 117573 61351 3262 10016 94013 58379 43866
9570 43866 17737 71418 53223 57872 64273 -14497 117178 21285 14734 32353 21434 43478
9558 43478 -51953 36888 34254 -689 18442 64672 6189 22134 47090 -1982 18752 -54647
9546e4647R402R3624m8278N0321j4413j5726L6814m2156j0787K5814L3967j6078
9534D7857k6273l3000Q5685n5565O1447k5722o7672K2407N0707p7682j4407R6864
9522F4646m9350N2782k1132q539j5780o2339J7280q857Q1809o9294o6579M2183
9510d3170J26411j32842J07826n4304m2751O2976j1102M507J2756l5108j0530
9499a5331K2105q051k1686R514K4845n3418J1607N9066m1677P7929L7698j18823
9487a6222n6960J28952q3867J14201l6716N835j6981N3411j14222p558N9142k3749
9475E266J9495P942L5467k3311J037m8138P0731J075K086J8935r2047O7107K115
9462F7760o8012p785L1126N309j453J20766r153r8246J0009R1766r1084L8422
$$ plain form
9546 -54647 -45245 48379 101 50422 36009 20283 57097 14941 4154 29968 63935 47857
9534 47857 21584 -11416 74269 18704 80151 54429 -13243 9164 59871 -17811 -32218 64646
9522 64646 15296 68078 46946 38407 22627 -39712 -22432 -31289 50520 -18774 -85353 -43170
9510 -43170 83241 -49601 58225 3921 -38830 24146 13044 17551 30307 -4801 -15331
9499 -15331 6774 -1277 -22963 -13449 11396 -42022 -30415 28651 -13026 64903 102601 -16222
9487 -16222 -73182 55770 -28097 86104 49388 55223 38242 91653 -22569 -30127 29015 5266
9475 5266 24761 32703 68170 44859 45896 -2242 68489 69564 71650 90585 -1462 65645 67760
9462 67760 -252 -8037 23089 28398 26945 147711 138558 40312 50321 142087 51003 89425
9450H9425K5847r1854M0405k2426K0199l8559J10610p1658j9036P9217m5566n955
9438G0649M675m7281K777N8722L0607N76q1177N216N1136Q0594j14367R5289r8897
9425E8519P5944M565L0120n2309J8289O8097j21179L1212L8991n5159L5547L4768
9413A67405J3576m2786L7365l5837p5772P4300L946K4397J1484J7560l336m2727
9401A49575L5704j9352l3637n4329O5260O8709l5779O0913p0616O4263q8005P4598
9389B17304l1437N2511L5592q5085Q4261m1110k9435M234L8232N67k7423M3742
9377B61953n3346Q2175l1258K3929l6537K4830O9194j1181o0035J05855o1903
9366C13676l4878l2412J12079o4981m345R9053j0963k4105L0248m33M6397K386
$$ plain form
9450 89425 115272 23418 63823 41397 61596 23037 133647 61989 42953 122170 76604 70649
9438 70649 75324 28043 30820 89542 120149 120725 39548 44764 95900 176494 62127 157416 58519
9425 58519 134463 139028 169148 116839 135128 203225 82046 113258 152249 97090 132637 167405
9413 167405 180981 138195 175560 139723 63951 138251 142197 166594 178078 195638 192302 149575
9401 149575 185279 165927 132290 77961 143221 211930 176151 237064 166448 230711 142706 217304
9389 217304 185867 238378 273970 188885 273146 232036 202601 206835 245067 245634 218211 261953
9377 261953 208607 290782 259524 283453 246916 271746 340940 329759 269724 375579 313676
9366 313676 278798 246386 358465 293484 289139 388192 377229 353124 383372 382939 429336 431722
9354D31722J02490j96778L8920k6628J01435m5188Q8558O691L4278l2334j4465
9343D88701Q555M3732L0817q1670N2531j4915N6342n3652L3664L3110J1599O7156
9331F75970k4116Q6267j21328J35512n0420J64777j4690J9102n360J47064n6981
9320I55797L0793J9643R8538L3412M7751O1119J53864P4333K30107P2551K17778
9309A995686J49381O5666j5918N0162M7254J01183J39194L11934J72850J80343
9299C197735J03865O6993K25970L22403M20546L93532M86861L28099J68806Q4953
9289E799763o1729l0052r8515k02j15420J74989J98950J90655L36780K30102K79243
9278F904564M37701N03803N36540M59296N03911M44393O86334Q57529J265674
$$ plain form
9354 431722 534212 337434 376354 349726 451161 405973 494531 501222 535500 503166 488701
9343 488701 497256 540988 571805 490135 542666 527751 584093 530441 564105 597215 608814 675970
9331 675970 651854 738121 616793 752305 701885 866662 851972 871074 865714 1012778 955797
9320 955797 986590 1006233 1104771 1138183 1185934 1247053 1400917 1475250 1705357 1777908 1995686
9309 1995686 2145067 2210733 2194815 2244977 2292231 2393414 2532608 2844542 3017392 3197735
9299 3197735 3301600 3368593 3594563 3916966 4337512 4731044 5217905 5546004 5714810 5799763
9289 5799763 5738034 5707982 5609467 5609265 5493845 5668834 5867784 6058439 6395219 6625321 6904564
9278 6904564 7342265 7846068 8382608 8841904 9345815 9790208 10476542 11334071 12599745
9269A2599745J588174J454548J244981Q27996M56920k1960m15769o92451p60837
9260A6281347p37748j92553J10537J076681J503737J716998J416614J003966L98299
9251B2577878l09596j480385j975645j989111j991738j816301j180591n75571
9243A1258940J6820J89533J31864j67011Q4139n46028n21489n94681m19103p94091
9233H638893o97681o50344p09117n96502k89496j26148M67270N12368J08302Q6637
9223F744182j32823m80848o67960p53231n51933m65572l41585m97918o7404j85942
9213B598966j26137j45614m8040k15763j40579p0552j58969M8539j31776m9400
9203A560675j66192J3730n7400j01490J1664r8736o2945J1111n8732j03553J30148
$$ plain form
9269 12599745 14187919 15642467 16887448 17715444 18172364 18150404 17734635 17042184 16281347
9260 16281347 15543599 15351046 15461583 16538264 18042001 19758999 21175613 22179579 22577878
9251 22577878 22268282 20787897 18812252 16823141 14831403 13015102 11834511 11258940
9243 11258940 11275760 11465293 11597157 11430146 11514285 10968257 10446768 9852087 9432984 8638893
9233 8638893 7941212 7290868 6581751 5985249 5695753 5569605 6036875 6549243 6657545 6744182
9223 6744182 6611359 6130511 5462551 4709320 4157387 3691815 3350230 2852312 2784908 2598966
9213 2598966 2472829 2327215 2279175 2063412 1922833 1852281 1693312 1741851 1610075 1560675
9203 1560675 1394483 1408213 1350813 1249323 1260987 1162251 1099306 1110417 1051685 948132 1078280
9192A078280q8019L6730n5944N9341j06619J2411j5221r7020R8276j18516R0923
9181H94622k39979Q9445n5698M0962o8814L5654L4323l9590L7529k995l5275j7181
9169F73003m7194K5913j10245R263J2115n8246j9686k88j603Q2420j3449k817
9157E49186m3096p503p7065P4972J07483j19059M5302P582j6309n6958l0949k6211
9145D07375n1290J08759m6719k6245J397l6482L7712J16801p5359k1533K690q304
9133D08802k0209p792P6286o0218J9130J0332m5228M4040o0572j2699J8262P6968
9121D47102m5198N6520m7159l4765N2534m7198l793l1758M165n3165J08295Q729
9109D14309j6021n5588J5376p19J6735O720p2898J25323j7491n5353l0147P7862
$$ plain form
9192 1078280 990261 1026991 971047 1030388 923769 936180 920959 823939 922215 803699 894622
9181 894622 654643 744088 688390 729352 660538 696192 730515 690925 728454 725459 690184 673003
9169 673003 625809 651722 541477 550740 562855 504609 484923 484635 483032 565452 552003 549186
9157 549186 506090 498587 421522 496494 603977 484918 530220 537802 521493 464535 433586 407375
9145 407375 356085 464844 418125 391880 393277 356795 394507 511308 435949 414416 417106 408802
9133 408802 388593 380801 457087 396869 415999 426331 381103 425143 364571 351872 370134 447102
9121 447102 401904 458424 411265 376500 429034 381836 378043 346285 350450 297285 405580 414309
9109 414309 398288 342700 358076 357357 374092 380812 307914 433237 415746 360393 330246 408108
9097D08108q0710M1663J2013j0134j5906M0066p4171J14369l5300p893n5800O4341
9085D00646n0382J20460p4370m5829j7049O4363o4657M6692M8071K3627k6566
9074D25006j9180J614J02643N072l9789q7668N0806j5344P9442o7589O8501L6130
9062E39644k5286r902L5389N5786k0155R808O6566J6497K4977n149l0689J77611
9050H35097q3891O457j4038Q5477n1229K7910R6066n6221Q2841j6536J24337j9696
9038A016574N7730n5142M1816R1708k8038K1351P9262l3425O2829n7071q7499
9027A110095L3431L1464M4733J9612M0321r5219O2083l8596J6941K7054l9991
9016A211928L8616j49419p357n1672L971L3678j11304O2084l0665m4529K0315
$$ plain form
9097 408108 327398 369061 381074 370940 355034 395100 320929 435298 399998 392105 336305 400646
9085 400646 350264 470724 396354 350525 333476 397839 333182 379874 427945 451572 425006
9074 425006 405826 407440 510083 515155 475366 387698 438504 423160 502602 435013 503514 539644
9062 539644 514358 504456 539845 595631 575476 585284 651850 668347 693324 688175 657486 835097
9050 835097 751206 757663 743625 829102 777873 805783 901849 845628 928469 911933 1036270 1016574
9038 1016574 1074304 1019162 1060978 1152686 1124648 1145999 1225261 1191836 1254665 1197594 1110095
9027 1110095 1143526 1174990 1219723 1239335 1279656 1184437 1246520 1207924 1224865 1251919 1211928
9016 1211928 1250544 1101125 1093768 1042096 1046067 1079745 968441 1030525 999860 955331 975646
9005I75646l0165o1454q195j3027o2129K1788O669p3280J2424l5785K7599n8291
8993G01800o3172M4555o4393j0368m3350J41328p0690m1830j7671n657K576l2479
8981E40649O185J1404p4081M0857n2011k7577m987k4932K3030m1915j1288K5476
8969D10810l5148Q3479r4106P9140q3398J42221j79633K1313j3748M7831m3951
8958C34810j2557n2796L8369R4742m9475l4914J8151k1692L911K8365k2310m6365
8946B78239P1685j6798m2336l5368N4948n840j5299k3658j5019O6397n2846r9726
8934A64379P6914O6083p0297m6513P2825J2477K4020k1214r8162k8267Q5020o0691
8922A76574O1689r4873K6994j3912P5726l0201M1727O666k7203J9692R910p1358
$$ plain form
9005 975646 945481 884027 875832 862805 800676 822464 829133 755853 768277 732492 760091 701800
8993 701800 638628 683183 618790 608422 565072 706400 635710 593880 576209 570552 573128 540649
8981 540649 546834 558238 484157 525014 473003 445426 440439 415507 438537 396622 385334 410810
8969 410810 375662 459141 365035 444175 360777 502998 323365 344678 330930 378761 334810
8958 334810 322253 269457 307826 402568 353093 318179 336330 314638 318549 346914 324604 278239
8946 278239 349924 333126 290790 255422 310370 304530 289231 265573 250554 316951 264105 164379
8934 164379 241293 307376 237079 190566 263391 275868 299888 278674 180512 152245 237265 176574
8922 176574 238263 143390 170384 156472 232198 201997 243724 250390 223187 242879 252789 181431
8910A81431J1066N4492q6448m191J9409M2247o6740j5976k2363L6251p852p0407
8898G0919M4450Q1468l6310j6870M131m0285J280J21469j10491K8081m7424N6875
8886A57293o3374O8348q7278M7886O5521o9569j7502O066M3721Q490m7686l2781
8874G9135N7847K5948n2029p3097O9242J7690j9453N0578O479j07988L4108n4959
8862C3501M6402m870k969L1654M1531l4892j36423J28469P047k4230P4616q2017
8850G7819L168j9302O3601m9887O2801n5170K2154l1664K7911j27427J58282l9334
8838I2952k5727l3355P2540p2566J24632n1662j511O4701m2839p1989O3060K606
8826A20842o5816K8476l6978n7378J04901m1382O0827J9012j5043n2008L7507
$$ plain form
8910 181431 192497 246989 160541 156350 175759 218006 151266 135290 112927 149178 141326 70919
8898 70919 115369 196837 160527 143657 147788 107503 108783 230252 119761 147842 100418 157293
8886 157293 93919 162267 74989 122875 188396 118827 101325 107391 151112 159602 111916 79135
8874 79135 136982 162930 110901 37804 107046 124736 105283 155861 162340 54352 88460 33501
8862 33501 79903 75033 72064 103718 145249 110357 -26066 102403 109450 85220 159836 77819
8850 77819 80987 61685 125286 75399 138200 83030 105184 73520 101431 -25996 132286 92952
8838 92952 67225 33870 106410 33844 158476 106814 105303 170004 127165 55176 118236 120842
8826 120842 55026 83502 46524 -10854 94047 52665 113492 132504 117461 65453 102960
8815A02960J6385n845j00680P2982Q8212o2896n8534K6144J9477J6508j54601
8804c9888J16348m2214M7398J5220j2520K9318J295j6611j9886Q2736n5935N6353
8792A61614r4927j9864k9084L6788N0566J9170J20952k15207l5387K4662O2407
8781H1690j1872k2204O8049M4638q2552K8306l323n519j6812O6239m9988q8530
8769H122P9131m4606K012M4878N6638k7913J7617j5553M698J3858o8153L2141
8757A02870k0916R8154r9919n3861O7055N4169p0857k8427m3049J10785j2405
8746A03599l4423M0052l9293j4730K2043K7376k9644M6501q0136m9232J00935
8735I3048J1553o125k7562M1886q0486L2458l4329K7561K1620j319N9550k1190
$$ plain form
8815 102960 119345 113500 12820 85802 174014 111118 52584 78728 98205 114713 -39888
8804 -39888 76460 34246 81644 96864 84344 113662 114957 98346 78460 161196 105261 161614
8792 161614 66687 46823 17739 54527 105093 124263 245215 30008 -5379 19283 81690
8781 81690 69818 47614 115663 160301 77749 106055 102732 97213 80401 146640 96652 8122
8769 8122 87253 42647 44659 89537 146175 118262 135879 120326 125024 138882 70729 102870
8757 102870 81954 180108 80189 26328 93383 147552 76695 48268 5219 116004 103599
8746 103599 69176 109228 69935 55205 77248 104624 74980 121481 41345 -7887 93048
8735 93048 104601 98476 70914 112800 32314 64772 30443 58004 79624 78305 137855 116665
8723A16665j1723K4138p1126L6873P150K2099n1906l2477R9778m7598l0818O0317
8711A21372j7741L9809r382r8511J9524l164k7132P0805j3735M590m09m5799M7791
8698H8018k3235K2482O136n935m2938R8336L9473p8803L55K5653M5990j1273N3650
8685B17909j14427m0470M827L1418P9009j7283r0950N8804J4693m0988R627m422
8673A07747k7817J5763N683J476J8972J3458j04295N2899L7859j9658J304N8978
8661A62369o5520j4762J18767j09388L7005L3772o435r4852J14848k3196m1986
8650A10622o8179Q8397n3434M5675n4766P7439O4989j13608O9605m5247J0276
8639A31769R283K5881m5672N265Q724j19048J7788R0276n8122M5602K0068n3101
$$ plain form
8723 116665 104942 129080 57954 94827 101977 124076 72170 39693 139471 91873 61055 121372
8711 121372 103631 143440 134058 35547 55071 51907 24775 95580 81845 86435 86026 40227 88018
8698 88018 64783 87265 93401 87466 44528 142864 182337 103534 103889 129542 175532 164259 217909
8685 217909 103482 63012 67839 99257 178266 160983 70033 128837 143530 102542 112169 107747
8673 107747 79930 95693 101376 102852 121824 135282 30987 83886 121745 102087 103391 162369
8661 162369 96849 82087 200854 91466 128471 162243 155808 60956 175804 152608 110622
8650 110622 42443 130840 77406 123081 68315 145754 210743 97135 166740 121493 131769
8639 131769 141052 166933 121261 126526 135250 16202 33990 124266 66144 111746 131814 78713
8627G8713m6296J11096o8997J3332L3946K1566o1586m032L3168n2041M1388L4788
8615A35045j11121J16731m9912O8770j1545j7249R222N8874n7192n2443J9689
8604A08869j02889R9832K1536m1662p195Q5738k5600n3704N8027J4848K08k8778
8592A29230L6980l7492L1829l9044m5933l0739J36768j23121M727O1801r2197
8581C2809m8489J08353J7085r4511J6374N0676J5946j742r508o7599J5605L3788
8569F8787k1322m752J8976R9134o9184n5462K528J7629L8077J3886L5210r3858
8557D9649O3242l6424j7229J8397P3239n7261j2206K8830N464Q8400m4061l9975
8545A20065j7915L150q470L350L1646j3209r4173P5451q9135P076r6795L70094
$$ plain form
8627 78713 32417 143513 74516 87848 121794 143360 81774 77742 110910 58869 100257 135045
8615 135045 23924 140655 90743 159513 147968 130719 139941 198815 141623 89180 108869
8604 108869 5980 105812 127348 85686 78491 164229 138629 84925 142952 157800 158008 129230
8592 129230 166210 128718 160547 121503 75570 44831 181599 58478 63205 125006 32809
8581 32809 -15680 92673 109758 15247 31621 82297 98243 96501 86993 19394 34999 68787
8569 68787 47465 42713 61689 160823 91639 36177 38705 56334 94411 108297 143507 49649
8557 49649 112891 76467 59238 77635 150874 93613 81407 110237 115701 204101 160040 120065
8545 120065 102150 105300 96830 100180 131826 118617 24444 99895 10760 17836 -78959 291135
8533B91135L72429l45822j77666r0004R6449n1662j2390J45506j32742J4097r415
8522I9915j9581l5369N5595K543K5599K7581L7388l3051J5478N6496j61996M6732
8510A17330N9330k6382M8808o4042n3688J34928q7217J3108p176j059K9480Q977
8498A72397o3791K5023J0978k3497J04387r4556m5391k9778P0842m7309j857M0132
8486A17580K3745j04787K5867j2791L9595Q0388j08400j678J10383j20897n4648
8475e643O2636j7327k4699P9413K5364m9363J3460J0458n0842K4042K389K0616
8463I0504N9082q0344M8454o3618P1161j47503R5343P1849m9335N335J30326p9304
8451A51950j02394M7437l1614N5989m0423L1783L828M7687p6563j4357P2557l8416
$$ plain form
8533 291135 663564 317742 140076 50072 146521 94859 82469 227975 95233 109330 99915
8522 99915 80334 44965 100560 103103 128702 156283 193671 160620 176098 232594 70598 117330
8510 117330 176660 150278 199086 135044 81356 216284 129067 142175 134999 133940 163420 172397
8498 172397 108606 133629 144607 121110 225497 130941 85550 55772 126614 79305 77448 117580
8486 117580 141325 36538 62405 49614 89209 169597 61197 59519 169902 49005 -5643
8475 -5643 56993 39666 14967 94380 119744 70381 83841 94299 43457 67499 69888 90504
8463 90504 149586 69242 117696 54078 125239 -22264 73079 144928 95593 100928 231254 151950
8451 151950 49556 96993 65379 121368 80945 112728 116556 164243 87680 73323 145880 107464
8439A07464M7261j09643Q3935m0845K0064m5656L0731K0752k8810j3104j5083
8428E7066N3263j6160q64R700q50J5729m2407J15799j19683O4065l7371P7524
8416A75811q3977J8673K5375K6718p6946K6653L0295q0555O4314j0902L470J182
8404A20111J224N7770k9181p7127l518L5717M1652j1432J92m5442M5221K9793
8392A64980m4503L5909o3642K3608J0958J7063r7271M0454N1986l673j1520O125
8380A30474m7582N3821R369n0642J8657N5166m370l2586n6054P5017p2670R1011
8368A69611j17451L7266L2421j7546p4615J19533j102L835K0589m6723k8814o840
8356I0164m1593O603O3540O7756j13597J18304n1053m9603K2955M2352p6780O5445
$$ plain form
8439 107464 154725 45082 129017 88172 108236 62580 93311 114063 85253 72149 57066
8428 57066 110329 94169 93305 103005 102155 117884 75477 191276 71593 135658 98287 175811
8416 175811 91834 110507 135882 162600 85654 112307 142602 62047 126361 115459 118929 120111
8404 120111 121335 179105 149924 72797 69279 104996 146648 135216 135408 89966 135187 164980
8392 164980 120477 156386 92744 116352 127310 144373 47102 87556 139542 135869 124349 130474
8380 130474 82892 136713 146082 95440 114097 169263 164893 132307 76253 151270 78600 169611
8368 169611 52160 89426 121847 104301 29686 149219 148117 151952 172541 125818 97004 90164
8356 90164 48571 55174 118714 186470 72873 191177 140124 90521 113476 155828 79048 144493
8344A44493N7393r5302j2645O6833q3250o8469R7258M1565j0579k0569n4938O6089
8332A27879n9990Q917k2163P5250K8399k0695k2850J756O3316k4427r1493N7654
8320A21553J7179o8538J60367j14107j8035N5936P4576r3929J7533n1555o122
8309I4858K4134J8228O5716p5864O2303j13712N6896J22524n3382r8848L7680
8298A40533n9042k44M2278O5986K2309q3164R8395r7116L3573o8793O8195n8927
8286A03983J10347L0165j01906n5832L0191M7172r7758M5206k5557J5382J32848
8275B34241r6489N2215l5194L7522n5669K138m0784R1330p599j15539m1778J48892
8263A73286k8441r5894Q1019N0072r145n2255O1072m6033O4369l4558K2402Q112
$$ plain form
8344 144493 201886 106584 93939 160772 77522 9053 106311 147876 137297 116728 61790 127879
8332 127879 67889 76806 54643 129893 158292 137597 114747 116503 179819 155392 63899 121553
8320 121553 138732 70194 230561 116454 98419 154355 228931 135002 152535 100980 94858
8309 94858 118992 137220 202936 127072 189375 75663 132559 255083 201701 102853 140533
8298 140533 81491 81247 123525 189511 211820 128656 227051 129935 163508 94715 162910 103983
8286 103983 214330 244495 142589 86757 116948 164120 66362 111568 86011 101393 234241
8275 234241 137752 189967 154773 192295 136626 138764 97980 189310 181711 66172 24394 173286
8263 173286 144845 48951 129970 180042 170897 118642 179714 133681 198050 163492 185894 194006
8251A94006p7330o2997O1028M8742n7017r1230P8615m3676J54840k9111p06M625
8239A79789K6807k8996m041q5575J72105j21083N4351n5098L4202q2994M8414
8228A37881J9724N9870r1936L5236O474p5054R0226M3471r8214P1411q5559J05855
8216B19385j33404M2564m2416O6444Q4j5633r7774J61914m0178J8803N6053L6883
8204B72725n1811p1115K6465Q5380l0675L628j25484K14483r5769N5673j65250
8193A18250J78366j5891k09139O5965n8471K867Q5201q7392J35478p01j05496
8182A09037M9591j0377j8754m7779N224N9665K7460L8328N4587r4496j5229k2380
8170A34877J16404r2772J710j08245J62086n5037o0983O8059M6507j10220J46386
$$ plain form
8251 194006 116676 53679 114707 163449 106432 15202 93817 50141 204981 175870 175164 179789
8239 179789 206596 177600 173559 87984 260089 139006 193357 138259 172461 89467 137881
8228 137881 157605 217475 125539 160775 167249 92195 182421 225892 127678 199089 113530 219385
8216 219385 85981 128545 86129 152573 152657 137024 39250 201164 160986 179789 235842 272725
8204 272725 220914 149799 176264 261644 230969 234597 109113 323596 227827 283500 118250
8193 118250 296616 280725 71586 137551 79080 81947 167148 79756 215234 214533 109037
8182 109037 158628 148251 129497 81718 86942 146607 174067 212395 266982 172486 157257 134877
8170 134877 251281 158509 160219 51974 214060 159023 98040 166099 212606 102386 248772
8159B48772l8797n416p5335N6628p3054N2759P4900l3057n8668L4592k4765l3230
8147A25329R8225r8130l7964Q9598p7543J75284j16167m367k2241J10983J242
8136B44249J179p8371p2664J04558j4168k830L6668m7059o4164L050J61966n0667
8124B21747o1449J3069O541j5795O8162K6775j06438N1611j25938J74339k9007
8113B23617J3248q3331L1025n1346R6941n487o4258j0728R5406k7183M242q3504
8101A38642O7933K1971O4697j32258L8838K3356K6503n5650K9034q4598J02041
8090B40509r6894K2706R4683N9839m9399j11350K9786J37949k9837j84749M7777
8079A61020N0081k135P3957p5303k5563O7789l4343o2367J28686r4645k3666L1157
$$ plain form
8159 248772 209975 204559 129224 185852 112798 165557 240457 207400 148732 183324 158559 125329
8147 125329 223554 125424 87460 177058 99515 274799 158632 154265 132024 243007 244249
8136 244249 245428 167057 94393 198951 184783 181953 218621 171562 107398 110448 272414 221747
8124 221747 160298 173367 179908 164113 232275 259050 152612 204223 78285 252624 223617
8113 223617 236865 153534 184559 133213 230154 224667 160409 149681 245087 217904 222146 138642
8101 138642 206575 228546 293243 160985 199823 223179 249682 194032 223066 138468 240509
8090 240509 143615 166321 261004 320843 271444 160094 189880 327829 297992 113243 161020
8079 161020 211101 208966 282923 207620 182057 249846 215503 153136 281822 187177 163511 194668
8067A94668N7621m1445o4003J5525J06535j4623l3618O359p4l0735J6904Q6101
8055B99215j01486M1902p5732l0752N0299R0289j950o7116r439M4877O9952m6703
8043B63356j4663k3248N621N5812m3635K4428p1035J70672j74301O8824L8178
8032C00009J4618k06210R7403P9761n9337L8215J9520o8157N6575k3819j1826
8021B36752O6013k9440p3525N6367j652M8803r9318J1696J8770O0514o2620m8283
8009A84077n7442J31306n2793P3838r0827M3466L5921p064k7549K8585o0252L3691
7997B34957K5775l972l2041r7603J03294l2873J2022O4438j6329l3994L6451n1154
7985B08971J473L7555l9698O5955q333r105j1448J0144l663n0087P7986o7842
$$ plain form
8067 194668 252289 210844 146841 162366 268901 254278 220660 227019 226945 196210 213114 299215
8055 299215 197729 239631 163899 133147 183446 273735 271785 204669 195230 240107 310059 263356
8043 263356 248693 225445 231066 286878 243243 267671 196636 367308 193007 261831 300009
8032 300009 314627 108417 205820 285581 226244 264459 283979 215822 272397 248578 236752
8021 236752 302765 273325 199800 256167 254515 303318 204000 215696 234466 294980 232360 184077
8009 184077 126635 257941 205148 278986 188159 231625 267546 260482 232933 261518 201266 234957
7997 234957 260732 256760 224719 127116 230410 197537 209559 273997 257668 223674 260125 208971
7985 208971 210444 247999 208301 274256 265923 256818 245370 255514 251851 201764 279750 211908
7973B11908K3329P997K2023r95l2575K415J604L3031J8795m0953R5779j25713
7961B16645P697P5235m1937k0636P8843p9055J5683N3039q485j3167O3679l0432
7949C17109p0292P4991M3844r1639M307r718M7279j9518K3131p3775N1844N9103
7937C56666n9106l3911J3264j4022L2805p6429J25340j4630k2475o7634N6636
7926B96504L7575k0979r2845K4971M6484O4685q9186L3692o5151N7691j8171N25
7914B75795m2879P9609L3378n7029J5386M565J7197j4013o5815J05052j4971m5533
7902B90742m7663R6909m1957Q3109m9068Q639L4149L689q7188O6445p2642L7033
7890C22197r617J901j807K3926p7550N9473J1916N3424p134o5145J20048p7688
$$ plain form
7973 211908 235237 243234 265257 264262 231687 234102 235706 268737 287532 246579 342358 216645
7961 216645 224342 299577 257640 237004 315847 236792 252475 305514 297029 283862 347541 317109
7949 317109 246817 321808 365652 274013 278320 268602 315881 296363 319494 245719 297563 356666
7937 356666 297560 263649 276913 262891 295696 219267 344607 329977 307502 239868 296504
7926 296504 334079 313100 220255 245226 291710 356395 267209 300901 235750 293441 275270 275795
7914 275795 232916 312525 345903 288874 304260 308825 326022 312009 246194 351246 336275 290742
7902 290742 243079 339988 298031 381140 332072 340711 374860 378549 291361 357806 285164 322197
7890 322197 312580 314481 312674 336600 259050 318523 330439 383863 376729 311584 431632 353944
7878C53944K0001k7662m6544L8624O7921l0784r0239J14271l7660K9381k4246
7867C67007k036R1294r9220M4238m1943N3732P4811j11431O8960m1478p1239L1971
7855C64666M6521N0179m3670P7550K23064j433528J089798k7758L8487j1772r507
7844C64030k7057N2519j6841l2652N7871N268j09640J51532m2761p408j874Q2067
7832D75054n5236J0103l7693K6158J4331O8976p1102K0103l1333n990J7378l174
7820D27575Q531P038O3319m0672L7219r8090J1845N6492j23997L5433M0865O3350
7808D88908j46449J65208J5672k7529n8285K9183j03220N3187L8141k1481m7666
7797C85669J02822p9331O1335O1204r7539o5742J52514k1218J17298r1178L5906
$$ plain form
7878 353944 373945 346283 299739 338363 406284 375500 285261 399532 361872 391253 367007
7867 367007 364971 456265 357045 401283 359340 413072 487883 376452 445412 403934 332695 364666
7855 364666 411187 461366 417696 495246 718310 -715218 374580 346822 385309 373537 364030
7844 364030 336973 389492 372651 339999 397870 403138 293498 445030 402269 394861 392987 475054
7832 475054 419818 429921 392228 418386 432717 501693 430591 450694 419361 413371 430749 427575
7820 427575 436106 443144 506463 465791 503010 404920 416765 473257 349260 384693 425558 488908
7808 488908 342459 507667 523339 495810 437525 466708 363488 416675 454816 433335 385669
7797 385669 488491 409160 470495 531699 434160 368418 520932 499714 617012 525834 561740
7786E61740p4912Q6316m246J8643r6434R2043m8618L2804j4290k9160P0301p6337
7774E17850m8871N5923K0233K0996o2353Q4010o3854L6076l4293J2773R136K9867
7762E77493p7508R141k8451N9880l6940R9084m1910R1118p6268m1652N263R0002
7750F29252j11920K7922O4992l100J048p1139o405L3441k9288R6885j20405J18508
7738F29791j1844Q99l7116j1495R0638l3848m7871K8667m6856N4453l7077K8637
7726F06978L0117m9580N0700m9580R3383m5040K7264k9755L3370n263j4205J0820
7714F59209k3145L0112m0003k025K6346M6615J0811m236j1520l417M6061M1064
7702G75872r489n3347J6062M878l9087N4780k0542J8625O0630p2081J452j1408
$$ plain form
7786 561740 486828 573144 568898 587541 491107 583150 534532 567336 553046 523886 594187 517850
7774 517850 468979 524902 545135 566131 503778 587788 523934 560010 525717 538490 547626 577493
7762 577493 499985 509126 480675 540555 503615 602699 560789 651907 575639 533987 539250 629252
7750 629252 517332 545254 610246 607146 608194 537055 530650 564091 534803 631688 511283 629791
7738 629791 617947 618846 581730 570235 660873 627025 579154 607821 560965 615418 578341 606978
7726 606978 637095 587515 638215 588635 682018 636978 664242 634487 667857 662594 648389 659209
7714 659209 636064 666176 626173 624148 650494 697109 707920 703684 692164 688747 734808 775872
7702 775872 766383 713036 729098 733976 694889 749669 729127 747752 808382 736301 737753 726345
7690G26345J15975l3279J393J9003r10Q256N2439j08950O5060q254L4415p0342
7678H01151K3728j5763P0587K0915N9302j32321L4628J3942K9173j7247M7340
7667I35435k6944J5704k2923M024l7197Q5780L7438p4722k3109J06667J7328N713
7655A023194m1543k6649l0603P7044L2172j31656K5892O7667k163O7647l4573
7644A026429O883m7070J08074l8084p0324K9151L9706J462j5124P2577n3297Q1871
7632A142254l2411p5630R0000K2457o40q6618P465J17719k7989P959k7035O3014
7620A200545j7255J3634J8843K469l317P2469o0269K9917p0990P2451j090L9842
7608A297249L7186O2215q3420R2516n3174L2684k5928J18868P984J03777l53696
$$ plain form
7690 726345 842320 809041 810434 829437 828527 836783 889222 780272 845332 837078 871493 801151
7678 801151 824879 809116 879703 900618 959920 827599 862227 876169 905342 888095 935435
7667 935435 908491 924195 901272 905296 868099 953879 991317 916595 893486 1000153 1017481 1023194
7655 1023194 981651 955002 924399 1001443 1033615 901959 927851 995518 993355 1061002 1026429
7644 1026429 1033312 986242 1094316 1056232 985908 1015059 1054765 1056227 1041103 1113680 1060383 1142254
7632 1142254 1109843 1034213 1124213 1146670 1146030 1059412 1066877 1184596 1156607 1164566 1137531 1200545
7620 1200545 1183290 1196924 1215767 1218236 1214919 1287388 1227119 1257036 1186046 1258497 1257407 1297249
7608 1297249 1334435 1396650 1313230 1405746 1352572 1385256 1359328 1478196 1486180 1589957 1236261
7597A236261J06122K0990J12768o6998M4271K5077j0769N1998k6581J30137p2592
7586A550684o1756J25610J2226p7612J02022P0595p7886P5952j4105M397k9204
7575A680923P1072p072j1900P1005o9658k3406J03642q0835j3354J38536N965
7564A864918P0267j2625K1958o0236J6406l4301R8828J5035p9110J23394l4146
7553A990388K9482J4083m183J6726L4895M445k0187J25703l9769m0834L796K01071
7541B315616j62273J34540m0838M3997l1498Q9788r1292J29775n1631P7179O0348
7530B473711k8441J2098O4952m3726Q4414l1883K2520P798J14019R476J8815o1511
7518B642242J08783n1058O6063N0942k8716R7670N8790o769j6731J01689m8734
$$ plain form
7597 1236261 1342383 1363373 1476141 1409143 1453414 1478491 1467722 1519720 1493139 1623276 1550684
7586 1550684 1488928 1614538 1626764 1549152 1651174 1721769 1643883 1719835 1705730 1710127 1680923
7575 1680923 1751995 1744923 1733023 1804028 1734370 1710964 1814606 1733771 1720417 1858953 1864918
7564 1864918 1935185 1922560 1944518 1884282 1900688 1866387 1965215 1980250 1901140 2024534 1990388
7553 1990388 2019870 2033953 2029770 2046496 2081391 2085836 2065649 2191352 2151583 2110749 2114545 2315616
7541 2315616 2153343 2287883 2247045 2291042 2259544 2349332 2258040 2387815 2336184 2413363 2473711
7530 2473711 2445270 2457368 2522320 2478594 2563008 2531125 2553645 2561443 2675462 2684938 2703753 2642242
7518 2642242 2751025 2699967 2766030 2816972 2788256 2885926 2944716 2937947 2921216 3022905 2974171
7507B974171N541N0166l827N6225K1852L5201J9287O7618M3410R752j204N9928
7495C338120K3891J43663o0944N8220K5926P0842j2185J11159o5067N1798Q0311
7484C765734k4756K4842L7949J21796k2564N8629M7621K5244N2349J46437j34324
7473D098957J55706n2483O0482P2258L5949m2844R2235R3380Q651M2191P8929
7462D643411n7817J10318J18668N2508k1661J15347Q5509J5967K8484J27501o4972
7451E153263J51326n433J22545o430J65400l3826N5074J19166J57025m3664N3622
7440E888068P9155R6001L8455M1578Q7123J30885Q8260J7102O2312J20078Q9335
7429F738352J33676j3489J21715J16073O3387Q5085J05000J59156O7253Q1578
$$ plain form
7507 2974171 2979712 3029878 3026051 3082276 3104128 3139329 3158616 3226234 3269644 3279396 3278192 3338120
7495 3338120 3362011 3505674 3444730 3502950 3528876 3599718 3587533 3698692 3633625 3685423 3765734
7484 3765734 3740978 3765820 3803769 3925565 3903001 3961630 4009251 4034495 4086844 4233281 4098957
7473 4098957 4254663 4202180 4262662 4334920 4370869 4328025 4420260 4513640 4522291 4564482 4643411
7462 4643411 4585594 4695912 4814580 4867088 4845427 4960774 5046283 5062250 5090734 5218235 5153263
7451 5153263 5304589 5299156 5421701 5415271 5580671 5546845 5601919 5721085 5878110 5834446 5888068
7440 5888068 5967223 6063224 6101679 6143257 6230380 6361265 6449525 6466627 6528939 6649017 6738352
7429 6738352 6872028 6858539 6980254 7096327 7159714 7244799 7349799 7508955 7576208 7657786
7419G657786J56606M7411O2389J02076R5734J39749O8962J17279J08042J17805
7409H673839Q0084J10022J55132J89318J71232R547N1768K57482R4881J30395
7399I923700J15238K25762O3869J96538N1853J71700K40617J11580J07146K31867
7389A1439870Q7004K66624J23474J50019J49487K61817J50761R2448K87970K21269
7379A3230743Q5583K55091J25315L30298J30799K55894K08368K68077K01639J69276
7369A5261083K26320L60955J44055L29622J86147L42652K39165L22744K19400
7360A7632143K51223L56116K76557K66929L60218L62311L27559J98265L64803
7351B0396124L57700M30521L00350L67697L99157M00127K97897L93241M52115
$$ plain form
7419 7657786 7814392 7861803 7924192 8026268 8122002 8261751 8330713 8447992 8556034 8673839
7409 8673839 8753923 8863945 9019077 9208395 9379627 9389174 9440942 9698424 9793305 9923700
7399 9923700 10038938 10264700 10328569 10525107 10576960 10748660 10989277 11100857 11208003 11439870
7389 11439870 11526874 11793498 11916972 12066991 12216478 12478295 12629056 12721504 13009474 13230743
7379 13230743 13316326 13571417 13696732 14027030 14157829 14413723 14622091 14890168 15091807 15261083
7369 15261083 15487403 15848358 15992413 16322035 16508182 16850834 17089999 17412743 17632143
7360 17632143 17883366 18239482 18516039 18782968 19143186 19505497 19833056 20031321 20396124
7351 20396124 20753824 21184345 21484695 21852392 22251549 22651676 22949573 23342814 23794929
7342B3794929N07479L37129M00658N03304M38892M57226M52547N24814N01679
7333B7918657N58076N04431N37035N96476N32951N59418O50586O82376O23297
7324C3163303O20248O28786P34173O73824Q30349P43837P99066Q67050P51115
7315C9811751Q31584R57536R89215Q65281J003763R36772J234856J024972J164081
7306D8819811J104418J241939J321898J314631J277179J479871J530138J493293
7298E9583178J559108J573068J781243J786189J838074J861405K046106K200838
7290G4229209K111648K303346K353094K563217K563740K782618K734682L139406
7282I4780960L074320L276239L406022L710161L733001L994402M130568M421522
$$ plain form
7342 23794929 24302408 24639537 25040195 25543499 25982391 26439617 26892164 27416978 27918657
7333 27918657 28476733 28981164 29518199 30114675 30647626 31207044 31857630 32540006 33163303
7324 33163303 33783551 34412337 35146510 35820334 36650683 37394520 38193586 39060636 39811751
7315 39811751 40643335 41600871 42590086 43455367 44459130 45395902 46630758 47655730 48819811
7306 48819811 49924229 51166168 52488066 53802697 55079876 56559747 58089885 59583178
7298 59583178 61142286 62715354 64496597 66282786 68120860 69982265 72028371 74229209
7290 74229209 76340857 78644203 80997297 83560514 86124254 88906872 91641554 94780960
7282 94780960 97855280 101131519 104537541 108247702 111980703 115975105 120105673 124527195
7274A24527195M645061M840072N101006N451304N712040O003548O300430O802276
7266A69382932O943187P537169P851941Q252957Q774846R253654R557008J0178593
7258B37732287J0616198J1089403J1468305J1917088J2229666J2633720J2760624
7251C20447291J2953927J2940180J2840414J2492413J1993435J1553437J0627492
7244D05848589R576016Q481203O906044N581275L923733K256499M39545j212077
7236D41800827k834977m515196n836549p162953q344640r185768j0084964j0644447
7228C83191333j1002415j1363854j1581931j1463175j1407401j1341899j0976859
7221C04053799j0791087j0436915j0069111r732342r455008q905622q641368q218785
$$ plain form
7274 124527195 129172256 134012328 139113334 144564638 150276678 156280226 162580656 169382932
7266 169382932 176326119 183863288 191715229 199968186 208743032 217996686 227553694 237732287
7258 237732287 248348485 259437888 270906193 282823281 295052947 307686667 320447291
7251 320447291 333401218 346341398 359181812 371674225 383667660 395221097 405848589
7244 405848589 415424605 423905808 430811852 436393127 440316860 442573359 443012904 441800827
7236 441800827 438965850 434450654 428614105 421451152 413106512 403920744 393835780 383191333
7228 383191333 372188918 360825064 349243133 337779958 326372557 315030658 304053799
7221 304053799 293262712 282825797 272756686 263024344 253569336 244663714 236022346 227803561
7213B27803561p859151p499810p125954o688139o595777o249081n930875n599618
7205A74255156n450057n131211m985513m548067m659187m249092m189595l847078
7197A37195356l814530l701302l462065l283643l283604l054113k989243k853759
7189A10753097k705432k623027k688103k423514k279483k377580k155124k040728
7181I1460106k135938j919702j881664j897569j830795j757683j652687j604894
7173G6779174j520844j481363j537258j365265j455513j312867j292993j283108
7165F5529963j352176j036835j210497j153599j078497r29108j098309j038086
7157E6632856r87055r15562r97402r73087q96279q27772q31120p92202q44171
$$ plain form
7213 227803561 219944410 212444600 205318646 198630507 192034730 185785649 179854774 174255156
7205 174255156 168805099 163673888 158688375 154140308 149481121 145232029 141042434 137195356
7197 137195356 133380826 129679524 126217459 122933816 119650212 116596099 113606856 110753097
7189 110753097 108047665 105424638 102736535 100313021 98033538 95655958 93500834 91460106
7181 91460106 89324168 87404466 85522802 83625233 81794438 80036755 78384068 76779174
7173 76779174 75258330 73776967 72239709 70874444 69418931 68106064 66813071 65529963
7165 65529963 64177787 63140952 61930455 60776856 59698359 58769251 57670942 56632856
7157 56632856 55645801 54730239 53732837 52759750 51863471 51035699 50204579 49412377 48568206
7148D8568206q39124p44230p88715o91733p52130p71063o69143o03159o96893
7139D2012016o06517o62229o88185o15142m96874o27784o20931n60537m38154
7130C6695663n78771m77896n73742n82405m65612m34636n38197m21532m59036
7121C2163836m60431m61401m74657l53541l66548m80517m18345l87440m25937
7112B8335019l94856l32197l71267l78027k76232l10504m15382l28982l29195
7103B5198377l08131k60591l45231m26663j79702l25338k75537l47319l18722
7094B2411143l23678k30698k50113k84608k27666k85985l30941k25529k10916
7085B0041009k93491j65282k60373k93093j95043j95417l11799j78117k18425
$$ plain form
7148 48568206 47729082 46984852 46196137 45504404 44752274 43981211 43312068 42708909 42012016
7139 42012016 41405499 40743270 40055085 39439943 38943069 38315285 37694354 37133817 36695663
7130 36695663 36116892 35638996 35065254 34482849 34017237 33582601 33044404 32622872 32163836
7121 32163836 31703405 31242004 30767347 30413806 30047258 29566741 29148396 28760956 28335019
7112 28335019 27940163 27607966 27236699 26858672 26582440 26271936 25856554 25527572 25198377
7103 25198377 24890246 24629655 24284424 23857761 23678059 23352721 23077184 22729865 22411143
7094 22411143 22087465 21856767 21606654 21322046 21094380 20808395 20477454 20251925 20041009
7085 20041009 19747518 19582236 19321863 19028770 18833727 18638310 18326511 18148394 17929969
7076A7929969k96310r7074k60617j66386k51408j26221k60312j37537k91638j83823
7066A5858643q2515j57987j92915k41692j51896k25800j03336k18254j80330j62092
7056A4141826j39565j47282j17413j86503j74733j87470j62252p7824j08179k16370
7046A2624235j97623j2992j32295j66576k9921k34093j51552p3051j71994j18571
7036A1335567q7445j13766j47303j12562n1052j19188j19811r7569p4659n9194
7026A0353018m7134j66432p9453q4427o6237l1572k6741q9981K2963m490m6519
7015I732995O2821L028M1664Q7195N6881J64304K71288L01072P05878J194137
7005A2621263J176814R35293L88326L8764n74064q11193r46528j017823p33709
$$ plain form
7076 17929969 17633659 17536585 17275968 17109582 16858174 16731953 16471641 16334104 16042466 15858643
7066 15858643 15776128 15618141 15425226 15183534 15031638 14805838 14702502 14484248 14303918 14141826
7056 14141826 14002261 13854979 13737566 13551063 13376330 13188860 13026608 12948784 12840605 12624235
7046 12624235 12426612 12413620 12281325 12114749 12084828 11850735 11699183 11626132 11454138 11335567
7036 11335567 11248122 11134356 10987053 10874491 10823439 10704251 10584440 10486871 10412212 10353018
7026 10353018 10305884 10139452 10059999 9975572 9909335 9877763 9851022 9761041 9784004 9779514 9732995
7015 9732995 9795816 9798844 9840508 9927703 9984584 10148888 10420176 10721248 11427126 12621263
7005 12621263 13798077 14733370 15121696 15160460 14586396 13775203 12828675 11810852 11077143
6996A1077143o70075n25012l50246k64764j30435o8713q0568R5151R5578L69185
6986I547244M30364Q69426J148004J728103J763749J838399J235339O29574k1024
6977A9169178r32452j265115j648062j647018j510708j297942j100135p79859
6969H987887o13597m13352k84598k09997j10908J7348N0084K13980J69626N07476
6959H313949R86129J112072J150454P28880K32027l53464p59454j032923j172003
6950I205667r79250p61784p97828o39786l98564l19380l16457j04430l69740j6752
6940D501696j37478j19710j10158m487j30700r6050j65377J5699l4361n0242p4118
6929C594714j23431k8344m3446l1367o9597q6277q5589l2689L867j19644k6951
$$ plain form
6996 11077143 10407068 9882056 9531810 9267046 9136611 9067898 8987330 9082481 9178059 9547244
6986 9547244 9977608 10847034 11995038 13723141 15486890 17325289 18560628 19190202 19169178
6977 19169178 18236726 16971611 15323549 13676531 12165823 10867881 9767746 8987887
6969 8987887 8374290 7960938 7676340 7466343 7355435 7372783 7422867 7636847 7806473 8313949
6959 8313949 9300078 10412150 11562604 12291484 12523511 12170047 11410593 10377670 9205667
6950 9205667 8226417 7464633 6666805 6027019 5628455 5309075 4992618 4888188 4518448 4501696
6940 4501696 4364218 4244508 4134350 4129863 3999163 3903113 3737736 3753435 3719074 3668832 3594714
6929 3594714 3471283 3442939 3399493 3368126 3298529 3212252 3126663 3093974 3097841 2978197 2951246
6918B951246j01179L2176j15611M4261l4233N057j18371l196j19637J0600o1888
6907B489225J3788p4786q7593j0005j0443j07760m2707R677n1781j6551o0267
6896B050797k4366j0093j20111J36518k07438N2956r8701J470l7323M9893j43669
6885A649933J45509q1606r85n1951m1533n6637P9629N621j06947n0104J822j34830
6873A357921P146M8989q1156P264q038J1582m8070M46m0540j73791Q7227l612
6861A165368k467J11419j14549r2368M3713L6600j21636N9784k1291n0372J2072
6850A026273O319l8737p039r457j01623j702J13077j18485J1336Q6736j01460
6839H65238P1814r9145l935L6037q5379R7821o9832k2922J5431k9874k5297P4093
$$ plain form
6918 2951246 2850067 2882243 2766632 2810893 2776660 2781717 2663346 2660150 2540513 2551113 2489225
6907 2489225 2503013 2428227 2340634 2330629 2320186 2212426 2169719 2179396 2127615 2111064 2050797
6896 2050797 2026431 2016338 1896227 2032745 1825307 1878263 1779562 1781032 1743709 1793602 1649933
6885 1649933 1795442 1713836 1712851 1660900 1619367 1562730 1642359 1647980 1541033 1490929 1492751 1357921
6873 1357921 1365067 1414056 1332900 1340164 1332126 1343708 1295638 1296084 1255544 1081753 1168980 1165368
6861 1165368 1162901 1274320 1159771 1067403 1111116 1147716 1026080 1085864 1064573 1014201 1026273
6850 1026273 1032592 993855 986816 977359 875736 874034 987111 868626 879962 966698 865238
6839 865238 937052 837907 833972 870009 784630 882451 812619 789697 805128 775254 749957 824050
6827H24050j33185L589j0892K6581M9966o4042p4355L8717l2859J6400j422J4915
6815F57463M8849n1164n2318j6184J1576o056O8347o9776o2546J27185o7860j9201
6803E68315R2148J856k6379r3118L1966j0662o9219M7297J2722m5388J7983r4241
6791D33280J49881q8021M8134q2324O5656r8968L9643m79N5727N804k8074m8988
6779D51271j973l1462q693n1933k4296M6419M2694j13208P4915Q3997r1712J8622
6767C94641k106n1712K4334J784Q464K0341o529o7364L6860J1939n388M6413p4131
6754C37546l9809J03963L1528j649m6389j3925j8418m3015K0809k1571J0389K7898
6742C47357o5440P4430L074m7945K8358j4309L1426M347m6151P5192J2623J2183
$$ plain form
6827 824050 690865 694454 683562 710143 760109 696067 621712 660429 627570 643970 642548 657463
6815 657463 706312 655148 602830 586646 598222 592166 660513 590737 528191 655376 587516 568315
6803 568315 660463 662319 635940 542822 574788 564126 494907 542204 554926 509538 527521 433280
6791 433280 583161 495140 543274 460950 526606 427638 467281 466802 522529 528333 500259 451271
6779 451271 449298 417836 409143 357210 332914 379333 422027 308819 383734 467731 376019 394641
6767 394641 392535 340823 365157 366941 375405 395746 389217 321853 358713 370652 365264 411677 337546
6754 337546 297737 401700 433228 431579 385190 371265 352847 309832 330641 309070 319459 347357
6742 347357 281917 356347 359421 311476 339834 325525 356951 361298 315147 390339 402962 415145
6730D15145N4042k7296N2245o7747J4085j2298M5542j241k6157P6225k0456J975
6718E04064N0964M6036j0123l3324Q7896J1454J2852P7392M0630j330K5152O1225
6706H72888o2448J47694M3312K617J04443j2607R0452j3475J05920R5329N5439
6695A429564O5889O6083J87183K48230K25397L52658L81688L69669M85038P14739
6685D526138P62382J219075J884719L184871M606175N601829M817792L032368
6677B9635349Q35242j136623l128551l996618m208877l658882k927807k419140
6669H994093j856800j374296j062075o60310n99183m45231l40581k48244k25444
6660B181929j39589j76713j18084j24308j17467q9576m954l2585j06484j35817
$$ plain form
6730 415145 469187 441891 494136 426389 440474 428176 473718 472477 446320 522545 502089 504064
6718 504064 555028 601064 590941 557617 645513 656967 669819 747211 787841 786511 811663 872888
6706 872888 810440 958134 1001446 1004063 1108506 1095899 1186351 1172876 1278796 1374125 1429564
6695 1429564 1495453 1561536 1748719 1996949 2222346 2575004 2956692 3326361 3811399 4526138
6685 4526138 5288520 6507595 8392314 11577185 16183360 21785189 26602981 29635349
6677 29635349 30470591 29333968 26205417 22208799 17999922 14341040 11413233 8994093
6669 8994093 7137293 5762997 4700922 4040612 3441429 2996198 2655617 2407373 2181929
6660 2181929 2042340 1865627 1747543 1623235 1505768 1416192 1411238 1378653 1272169 1136352
6650A136352K5325k08170M0834n586l7977n3594L3024r4547J5551j02962k7335
6639G20915j22728P2631r1879m7925N8686Q638j66829M9152j30938M396j3435
6628C40684Q2411p9786j8222n3832L4182o1954N6652q9768L4200p6687J1889k7235
6616A52534J957O3449m3595k6947N0475j6611o1724k8123L9625j3470k6813p842
6604H2915j9387N193L7065n4727P3492o5894L6862p8010L0760k9540M8784L016
6592G0529j7628K0255j10685M9314m0658j0744K2959l284m8694L3409J4032m3705
6580f4900o8701P5737J1490k2485J6617m2748l3560P5385n9391j4379L1579k370
6568i7726j5395N7321j21833J31853j8283Q9316q2634r0185O8406J9469l4507
$$ plain form
6650 1136352 1161677 953507 994341 988755 950778 897184 930208 835661 851212 748250 720915
6639 720915 598187 670818 578939 531014 589700 598338 431509 480661 349723 354119 340684
6628 340684 423095 343309 325087 271255 305437 243483 300135 210367 244567 167880 179769 152534
6616 152534 154491 217940 174345 147398 197873 181262 119538 91415 131040 117570 90757 82915
6604 82915 63528 68721 105786 51059 124551 58657 95519 17509 48269 18729 67513 70529
6592 70529 52901 73156 -37529 11785 -28873 -39617 -16658 -19942 -68636 -35227 -21195 -64900
6580 -64900 -133601 -57864 -46374 -68859 -52242 -94990 -128550 -53165 -112556 -126935 -95356 -97726
6568 -97726 -113121 -55800 -177633 -45780 -64063 25253 -57381 -147566 -79160 -59691 -94198
6557i4198k3601Q646J3505p1715k9388R022J6639o4116R1180k8595K6242N0124
6545i6255m3681o4415L4150l9115P7689k3162j8162J698j2736L9901L7570j03447
6533b09965k5643r538K7391R0867m0480n6641M6471l7596K4599O0874o6538l8525
6521b34724M1302k6634j469n9619O2564k1748l4051O5370J3012m9976N9851r7433
6509b83555P5683L8906K3952q1231r998J9907M808p203l238m9299J7594n4922
6497c08596N7603O3433m0921m3626O8629K5656r2444N3822j03641P9840L2682
6486b07563m2147K2600q8646N4048k6237Q880J0695J0138j1723M6288L955N610
6474b14102k7202J420k8116M641L7369r3352k0696J21924m7773M4703r0216k0839
$$ plain form
6557 -94198 -117799 -109153 -95648 -167363 -196751 -187729 -171090 -235206 -144026 -172621 -146379 -96255
6545 -96255 -139936 -204351 -170201 -209316 -131627 -154789 -172951 -171253 -183989 -144088 -106518 -209965
6533 -209965 -235608 -245146 -217755 -126888 -167368 -224009 -177538 -215134 -190535 -129661 -196199 -234724
6521 -234724 -193422 -220056 -221525 -281144 -218580 -240328 -274379 -209009 -195997 -245973 -186122 -283555
6509 -283555 -207872 -168966 -145014 -226245 -236243 -216336 -211528 -218731 -221969 -271268 -253674 -308596
6497 -308596 -250993 -187560 -228481 -272107 -203478 -177822 -270266 -216444 -320085 -240245 -207563
6486 -207563 -249710 -227110 -315756 -261708 -287945 -279065 -268370 -258232 -269955 -223667 -219712 -214102
6474 -214102 -241304 -239884 -268000 -263359 -225990 -319342 -340038 -218114 -265887 -221184 -311400 -332239
6462c32239L9637N4240J0784K529p376J51m7545K5631J2383P3453q7581l6065
6450b91998k3283O6398R981n599j4179k4835K958R9390p4085m1671J4274P4465
6438b08184o4938K2262l7695J0665L6304J0098p2326L0637J0482R57j5862P1280
6426b06320K424l0863K4182m390j17830Q9782m1854k9019j3459l1469J54340K0694
6414a83782P450q1351j075R78j12671P7630Q5106n8627q824P7058m4028q5216
6402c27352R0222p0234P5896J9247o785N1504M179o0465M6745O6749O659n1676
6390a55311J42869r1569k9746m9295r361l9350K2786m9418k171R2150P409q2685
6378b43692K4787K0717m5405l8338L8625J8959Q482n4003j8247J7266q40L6942
$$ plain form
6462 -332239 -292602 -238362 -227578 -225049 -232425 -232274 -279819 -254188 -241805 -168352 -255933 -291998
6450 -291998 -315281 -248883 -238902 -244501 -258680 -283515 -280557 -181167 -255252 -296923 -282649 -208184
6438 -208184 -273122 -250860 -288555 -277890 -241586 -231488 -303814 -273177 -262695 -261738 -277600 -206320
6426 -206320 -203896 -234759 -210577 -214967 -332797 -243015 -284869 -313888 -327347 -358816 -204476 -183782
6414 -183782 -176332 -257683 -258758 -257780 -370451 -292821 -207715 -266342 -275166 -198108 -242136 -327352
6402 -327352 -237130 -307364 -231468 -212221 -219006 -167502 -163323 -223788 -177043 -110294 -103635 -155311
6390 -155311 -12442 -104011 -133757 -183052 -192413 -231763 -208977 -258395 -260566 -168416 -161007 -243692
6378 -243692 -218905 -198188 -243593 -281931 -243306 -224347 -215865 -269868 -288115 -270849 -271689 -234747
6366b34747m3484j10349J83977k5482p681P870M5652k2205o3353L6129m6319k1672
6354c01664N5755k3214k5396K9379N0635m8440o8067L9267P8286L3468o538p7964
6342b64493J11782j7988l1163n9759N0583n6197m6332P3538n2688P3905p5874
6331b94686J327O5600O814L087j5662j9524J1081Q6906p7681R1915o1414l6237
6319b38474p9413M3063K0473l8900L7355l1365O9759m6846J4896M583K7014l1770
6307b49625K6122o7885K0913L5068O931r449K1414k8661j9943N901j0580M2455
6295b27339j5409L5694l0849m7578J12322k4604m7336M6058O7749j06953K7789
6284b10456K9692l3162R9912p0403J9266k1226M1944R731j2465m6620L7835R586
$$ plain form
6366 -234747 -278231 -388580 -204603 -230085 -237766 -229896 -184244 -206449 -269802 -233673 -279992 -301664
6354 -301664 -245909 -269123 -294519 -265140 -214505 -262945 -331012 -291745 -213459 -179991 -186529 -264493
6342 -264493 -152711 -170699 -201862 -261621 -211038 -267235 -313567 -240029 -292717 -218812 -294686
6331 -294686 -293359 -227759 -220945 -217858 -233520 -253044 -241963 -155057 -232738 -140823 -202237 -238474
6319 -238474 -317887 -274824 -254351 -293251 -255896 -287261 -217502 -264348 -249452 -244869 -217855 -249625
6307 -249625 -223503 -291388 -270475 -235407 -228476 -237925 -216511 -245172 -265115 -259214 -269794 -227339
6295 -227339 -242748 -207054 -237903 -285481 -173159 -197763 -245099 -199041 -131292 -238245 -210456
6284 -210456 -180764 -213926 -114014 -184417 -165151 -186377 -144433 -134702 -147167 -193787 -155952 -146366
6272a46366J9516k9560j5275k2202L2381k7067k175O4536o6916O8168p0394N5453
6260a39901q1151L9174q9553J12397j9662J3590j7625k5415N9647O1065j835o2638
6248a51907k013N5556j14759R1027L3111N86r4568O9443n1219M0434J3574M1425
6236f9310p109J15995k9420K1022o7113L7977m8739J50237j2721J5624m8412M9917
6224A07948l7378p0606j3947Q977J5146l9712K1548o416p0231K0997m3523M1284
6212f5913P0274k3719j13827L1190L731j9400n9971J44273j51320M2439O340l1360
6200a67263J5819k853R256L5636q196l996N6843j4628q3052M0898j9701K3895
6188a17342q0944O2447M7719K0783R50N482j09690J17916r7348P4542L8882l9616
$$ plain form
6272 -146366 -126850 -156410 -171685 -193887 -161506 -188573 -190748 -126212 -193128 -124960 -195354 -139901
6260 -139901 -221052 -181878 -271431 -159034 -178696 -165106 -182731 -208146 -148499 -87434 -89269 -151907
6248 -151907 -153920 -98364 -213123 -122096 -88985 -88399 -182967 -113524 -164743 -124309 -110735 -69310
6236 -69310 -76419 39576 10156 31178 -35935 2042 -46697 103540 90819 106443 58031 107948
6224 107948 70570 -36 -13983 -5006 10140 -29572 -8024 -14440 -84671 -63674 -107197 -65913
6212 -65913 4361 -19358 -133185 -101995 -98264 -117664 -177635 -33362 -184682 -142243 -135903 -167263
6200 -167263 -151444 -154297 -145041 -109405 -117601 -121597 -64754 -79382 -162434 -121536 -141237 -117342
6188 -117342 -198286 -135839 -88120 -67337 -66387 -60905 -170595 -52679 -150027 -75485 -36603 -76219
6176g6219l0869J46443q2577J3685p8942N1872N947o2954J02699o9491n742M7870
6164c8278M3832n0477K6419n6448k3328q106m0719J13161k9940J0690M8676j3970
6152a8488K408R725k5745k8884j3084Q4729J7068O0684r7867j534j772R685n9829
6139f2904L4136O8256l2817r831N7123P308l0840l5169o434J882M8510j6794k4905
6126b479L320k4140K036k8101J5321M1617l004j2808K1888K7190J2619k3055J9411
6113D9815l612M190J5053k7754K1686M3593n1919L2603P7160j04705n0683O041
6101A1468J24056l8253O1757j03855Q9189n322j0403q5976L126R3268l0480K7801
6089A36376j6424O6219j4129J7377n1913Q0220m8646J6265l2678J3593L1270Q054
$$ plain form
6176 -76219 -107088 39355 -43222 -29537 -108479 -56607 -50660 -113614 -10915 -80406 -86148 -38278
6164 -38278 5554 -44923 -18504 -74952 -98280 -106386 -147105 -33944 -63884 -53194 -4518 -18488
6152 -18488 -16080 -6355 -32100 -60984 -74068 10661 27729 88413 -9454 -10988 -12760 -3075 -62904
6139 -62904 -28768 39488 6671 -3160 53963 61271 30431 -4738 -11172 -9290 39220 22426 -2479
6126 -2479 841 -23299 -21263 -49364 -34043 7574 4570 -8238 13650 40840 53459 30404 49815
6113 49815 46203 50393 65446 37692 59378 102971 51052 83655 160815 56110 5427 11468
6101 11468 135524 97271 159028 55173 144362 139040 128637 42661 45787 139055 108575 136376
6089 136376 119952 186171 172042 189419 137506 217726 169080 185345 152667 166260 197530 205584
6077B05584L7172J6601L279n1638L1900m1984J00070n5449l8443R7816L914K3667
6065C32489q8694J4537n0413J24591n0265M2676O4459Q0569n8611l7174P1191
6054D45355l1203k8701N3155N302Q987M1684k1037j4068J14616k8606l5715N3171
6042E62940L1920k6618J1926Q569N1221m1896J84856j46507J0800j0971J494n8925
6030E78809J52419N3052J3301l1470Q4798O4825m1433l9714O4313Q448J9599q090
6018I18857M6867J7250m3368K2974J11887n011Q3920n8805O8399O0280P3902j1972
6006A285180P4276M779L5074K0782M6302Q1429j0401M1117J05209Q1373L8330
5995A803450R3096O0201N647J78300O2463N9165J08883M8590J50841J21086P0040
$$ plain form
6077 205584 242756 259357 262636 210998 242898 200914 300984 245535 207092 304908 308822 332489
6065 332489 243795 258332 207919 332510 282245 324921 389380 469949 411338 374164 445355
6054 445355 414152 385451 438606 443908 452895 494579 473542 459474 574090 545484 509769 562940
6042 562940 594860 568242 580168 588737 639958 598062 782918 636411 647211 636240 637734 578809
6030 578809 731228 784280 797581 766111 850909 915734 874301 834587 898900 907348 926947 918857
6018 918857 965724 982974 939606 962580 1074467 1069456 1153376 1094571 1162970 1223250 1297152 1285180
6006 1285180 1359456 1364235 1399309 1420091 1466393 1547822 1537421 1578538 1683747 1765120 1803450
5995 1803450 1896546 1956747 1962394 2140694 2203157 2262322 2371205 2419795 2570636 2691722 2761762
5984B761762J17495J86523K1991J76236R3343J56448K82445K26898K59111L71954
5974D654206L87305K64082M88829O74046P60763J305176K366087L048620K351077
5965A6300191J553238J381102J259903J890728L535240L853713K129669J226710
5957C3130494Q16257M60094K055909M397421L147063M99972j04286j503292k399481
5948D0500151j119490k1853j401482j844443k156907l023971k897661j650945
5940B6383399j638363j910844j913921k238550k678119k420775k253051j668778
5932I660998j303241j104063q63066n88203l75847m18994l20975k12736k09562
5923D264311j82863j39591j46009j15784k7935k58164M417o4545j56472m8862
$$ plain form
5984 2761762 2879257 3065780 3087771 3264007 3357350 3513798 3796243 4023141 4282252 4654206
5974 4654206 5041511 5305593 5794422 6468468 7229231 8534407 10900494 13949114 16300191
5965 16300191 17853429 19234531 20494434 22385162 25920402 29774115 31903784 33130494
5957 33130494 33946751 34406845 36462754 40860175 44007238 44507210 44402924 42899632 40500151
5948 40500151 39380661 39358808 37957326 36112883 33955976 30932005 28034344 26383399
5940 26383399 24745036 22834192 20920271 18681721 16003602 13582827 11329776 9660998
5932 9660998 8357757 7253694 6390628 5802425 5426578 5007584 4686609 4473873 4264311
5923 4264311 4081448 3941857 3795848 3680064 3652129 3393965 3398382 3333837 3177365 3128503
5913C128503l9306j20511k5430o0787m6341O31p3582k7643M249K0015K0012J03141
5901B882951J1190R5618J55633K66466K95096N35181Q49770J071157J064339Q82876
5891H110277L70154l2873l11438p60299q75113q05922p67274n90944m55030k98319
5881C583219l30940j12436j30212N986Q4184J87238J32465K10885K16770J67835
5871D014994J91423K35403L29766M52220P41815Q75261R62573J076194R24552
5862I804201N53841L22004k921k44664m86067n40744o45941o26247p52112p93083
5852F588267o13004o58118m38302l23937k64448k35285j71894l37516j71372r4962
5842C279429k34614j05456l4608p7765J77715J15700K87852L94234P73348J040243
$$ plain form
5913 3128503 3089197 2968686 2943256 2882469 2836128 2836759 2763177 2735534 2739783 2759798 2779810 2882951
5901 2882951 2894141 2989759 3145392 3411858 3706954 4242135 5091905 6163062 7227401 8110277
5891 8110277 8480431 8447558 8136120 7375821 6500708 5694786 4927512 4336568 3881538 3583219
5881 3583219 3252279 3139843 3009631 3015617 3099801 3287039 3419504 3630389 3847159 4014994
5871 4014994 4206417 4441820 4771586 5223806 5965621 6840882 7803455 8879649 9804201
5862 9804201 10358042 10680046 10677125 10432461 9946394 9405650 8759709 8133462 7381350 6588267
5852 6588267 5975263 5317145 4878843 4554906 4290458 4055173 3883279 3545763 3374391 3279429
5842 3279429 3044815 2939359 2904751 2826986 3004701 3120401 3408253 3802487 4575835 5616078
5832E616078J271977J137059P27576L01726l20860p51683q91433j051916r98943
5823E039581p95036o65933n72459l84077l23261k94898j02181j71738j25432q6325
5813A518241j0992j72738K9932K1743j25383j9982J825K4490M1309m980r3591
5802A209874k9127R7725K0318j01321q552n1590L0404n206l2577j3707l5492o4836
5790A015913J8916N1379o4634N4728r8150P8847J9769K1120J6949o9122N6942
5779A102657o462J26488j0809P6895P0054J06068Q4420J96995K95745J00325M56509
5768B598885M12728N22886O12512O34161N59221M90841L40401K24546m6102j87765
5758F162314l99000l56606n64479m28514n36221l51030l32206k03421l07205m8261
$$ plain form
5832 5616078 6888055 8025114 8752690 9054416 8733556 7981873 7090440 6038524 5039581
5823 5039581 4244545 3578612 3006153 2622076 2298815 2003917 1901736 1729998 1604566 1518241
5813 1518241 1507249 1334511 1364443 1386186 1260803 1240821 1242646 1267136 1308445 1303465 1209874
5802 1209874 1180747 1278472 1298790 1197469 1188917 1137327 1167731 1162525 1129948 1116241 1080749 1015913
5790 1015913 1034829 1086208 1021574 1076302 978152 1056999 1076768 1097888 1114837 1045715 1102657
5779 1102657 1096195 1222683 1211874 1288769 1358823 1464891 1549311 1746306 2042051 2142376 2598885
5768 2598885 3011613 3534499 4147011 4781172 5340393 5831234 6171635 6396181 6350079 6162314
5758 6162314 5763314 5406708 4842229 4413715 3877494 3526464 3194258 2990837 2683632 2635371
5748B635371j47025K6110q037M2489R2463K19643K07539L35080M71603O61526
5738D536762Q70025R16534J174838J068449R84469Q72988O80239L84956J30667
5729A1619927k09132n43561o59634r69563q60698j126680q04897r14021p43872
5720D787869o69873m63872k91157l31498j37075q6530J4631j6702J03279R3366
5710C002438K34134K19004K72545M21153N32431O30448O22741N86331O22096M14848
5700G558169K76197n1188l10790m98469n75015q07578o61619o83403n37366n94621
5690C114317m06961k56385k60528l07692m5215j31984p6954j5151r9953l2447
5680A481047M9212j82679L7102k094N2473r0253m6501m2177q1850O7915j03322
$$ plain form
5748 2635371 2488346 2514456 2506419 2548908 2641371 2861014 3068553 3403633 3875236 4536762
5738 4536762 5406787 6323321 7498159 8566608 9551077 10424065 11104304 11489260 11619927
5729 11619927 11410795 10867234 10207600 9238037 8377339 7250659 6445762 5531741 4787869
5720 4787869 4117996 3654124 3362967 3031469 2894394 2807864 2822495 2805793 2909072 3002438
5710 3002438 3236572 3455576 3728121 4149274 4681705 5312153 5934894 6521225 7143321 7558169
5700 7558169 7834366 7783178 7472388 6973919 6398904 5591326 4929707 4246304 3708938 3114317
5690 3114317 2707356 2450971 2190443 1882751 1837536 1705552 1628598 1613447 1513494 1481047
5680 1481047 1530259 1347580 1384682 1382588 1435061 1344808 1298307 1256130 1174280 1242195 1138873
5669A138873l9957M1952k6470j33734r379K3554n941M6091j07198j00220R6168
5658I23739k6887j05270L961K5122r1249l5261K0173k3613o900L2331n0896N4321
5646G19571k037q7347K9156J4875L192M946P376m102L6422k3098l6719P7201k0935
5633G18501n2359L3671M2073p6907J19479J815K2567j3067J8532k9374j072J631
5621G85490J22272n2924K9979q037J15447m9161q184O2158J21071p2311J02007
5610A147807L0631M6561O3530Q5066P3504J45457P3628J58240K01939L78287K43414
5599B648064L38742N50867M65356N69690N71202M92952M21660L29222K3694p211
5589F404238j08368l12933m10518l35370l89122k68755k98165j67953o7258P096
$$ plain form
5669 1138873 1098916 1140868 1114398 980664 971285 994839 988898 1034989 927791 827571 923739
5658 923739 896852 791582 795543 820665 729416 694155 714328 690715 683815 716146 665250 719571
5646 719571 717534 630187 659343 674218 677410 682356 689732 685630 722052 698954 662235 739436 718501
5633 718501 666142 699813 741886 664979 784458 786273 808840 795773 814305 784931 783859 785490
5621 785490 907762 854838 884817 876780 992227 943066 934882 997040 1118111 1045800 1147807
5610 1147807 1178438 1224999 1288529 1373595 1447099 1592556 1666184 1824424 2026363 2404650 2648064
5599 2648064 2986806 3537673 4003029 4572719 5143921 5636873 6058533 6387755 6411449 6404238
5589 6404238 6295870 5982937 5572419 5237049 4847927 4579172 4281007 4113054 4045796 4052892
5579D052892J34298J09740K61447K54285M31780M30568N56342P41586Q64270R09705
5569H746913J117620J066678J073968J007586R55259P50919M28168K53181k14634
5560A5185658l72245n16530p67930p61124o00563o93340m08561l57165r2130o3940
5550A0552130P1970J43619K64283K97243L66810L37375L09221L65774L15751L33523
5540A3357699L49631L75731N43194K39054L65438K09657O5111l11779m33954n88851
5530A4170931o68622q02138p99688q07361p30051o01797n88075n50977m46938
5521H175284n85630l95630m16118m13810m17288l49111m83809k45112l52968k98428
5511D217380l65741k29257k79061k56868k67378j37196k25626J4112l15934q2284
$$ plain form
5579 4052892 4187190 4296930 4558377 4812662 5244442 5675010 6231352 6972938 7837208 8746913
5569 8746913 9864533 10931211 12005179 13012765 13968024 14718943 15147111 15400292 15185658
5560 15185658 14813413 14296883 13528953 12767829 12167266 11473926 11065365 10708200 10616070 10552130
5550 10552130 10624100 10767719 11032002 11329245 11696055 12033430 12342651 12708425 13024176 13357699
5540 13357699 13707330 14083061 14626255 14865309 15230747 15440404 15505515 15193736 14759782 14170931
5530 14170931 13502309 12700171 11900483 11093122 10363071 9761274 9173199 8622222 8175284
5521 8175284 7589654 7194024 6777906 6364096 5946808 5597697 5113888 4868776 4515808 4217380
5511 4217380 3851639 3622382 3343321 3086453 2819075 2681879 2456253 2470365 2154431 2072147
5501B072147n8407q5579r0833m1693j57638k8920m8579o7331j05084Q646n1417
5490A345312j06460l3955n1581k5527n9980n6505r2839r0430R3426m4989k8208
5479H48264j6975m3358n5657k8146l7949p367j2486K2987J6852k5610k1147m2727
5467E96681m1461J3226j258p1312J45181j99853R7065j15802j8536J23471q9853
5456D37549K8591j9223n8989j7765O5612r9788K9073l7436K0371j3259l3408j3036
5444B88292J2197J3084n095m768K3586K6853j86340L6386J4956L2067k2334m1825
5432A87059O4384K0055q3466K4L8301J0845p5927O1157k202n3755k7509L9731
5420A78697o2944K8173P720R520j7258k1315j2975J7031Q508O1514q1965P4530
$$ plain form
5501 2072147 2013740 1928161 1837328 1795635 1637997 1609077 1560498 1493167 1388083 1396729 1345312
5490 1345312 1238852 1204897 1153316 1127789 1067809 1011304 918465 828035 921461 876472 848264
5479 848264 831289 787931 732274 704128 666179 658812 646326 669313 686165 660555 639408 596681
5467 596681 555220 568446 567188 495876 641057 441204 538269 422467 403931 527402 437549
5456 437549 466140 446917 387928 370163 435775 335987 365060 327624 347995 334736 301328 288292
5444 288292 300489 313573 308478 303710 327296 354149 167809 204195 219151 251218 228884 187059
5432 187059 251443 271498 188032 188056 226357 237202 161275 222432 220230 166475 138966 178697
5420 178697 115753 143926 151646 161166 143908 122593 109618 126649 135157 196671 114706 189236
5408A89236m8939N399l4347J11416q4058N2421L1685N9191m6320J0750J9338n9718
5396B06054J4851K8252j26652N8345O4818m9230j5318p318l0851j0465N1654p898
5384A76242n217q7976O2424K9462O515P6938p8989P9693O0142l3561o3198Q8568
5372C11043j6304m9362J2977m899l1384J01173q2884K7478K0097o4292M2224L461
5360B69328l9734o166P0237o1228O2513p01O834M4735M0826k8729k9794Q1810
5348D09931o4975m0795R0107N51J6126J50631o5786j457M1830k1551J6100J39891
5336F70603o5892l4512R8316n017M5694R8446J6322O494K8347L2103O3789K8068
5324I82761K2079m37J66242J893Q9218R1879J05962L630J66351K55701M1092K32912
$$ plain form
5408 189236 140297 145696 111349 222765 138707 191128 222813 282004 235684 246434 265772 206054
5396 206054 220905 249157 122505 180850 245668 196438 181120 173802 142951 132486 184140 176242
5384 176242 171025 83049 145473 174935 181450 258388 179399 259092 319234 285673 222475 311043
5372 311043 294739 245377 258354 253455 222071 323244 240360 267838 287935 223643 265867 269328
5360 269328 229594 223428 293665 232437 294950 294249 301083 345818 386644 357915 328121 409931
5348 409931 344956 304161 394268 394819 410945 561576 495790 494333 536163 514612 530712 670603
5336 670603 604711 570199 668515 663498 709192 807638 823960 830454 858801 890904 954693 982761
5324 982761 1004840 1004403 1170645 1172538 1261756 1353635 1459597 1463227 1629578 1885279 1926371 2159283
5312B159283K51963J73815J87024L07724L07245K50290L48266K53189K88067K06750
5302D733616J31718J60879K22119J33323J64138J33034P6830N9849K20286J34588
5292F170380J16576J19734L10888L39418L47277L21511L52227M37195L38674K87121
5282I141001M56162j8394J18874J1735k84539k38884l05989m47474m62317l38145
5272G632030m25800m38217k32066m51321k51952l15837j05603k07832J1059j24241
5262E090220L160J8796j7915p969J08687j22625p3854k26517j36774k22358k94729
5251D118122l38185l04917k80776k92463k40449k33264j56850j68839k48739p6976
5241A776664j61315n5490j30130j63039j32087m578j0782r6982m6201k6396q624
$$ plain form
5312 2159283 2411246 2585061 2772085 3079809 3387054 3637344 3985610 4238799 4526866 4733616
5302 4733616 4865334 5026213 5248332 5381655 5545793 5678827 5755657 5815506 6035792 6170380
5292 6170380 6286956 6406690 6717578 7056996 7404273 7725784 8078011 8515206 8853880 9141001
5282 9141001 9597163 9578769 9697643 9709378 9424839 9185955 8879966 8432492 7970175 7632030
5272 7632030 7206230 6768013 6535947 6084626 5832674 5516837 5411234 5203402 5214461 5090220
5262 5090220 5093380 5112176 5094261 5086292 5194979 5072354 4998500 4771983 4635209 4412851 4118122
5251 4118122 3779937 3475020 3194244 2901781 2661332 2428068 2271218 2102379 1853640 1776664
5241 1776664 1615349 1559859 1429729 1266690 1134603 1130025 1119243 1022261 976060 949664 941040
5230I41040p6931M5749l5757l4968p637O0399j08354l034j0438q8981q068P8100
5218G51120K2412m8091n4172l4965j5667k0172K0670Q858P814L2272q7442K9259
5206F11896r344j3872k8629r403l897J07481k5787N363j021r795J9919N6090j3959
5193F85042l2849P1274q803m3293N0304p5447l672j23J08068R755P1959n1784
5181G80431P9694J9472J15306J62663J72961J41400J59280K99678L20418K26445
5171B477748K26706J38686l0419p176k11252j62155j75606j37929j98030J7988
5161A938561j42738j7531r546m5200l136K1857P490N3064O5961M6692J82551K47263
5149B345288L43852M05321M29925M51251M38242M68971N24687O63995O42672M31671
$$ plain form
5230 941040 864109 909858 874101 839133 831496 891895 783541 780507 770069 681088 673020 751120
5218 751120 773532 725441 671269 636304 620637 600465 621135 629993 637807 670079 582637 611896
5206 611896 602552 588680 560051 550648 546751 654232 628445 633808 632787 622992 642911 699001 685042
5193 685042 652193 723467 714664 671371 721675 646228 642556 642433 750501 760256 832215 780431
5181 780431 860125 879597 994903 1157566 1330527 1471927 1631207 1930885 2251303 2477748
5171 2477748 2704454 2843140 2812721 2805545 2594293 2432138 2256532 2118603 1920573 1938561
5161 1938561 1795823 1778292 1768746 1723546 1720410 1742267 1749757 1802821 1868782 1915474 2098025 2345288
5149 2345288 2689140 3094461 3524386 3975637 4413879 4882850 5407537 6071532 6714204 7145875
5139G145875J79322k5412m76814n98228o55838n80799n15979m25876k37035k67137
5129C542079j84503j54385m8456j96686m2771J20468L2779J62667J92583L35027
5119C758802L75571L66062M71055O28970O91959P24122P81088Q35284O45084N70404
5109I848401L68226J25361k10172l85330q57859p94522q45908q74518p03749o37027
5099E032903m94464k51563j91944r3753m5456k6782k4409R9900R3607K11404J59330
5088D468773M13902N87871Q58800J069554J150537J240389R29600M04225J65619
5079A1289270l13725n63064o44810o89997p64827n93243n89285m66936m87909
5070F175474l45753l00669k47572k88039k03292j35129Q1419q8798K45831K54280
$$ plain form
5139 7145875 7325197 7299785 6822971 6224743 5568905 4988106 4472127 4046251 3809216 3542079
5129 3542079 3357576 3203191 3154735 2958049 2915278 3035746 3068525 3231192 3423775 3758802
5119 3758802 4134373 4500435 4971490 5600460 6292419 7016541 7797629 8632913 9277997 9848401
5109 9848401 10216627 10341988 10131816 9746486 8888627 8094105 7248197 6373679 5669930 5032903
5099 5032903 4538439 4286876 4094932 4001179 3955723 3928941 3904532 4004432 4098039 4309443 4468773
5088 4468773 4882675 5470546 6329346 7398900 8549437 9789826 10719426 11123651 11289270
5079 11289270 10975545 10412481 9767671 9077674 8312847 7719604 7130319 6663383 6175474
5070 6175474 5829721 5529052 5281480 4993441 4790149 4655020 4736439 4647641 4893472 5147752
5060E147752M74315L98569M29893K89536K60289J45738J11564K11868J48819J24332
5050G742675K5917L5347R7903p6431j59919k62046l77471m60986m99215o35659
5040E430115m44919m59047m53645j81275n0043j20786l7151j21679L1511K5402
5030C618483P2305R7123K38362J68668K26687K96263K91173K28157K24978P6224
5020E538423K3981k66780l62909n41436m27738m45465m32588m50392k92309l04291
5010B038496j82317k02545o9908p9397k9012j20790j1834N4180j6556J08098J06581
4999A594996K67140K37463J73348N5303o4238j58006k07810j74311k83696k39273
4989A200916j58327j42048n6836n5138n9325n8927o9828r337J8913n4829j3815
$$ plain form
5060 5147752 5622067 6020636 6450529 6740065 7000354 7146092 7257656 7469524 7618343 7742675
5050 7742675 7768592 7803939 7901842 7825411 7665492 7403446 7025975 6564989 6065774 5430115
5040 5430115 4985196 4526149 4072504 3891229 3841186 3720400 3683249 3561570 3593081 3618483
5030 3618483 3690788 3787911 4026273 4194941 4421628 4717891 5009064 5237221 5462199 5538423
5020 5538423 5562404 5295624 4932715 4391279 3963541 3518076 3085488 2635096 2342787 2038496
5010 2038496 1856179 1653634 1583726 1504329 1475317 1354527 1342693 1396873 1380317 1488415 1594996
4999 1594996 1862136 2099599 2272947 2328250 2264012 2106006 1898196 1723885 1440189 1200916
4989 1200916 1042589 900541 843705 788567 729242 670315 600487 591150 610063 555234 541419
4978E41419m1697l4655L664J1711l3350N947j7905k8346l9819P2808m0192k2861
4966C76724n9175Q2802j8777o5014O5355J1465r4140M8414l5712L5211M8558m5687
4954C50024R458J4265o5664N9922j01031J06551o5928M3436n6703O2414r1801
4943B64943J37652j7293Q2755n0616M5260N8297J68875K263P0315n4844O7515
4932G75122o9420q1298N6929q2349P0882K12o1130N136q7137n4344N0229m8393
4920D74439l6984M2654j0598n4082R6060Q557J5378M392J2299J3647J39373J10111
4908H15246M0942J7502P0757n4596p3165n9636k8925l2638L0515J328M082l7787
4896F93625l0882J46629N8376R9511m7828m639J24174K6150N9873L6919L6764
$$ plain form
4978 541419 499722 465067 468731 480442 447092 453039 435134 406788 366969 439777 399585 376724
4966 376724 317549 400351 381574 316560 381915 393380 299240 347654 311942 347153 395711 350024
4954 350024 359482 373747 308083 368005 266974 373525 307597 351033 294330 356744 264943
4943 264943 402595 385302 468057 417441 462701 520998 689873 692136 762451 707607 775122
4932 775122 705702 624404 681333 598984 669866 670078 608948 614084 526947 472603 522832 474439
4920 474439 437455 480109 469511 415429 511489 520046 535424 539816 552115 565762 705135 815246
4908 815246 856188 873690 944447 889851 816686 757050 728125 695487 726002 727330 731412 693625
4896 693625 662743 809372 867748 967259 919431 914792 1038966 1065116 1124989 1161908 1198672
4885A198672N6446P3597J15355Q4584N2700J35121J3093J08048J2416M5705K6807
4874A922544J04513Q3722P1554J27539L4697M5226n1771P5852P4643J8991L5264
4863B542774K0327K02779P4618J80028J89143K50768L12797K06734M34447L19571
4853D733986M24028N18626M57140N78664N06359N71096L15160K66210K80612K7025
4843H678906K14949O7544J86442K43896N65323P69478R07243R94130O36936L27948
4833A3592795J78968m2343k04613q7679J57629J88063P12062P28085Q92730R04557
4823A7020254Q67432M81662K73608m8276n21902p15163q78278r40027q86411o88217
4813A3964682m12086k86062J80690P7351r3788k95099m43099p09255p06458p50351
$$ plain form
4885 1198672 1255118 1328715 1444070 1528654 1581354 1716475 1729568 1837616 1850032 1895737 1922544
4874 1922544 2027057 2110779 2182333 2309872 2344569 2389795 2338024 2413876 2488519 2507510 2542774
4863 2542774 2563101 2765880 2840498 3020526 3209669 3460437 3773234 3979968 4414415 4733986
4853 4733986 5158014 5676640 6133780 6712444 7218803 7789899 8105059 8371269 8651881 8678906
4843 8678906 8893855 8961399 9147841 9391737 9957060 10726538 11633781 12627911 13264847 13592795
4833 13592795 13771763 13729420 13524807 13437128 13594757 13782820 14494882 15222967 16115697 17020254
4823 17020254 17887686 18369348 18642956 18594680 18072778 17357615 16479337 15539310 14652899 13964682
4813 13964682 13552596 13266534 13447224 13524575 13430787 13135688 12692589 11983334 11276876 10526525
4803A0526525n92612o05469l81802l42934j32111j68559p1718k50654k83918l92372
4793G304376m23110m75687m61720m06541n50987l56746k71012l62788k97795l41106
4783C356884j36133l30979q0018j38127j73079q9534q2529p1254J9971r0464m4667
4772B140071l0748k4991l9013j53099k6786P6325j28292j3496j51628j9697j02375
4761A526271o2140j16770l7672j43406N099q6209j2922o0576K1321j07725p3982
4750H51289J6907l4989k3182l9966l7964q2224N3389r1765m9736j287j2270q7741
4738D60461L2304K2481p9887p2215P2677l2519K836k2393p4944J3398M9987n5483
4726C16703l795n1477J8309m0726j0253K7641o1825K623N993r0893J02596K6761
$$ plain form
4803 10526525 9933913 9328444 8946642 8603708 8471597 8303038 8231320 7980666 7696748 7304376
4793 7304376 6881266 6405579 5943859 5537318 4986331 4629585 4358573 3995785 3697990 3356884
4783 3356884 3220751 2889772 2809754 2671627 2498548 2409014 2326485 2255231 2275202 2184738 2140071
4772 2140071 2109323 2084332 2045319 1892220 1865434 1941759 1813467 1799971 1648343 1628646 1526271
4761 1526271 1464131 1347361 1309689 1166283 1171382 1085173 1072251 1011675 1032996 925271 851289
4750 851289 868196 833207 810025 770059 732095 649871 703260 611495 561759 560472 548202 460461
4738 460461 492765 515246 435359 363144 435821 403302 406138 383745 308801 322199 372186 316703
4726 316703 312908 261431 279740 239014 228761 256402 194577 197200 203193 112300 214896 241657
4714B41657l6376j8627K4957o3039N0323r5471M3926M8653o2247N1753k2382r4756
4702F8371L3606p544R4222r5843K2003j9173K1643K8220J4280o3099M5617q4882
4690E7421P3837q0102J15826o1737l1605K139L8495k2544M2542k3651q3229J5521
4678D2913N1198n0628j2514m6053Q2238n8472J7765j05132J08499j5519J070o0843
4666d5478J22437q5276N223L9407L3676q791j111K8682m4981k8389m491J4174
4654B5082k3366J886l5306M8977J0087n3266Q4547k3090J01045j86141L6923o545
4642a9167M1802J764o9503N286N4522Q4010j06335K7527j5549l2328L9617O0929
4630G2575N9283j35249M8410j3381j2998O1310M1621j07392L5793n3023k282j1895
$$ plain form
4714 241657 205281 186654 211611 148572 198895 103424 147350 196003 133756 185509 163127 68371
4702 68371 101977 94433 188655 92812 114815 95642 117285 145505 159785 96686 142303 57421
4690 57421 131258 51156 166982 105245 73640 75779 114274 91730 134272 110621 27392 42913
4678 42913 94111 43483 30969 -15084 67154 8682 26447 -78685 29814 14295 15365 -45478
4666 -45478 76959 -8317 -3094 36313 69989 61198 60087 88769 43788 15399 10908 25082
4654 25082 1716 3602 -31704 17273 27360 -25906 58641 35551 136596 -49545 -12622 -19167
4642 -19167 22635 24399 -45104 -39818 14704 98714 -7621 19906 4357 -27971 11646 72575
4630 72575 131858 -3391 45019 31638 18640 79950 121571 14179 49972 -3051 -5333 -17228
4618a7228M2957M2902N181K1364K536K8801n2439M6661j12746J08856j5427j2116
4606H9302p1025M9733J25515r1773l4317j5404M0948L6306M8714J6730r9727J24162
4594B19164m9091n479j1458Q223o2034P3276n3022J8242K2395K9192l8638m4121
4582A06649J6098K4455K1736l6460J373K086l464q942R1446l9799k7538J7114
4570A64754L6861j3030j0448j1864k6133l739K0552K4757j5317L3205p574r8898
4558I3126M7284O9755r6019J5083J6840j7240J3912O281K8337l3700J7498q8007
4546G3150L3164j9152R3626j37375O0484N632j4607l6167O1541l2389N3720l4765
4534A06862Q4549r0989m2059L6366m8693M6O3263k9540p5801L9863m5439k0808
$$ plain form
4618 -17228 25729 68631 73812 95176 97712 126513 74074 120735 7989 116845 101418 89302
4606 89302 18277 68010 193525 101752 67435 52031 92979 129285 177999 194729 95002 219164
4594 219164 170073 164594 153136 161359 99325 172601 119579 137821 160216 189408 150770 106649
4582 106649 122747 147202 168938 132478 133851 135937 132473 123531 214977 175178 147640 164754
4570 164754 201615 188585 178137 166273 140140 136401 156953 181710 166393 199598 192024 93126
4558 93126 140410 210165 114146 129229 146069 128829 142741 149022 177359 143659 161157 73150
4546 73150 106314 87162 180788 43413 103897 109529 94922 58755 120296 87907 141627 106862
4534 106862 191411 100422 58363 94729 46036 46082 109345 79805 4004 43867 -1572 -22380
4522b2380Q1014p0156R158J8899O3615o3989l1664M6586n5544o246K8156r911
4510a2462K141K0501k6662K4738N8717j12900O774q627J5784j4608J12515j23487
4498e7576Q2927k4795O2160j33794J0349m525J9086N0207n8866l1906P4798j0710
4486b2645p1808M5628k5594P4866n3893k5153N1350L5031j6450l0483m0694J11529
4474C1684J138m1275o2729L7669K2171J9087q7694R5145n7407O5988p4618P2273
4462B1432k7696J578m4515R232J1230j7998O2837L0112j4052o6780k6825O8659
4450G214o1536N2014m8574N7670L3679m9383m4214O5482K6629L7558r8452O8139
4438D6226m0501J14069j04040Q3548j05732P7848J7285P0843n3488l1397o8852
$$ plain form
4522 -22380 58634 -11522 -2364 16535 80150 16161 -15503 31083 -24461 -30707 -2551 -12462
4510 -12462 -10321 10180 -16482 8256 66973 -45927 -39153 -47780 -31996 -46604 65911 -57576
4498 -57576 25351 556 62716 -71078 -60729 -65254 -46168 4039 -54827 -86733 -11935 -22645
4486 -22645 -94453 -48825 -74419 447 -53446 -78599 -27249 7782 -8668 -39151 -79845 31684
4474 31684 32822 -8453 -71182 -33513 -11342 7745 -79949 15196 -42211 23777 -50841 21432
4462 21432 -6264 -4686 -49201 -39969 -28739 -46737 16100 46212 32160 -34620 -61445 7214
4450 7214 -54322 -2308 -50882 6788 40467 -8916 -53130 12352 38981 76539 -21913 46226
4438 46226 5725 119794 15754 99302 -6430 71418 88703 159546 106058 74661 5809
4427E809O1826l1405Q6089l7002P4408q5786O4677L4933j6286p2328L9056M7042
4415A71033j8499q4399M2182L0514N9825p9436J8343M1396K6615r6334J09668
4404B20908J4196o0460M0785M6515o2450J22962M120p0861J6509J348O2525m7940
4392B88157O6175n3797L267L9499K1858P4445l7928K3959P386J06584q3088L2038
4380D88555P3794p511J26019r3655M0435M5245n9349j440J42363l7370j696O836
4368G22226J09816l0085O4710J741O9049N2749P515R2049L8284M2813P797J29874
4356A308538N2661m9022J28706J4527Q8669K8449K31372k1681J09301O0501M5482
4345A997503N499r3058j87739l9946j52461j05731k58769l4562j60088q6050N180
$$ plain form
4427 5809 67635 36230 122319 85317 159725 73939 138616 173549 157263 84935 123991 171033
4415 171033 152534 68135 110317 140831 200656 121220 139563 180959 207574 111240 220908
4404 220908 235104 174644 215429 261944 199494 322456 326576 255715 272224 273572 336097 288157
4392 288157 354332 300535 303802 343301 365159 439604 401676 425635 433021 539605 456517 488555
4380 488555 562349 554838 680857 587202 627637 672882 613533 612093 754456 717086 715390 722226
4368 722226 832042 801957 866667 868408 937457 990206 997721 1089770 1128054 1170867 1178664 1308538
4356 1308538 1361199 1312177 1440883 1455410 1544079 1572528 1803900 1782219 1891520 1952021 1997503
4345 1997503 2003002 1909944 1722205 1682259 1529798 1424067 1165298 1130736 970648 884598 889778
4334H89778j54221q3184L9670o3409o5774K9087N2248j57584J12640k765P2657
4323F69143l0266J17576j13547m0438r1466j6744k2975m3654j25276M7437R3663
4312D43453j3531j5137o1001N9409k5m3873o5339J4671R8007n9011J10230n3479
4300D14374o7607l5080L5131j51549N8524k3007j14020J8308Q3145q9616K8890
4289A57493N3098q4794J3547O1642j03049J3513P4115j8326m6701M330m4518L7715
4277A18065m9191r74q384J10071j7702l4516n7874J8394K044L4504l0727l7047
4265D6663K5590J4083l8466j8286N697l348O8274p5790K6992J7101n357K5904
4253H9057n3844N343k8559M2389q1321M4663n8002M0004J2876J7686J4756j18115
$$ plain form
4334 889778 735557 652373 692043 628634 562860 591947 644195 486611 599251 596486 669143
4323 669143 638877 756453 642906 602468 511002 494258 471283 427629 302353 349790 443453
4312 443453 429922 414785 353784 413193 413168 369295 303956 318627 416634 357623 467853 414374
4300 414374 346767 311687 346818 195269 253793 230786 116766 135074 218219 128603 157493
4289 157493 210591 125797 139344 200986 97937 111450 185565 167239 120538 124868 80350 118065
4277 118065 68874 67900 59516 169587 151885 117369 59495 77889 79933 114437 83710 46663
4265 46663 72253 86336 47870 29584 35281 31933 100207 24417 51409 68510 63153 89057
4253 89057 35213 40556 11997 54386 -26935 17728 -40274 -270 12606 30292 45048 -73067
4241g3067J18386p3406K0995P4804l7702o213J3655M0553O4324O613k2677o2735
4229F3530O9193j18565l987q329J6875L4027q2500O0818n3342R869o471k479J3113
4216h248l5166q643k8780P2135K1672l6002J4432o058K9593k241J077M3254l9399
4203A7626P0067j01032j9157N3816m2798K7006l3139K7484L0720j6069l1010n0157
4191f6643m9825J9154M6465k536k1417l9497K2909N0818j8984m0778o0568L0265
4179a30637J14996k3318l1378j6362j5902N4516o8745j3995Q376J38059j08744
4168i3134j451j8918J9796o299M816L8748p7660M7752J2606n2321P6977O7946
4156A8858p9910K4111m30m8460J1680p5513K7619j6309J0055K3431O4372j0824
$$ plain form
4241 -73067 45319 -28087 -7092 67712 30010 23797 37452 78005 142329 148942 126265 63530
4229 63530 132723 14158 10171 1842 18717 52744 -29756 31062 -22280 -12411 -18882 -21361 -8248
4216 -8248 -43414 -52057 -80837 -8702 12970 -23032 -8600 -14658 14935 12694 13771 57025 17626
4203 17626 87693 -13339 -32496 21320 -21478 5528 -27611 -127 30593 14524 -16486 -66643
4191 -66643 -116468 -97314 -50849 -53385 -74802 -114299 -91390 -40572 -59556 -100334 -160902 -130637
4179 -130637 -15641 -38959 -70337 -86699 -102601 -48085 -116830 -130825 -122449 15610 -93134
4168 -93134 -94585 -113503 -93707 -100006 -95190 -56442 -134102 -86350 -73744 -126065 -49088 18858
4156 18858 -61052 -36941 -37371 -85831 -74151 -149664 -122045 -138354 -128299 -104868 -40496 -51320
4144e1320m2166r2053R0951r500M9969j8200l3579L4697O4689p212n7229q039
4132g8992R7531q0882L3887r55l9631K8063L2218k2941J7398O1736P380m3688
4120A1124q668K6277K347o321P120r188m5183n504K2560j4003O5017m7625M5513
4107D3466p3348J61977J0369p4036O7831m1973j05637J39956j5763j9050K0761
$$ plain form
4144 -51320 -93486 -185539 -94588 -104088 -54119 -72319 -105898 -71201 -6512 -13724 -70953 -78992
4132 -78992 18539 -62343 -28456 -29411 -69042 -40979 -8761 -31702 -14304 47432 54812 11124
4120 11124 2456 28733 31080 24759 31879 22691 -22492 -27996 -5436 -19439 45578 -2047 43466
4107 43466 -29882 132095 142464 68428 136259 94286 -11351 128605 112842 93792 114553
$$ [...]
##END NTUPLES=NMR SPECTRUM
##END=
