##TITLE=abcd
##JCAMPDX= 6.0         $$ Bruker NMR JCAMP-DX V2.0
##DATA TYPE= NMR SPECTRUM
##DATA CLASS= NTUPLES
##ORIGIN= UXNMR, Bruker Analytische Messtechnik GmbH
##OWNER= root
$$ XWIN-NMR		Version 3.5
$$ Tue Jul 28 19:56:41 2026 Russian Standard Time (UT+4h)  servis@DPX200
##.OBSERVE FREQUENCY= 200.131235884673
##.OBSERVE NUCLEUS= ^1H
##.ACQUISITION MODE= SIMULTANEOUS
##.ACQUISITION SCHEME= undefined
##.AVERAGES= 32
##.DIGITISER RES= 18
##SPECTROMETER/DATA SYSTEM= spect
##.PULSE SEQUENCE= zg
##.SOLVENT NAME= MeOD
##.SHIFT REFERENCE= (INTERNAL, MeOD, 0, 16.4885)
##AUDIT TRAIL= $$ (NUMBER, WHEN, WHO, WHERE, WHAT)
$$ ##TITLE= Audit trail, XWIN-NMR		Version 3.5
$$ ##JCAMPDX= 5.01
$$ ##ORIGIN= Bruker BioSpin GmbH
$$ ##OWNER= servis
$$ F:\spectra/data/av/nmr/H1/1/pdata/1/auditp.txt
$$ ##AUDIT TRAIL=  $$ (NUMBER, WHEN, WHO, WHERE, WHAT)
(   1,<2026-07-28 19:50:50.34 +0400>,<servis>,<DPX200>,
      <created by zg, POWCHK disabled, PULCHK disabled
       configuration hash MD5:
       00 E9 B6 7A A2 85 ED C7 34 08 36 98 17 FE 4E 26
       data hash MD5: 32K
       C1 48 0F 9E 36 80 AC 9F 59 E6 91 8D AA B7 7C D7>)
(   2,<2026-07-28 19:56:08.45 +0400>,<servis>,<DPX200>,
      <Start of raw data processing
       efp BC_mod = 2 LB = 0.05 FT_mod = 6 PKNL = 1 PHC0 = -415.5518 PHC1 = 3.101563 SI = 16K 
       data hash MD5: 16K
       2C E3 C0 7E 81 0F 18 00 98 AD DA 69 4F 91 73 94>)
$$ ##END=
$$ 
$$ hash MD5
$$ 55 5A E3 CD 02 81 0A CC 71 B7 C5 03 C0 86 18 43
##$RELAX= 
##$RELAX= 
##$RELAX= 
##$RELAX= 
##$RELAX= 
##$RELAX= 
##$RELAX= 
##$RELAX= 
$$ Bruker specific parameters
$$ --------------------------
##$DU= <F:\spectra>
##$EXPNO= 1
##$NAME= <H1>
##$PROCNO= 1
##$TYPE= <nmr>
##$USER= <av>
##$AMP= (0..31)
100 100 100 100 100 100 100 100 100 100 100 100 100 100 100 100 100 100 
100 100 100 100 100 100 100 100 100 100 100 100 100 100 
##$AQSEQ= 0
##$AQ_mod= 1
##$AUNM= <au_zg>
##$AUTOPOS= <>
##$BF1= 200.13
##$BF2= 200.13
##$BF3= 200.13
##$BF4= 200.13
##$BF5= 500.13
##$BF6= 500.13
##$BF7= 500.13
##$BF8= 500.13
##$BYTORDA= 1
##$CFDGTYP= 0
##$CFRGTYP= 5
##$CHEMSTR= <none>
##$CNST= (0..31)
1 1 145 1 1 1 1 1 1 1 1 1 1 1 1 1 1 1 1 1 1 1 1 1 1 1 1 1 1 1 1 1 
##$CPDPRG= <>
##$CPDPRG1= <>
##$CPDPRG2= <>
##$CPDPRG3= <>
##$CPDPRG4= <mlev>
##$CPDPRG5= <mlev>
##$CPDPRG6= <mlev>
##$CPDPRG7= <mlev>
##$CPDPRG8= <mlev>
##$CPDPRGB= <>
##$CPDPRGT= <>
##$D= (0..31)
0 2 0 0 0 0 0 0 0 0.06 0 0 0 0 0 0 0.0002 0 0 0 0 0 0 0 0 0 0 0 0 0 0 
0 
##$DATE= 1785253849
##$DBL= (0..7)
120 120 120 120 120 120 120 120 
##$DBP= (0..7)
150 150 150 150 150 150 150 150 
##$DBP07= 0
##$DBPNAM0= <>
##$DBPNAM1= <>
##$DBPNAM2= <>
##$DBPNAM3= <>
##$DBPNAM4= <>
##$DBPNAM5= <>
##$DBPNAM6= <>
##$DBPNAM7= <>
##$DBPOAL= (0..7)
0.5 0.5 0.5 0.5 0.5 0.5 0.5 0.5 
##$DBPOFFS= (0..7)
0 0 0 0 0 0 0 0 
##$DE= 6
##$DECBNUC= <off>
##$DECIM= 32
##$DECNUC= <off>
##$DECSTAT= 4
##$DIGMOD= 1
##$DIGTYP= 9
##$DL= (0..7)
0 120 120 120 120 120 120 120 
##$DP= (0..7)
150 150 150 150 150 150 150 150 
##$DP07= 0
##$DPNAME0= <>
$$ [...]
##$SUBNAM4= <"">
##$SUBNAM5= <"">
##$SUBNAM6= <"">
##$SUBNAM7= <"">
##$SUBNAM8= <"">
##$SUBNAM9= <"">
##$SW= 20.6817932712277
##$SWIBOX= (0..15)
0 0 3 0 0 0 0 0 0 0 0 0 0 0 0 0 
##$SW_h= 4139.07284768212
##$TD= 32768
##$TD0= 1
##$TE= 0
##$TE2= 300
##$TE3= 300
##$TEG= 300
##$TL= (0..7)
0 120 120 120 120 120 120 120 
##$TP= (0..7)
150 150 150 150 150 150 150 150 
##$TP07= 0
##$TPNAME0= <>
##$TPNAME1= <>
##$TPNAME2= <>
##$TPNAME3= <>
##$TPNAME4= <>
##$TPNAME5= <>
##$TPNAME6= <>
##$TPNAME7= <>
##$TPOAL= (0..7)
0.5 0.5 0.5 0.5 0.5 0.5 0.5 0.5 
##$TPOFFS= (0..7)
0 0 0 0 0 0 0 0 
##$TUNHIN= 0
##$TUNHOUT= 0
##$TUNXOUT= 0
##$USERA1= <user>
##$USERA2= <user>
##$USERA3= <user>
##$USERA4= <user>
##$USERA5= <user>
##$V9= 5
##$VALIST= <valist>
##$VCLIST= <CCCCCCCCCCCCCCC>
##$VD= 0
##$VDLIST= <DDDDDDDDDDDDDDD>
##$VPLIST= <PPPPPPPPPPPPPPP>
##$VTLIST= <TTTTTTTTTTTTTTT>
##$WBST= 1024
##$WBSW= 30
##$XGAIN= (0..3)
0 0 0 0 
##$XL= 0
##$YL= 0
##$YMAX_a= 1329383
##$YMIN_a= -2106756
##$ZGOPTNS= <>
##$ZL1= 120
##$ZL2= 120
##$ZL3= 120
##$ZL4= 120
##$ABSF1= 0
##$ABSF2= 0
##$ABSG= 0
##$ABSL= 0
##$ALPHA= 0
##$AQORDER= 0
##$ASSFAC= 0
##$ASSFACI= 0
##$ASSFACX= 0
##$ASSWID= 0
##$AUNMP= <proc_1d>
##$AZFE= 0.1
##$AZFW= 0.1
##$BCFW= 0
##$BC_mod= 2
##$BYTORDP= 0
##$COROFFS= 0
##$CY= 18.4799938201904
##$DATMOD= 1
##$DC= 0
##$DFILT= <>
##$DTYPP= 0
##$F1P= 9.9274215381318
##$F2P= -0.165520771350173
##$FCOR= 1
##$FTSIZE= 16384
##$FT_mod= 6
##$GAMMA= 0
##$GB= 0
##$INTBC= 1
##$INTSCL= 4.127829e-11
##$ISEN= 128
##$LB= 0.05
##$LEV0= 0
##$LPBIN= 0
##$MAXI= 10000
##$MC2= 0
##$MEAN= 0
##$ME_mod= 0
##$MI= 50
##$NCOEF= 0
##$NC_proc= -3
##$NLEV= 6
##$NOISF1= 3.799351
##$NOISF2= 2.8
##$NSP= 0
##$NTH_PI= 0
##$NZP= 0
##$OFFSET= 16.48848
##$PC= 4
##$PHC0= -415.5518
##$PHC1= 3.101563
##$PH_mod= 1
##$PKNL= yes
##$PPARMOD= 0
##$PSCAL= 4
##$PSIGN= 0
##$REVERSE= no
##$SF= 200.130005582386
##$SI= 16384
##$SIGF1= 3
##$SIGF2= 2
##$SINO= 400
##$SIOLD= 16384
##$SREGLST= <1H.CDCl3>
##$SSB= 0
##$STSI= 16384
##$STSR= 0
##$SW_p= 4139.07284768211
##$SYMM= 0
##$S_DEV= 0
##$TDeff= 32768
##$TDoff= 0
##$TI= <>
##$TILT= no
##$TM1= 0
##$TM2= 0
##$TOPLEV= 0
##$USERP1= <user>
##$USERP2= <user>
##$USERP3= <user>
##$USERP4= <user>
##$USERP5= <user>
##$WDW= 1
##$XDIM= 16384
##$YMAX_p= 300576902
##$YMIN_p= -387791
$$ End of Bruker specific parameters
$$ ---------------------------------
##NTUPLES= NMR SPECTRUM
##VAR_NAME=  FREQUENCY,     SPECTRUM/REAL,   SPECTRUM/IMAG
##SYMBOL=    X,             R,               I
##VAR_TYPE=  INDEPENDENT,   DEPENDENT,       DEPENDENT
##VAR_FORM=  AFFN,          ASDF,            ASDF
##VAR_DIM=   16384,         16384,           16384
##UNITS=     HZ,            ARBITRARY UNITS, ARBITRARY UNITS
##FACTOR=    0.252644378177508, 1,           1
##FIRST=     3299.83951724647, 0,            0
##LAST=      -839.233330435636, 0,           0
##MIN=       -839.233330435636, -387791,     0
##MAX=       3299.83951724647, 300576902,    0
$$ Real data points
##PAGE= N=1
##DATA TABLE= (X++(R..R)), XYDATA
$$ [...]
12733 -255833 -233877 -226788 -247839 -193690 -233440 -257546 -221893 -246733 -267531 -252363 -229623 -247182
12721 -247182 -258116 -262313 -229626 -240712 -243651 -210628 -249166 -243326 -234702 -249799 -213545 -198029
12709 -198029 -235226 -245664 -233472 -227334 -232415 -233253 -263627 -258689 -236944 -219931 -237922 -240954 -254633
12696 -254633 -246629 -239081 -260243 -232690 -282350 -275876 -229829 -201313 -210808 -269680 -248869 -240760
12684 -240760 -226005 -237437 -245308 -262430 -265232 -246441 -222870 -232600 -272786 -254400 -235351 -255616
12672 -255616 -212187 -228087 -286794 -234677 -248880 -226297 -241772 -246645 -245178 -256117 -259067 -246648
12660 -246648 -253730 -232628 -260831 -232264 -257150 -265389 -263788 -245461 -257276 -272641 -250276 -247352
12648 -247352 -231815 -222349 -260579 -251309 -242153 -256484 -249491 -237014 -244926 -238727 -240967 -249304 -252724
12635 -252724 -238314 -254415 -262137 -245437 -221454 -245762 -256494 -232573 -262275 -220703 -234665 -236171
12623 -236171 -240999 -244669 -238151 -238588 -233988 -234064 -268955 -250751 -242988 -239248 -205857 -245053 -235172 -239287
12609 -239287 -217266 -221433 -223923 -245148 -253852 -255107 -228005 -264456 -238669 -241273 -241776 -220313 -235526
12596 -235526 -226048 -246012 -249613 -261258 -229116 -260615 -240930 -255319 -250483 -268213 -226282 -247859
12584 -247859 -240110 -281366 -229729 -247849 -232822 -255295 -269030 -242308 -258876 -247053 -224299 -226734
12572 -226734 -264629 -245473 -216226 -226413 -218653 -240205 -237418 -249638 -234636 -232602 -242933 -241698
12560 -241698 -273931 -233970 -244648 -246979 -240946 -257811 -260203 -241323 -226041 -220723 -227755 -240125
12548 -240125 -233050 -245207 -251455 -251190 -268050 -253857 -225184 -246259 -245164 -236085 -236031 -251662 -234439
12535 -234439 -269032 -246743 -247020 -237458 -218464 -232117 -247546 -221467 -231179 -246597 -231890 -252703
12523 -252703 -236658 -224920 -243253 -231682 -258454 -225364 -240291 -224646 -240537 -258826 -223335
12512 -223335 -245651 -246007 -253879 -234749 -234320 -234806 -245893 -226096 -239196 -263418 -244043 -256083 -230320
12499 -230320 -256749 -248965 -237426 -234834 -226331 -227265 -265322 -268866 -255346 -241221 -221546 -255381 -244947
12486 -244947 -233303 -230188 -237616 -254412 -236714 -255851 -245041 -225831 -221657 -240024 -224844 -249863
12474 -249863 -264580 -253483 -230074 -246686 -242196 -251201 -239329 -219799 -240394 -248534 -240063 -240149 -251556
12461 -251556 -192180 -211552 -244241 -232309 -235175 -268285 -255894 -221835 -245156 -224075 -233087 -223662
12449 -223662 -244550 -234632 -228961 -267724 -233971 -269974 -250795 -261292 -243996 -246323 -270470 -258232
12437 -258232 -271597 -262774 -278864 -232221 -228242 -229637 -227546 -234985 -244423 -255368 -217469 -250727 -227042
12424 -227042 -257976 -253441 -263424 -223205 -250918 -241911 -225432 -245565 -241536 -265850 -233863 -244870
12412 -244870 -257449 -235267 -232268 -229710 -254700 -248471 -246871 -241549 -252085 -259408 -234828 -231020 -236050
12399 -236050 -231712 -245823 -246902 -229815 -245829 -232369 -242226 -212003 -250948 -220991 -217823 -250305
12387 -250305 -221381 -240910 -277817 -260742 -243432 -240562 -229241 -247367 -234823 -243506 -220652 -220499
12375 -220499 -237442 -258457 -249728 -240692 -215826 -240168 -240858 -232631 -247626 -245525 -229656 -256732 -255823
12362 -255823 -232039 -245574 -260931 -249936 -256924 -256422 -264797 -265087 -238509 -229456 -230458 -234815 -249167
12349 -249167 -238231 -238017 -202547 -234526 -236489 -243083 -239850 -229646 -244718 -244237 -253760 -235455 -238962
12336 -238962 -237560 -227089 -228503 -234185 -236315 -235901 -219439 -230671 -250852 -225971 -255943 -205622 -218197
12323 -218197 -220367 -245116 -237786 -249033 -236321 -238763 -276688 -245605 -234914 -249069 -267261 -271086
12311 -271086 -271763 -241792 -252826 -247979 -257763 -227870 -252115 -233842 -242933 -269117 -249248 -248412 -254193
12298 -254193 -233844 -251370 -264331 -260852 -247342 -263418 -247312 -251843 -237154 -258619 -252369 -238452
12286 -238452 -242826 -263224 -235722 -223973 -226598 -238826 -263522 -255930 -222242 -263838 -240655 -253590
12274 -253590 -245575 -238051 -243563 -250419 -253669 -244106 -248578 -261991 -249151 -258575 -246372 -232498 -227372
12261 -227372 -272682 -223694 -230484 -267923 -284685 -235798 -250672 -245119 -248745 -252919 -245712 -270505
12249 -270505 -230329 -238262 -231831 -244036 -255017 -231173 -240574 -239061 -236251 -231574 -257959 -239441 -228039
12236 -228039 -241079 -253285 -244406 -244853 -230678 -243204 -239354 -252870 -244434 -238032 -241569 -245763 -252737
12223 -252737 -268124 -258647 -232515 -217488 -263974 -243421 -262827 -214624 -234515 -255828 -233951 -254778
12211 -254778 -263053 -239715 -237505 -232160 -225644 -229752 -239012 -225670 -242655 -247830 -261213 -261595 -236237
12198 -236237 -214882 -246963 -258033 -240767 -268905 -233559 -225260 -228997 -273863 -266269 -243094 -201669
12186 -201669 -251125 -260531 -229703 -237980 -229213 -257230 -259075 -256529 -247689 -234233 -282858 -276305 -259625
12173 -259625 -248922 -262979 -254974 -230086 -252255 -239714 -241503 -252653 -241138 -215563 -229501 -244451
12161 -244451 -230800 -221313 -230513 -246243 -247268 -253222 -230825 -251205 -227982 -243890 -248745 -263294
12149 -263294 -240824 -248199 -248193 -247168 -249849 -233340 -265716 -242461 -255254 -245322 -250306 -231534 -237648
12136 -237648 -266436 -274122 -231553 -254748 -260631 -243131 -238268 -250388 -226820 -232404 -252397 -230275
12124 -230275 -241394 -241502 -231355 -263340 -236236 -248525 -242682 -251078 -250073 -262310 -278634 -238692
12112 -238692 -272198 -243230 -290402 -254446 -233694 -260378 -264138 -265503 -233970 -227449 -224586 -236409
12100 -236409 -246130 -283270 -251954 -241629 -245923 -259552 -263614 -251841 -256691 -248612 -240716 -256038 -268388
12087 -268388 -277747 -225898 -245813 -237821 -252880 -260785 -258177 -228566 -233248 -231287 -262255 -252948 -254205
12074 -254205 -243386 -252412 -259658 -240448 -251770 -242849 -219922 -250550 -255243 -261347 -242027 -249070 -236686
12061 -236686 -264315 -262570 -235965 -240700 -250102 -242936 -255109 -252183 -264170 -258266 -242774 -237514 -252439
12048 -252439 -245338 -254664 -245834 -225019 -262460 -262393 -259082 -283014 -230870 -251816 -252562 -241665 -242466 -252796
12034 -252796 -245983 -241593 -245112 -245882 -252267 -252526 -244982 -242079 -236837 -255536 -259506 -229186 -244536 -245023
12020 -245023 -245584 -261752 -236523 -247439 -216968 -244481 -240408 -237964 -250832 -218424 -222252 -236790
12008 -236790 -253843 -256531 -248114 -229363 -207112 -260714 -257776 -254119 -249994 -254261 -265320 -261538 -252140
11995 -252140 -264027 -251321 -255884 -227577 -239402 -259236 -228907 -227330 -231437 -239707 -265689 -231747
11983 -231747 -218350 -232680 -234607 -236376 -228743 -246050 -247766 -240937 -253432 -245035 -240348 -250625 -249669
11970 -249669 -224967 -243002 -241463 -244101 -227310 -249428 -262131 -261327 -234352 -247981 -241983 -250615 -246111
11957 -246111 -258737 -280999 -263612 -240708 -260199 -252158 -272214 -221006 -243946 -268145 -280080 -251482
11945 -251482 -228515 -278789 -243004 -250151 -266896 -268840 -245044 -237179 -244956 -249985 -263756 -238221
11933 -238221 -251637 -246112 -223836 -252846 -256501 -254975 -227077 -241647 -245826 -248862 -249170 -231835 -231648
11920 -231648 -245398 -235766 -246100 -238028 -240401 -244260 -244199 -255203 -248790 -252888 -230369 -248118 -242729
11907 -242729 -267992 -255863 -236102 -240732 -231249 -240865 -265972 -222210 -285449 -225155 -252446 -263742
11895 -263742 -258251 -267299 -231008 -266123 -247775 -248218 -257225 -214979 -248733 -260149 -236058 -258864
11883 -258864 -265288 -263989 -245639 -273641 -258656 -243543 -249681 -264827 -263248 -226579 -243260 -252448
11871 -252448 -248775 -264358 -240420 -247875 -239023 -266687 -248319 -259237 -248753 -237817 -234470 -259085
11859 -259085 -239383 -263624 -230582 -244159 -258705 -246501 -252024 -251179 -254295 -247126 -295285 -259013
11847 -259013 -253758 -252720 -233205 -226572 -284193 -261472 -248897 -233185 -227543 -241449 -242471 -233842 -255629
11834 -255629 -245817 -234096 -225057 -214764 -251025 -246068 -268509 -230750 -266539 -270313 -264143 -247735
11822 -247735 -246605 -237306 -273867 -264170 -242304 -234664 -254804 -268110 -257355 -254985 -242256 -224788
11810 -224788 -228171 -243777 -281341 -230387 -236859 -239528 -243867 -267042 -297612 -261135 -242675 -246145
11798 -246145 -260415 -239971 -243676 -231471 -236174 -241175 -237987 -248613 -246514 -216965 -217285 -251897 -247086
11785 -247086 -280824 -246602 -232529 -260780 -257084 -265333 -259628 -250914 -247172 -243382 -254983 -242570 -230397
11772 -230397 -259486 -232407 -266297 -225036 -266990 -249510 -245787 -260157 -251979 -272356 -274886 -223930
11760 -223930 -244377 -266668 -262735 -238844 -259286 -249301 -254850 -264516 -243530 -248690 -240895 -236199 -260669
11747 -260669 -245292 -214294 -247814 -229983 -253327 -223303 -264475 -250563 -277888 -258269 -237984
11736 -237984 -242632 -266012 -261878 -260218 -277755 -253332 -258389 -269719 -238830 -234574 -239810 -247460 -248851
11723 -248851 -231600 -247599 -243668 -218832 -225818 -247545 -258709 -244588 -255093 -251636 -256172 -269663
11711 -269663 -264912 -250800 -261685 -235117 -292068 -243112 -244731 -237165 -250378 -263931 -221968 -234313
11699 -234313 -252517 -256112 -236032 -250807 -249275 -234214 -246519 -228548 -260358 -269397 -273802 -260278
11687 -260278 -225082 -256453 -261066 -237234 -243967 -246682 -265327 -257731 -258511 -247428 -229858 -250924 -262220
11674 -262220 -229791 -259909 -235722 -225714 -249534 -282871 -257377 -249016 -245122 -252808 -235999 -261342
11662 -261342 -249358 -237297 -258922 -261788 -254444 -229575 -234019 -246248 -248847 -243379 -231020 -239442 -252634
11649 -252634 -234125 -260795 -244432 -247576 -240216 -261405 -267332 -219121 -250955 -259949 -273011 -251124
11637 -251124 -264744 -245773 -249582 -256206 -261744 -232927 -269169 -246145 -243155 -287656 -252226 -246258
11625 -246258 -267354 -247505 -241159 -238431 -250963 -246382 -243446 -227894 -261759 -264903 -252816 -238426
11613 -238426 -237652 -241974 -262554 -253745 -238441 -260181 -251744 -252002 -244490 -266983 -256037 -234945 -241656
11600 -241656 -251981 -246077 -234640 -232701 -241060 -259359 -269361 -244541 -192093 -245255 -276420 -264377
11588 -264377 -286556 -255392 -244548 -258931 -269638 -228136 -252025 -251944 -237297 -281969 -260840 -236982
11576 -236982 -257393 -226081 -242355 -269532 -275213 -246575 -257020 -261712 -242608 -243173 -253258 -219948
11564 -219948 -247019 -230290 -262814 -260073 -253267 -252218 -247591 -263363 -251794 -230284 -243424 -266154
11552 -266154 -260724 -248826 -251059 -261308 -272958 -234691 -250816 -261290 -229462 -254261 -225319 -247600
11540 -247600 -258408 -222061 -235776 -268039 -262484 -241744 -232634 -266884 -248006 -256600 -260896 -259552
11528 -259552 -247574 -254335 -277204 -258778 -246866 -245420 -249994 -262631 -283668 -260346 -241658 -258717
11516 -258717 -252325 -255456 -271797 -254545 -242013 -249056 -235214 -251212 -244276 -271532 -243120 -254230
11504 -254230 -268739 -264553 -239491 -240456 -258388 -241093 -279861 -242886 -236227 -254796 -279172 -277948
11492 -277948 -260932 -250034 -249303 -253760 -257437 -253262 -238069 -251712 -254664 -250756 -251777 -238823 -242698
11479 -242698 -239261 -277984 -253546 -242422 -224696 -232112 -249902 -237375 -257622 -234741 -239012 -234840
11467 -234840 -251357 -254652 -252845 -239184 -239209 -221298 -247172 -255759 -249194 -228229 -222657 -256246 -248807
11454 -248807 -219821 -243894 -269404 -234013 -249182 -262530 -226008 -231958 -283418 -253934 -245387 -256119
11442 -256119 -245244 -250558 -264508 -271637 -231787 -228341 -255144 -237732 -255094 -219225 -246566 -244999
11430 -244999 -249383 -268112 -238944 -270103 -254841 -233255 -274016 -281483 -259974 -238492 -247451 -264231
11418 -264231 -239592 -262680 -229259 -221556 -253456 -246538 -258898 -220629 -231682 -259145 -256756 -270432
11406 -270432 -254248 -264153 -222813 -238561 -258472 -261835 -264843 -239998 -242786 -241554 -283083 -256534
11394 -256534 -244900 -246193 -229765 -242802 -253405 -247896 -258724 -225372 -238434 -256516 -262542 -281175
11382 -281175 -245910 -264781 -261594 -271716 -253051 -259512 -265272 -279456 -274111 -255473 -265884 -267103
11370 -267103 -239042 -257126 -234420 -230649 -257281 -259928 -248577 -250586 -251502 -253869 -271372 -273729 -244670
11357 -244670 -265658 -268845 -262464 -242164 -237941 -253101 -239458 -257035 -235933 -246089 -248198 -245034
11345 -245034 -254602 -242050 -254103 -258034 -276004 -254305 -226584 -263668 -249761 -255876 -264135 -265433
11333 -265433 -241382 -255245 -248981 -258416 -244428 -259058 -251259 -255892 -268162 -267904 -256399 -244713 -257871
11320 -257871 -237801 -262474 -257040 -227377 -228202 -274276 -242220 -261486 -219103 -232153 -254180 -255596
11308 -255596 -303327 -259421 -229937 -230833 -237851 -249542 -253209 -255550 -235775 -256097 -281317 -268297
11296 -268297 -239283 -246438 -224050 -267792 -257524 -272826 -252563 -226026 -249794 -246321 -241488 -253661
11284 -253661 -226149 -244809 -247756 -246950 -232692 -259781 -226456 -260261 -276083 -246225 -293975 -237958
11272 -237958 -254312 -268064 -266715 -235023 -241307 -276819 -244665 -263773 -253007 -263478 -221142 -265510
11260 -265510 -250056 -241420 -252137 -244277 -258949 -245103 -239731 -248582 -248374 -255005 -274811 -253017 -247744
11247 -247744 -283611 -274573 -242199 -237316 -254734 -234959 -275364 -267369 -259793 -247072 -249477 -254738 -239312
11234 -239312 -243012 -238186 -234780 -254677 -237166 -235648 -246762 -261034 -248930 -253285 -262404 -245346 -259595
11221 -259595 -230346 -250733 -256557 -257650 -245362 -243629 -236552 -266141 -252614 -264743 -244229 -259106
11209 -259106 -261042 -240342 -259858 -262089 -250326 -238239 -257551 -234465 -252641 -275331 -245772 -257079
11197 -257079 -265971 -271167 -241587 -258747 -277212 -250688 -277410 -276566 -240511 -254871 -231470 -242317
11185 -242317 -246138 -223311 -253652 -258993 -255392 -248896 -256147 -238501 -268159 -275184 -240944 -239222 -258273
11172 -258273 -269097 -257570 -267366 -247464 -255747 -234263 -274638 -270044 -277893 -274043 -223312 -238678
11160 -238678 -270864 -275730 -246239 -251421 -243301 -257903 -260891 -278958 -243113 -259792 -266131 -283926
11148 -283926 -274326 -250383 -257157 -249822 -266826 -265065 -242330 -264267 -250076 -262415 -277173 -251059
11136 -251059 -253762 -249697 -266872 -275705 -268733 -241201 -240959 -268758 -246169 -242692 -249467 -259152 -260593
11123 -260593 -254615 -230733 -258562 -258766 -254034 -260003 -284113 -228191 -250249 -251967 -272876 -249293 -249157
11110 -249157 -238368 -248518 -268286 -259453 -256512 -248129 -254725 -246294 -251449 -243855 -263855 -226502 -244905
11097 -244905 -247949 -277014 -283489 -259374 -215169 -246110 -265732 -281665 -273319 -246214 -240869 -236184
11085 -236184 -247611 -249867 -262568 -245264 -277886 -266677 -229075 -266353 -239912 -235516 -283464 -242759
11073 -242759 -259083 -233270 -250494 -249340 -253559 -233702 -238785 -259659 -269547 -255281 -244363 -243875 -249282
11060 -249282 -242345 -249892 -266027 -251561 -264560 -219887 -262148 -279638 -232548 -248160 -258389 -273493
11048 -273493 -256797 -273905 -263802 -253414 -247608 -258216 -274228 -268249 -247779 -231958 -246993 -256348
11036 -256348 -262281 -273560 -250171 -244677 -278767 -283641 -255367 -252696 -255579 -241828 -226606 -256606
11024 -256606 -259885 -243155 -280552 -263476 -274803 -260096 -270335 -259651 -284829 -271213 -286006 -278380
11012 -278380 -281422 -302983 -266004 -287914 -293274 -286421 -307938 -301212 -273495 -298187 -288993 -301863
11000 -301863 -280205 -265176 -265129 -291946 -270341 -290601 -290533 -281007 -275565 -251333 -261804 -275528 -290371
10987 -290371 -282785 -274672 -266268 -272133 -277694 -262538 -278800 -239822 -264717 -230428 -256432 -234802
10975 -234802 -243640 -243263 -250679 -244608 -254847 -237234 -212190 -222754 -230087 -261967 -262238 -258826 -249076
10962 -249076 -245906 -239742 -238554 -267273 -286430 -251781 -262348 -246715 -269347 -261743 -256856 -264152 -247109
10949 -247109 -233257 -273660 -245543 -281312 -277013 -251704 -245843 -272098 -266168 -258641 -233818 -216800
10937 -216800 -270484 -263749 -234981 -250238 -255148 -262217 -256843 -247961 -254804 -238311 -261800 -252080 -287069
10924 -287069 -255866 -273339 -273265 -250092 -282437 -284782 -249794 -260855 -258776 -238733 -274971 -262186
10912 -262186 -265187 -239888 -232206 -265884 -265662 -265794 -259873 -228085 -244361 -277689 -277405 -264760 -256839
10899 -256839 -281407 -270918 -261733 -295274 -254358 -266876 -243819 -265262 -266342 -241332 -259136 -250153
10887 -250153 -245030 -267439 -258554 -256710 -243090 -259054 -272637 -294902 -267504 -260502 -252789 -231499
10875 -231499 -250866 -262869 -253080 -253108 -256340 -255419 -255979 -274275 -244828 -237218 -247316 -244410 -275447 -279244
10861 -279244 -267069 -263916 -242245 -280486 -276098 -274931 -292747 -256683 -268240 -267997 -279661 -266121
10849 -266121 -242289 -250829 -253259 -271434 -227910 -264190 -253290 -243927 -264101 -271398 -267758 -254580
10837 -254580 -255240 -270419 -257877 -263966 -250605 -276867 -252595 -279325 -283746 -277694 -259723 -250125 -274005
10824 -274005 -264876 -259468 -270948 -266315 -267059 -267541 -253509 -254532 -256870 -267612 -259846 -271270 -279649 -242069
10810 -242069 -248939 -250889 -270631 -263719 -274065 -251251 -217971 -260074 -248069 -252271 -249184 -263666
10798 -263666 -236675 -264755 -265535 -261910 -237085 -266995 -261934 -264063 -269510 -268912 -258494 -273112 -261102
10785 -261102 -271751 -241087 -257385 -256549 -272346 -236489 -256246 -246493 -268151 -260023 -242838 -253753
10773 -253753 -259866 -250775 -256117 -253570 -273261 -248740 -247233 -251547 -268928 -234803 -251428 -261981 -262695
10760 -262695 -269824 -233228 -194742 -242306 -243491 -262118 -240400 -238461 -247603 -244268 -260307 -285676
10748 -285676 -265385 -235140 -261195 -239069 -272653 -254524 -261110 -227143 -272436 -286578 -271999 -227343
10736 -227343 -242502 -272320 -244954 -295441 -265033 -229692 -256823 -259696 -271579 -224571 -273111 -258446
10724 -258446 -250862 -285278 -267469 -249994 -238818 -250012 -267385 -256786 -268993 -237290 -254964 -242018
10712 -242018 -253224 -270691 -266084 -251975 -240253 -255086 -242718 -267574 -280348 -253568 -267295 -275770
10700 -275770 -299912 -269572 -266622 -273781 -239885 -267362 -265565 -266705 -291510 -230098 -265662 -250402
10688 -250402 -258710 -266871 -234870 -272400 -226021 -265177 -255006 -264755 -239620 -242340 -255707 -264640
10676 -264640 -252707 -258361 -245818 -257628 -250711 -259276 -271894 -256213 -262242 -259453 -252193 -251298 -259978
10663 -259978 -264138 -248623 -269803 -245100 -251201 -270709 -270646 -247043 -258621 -253341 -244319 -279619 -292414
10650 -292414 -254747 -247520 -257108 -265031 -276973 -283104 -272908 -265367 -239464 -278001 -290365 -251115
10638 -251115 -252291 -257919 -246359 -299542 -292359 -232195 -250998 -254070 -242173 -267869 -274145 -254783
10626 -254783 -274952 -276101 -258178 -235408 -240417 -251951 -246663 -259870 -286118 -289439 -262250 -247252
10614 -247252 -236895 -262659 -249254 -253811 -238714 -233907 -246214 -255651 -249766 -242279 -257591 -237487
10602 -237487 -275974 -268866 -247837 -234326 -262747 -252733 -292243 -300463 -278230 -270203 -233282 -263441
10590 -263441 -281625 -245354 -278422 -245140 -273387 -274207 -255394 -265162 -248823 -274087 -239388 -262215
10578 -262215 -278979 -262582 -261855 -234872 -274060 -263788 -249838 -256019 -253536 -249898 -261117 -274874
10566 -274874 -254037 -255263 -275277 -262870 -263049 -264796 -247831 -251591 -246146 -252071 -241346 -251176 -241192
10553 -241192 -242744 -241173 -254585 -274793 -250013 -225366 -259295 -254111 -264232 -254410 -279050 -243171
10541 -243171 -265226 -255655 -270796 -253742 -230405 -246800 -246505 -270726 -266662 -245301 -233939 -246013
10529 -246013 -268848 -280177 -258908 -223491 -261072 -246960 -269668 -267773 -236415 -232281 -245091 -238345
10517 -238345 -279686 -271978 -248574 -255695 -258870 -257053 -298407 -254536 -264372 -250255 -248373 -260371 -256274
10504 -256274 -269074 -258524 -232889 -249237 -265762 -257003 -257499 -241458 -247627 -273697 -255815 -260597
10492 -260597 -262506 -270501 -251823 -274404 -275156 -215754 -249653 -234895 -252825 -276250 -247941 -239268
10480 -239268 -236805 -256294 -270917 -269648 -249060 -238652 -245328 -260177 -260676 -264975 -250170 -231892 -253964
10467 -253964 -248539 -288569 -263263 -262372 -253738 -260076 -241376 -255245 -262257 -265377 -251701 -265617 -239127
10454 -239127 -275961 -239278 -248109 -246779 -271459 -252338 -249076 -268858 -254739 -253365 -241429 -258018
10442 -258018 -254252 -236619 -263536 -266807 -263050 -271615 -245949 -233191 -265493 -257572 -259698 -272859 -259728
10429 -259728 -229487 -230613 -245768 -252829 -260371 -245913 -271896 -261323 -258273 -264106 -278745 -254796
10417 -254796 -264823 -276958 -259130 -249707 -260039 -240020 -262054 -251394 -260949 -229454 -276616 -259896
10405 -259896 -229027 -259110 -266552 -255557 -252900 -255463 -236707 -232764 -254524 -262399 -250170 -250837 -261769
10392 -261769 -247484 -266830 -277334 -281281 -265150 -258240 -267206 -238050 -261200 -273567 -252501 -253168
10380 -253168 -269470 -251202 -253298 -262048 -250219 -246452 -265510 -261280 -254632 -264527 -254794 -243683 -242265
10367 -242265 -234946 -247042 -251345 -268417 -254260 -266790 -245267 -231611 -249998 -271401 -251055 -261807
10355 -261807 -240881 -253781 -263228 -260734 -253939 -268494 -258607 -241669 -254624 -247440 -246094 -245481 -259374
10342 -259374 -237704 -250675 -251587 -264856 -240888 -264280 -275065 -262405 -252971 -248153 -244431 -259586
10330 -259586 -269318 -254171 -283281 -245041 -232433 -284027 -253330 -232479 -237387 -237783 -216715 -241066
10318 -241066 -253128 -202391 -271055 -233926 -230274 -279959 -261830 -269372 -274289 -262696 -271836 -238296
10306 -238296 -279085 -245975 -260605 -246868 -261493 -246859 -244916 -245228 -227547 -260927 -244857 -246592
10294 -246592 -248856 -236329 -253939 -220596 -248085 -251520 -267905 -258838 -231730 -244052 -249892 -255805
10282 -255805 -266374 -269533 -265881 -261574 -264766 -256843 -258756 -282460 -261169 -259997 -227460 -239011 -248616
10269 -248616 -264390 -252982 -255522 -259467 -277172 -250106 -260716 -268465 -250233 -244948 -275639 -258322
10257 -258322 -278527 -250888 -234276 -258650 -258882 -273606 -272024 -249536 -239025 -260214 -234376 -267250
10245 -267250 -239461 -236569 -237534 -250357 -259339 -260818 -245622 -231395 -250324 -255431 -286073 -246382 -266027
10232 -266027 -236512 -259160 -263146 -258687 -267483 -245627 -261490 -232612 -263813 -237813 -227627 -241158
10220 -241158 -235667 -267519 -256598 -272512 -264715 -243806 -282094 -261732 -258083 -288134 -266268 -243600
10208 -243600 -263054 -269171 -267471 -280809 -284294 -247057 -262130 -238623 -253619 -266681 -264090 -256889
10196 -256889 -221278 -233140 -243473 -241401 -253432 -232846 -242723 -263407 -272219 -266857 -246388 -248456
10184 -248456 -246450 -273774 -281529 -259633 -251810 -242062 -252669 -258444 -286023 -248628 -225069 -229795 -240974
10171 -240974 -273123 -229833 -230804 -225712 -245028 -256841 -257690 -269880 -244351 -230986 -265345 -266365 -264300
10158 -264300 -236686 -246080 -242996 -245005 -272789 -261055 -238279 -254985 -255385 -267572 -240424 -239409 -207628
10145 -207628 -246883 -249904 -253160 -270585 -252623 -267271 -246329 -254110 -278840 -260890 -252044 -253489
10133 -253489 -259923 -271170 -278859 -256972 -235098 -243312 -244175 -272338 -239593 -258999 -261733 -225619 -245456
10120 -245456 -265283 -253431 -256893 -246883 -241661 -258342 -246795 -259382 -244287 -222333 -239672 -247024
10108 -247024 -265125 -253662 -246137 -214910 -216652 -254579 -253276 -231863 -211749 -229054 -232628 -226220
10096 -226220 -226730 -154124 -167053 -183047 -183718 -195804 -197448 -192029 -232673 -231299 -234597 -242121 -245660
10083 -245660 -243740 -249277 -225734 -248163 -222843 -251989 -233904 -269139 -256792 -245896 -250960 -250249
10071 -250249 -266808 -235981 -243791 -234243 -216479 -243442 -227953 -237498 -240231 -256200 -227126 -233187
10059 -233187 -247120 -237784 -231971 -224884 -223301 -239142 -230456 -237040 -218275 -227631 -224654 -251788 -237718
10046 -237718 -232169 -226621 -211865 -226078 -242026 -239657 -220039 -226642 -218259 -221621 -249990 -262498 -205146
10033 -205146 -235229 -221875 -231273 -220851 -250831 -220940 -223303 -214599 -223313 -231234 -246415 -212075
10021 -212075 -203257 -234163 -240557 -236214 -241414 -223778 -219990 -244231 -230854 -251927 -243691 -233079 -217646
10008 -217646 -236192 -226328 -212547 -235434 -192897 -229545 -248415 -260244 -235951 -217321 -238820 -217649
9996 -217649 -237081 -243891 -223113 -231370 -226909 -225598 -235227 -250448 -242967 -229542 -256476 -242829 -193766
9983 -193766 -213645 -222920 -241504 -236517 -210294 -227232 -217704 -235697 -228724 -259909 -230902 -196078
9971 -196078 -220365 -200638 -235452 -247907 -238281 -205759 -217615 -235075 -222213 -229726 -224077 -229556
9959 -229556 -226916 -234422 -196245 -219182 -253059 -244562 -239809 -220068 -226287 -229854 -248656 -230871 -247909
9946 -247909 -239473 -208723 -223860 -224292 -243257 -239017 -228395 -217835 -202608 -227923 -195071 -232319
9934 -232319 -221695 -194913 -192708 -248397 -218217 -225812 -220366 -202986 -188014 -204426 -230384 -186596
9922 -186596 -204682 -199192 -171508 -178129 -175961 -157812 -138956 -142225 -122123 -100760 -105491 -59823 -94285
9909 -94285 -95419 -127769 -128373 -97978 -104890 -130964 -126449 -128709 -116941 -93184 -69049 -37603 -51158
9896 -51158 -1086 7496 -8715 -9079 -30012 5190 23608 15753 3237 22129 15500 -20191 -32731
9883 -32731 -3493 -18582 -316 -6970 606 17338 35528 55202 84751 92082 80471 97222
9871 97222 73427 67315 54615 84506 48373 19767 28249 26004 16494 47890 74857 86458 114053
9858 114053 108081 88250 92924 92755 97949 76226 57227 27988 937 32643 10518 17819 29434
9845 29434 8187 5505 53595 38022 26835 48218 67577 75376 83328 64849 83784 73613
9833 73613 81227 77207 49669 55887 50070 13844 6828 13717 10782 10617 2006 20520 6661 27126
9819 27126 36910 2428 -3023 29543 34641 37856 29821 20840 13953 22344 47891 39370 37173 16616
9805 16616 29518 42120 32797 17627 9559 12680 28009 38973 50238 73646 52300 79874
9793 79874 77335 88214 47250 67264 39741 42384 32863 31936 21867 11829 6164 -15265 -21290
9780 -21290 -14398 -29361 4532 -17188 -38335 -12533 -46089 -16682 -47448 -21134 -51950 -46437
9768 -46437 -66544 -47313 -44353 -47659 -52165 -46394 -56908 -64905 -60238 -64546 -66907 -81928 -83619 -81179
9754 -81179 -88083 -82189 -93840 -78391 -74467 -59025 -90879 -74649 -82536 -62405 -54215 -79155 -76465
9741 -76465 -34151 -6059 1224 -2753 -709 4385 -8929 9569 -14508 22676 15273 4378 45443
9728 45443 117255 207403 377468 587467 803606 954756 1056784 1004510 902640 756592
9718 756592 578734 458046 310661 190502 164144 79447 30500 19296 16359 3157 14678
9707 14678 25882 39398 17505 24347 -13291 -33238 -27596 -64236 -85381 -95446 -120586 -123601
9695 -123601 -121026 -95476 -138814 -144186 -124269 -142409 -175263 -142716 -153260 -161381 -143284 -156342
9683 -156342 -152249 -139222 -157853 -139441 -158110 -167147 -155709 -169669 -142633 -129516 -209096 -161965
9671 -161965 -168260 -155596 -186267 -169033 -164374 -175301 -163848 -163236 -177438 -155883 -174440 -171077 -191556
9658 -191556 -168994 -187291 -164293 -168692 -173892 -157824 -156331 -156358 -154922 -170600 -161601 -155047 -166900
9645 -166900 -179000 -159580 -165757 -159965 -160524 -226146 -191107 -169750 -173692 -189708 -195569 -192739 -199460
9632 -199460 -184478 -185789 -167576 -186772 -191904 -228205 -172871 -176110 -179262 -209282 -186906 -209663
9620 -209663 -227969 -185037 -219942 -204915 -201906 -211091 -182850 -186427 -179628 -178446 -209050 -185085 -163862
9607 -163862 -153150 -173820 -213185 -195371 -176300 -182933 -166762 -188369 -200450 -197723 -195721 -173664
9595 -173664 -203917 -207727 -209052 -192424 -161797 -153442 -181575 -181322 -165167 -153774 -119053 -126328 -114163
9582 -114163 -92309 -58183 29205 104062 148425 222938 256707 294072 314038 292130 239758 187923
9570 187923 147840 108661 61890 23415 2756 -16401 -52617 -45765 -74274 -107256 -89280 -114064
9558 -114064 -94803 -108497 -155245 -110704 -89217 -86409 -94527 -62371 -75295 -52830 -6300 18765
9546 18765 17426 32229 22371 29117 26064 15793 34113 32507 20697 23229 -9559 -2197 -41728
9533 -41728 -26868 -34970 -18855 5832 20309 54369 143817 139494 133082 163904 173465 161044 216885
9520 216885 223428 229049 186742 192894 145272 156433 154388 133560 112753 62260 46001 58244
9508 58244 12479 -1199 -14317 13801 28277 59600 52805 25282 62211 74650 107079 128832
9496 128832 192256 230419 258980 233165 235554 225117 230195 245791 246005 221507 228752 196639 186487
9483 186487 142076 82326 50240 14447 15804 15011 -27817 -32963 -17264 -32067 -30947 -8642 -45918
9470 -45918 -63623 -65603 -65134 -29637 -52322 -73031 -57458 -27701 -19971 -14844 -59069 -65124 -40763
9457 -40763 -12958 -5197 -36271 -53969 -55487 -51581 -49341 -10264 -25511 -33130 -260 5492 43498
9444 43498 13140 -24565 -9573 4053 15494 -7876 13642 9654 3222 2108 19423 12892 -8812
9431 -8812 -5968 -10288 -10988 2350 -1737 2413 16588 31042 13204 35770 4268 -18366 -35516
9418 -35516 -45287 -51521 -68198 -90552 -57230 -70112 -87033 -75423 -70014 -62332 -67695 -86471 -81578
9405 -81578 -78851 -67978 -94433 -125548 -124748 -95555 -88391 -82080 -75576 -109845 -106103 -107204 -84039
9392 -84039 -89862 -62151 -76800 -70594 -63994 -61252 -48877 -54731 -55856 -68363 -45391 -47691 -17156
9379 -17156 -60360 -61448 -49780 -16337 32351 29288 27343 51251 21264 15547 13678 19652 1686
9366 1686 -20152 19255 -9846 22069 33662 41702 46794 64996 62006 43340 37553 53983 93466
9353 93466 60493 81239 128079 107877 127321 159668 189979 207244 265344 258789 269123 249829
9341 249829 286212 278183 296051 264570 312907 301504 305018 296965 314040 340367 379191 378926 420311
9328 420311 426844 407916 420473 416596 417513 404401 388577 381098 363061 386510 408739 419432 495916
9315 495916 516103 546702 549131 543093 520662 540837 531115 580912 605170 630870 649614 639269
9303 639269 576322 552029 482211 449049 452990 427360 392516 426424 421186 435214 448849 497531
9291 497531 522639 521073 522978 517877 532334 482200 525461 494615 529579 515747 544457 571718
9279 571718 533972 555595 555997 542075 562186 612399 648422 653020 676432 690308 723299 758767
9267 758767 836329 913101 1005834 1116318 1196559 1215194 1216350 1228090 1209854 1232538 1291136 1342138
9255 1342138 1423596 1505519 1501798 1477485 1408837 1342041 1287297 1231892 1211169 1176936 1164115 1164698
9243 1164698 1176881 1181715 1202672 1227433 1244341 1244598 1289706 1323964 1379596 1461358 1538280 1593117
9231 1593117 1623695 1654980 1683780 1707741 1746730 1838471 1911231 1952158 2007714 2046717 2068687
9220 2068687 2118174 2209265 2292205 2364899 2527156 2567891 2622411 2654615 2676450 2709261 2820774
9209 2820774 2997044 3160386 3379210 3615134 3794618 4033715 4300584 4527676 4771589 5055478
9199 5055478 5304373 5579404 5934725 6243930 6498812 6742095 6858688 6977541 7065824 7104992
9189 7104992 7168637 7164226 7017948 6759247 6531101 6200038 5956557 5812674 5782916 5888493
9179 5888493 6062553 6249558 6455313 6675612 6885887 7162889 7545465 8071234 8658346 9223971
9169 9223971 9708413 10151733 10503083 10705160 10673863 10467206 10291387 10070698 10096023 10335963
9159 10335963 10742981 11214904 11751548 12358264 13006211 13797289 14837700 16589901 19392061
9150 19392061 23375412 28009361 32481295 35954382 38022179 38563789 37453720 35006717
9142 35006717 31756241 28084422 24440536 21125522 18297892 16091502 14433108 13310902
9134 13310902 12679279 12522174 12743419 13219598 13710936 14078497 14220875 14146942 14069039 13988721
9124 13988721 13914837 13809849 13552813 13123947 12596202 11949911 11322169 10668695 10175983 9720104
9114 9720104 9388924 9071163 8842444 8661832 8489203 8274425 8040709 7816503 7586307 7377458
9104 7377458 7238595 7100506 7078523 7037215 7026143 7048554 7047276 7094027 7113576 7079338 6979744
9093 6979744 6799314 6606775 6402188 6211529 6059804 5910400 5772615 5680344 5583167 5495936
9083 5495936 5390398 5216207 5101738 5020812 4916526 4836887 4744608 4656046 4623533 4600067 4577286
9072 4577286 4497047 4384132 4240364 4087132 3968840 3792323 3656003 3557599 3466555 3402495
9062 3402495 3319774 3233940 3100649 3020884 2916257 2828626 2742270 2639998 2600220 2490449 2421750
9051 2421750 2348601 2251433 2228222 2124053 2041733 1994541 1952612 1899734 1820053 1824161 1746344
9040 1746344 1706285 1666552 1600299 1583535 1534797 1538258 1457887 1410582 1358539 1326725 1327012 1290263
9028 1290263 1192879 1181864 1135575 1123928 1096601 1015293 992234 972993 938076 905718 889230
9017 889230 862202 807357 809698 786589 752577 709405 719512 681098 708351 675793 637250 616962
9005 616962 609590 627409 621998 604334 575456 536291 551116 544135 554388 548546 484337 499603
8993 499603 477991 486234 484489 419637 444979 434800 432234 419673 392873 368211 364585 366961 372601
8980 372601 346080 361815 328908 349939 296437 329093 318056 302737 312935 318133 291808 283252
8968 283252 277124 283208 252854 299167 275933 285885 252008 269157 261505 231284 237142 244755 231487
8955 231487 226817 198927 192242 207726 222030 227045 194597 192988 200728 204552 210128 199660 216628
8942 216628 203949 186591 226705 191264 220359 203318 200797 219253 218247 210508 190588 216792
8930 216792 160402 186194 192448 166494 152033 173783 166501 138544 150961 141186 154303 147951
8918 147951 136889 132122 124336 127621 112746 108315 130113 106829 93642 77372 85298 83918 97585
8905 97585 56321 70523 65975 42471 53928 36668 52063 28822 42617 32058 43447 37124
8893 37124 36856 27671 -16164 23427 -803 -25360 25986 -18821 7711 2513 7225 -8024 25663
8880 25663 26470 462 9864 22365 18476 26539 -13132 3563 -6080 15287 6981 -8661 5191
8867 5191 -34401 20308 -27253 -22343 -25598 -24856 -24701 -4946 -11743 -19843 -46754 -3617 -22512 -5063
8853 -5063 -23132 3925 -11815 6661 26006 33808 34103 40313 45626 65475 58632 36801 36419 12683
8839 12683 32460 12616 20700 15702 25186 -18064 7780 -11889 -11803 -4326 -38307 -49272 -32051
8826 -32051 -60833 -23894 -36745 -24174 -26703 -27977 -28712 -36031 -20251 -20449 -21493 -39924 -38941 -36103
8812 -36103 -21873 -36753 -49416 -54465 -65567 -49714 -53759 -95001 -69215 -86302 -70959 -72058
8800 -72058 -77489 -109533 -124229 -57029 -97247 -75805 -105857 -123505 -137516 -109823 -98658 -102625
8788 -102625 -122365 -136367 -140739 -94971 -91811 -134536 -130839 -157523 -114883 -125894 -104370 -121129
8776 -121129 -137572 -145145 -140638 -129740 -114593 -147196 -156143 -166714 -128552 -157363 -144863 -171609
8764 -171609 -174873 -126499 -145941 -148663 -134661 -176650 -189066 -127723 -144483 -137115 -172714 -153990
8752 -153990 -181163 -158121 -162919 -166052 -170472 -149841 -147332 -168951 -180789 -163648 -167897 -172653 -172375
8739 -172375 -176297 -158633 -170632 -158532 -165430 -157969 -154977 -166006 -174322 -178789 -163954 -170923 -205304
8726 -205304 -160545 -173240 -186262 -197435 -202800 -158218 -188363 -163568 -186621 -184595 -170274 -204813
8714 -204813 -173430 -181246 -205187 -164191 -170362 -189215 -176306 -155147 -187560 -147182 -128487 -162626
8702 -162626 -131115 -157140 -147799 -146552 -122736 -157698 -154820 -161687 -157879 -166152 -166953 -204804 -178909
8689 -178909 -175832 -193186 -177551 -175410 -191271 -213585 -166665 -182531 -181948 -158288 -179624 -178876 -187993
8676 -187993 -167231 -180792 -162289 -152210 -158046 -166165 -151560 -175261 -175368 -148016 -171916 -197695
8664 -197695 -164770 -187574 -174274 -183907 -204047 -206667 -192782 -208358 -175131 -174544 -214093 -205258 -177490
8651 -177490 -208864 -205962 -216692 -234134 -231786 -203764 -200475 -208493 -189581 -216021 -229778 -198595
8639 -198595 -209354 -233728 -211156 -209805 -225958 -206817 -227328 -230025 -227344 -199311 -211909 -224218
8627 -224218 -218881 -243777 -220785 -233770 -214506 -239367 -223399 -266267 -223620 -212916 -212507 -252395
8615 -252395 -233421 -233069 -234070 -189479 -202964 -225026 -214103 -243118 -226574 -185353 -195684 -216120
8603 -216120 -229103 -233469 -229433 -206452 -219147 -255324 -241331 -193232 -201066 -188637 -204699 -242371
8591 -242371 -246128 -205975 -217847 -226233 -218884 -250504 -270889 -231512 -220643 -251835 -262763 -266305
8579 -266305 -256332 -220979 -240377 -231036 -229618 -252616 -236257 -194797 -225918 -261772 -227853 -227590 -207426
8566 -207426 -235110 -206456 -262190 -247340 -212277 -222042 -234312 -238471 -242342 -246844 -234433 -250813
8554 -250813 -246283 -232502 -239969 -244923 -246646 -227070 -219829 -246602 -228290 -263049 -259025 -252789 -263408
8541 -263408 -246082 -240266 -223449 -250948 -256161 -220459 -257737 -267688 -216136 -262123 -250749 -251295 -226179
8528 -226179 -227804 -250063 -237897 -238147 -233220 -267520 -245839 -251916 -258863 -256177 -222677 -282410 -272092
8515 -272092 -254225 -241639 -245218 -238119 -257139 -233877 -240933 -239256 -258939 -237069 -264978 -260470 -246902
8502 -246902 -239863 -254910 -219393 -241709 -254906 -258893 -241283 -251135 -259902 -251396 -255645 -255627 -262244 -263949
8488 -263949 -239048 -245403 -258264 -249103 -253891 -263812 -239136 -240399 -245890 -248369 -260444 -231226 -240396
8475 -240396 -240157 -247173 -250902 -247941 -252991 -259964 -247524 -264206 -269275 -245954 -248581 -249075 -228442 -259192
8461 -259192 -234108 -214117 -230619 -258895 -251772 -233604 -237804 -236276 -254278 -253852 -272314 -251545 -251201
8448 -251201 -246850 -241205 -244348 -267720 -245020 -246146 -277417 -254588 -270375 -255769 -222550 -249880
8436 -249880 -265190 -211926 -240214 -232807 -256129 -243278 -240109 -236883 -253272 -232410 -235265 -259492
8424 -259492 -248046 -238109 -246454 -247450 -238905 -253557 -268765 -244493 -248560 -256869 -252138 -258131 -244794
8411 -244794 -271267 -246384 -270965 -261224 -260021 -265703 -251727 -252448 -268650 -248099 -270207 -267441 -254686
8398 -254686 -245097 -271686 -267356 -252515 -273003 -269440 -273824 -273833 -266083 -277770 -263398 -290085 -251393
8385 -251393 -257495 -291411 -277659 -275984 -261350 -266323 -254778 -260539 -242861 -261170 -268292 -284968 -299304
8372 -299304 -262001 -271186 -240067 -279142 -258479 -282214 -273528 -284366 -254265 -276165 -289279 -257897
8360 -257897 -242582 -262670 -249025 -276952 -257097 -229647 -245556 -255695 -268809 -306220 -280680 -236586
8348 -236586 -260101 -278867 -267492 -259017 -274506 -283423 -267022 -267679 -273743 -268192 -267556 -288126 -308988
8335 -308988 -272759 -277781 -266406 -287769 -293646 -274917 -274807 -227207 -262119 -280962 -286091 -278600 -261592
8322 -261592 -251664 -256059 -259834 -292777 -282283 -227413 -244367 -281779 -285150 -262314 -266971 -252666 -277602
8309 -277602 -267481 -296967 -266449 -255249 -270838 -296763 -300704 -281314 -256902 -274533 -264181 -285170
8297 -285170 -320942 -282854 -256323 -271066 -284796 -278031 -282716 -271661 -261901 -259910 -272534 -275271 -260541
8284 -260541 -241657 -233756 -289161 -265454 -273433 -263197 -267110 -261626 -252210 -290264 -279935 -270694 -255923
8271 -255923 -285760 -294650 -301333 -288271 -286336 -302128 -295327 -269511 -282823 -278199 -279257 -282788 -301980
8258 -301980 -284666 -272416 -272228 -255407 -270974 -264027 -270188 -287695 -276062 -298796 -300240 -280252 -311229
8245 -311229 -304928 -266543 -276748 -288530 -297693 -279679 -306012 -261110 -276508 -267020 -301935 -292206
8233 -292206 -263603 -269026 -272491 -249834 -304575 -284283 -276373 -284885 -288758 -283510 -315429 -273806 -274615
8220 -274615 -270113 -259642 -261976 -317361 -267833 -267257 -262057 -256229 -268544 -253507 -266870 -261548 -276600
8207 -276600 -254757 -275299 -297543 -295506 -255072 -263409 -277429 -283078 -312769 -284554 -274863 -264027
8195 -264027 -279562 -263316 -270494 -54192 -318539 -320387 -346062 -335233 -303833 -299493 -273720 -291402
8183 -291402 -293465 -279862 -285600 -283724 -267645 -260837 -286589 -294086 -274358 -308505 -298453 -292380 -268634
8170 -268634 -278880 -269795 -306959 -288195 -270475 -276734 -277406 -290341 -306227 -302805 -293051 -262372 -285105
8157 -285105 -293834 -300614 -314761 -274607 -267694 -275298 -296301 -288874 -298507 -274026 -255675 -272050 -311133
8144 -311133 -273749 -268483 -296578 -270553 -304468 -262679 -290543 -285276 -296177 -279679 -320531 -293321
8132 -293321 -307310 -289748 -315493 -313966 -296572 -297907 -299930 -279209 -274544 -292435 -250795 -284111
8120 -284111 -289960 -294206 -316747 -295020 -305795 -293952 -296372 -310606 -271810 -289825 -297366 -284662
8108 -284662 -289124 -307282 -315650 -306796 -316681 -299631 -295667 -296434 -297720 -290673 -273024 -266794 -290773 -281634
8094 -281634 -309702 -278061 -294864 -276807 -298028 -308287 -294128 -301731 -300108 -270285 -296930 -284827
8082 -284827 -298920 -292856 -317776 -301858 -271088 -279207 -276360 -308150 -297761 -302173 -279127 -318151
8070 -318151 -290488 -297173 -274419 -263998 -300606 -335928 -311798 -288166 -302369 -282519 -279188 -307509
8058 -307509 -300155 -321049 -314897 -315619 -304723 -315379 -302780 -306359 -296029 -322701 -310659 -317989 -306786
8045 -306786 -291349 -298661 -297490 -282215 -310493 -298444 -322756 -294551 -301106 -302197 -304602 -319400 -307029
8032 -307029 -320223 -297683 -312811 -316117 -300106 -291393 -307862 -330665 -295386 -313728 -345942 -323586
8020 -323586 -300932 -299160 -325540 -305496 -320425 -316647 -307180 -330946 -313292 -338475 -310512 -293020
8008 -293020 -300029 -329118 -328184 -305952 -333663 -315260 -315479 -325681 -329780 -312953 -309554 -322442 -323601
7995 -323601 -309366 -340598 -327338 -330628 -319509 -312603 -325035 -323190 -322137 -312871 -331208 -328916 -345033
7982 -345033 -334041 -338259 -322185 -338541 -335635 -314692 -319456 -308125 -338102 -339148 -353055 -309651
7970 -309651 -308295 -315478 -304278 -332079 -341265 -301661 -312411 -333184 -334675 -322099 -329324 -314545 -310831
7957 -310831 -328797 -324483 -319748 -332617 -320253 -325792 -313105 -333405 -330703 -304280 -313105 -298368 -328889
7944 -328889 -305020 -336289 -336794 -332072 -299462 -318190 -330880 -304974 -325192 -331883 -319374 -332545
7932 -332545 -310735 -326099 -326462 -330351 -323659 -317242 -322491 -310783 -303505 -330032 -308551 -326603 -324921
7919 -324921 -314134 -304612 -319058 -343001 -338521 -317433 -327736 -293020 -330987 -331957 -325050 -334219 -313260
7906 -313260 -334189 -342996 -330675 -347245 -371308 -340747 -333380 -337328 -342519 -348955 -332232 -328108 -324218
7893 -324218 -322645 -326943 -337851 -316747 -303788 -299811 -315190 -326907 -339605 -322327 -319446 -315256 -361139
7880 -361139 -331889 -321408 -324014 -316174 -334570 -365004 -341317 -310336 -321562 -328294 -350413 -340856
7868 -340856 -320882 -327698 -327709 -347413 -341986 -342993 -352504 -316319 -331730 -341567 -340146 -350091 -358461 -346714
7854 -346714 -360744 -335429 -335536 -366929 -387791 -140864 -238833 -313740 -305747 -325589 -319632 -320101 -321946
7841 -321946 -299963 -321802 -298714 -340983 -320482 -309506 -332194 -305330 -309367 -328179 -321882 -330125
7829 -330125 -305705 -327805 -342407 -326949 -331495 -317911 -303001 -326196 -317751 -320145 -322174 -323547 -306531
7816 -306531 -329813 -313878 -325989 -337842 -302924 -313570 -306815 -300734 -299171 -325561 -314339 -302968
7804 -302968 -334628 -294507 -318220 -308637 -315269 -296404 -305873 -331215 -308997 -318961 -299792 -325826
7792 -325826 -337273 -297310 -313557 -317716 -295465 -307243 -307400 -309749 -323942 -318061 -322394 -319600 -326108
7779 -326108 -355648 -305966 -314054 -329173 -321493 -294784 -332567 -302355 -294622 -303982 -324090 -326557 -307017
7766 -307017 -309150 -283189 -288925 -328373 -280012 -303353 -303156 -294396 -296214 -296852 -297640 -304816 -284002 -310012
7752 -310012 -322127 -306491 -267338 -295419 -264525 -277024 -278341 -261539 -244449 -262657 -276740 -298844
7740 -298844 -296915 -293745 -257837 -268730 -284561 -290460 -295824 -262569 -269571 -297585 -280654 -276979 -259133
7727 -259133 -272336 -262042 -304095 -304898 -293656 -268536 -257670 -286626 -271959 -269581 -265262 -278949
7715 -278949 -267151 -253106 -280006 -225408 -241501 -275046 -262957 -239252 -242194 -261098 -286415 -262835
7703 -262835 -255662 -261611 -244090 -225164 -222321 -247953 -249704 -254853 -240016 -231079 -246171 -236193 -241185
7690 -241185 -222397 -247384 -226202 -223513 -206682 -215954 -247301 -204292 -225789 -225807 -205321 -222729 -209597
7677 -209597 -223306 -204049 -209828 -218038 -212141 -221174 -190999 -201180 -185444 -221232 -203037 -193652 -180588
7664 -180588 -200487 -175132 -186675 -169253 -153968 -196323 -192592 -154532 -143432 -180948 -180354 -159301
7652 -159301 -162260 -166896 -166545 -155190 -160890 -160726 -158054 -162121 -124160 -153799 -156275 -135424 -111296 -118018
7638 -118018 -118612 -115650 -124195 -129352 -126870 -109974 -119507 -121896 -109524 -93250 -81785 -85594 -78718 -85217
7624 -85217 -43927 -75934 -63027 -63882 -64074 -85264 -76181 -41982 -35680 -42937 -40403 -18234 -45511
7611 -45511 -45056 -7951 -12005 -27747 -4074 -14671 -140 -91 -6033 30548 10824 22652 23048 -10568
7597 -10568 44494 43378 20285 27808 50977 50051 79803 83361 62538 107279 77251 123682 105679
7584 105679 118264 126725 137714 154536 140173 171659 159732 164876 210397 200699 227116 234337
7572 234337 212778 235643 231752 244363 254359 264437 265386 292207 316015 276498 322507 327543 330507
7559 330507 395959 381956 360776 358732 378822 411573 396040 391465 366415 385117 385656 399732
7547 399732 390870 380528 433721 420814 480610 452548 452926 444295 460437 497256 505002 536383 508369
7534 508369 498832 521957 535723 560581 543567 531733 542392 544137 566492 554422 564943 567338
7522 567338 604229 626701 589803 630942 618985 647094 645569 665319 666757 669091 684132 695531
7510 695531 722074 719311 724602 740448 749975 752609 787025 797829 822009 855973 869507 882753
7498 882753 872244 891921 931437 925104 965145 957715 987153 983241 1011098 1031312 1057180 1061284
7486 1061284 1109437 1098477 1132386 1167686 1180796 1180711 1222698 1261804 1266692 1289841 1305846 1307605
7474 1307605 1344743 1382846 1400991 1409527 1452193 1491775 1508158 1547724 1562045 1594600 1609644 1614968
7462 1614968 1671609 1694194 1737448 1771097 1790611 1818121 1848377 1912302 1927524 1991966 1958579
7451 1958579 2003288 2064456 2072531 2155695 2160522 2226155 2243259 2257616 2323391 2365312 2397354 2443264
7439 2443264 2476349 2520339 2558548 2610963 2671886 2704079 2738816 2768090 2861767 2893077 2965509
7428 2965509 2975086 3064412 3122601 3157438 3222628 3272102 3318737 3405169 3472254 3544823 3567693 3671972
7416 3671972 3707921 3779617 3864550 3927457 4007264 4069112 4159204 4225266 4306918 4388550 4470093
7405 4470093 4553706 4608145 4712276 4793641 4883741 4986100 5066293 5186455 5278995 5387904 5492683
7394 5492683 5598755 5702504 5791521 5923480 6055763 6152893 6291696 6426250 6586299 6709345
7384 6709345 6813609 6955832 7098775 7244920 7443121 7647580 7806391 7994817 8141256 8322805
7374 8322805 8467207 8594508 8701437 8855931 9037511 9141368 9334078 9487050 9658202 9843289
7364 9843289 10043775 10222766 10424186 10613745 10843827 11049075 11284149 11469243 11725228 11942533
7354 11942533 12205078 12499985 12739991 12990632 13262640 13538180 13832082 14142747 14435375
7345 14435375 14727377 15093151 15449463 15754959 16125357 16474758 16857982 17258898 17667972
7336 17667972 18060171 18480152 18952459 19397622 19879124 20386257 20879306 21393444 21950889
7327 21950889 22523486 23108114 23740267 24360473 25025701 25714768 26410391 27179526 27953523
7318 27953523 28736528 29597855 30447506 31383209 32315723 33328234 34301529 35397170 36539025
7309 36539025 37707339 38953476 40243365 41574473 43013470 44499902 46069455 47709346
7301 47709346 49449379 51253723 53193943 55212031 57383034 59622484 62025277 64591274
7293 64591274 67278047 70133249 73132242 76362583 79783996 83413237 87281884 91394390
7285 91394390 95776967 100460534 105422981 110736830 116365976 122400701 128830180 135616772
7277 135616772 142856771 150492593 158587546 167075280 175993323 185311102 194925475 204882648
7269 204882648 214985069 225247092 235443559 245501775 255249241 264453377 272984726
7262 272984726 280649604 287284007 292672806 296746444 299414437 300576902 300302033 298628422
7254 298628422 295607135 291415169 286106376 279934032 273007727 265480133 257568101 249346957
7246 249346957 241009133 232610864 224288690 216053137 208009036 200205967 192697943 185444299
7238 185444299 178460308 171835888 165488618 159421878 153675519 148209464 143019317 138075427
7230 138075427 133401580 128957631 124745904 120748858 116952683 113336747 109879628 106641325
7222 106641325 103523658 100565356 97727595 95019337 92474056 89977872 87633448 85390306
7214 85390306 83207434 81172341 79168443 77253769 75469599 73696042 71996810 70412045
7206 70412045 68876211 67356783 65900249 64496653 63177806 61889496 60619038 59400643
7198 59400643 58216124 57079370 56006825 54948889 53939443 52889831 51954429 51025452
7190 51025452 50115108 49246630 48378621 47565135 46757377 45967185 45246570 44507122 43767907
7181 43767907 43117557 42467714 41806203 41153429 40540619 39951435 39353135 38815452 38248114
7172 38248114 37685941 37186735 36647976 36172602 35699851 35231353 34727354 34277242 33879578
7163 33879578 33436131 33015612 32590910 32191058 31760764 31405349 31058739 30680897 30310129
7154 30310129 29940924 29616083 29322777 29009404 28631071 28294312 28014689 27713425 27457939
7145 27457939 27158374 26861664 26565746 26297787 26043099 25787651 25489143 25255981 25021936
7136 25021936 24809490 24571113 24298857 24060805 23831948 23638605 23419961 23184655 22983284
7127 22983284 22779158 22550773 22362153 22196896 21987905 21781434 21619027 21445879 21245617
7118 21245617 21080174 20863278 20683083 20542011 20358868 20211815 20041310 19870149 19686661
7109 19686661 19551095 19409299 19256840 19081871 18929011 18762305 18658857 18475820 18332129
7100 18332129 18180238 18041851 17930732 17808726 17665062 17509701 17361013 17248762 17123019
7091 17123019 17010875 16882854 16738525 16617887 16507557 16349253 16256617 16099654 15964593 15853233
7081 15853233 15725789 15594177 15480739 15375157 15255923 15144688 15063792 14934432 14825428 14736023
7071 14736023 14594312 14480202 14369721 14234453 14135686 14023363 13916626 13809793 13704108 13576444
7061 13576444 13501640 13432396 13334321 13210532 13121686 13024918 12940642 12882488 12761957 12648862 12561588
7050 12561588 12488270 12393197 12312217 12278039 12152744 12120985 12070247 11986761 11895729 11788639 11659494
7039 11659494 11527246 11422355 11298948 11151496 11052824 10903540 10831233 10735301 10638927 10528503
7029 10528503 10417877 10356970 10280294 10162562 10101088 9990114 9958353 9873828 9822802 9753437 9712452
7018 9712452 9669824 9669759 9688610 9625825 9591704 9503617 9438634 9357114 9313671 9229906 9199592 9160420
7006 9160420 9161444 9154404 9185029 9180882 9213350 9244643 9250335 9298679 9346206 9417762 9506712 9641161
6994 9641161 9826761 10075301 10409456 10833770 11320850 12022347 12922291 14101311 15557678
6985 15557678 17250736 19126209 20937397 22478612 23535441 23959729 23701904 22888572 21650807
6976 21650807 20124645 18527861 16944569 15474944 14097920 12918645 11929983 11102081
6968 11102081 10393990 9741822 9191480 8678853 8236022 7839257 7479254 7179472 6911616
6959 6911616 6678277 6493355 6297577 6100898 5963077 5820106 5710795 5554399 5445784 5368756
6949 5368756 5276343 5188809 5100530 5011665 4949540 4884693 4814885 4718891 4689782 4607054 4542368
6938 4542368 4482993 4436254 4401853 4377588 4377073 4350006 4338306 4325560 4281080 4229688 4170453 4126380
6926 4126380 4046061 3971397 3905797 3847815 3809934 3765846 3829807 3926006 4011642 4082729 4155887
6915 4155887 4109171 4026986 3934680 3800858 3674386 3557867 3420310 3347961 3272433 3235054 3208364
6904 3208364 3211884 3222184 3210370 3223418 3230512 3232942 3177918 3158196 3131942 3054120 2954920 2878424
6892 2878424 2807696 2704068 2642280 2593307 2532476 2448614 2401828 2372629 2338699 2273282 2214792
6881 2214792 2179242 2159057 2127095 2144844 2096507 2055311 2032978 2011226 1969463 1963811 1930274 1904366
6869 1904366 1871810 1841192 1829557 1827639 1780709 1749642 1755043 1726399 1736393 1703753 1685131 1665102
6857 1665102 1641578 1667636 1658124 1626948 1600733 1585992 1579740 1581184 1559182 1537652 1518815 1516902
6845 1516902 1495446 1460853 1442192 1439467 1406379 1407233 1382928 1357993 1389533 1364030 1340858 1328644
6833 1328644 1327525 1312321 1295964 1300206 1294576 1272430 1284733 1268733 1258589 1261805 1234063 1267859
6821 1267859 1273410 1251735 1261854 1281399 1297753 1285535 1336367 1361137 1429546 1448341 1542403 1675354
6809 1675354 1790523 1880784 1936763 2018328 2004386 1935271 1869259 1757726 1655008 1546314 1465871
6798 1465871 1421273 1334638 1310823 1266907 1255474 1218347 1203906 1195158 1157517 1150019 1101380 1076298
6786 1076298 1068322 1039820 1024659 1007181 989986 1005003 1029719 1018684 1003076 1007833 974381 987482
6774 987482 992993 959247 972539 944006 941774 957524 923681 923289 888454 892592 872757 838101 849336
6761 849336 828622 838429 821141 832946 827859 823430 819521 828368 845891 889299 923174 980100 999310
6748 999310 976907 1017117 1021840 1056802 1041288 1065994 1049992 1026944 982344 963876 963304 892558
6736 892558 880807 878867 847424 838572 819719 820303 836339 841589 892132 958796 1040707 1112329 1222717
6723 1222717 1287959 1281683 1289070 1248044 1196303 1176558 1116664 1117016 1072203 1016052 987236 976687
6711 976687 939393 910012 921818 879090 871989 910027 876201 915275 930625 992068 1017043 1040807
6699 1040807 1035895 1039309 1017155 995933 969777 899762 893004 830980 831604 819809 826006 856977 871229
6686 871229 893452 900551 921318 928430 919946 955283 1011562 1062745 1163004 1252829 1318746 1459744
6674 1459744 1616233 1776768 1851948 1842723 1786753 1660983 1514165 1377903 1264180 1143672
6664 1143672 1070116 1012348 946760 929638 903846 929387 922580 911064 918828 920841 981547 1061731
6652 1061731 1233562 1421111 1604068 1655954 1686753 1613051 1475715 1316020 1200238 1062949
6642 1062949 986262 950305 874117 845413 807333 825886 780590 786861 762131 720996 726488 723070
6630 723070 759261 752600 771209 781987 824768 923749 1117885 1312283 1521829 1639921 1636702
6619 1636702 1603097 1503258 1343444 1200724 1072034 991033 905045 809773 786042 767076 787330
6608 787330 810395 833056 836993 799232 787233 756641 791710 730603 739346 715233 759055 802358
6596 802358 845042 941479 1041989 1057734 1072279 1042013 1016524 960553 895124 826934 767843
6585 767843 784356 766049 750891 764736 819949 902573 895983 920523 897602 893786 863915 837796
6573 837796 769118 741384 710024 709417 690978 665522 644789 637965 625007 640515 619726 594147
6561 594147 597271 602282 577757 616481 598195 592434 585582 639975 666234 704437 694738 669994 680985
6548 680985 649592 637346 615847 557994 541108 523273 541457 511141 505072 504989 513752 537068 517375
6535 517375 546672 524913 519594 509637 533831 522567 519412 569452 521445 539253 546809 546205 557771
6522 557771 552313 562346 563196 562665 551275 539205 572290 554805 563876 566001 586405 610340 637769
6509 637769 666874 709317 727349 768430 854081 921707 1000020 1068997 1164481 1316983 1548456
6498 1548456 1858523 2411662 3125856 3971290 4687560 5046535 5067394 4731365 4220246 3631367
6488 3631367 3070831 2539428 2107847 1765126 1491499 1309015 1188433 1060146 970036 905274
6478 905274 848334 776407 741278 702391 666803 655179 661716 614061 562422 550078 528890 546281
6466 546281 523593 530467 515388 508350 518717 494209 489283 506692 485890 517647 505439 522553
6454 522553 470870 460821 441690 462618 454790 430131 403724 394581 417042 400474 420580 397026
6442 397026 372128 384170 399279 413832 416682 375207 399610 391315 411289 418486 396797 364460
6430 364460 380560 433632 426255 412979 380726 396983 402875 424469 435532 402713 392335 361993
6418 361993 404341 425610 401556 374041 411776 414288 437215 433374 460896 448725 475402 505959
6406 505959 517952 536561 516926 557971 590948 645019 693849 748022 772357 755248 772948 754438
6394 754438 688091 658711 639258 611559 593378 590984 575394 593080 615567 641936 622263 614674
6382 614674 647721 701239 723120 746004 733076 727995 709878 687926 686521 626298 601807 595429
6370 595429 599125 621406 576492 590134 562944 602058 669929 665730 694607 744762 827026 884663
6358 884663 965070 981791 970534 927823 907715 901164 865046 817331 773230 753763 763166 776439
6346 776439 765451 792181 793641 854181 868871 847868 838029 831405 894643 927365 948914 906663
6334 906663 876502 859660 803908 747865 749549 696172 673344 668720 658094 630504 624644 596853
6322 596853 615832 628187 632445 629550 608702 606835 645760 653432 668403 668068 701010 700845 730433
6309 730433 787074 816699 885561 925464 1028136 1038526 1062090 1130171 1279642 1496890 1685440
6298 1685440 1823561 1851273 1818048 1701320 1550642 1398491 1258842 1125023 1073298 1001719
6288 1001719 974591 903648 890775 887390 890921 904930 904364 885433 897574 909011 982851 945393
6276 945393 927162 928120 937140 992006 994518 1036699 1016619 1067694 1084193 1154944 1209538 1187897
6264 1187897 1233371 1270314 1369313 1448019 1509912 1570422 1704261 1820995 1966419 2158426 2370161
6253 2370161 2596297 2931435 3414320 3985397 4725424 5477075 6183603 6772331 7089233 7205247
6243 7205247 7020344 6702061 6303896 5920517 5555104 5227863 4981221 4799903 4757103 4702816
6233 4702816 4735662 4847465 5058577 5403250 5856604 6531392 7420246 8617463 10073318
6224 10073318 11528266 12805914 13641936 13931378 13683754 12961374 11921634 10747664 9568916
6215 9568916 8535176 7597653 6850124 6266654 5807646 5482128 5326900 5217561 5179145 5248829
6205 5248829 5364997 5657130 6068570 6609777 7295952 7834281 8277642 8446464 8342297 7954136
6195 7954136 7373591 6706168 6058920 5464943 4907428 4381327 3969941 3636556 3381348 3163405
6185 3163405 2972792 2857638 2733082 2636508 2599573 2545944 2492861 2443639 2407724 2411899 2340989
6174 2340989 2318307 2290125 2245109 2212791 2226325 2202705 2214296 2199862 2232253 2268212 2297748
6163 2297748 2335783 2298723 2288980 2282975 2261201 2206537 2211812 2208047 2197136 2198781 2201928 2235653 2292495
6150 2292495 2366468 2429424 2508462 2544987 2598201 2708670 2787400 2918934 3048653 3188848 3372582
6139 3372582 3544821 3712827 3735106 3799976 3817340 3809494 3863777 3914501 4062591 4299675 4551495
6128 4551495 4915305 5331783 5800018 6183961 6505329 6685880 6755884 6632199 6456473 6202390
6118 6202390 5907012 5642101 5380584 5138183 4942240 4822181 4832400 4915695 5062202 5217104
6108 5217104 5346946 5502486 5690034 5920292 6253884 6672417 7323914 8076823 8888925 9718265
6098 9718265 10404079 10856087 10962712 10746713 10298235 9612576 8854190 8064097 7358882 6671500
6088 6671500 6111432 5655868 5314010 5047555 4948816 4900993 4954442 5014860 5038059 5016455 5031960
6077 5031960 5024541 5138239 5309820 5545696 5820366 6011908 6184515 6252829 6175802 6002205
6067 6002205 5687690 5347464 4940353 4596272 4277645 3909470 3668225 3431916 3273664 3071644
6057 3071644 2960928 2899487 2791086 2762502 2678025 2614568 2494459 2373570 2295442 2175040
6047 2175040 2109289 2032730 1950902 1897377 1821876 1802461 1773851 1737146 1723210 1698833 1709387
6036 1709387 1696813 1681962 1668188 1658447 1687366 1694521 1708868 1703737 1693011 1730061 1710188 1709883
6024 1709883 1672782 1647654 1649048 1622338 1650549 1618195 1585313 1578925 1588683 1582732 1565446 1543511
6012 1543511 1520587 1517282 1512386 1511749 1505655 1528583 1534786 1563404 1549570 1577199 1579982 1632127 1652858
5999 1652858 1702124 1715493 1701833 1742689 1790151 1794436 1806278 1814751 1835002 1856084 1909334 1940545
5987 1940545 1969326 1996742 2050838 2117517 2189135 2255868 2286808 2330201 2409662 2513751 2651902
5976 2651902 2823757 2986253 3161653 3359248 3601442 3880025 4310520 5026950 6394385
5967 6394385 8297943 9956879 10873711 11452111 12031215 12998124 15299297 18015901 19612636
5958 19612636 19920877 20066983 20041767 21408663 24608158 27164366 27744661 26939168 25825628
5949 25825628 24178691 24050615 24569901 24273480 22850401 21220352 19236793 17585583 16840601
5940 16840601 16094950 14996562 13548155 12140228 10480760 9060093 7794306 6750465
5932 6750465 5919098 5220851 4772335 4403084 4125934 3919070 3810452 3753768 3722606 3663074
5922 3663074 3620880 3535949 3512177 3525191 3534783 3517310 3444467 3305537 3185773 3051396 2881066
5911 2881066 2742715 2568678 2474424 2378860 2311010 2259933 2202127 2144285 2138446 2090650 2087700
5900 2087700 2095661 2065078 2057758 2066644 2030845 2004809 1997943 1975145 2031594 2116431 2239076 2299106
5888 2299106 2310937 2221653 2103500 2014082 1937740 1807038 1678100 1563472 1524481 1492975 1501752
5877 1501752 1453827 1441958 1451987 1419035 1414723 1365011 1336816 1299714 1240310 1253131 1214630 1215297
5865 1215297 1239191 1245601 1320237 1358540 1379884 1361256 1367235 1323408 1296920 1296716 1241539 1217556
5853 1217556 1216120 1209101 1215589 1206715 1230393 1236660 1233004 1185378 1182476 1169590 1135437 1121828 1110702
5840 1110702 1099366 1060346 1001706 978879 952977 928492 903207 891575 887889 858016 873217 865734
5828 865734 852445 820459 843293 847513 845356 859351 889113 879374 930680 922421 983848 966517
5816 966517 971634 951469 944965 914723 858432 845105 780411 795596 787614 749582 762628 704914
5804 704914 734970 739880 698423 680855 681835 686194 694319 707156 669401 683104 696403 701686 710778
5791 710778 709821 710284 716016 740947 777911 786022 815878 810762 783983 796454 789184 784775 801019
5778 801019 774116 771384 774391 805261 782218 779882 808069 826898 840118 879649 867877 867446 886398
5765 886398 888967 916138 917773 894520 869500 872753 895745 883105 891514 886458 877109 915860 912373
5752 912373 916080 926955 934460 950465 1004800 1059722 1071907 1144794 1169069 1233472 1304989 1395212
5740 1395212 1489161 1576780 1665147 1724974 1826272 1925214 1921413 1934938 1921201 1878546 1841416
5729 1841416 1792535 1722318 1646060 1583023 1549256 1541627 1501018 1483646 1461591 1463825 1508263 1530227
5717 1530227 1558447 1573544 1637184 1684770 1787998 1836962 1947210 2058992 2176642 2333571
5707 2333571 2503456 2613065 2758224 2804159 2865638 2963228 2956342 2946601 2915681 2882600 2804065
5696 2804065 2779985 2775649 2769572 2837194 2949941 3103651 3289357 3382622 3440483 3452057 3417170
5685 3417170 3375470 3384000 3406102 3503585 3610372 3767692 3991660 4259624 4610378 5037334
5675 5037334 5500816 6007143 6512591 6979210 7438861 7754705 7970459 8081270 8086325 8057068
5665 8057068 7980623 7897223 7792722 7723767 7632668 7470560 7337911 7136370 6978630 6771667
5655 6771667 6655063 6561419 6533060 6636420 6776879 7042393 7337245 7768499 8274175 8857196
5645 8857196 9542700 10328658 11163085 12059966 12877309 13668784 14332267 14793753 14956046 14781294
5635 14781294 14326216 13759488 13048508 12314851 11553967 10791873 10011731 9284557 8667329
5626 8667329 8167318 7763745 7524429 7301027 7160455 7149119 7152008 7268208 7440163 7615599
5616 7615599 7924242 8297068 8758163 9236928 9695130 10139692 10521447 10866002 11086046 11128607
5606 11128607 11048670 10894139 10672554 10435062 10214888 9991628 9852174 9783589 9762775 9857330
5596 9857330 9983791 10156658 10325952 10487742 10702294 10873372 11063892 11249560 11504092 11742701
5586 11742701 12042523 12338294 12691175 13016373 13359336 13682360 13982961 14247741 14485940
5577 14485940 14692136 14899127 15062891 15219973 15393365 15536025 15596935 15588352 15556335 15437777
5567 15437777 15281052 15074626 14856809 14599487 14390755 14242610 14140450 14179515 14345625 14542753
5557 14542753 14907009 15306531 15787303 16147884 16560564 16821189 16960276 16960657 16784033 16424950
5547 16424950 15930462 15376037 14733062 14082129 13367990 12698362 12060272 11484354 10918127
5538 10918127 10443298 9997710 9660107 9385971 9125504 8957849 8823010 8831213 8852260 8969241
5528 8969241 9099862 9194212 9375525 9489713 9558718 9576439 9493962 9320610 9095316 8830574
5518 8830574 8499503 8134658 7728641 7361266 6953117 6611174 6242219 5905381 5573535 5307609
5508 5307609 5065882 4860375 4650205 4452019 4290735 4146703 4038970 3919373 3770377 3695254
5498 3695254 3564137 3463128 3399249 3329002 3200115 3125207 3072662 2990763 2943403 2843520 2790577
5487 2790577 2741503 2711673 2670065 2592566 2550037 2527987 2490060 2466184 2468660 2418220 2399649 2375280
5475 2375280 2393433 2387872 2376997 2351849 2355808 2339091 2333139 2372677 2353608 2347175 2337265 2362505
5463 2362505 2390065 2386719 2391679 2384234 2404876 2416548 2426285 2444702 2466517 2474228 2492756 2550439
5451 2550439 2608935 2643858 2748567 2805286 2880606 2965537 2999504 3044632 3033639 3081296 3133730
5440 3133730 3166698 3192776 3212665 3213236 3224063 3228541 3220674 3216140 3193712 3198606 3167760 3185114 3192101
5427 3192101 3209868 3192943 3248319 3291755 3342637 3418839 3491912 3581490 3755225 3923616 4032625
5416 4032625 4139545 4223750 4278946 4265989 4243746 4178853 4149332 4105141 4075464 4095697 4076817
5405 4076817 4162210 4237846 4342555 4457138 4565262 4735635 4924528 5055423 5230085 5330778
5395 5330778 5444137 5540108 5603021 5623923 5663066 5610681 5556833 5557234 5513383 5465440 5448484 5473592
5383 5473592 5569742 5621122 5771902 5932038 6132569 6379322 6630685 6946679 7201759 7455596
5373 7455596 7711533 7931562 8106716 8144787 8164484 8116845 8004597 7868629 7670667 7438037
5363 7438037 7158433 6927500 6721778 6488815 6290449 6115032 5979088 5902009 5828354 5787896
5353 5787896 5725494 5716811 5671660 5677880 5637834 5574042 5454344 5343430 5232252 5081451 4885508
5342 4885508 4660385 4441016 4245310 4017206 3806492 3601349 3384010 3211862 3024817 2900137
5332 2900137 2753589 2579295 2511653 2410930 2336973 2242866 2189920 2136324 2086287 2041411 2009359
5321 2009359 1944842 1899556 1851526 1841774 1818345 1802877 1768858 1785030 1758293 1717224 1720889 1677155
5309 1677155 1675099 1627664 1622629 1589085 1551401 1550605 1582957 1588660 1560263 1530154 1550758 1582046
5297 1582046 1595024 1607010 1627311 1641042 1666597 1678768 1713141 1741072 1733268 1716668 1764980 1767093
5285 1767093 1766280 1755302 1771071 1751444 1766633 1788904 1777104 1772302 1805150 1829020 1855366 1893940
5273 1893940 1929907 1931616 1991613 2031478 2089911 2096818 2133109 2102527 2130278 2128416 2107302 2084539
5261 2084539 2036945 1961702 1902305 1884760 1783774 1702028 1677498 1626970 1616369 1554048 1515993
5250 1515993 1484452 1484850 1452027 1461691 1461928 1442009 1427178 1454907 1440285 1391402 1393845 1357035 1342244
5237 1342244 1298119 1285765 1260024 1186056 1166761 1128365 1077341 1046981 1012919 1017970 959892 939260
5225 939260 929579 892129 888162 867633 874465 853128 851269 830766 835287 826081 807199 812468 797759
5212 797759 814011 786797 796656 803907 793003 772918 808610 784029 787309 763645 735882 723141
5200 723141 715546 762593 752268 729941 743780 718495 729342 761502 720510 705776 720037 723973
5188 723973 747889 741011 716452 711973 698549 728581 722531 688105 687709 708264 746888 718948 696851
5175 696851 692967 680677 672920 699241 705618 704003 719313 703368 719760 743166 725072 740677
5163 740677 774468 780288 807764 824450 821028 790647 797092 824782 824765 843514 838790 878516 906998
5150 906998 935012 957608 940846 954976 947869 959109 901334 882409 893000 889068 928609 891309
5138 891309 878791 865450 909492 926708 938382 967044 968002 986274 1018931 1057685 1079278 1143021
5126 1143021 1177317 1277092 1391063 1493730 1583667 1670336 1746544 1800431 1806600 1778883 1729128
5115 1729128 1670826 1599486 1595558 1564843 1534815 1506227 1494303 1471213 1393301 1388025 1330455 1353587
5103 1353587 1315121 1350168 1370043 1375703 1392178 1454021 1537498 1611973 1709154 1760144 1861141
5092 1861141 1931748 2083476 2153718 2197082 2254022 2294504 2390221 2477077 2586657 2605525 2575179
5081 2575179 2508542 2364465 2188457 2027529 1887530 1816339 1735845 1697488 1662401 1650074 1637472
5070 1637472 1710203 1746776 1803686 1831913 1947520 2084273 2255428 2504422 2716888 2934367
5060 2934367 3103590 3140533 3098783 3000975 2834991 2683243 2577378 2457371 2339338 2271604
5050 2271604 2267409 2230839 2265577 2275488 2305758 2363018 2479698 2572234 2709477 2839939 2979408
5039 2979408 3178330 3315860 3462153 3548476 3580006 3575495 3500695 3448295 3376024 3253318 3195551
5028 3195551 3113150 3078990 3043978 3052913 3058022 3097588 3132621 3178106 3271982 3385927 3515659
5017 3515659 3696573 3929383 4224789 4560512 5021210 5537957 6075784 6616284 7042412 7397998
5007 7397998 7526578 7491389 7367305 7076620 6738499 6335266 5926807 5581320 5289732 5059480
4997 5059480 4867212 4743171 4649189 4618691 4561676 4574547 4580666 4601120 4696299 4820644 5016904
4986 5016904 5262868 5550966 5947868 6348462 6793593 7237180 7712551 8114242 8467405 8696211
4976 8696211 8714979 8550242 8215024 7760828 7239548 6759469 6254780 5840850 5483727 5168749
4966 5168749 4944222 4789214 4673209 4597118 4548196 4504847 4505280 4487088 4484907 4518999 4574834
4955 4574834 4695738 4862458 5075538 5336960 5641515 5929315 6153000 6332065 6367454 6273094
4945 6273094 6102101 5810364 5479654 5143348 4839162 4556969 4304140 4111821 3918223 3818636
4935 3818636 3759110 3688716 3637535 3533853 3465937 3428085 3477855 3566991 3584010 3583480 3513933 3462066
4923 3462066 3366489 3332745 3277142 3274433 3252346 3255610 3231494 3176776 3107819 3010846 2916854 2822494
4911 2822494 2711438 2573199 2441358 2323934 2251563 2169805 2121730 2045380 1981973 1935326 1927081
4900 1927081 1925485 1905419 1857862 1871244 1854240 1885802 1905929 1902377 1874248 1865111 1845376 1854161
4888 1854161 1818576 1789355 1742180 1731218 1748137 1738085 1746204 1705470 1730852 1734374 1756421 1747394
4876 1747394 1761016 1767572 1778797 1797861 1841285 1895510 1931487 1925280 1921976 2004728 1997440 1998397 1991345
4863 1991345 1991127 2047282 2077620 2101259 2102840 2136328 2169561 2216810 2263153 2320859 2360698 2419729
4851 2419729 2495206 2562541 2622697 2694541 2801386 2878385 2977260 3060467 3202714 3341413 3502040
4840 3502040 3704614 3889209 4080360 4286790 4497544 4793421 5141032 5500872 5729556 5904386
4830 5904386 6032254 6124648 6189739 6282481 6391854 6554404 6785021 7003827 7309447 7556181
4820 7556181 7794284 8030152 8220475 8368025 8526333 8664600 8810213 8948210 9122966 9318105
4810 9318105 9512510 9737213 9925290 10149571 10330912 10530232 10709333 10974455 11249516 11636442
4800 11636442 12031339 12505218 13002326 13491528 13926083 14292708 14540566 14584513 14529973 14391234
4790 14391234 14215261 14089152 13926793 13849002 13751848 13739837 13777772 13899770 13933748 14060724
4780 14060724 14217090 14427802 14713458 15080456 15573361 16139031 16800026 17480917 18083511
4771 18083511 18543769 18834134 18940451 18873485 18710646 18444179 18182318 17900601 17638353 17450310
4761 17450310 17285543 17163318 17023606 16868009 16746255 16607130 16482952 16451011 16450409 16538665
4751 16538665 16689246 16901519 17091260 17256740 17287375 17291622 17205013 17048404 16826826 16516244
4741 16516244 16190704 15801299 15437275 15074597 14730153 14384027 14050068 13729535 13400288
4732 13400288 13003419 12580093 12156784 11752270 11371707 11049229 10799188 10554934 10450736
4723 10450736 10333966 10280008 10179581 10081997 9929270 9784191 9642774 9404017 9220345 8981797
4713 8981797 8765961 8593225 8406749 8271284 8102311 7949268 7786058 7618861 7420310 7243436
4703 7243436 7069800 6921867 6788912 6647300 6566038 6434599 6286653 6208534 6065589 5946237
4693 5946237 5851747 5698974 5597676 5493619 5373655 5226540 5127124 5014530 4909557 4823051
4683 4823051 4724866 4614805 4493598 4408006 4341600 4247273 4150596 4072626 3981627 3905823 3792552
4672 3792552 3701808 3609051 3504386 3420137 3377036 3302682 3213779 3144756 3037085 2965812 2913111
4661 2913111 2845453 2799168 2753368 2693735 2670139 2637267 2588509 2558333 2516456 2481844 2439932
4650 2439932 2418108 2353735 2344941 2318368 2253986 2228344 2193462 2148369 2094906 2095843 2020788 2011378
4638 2011378 1977496 1979052 1932330 1929914 1915034 1907260 1882507 1864765 1847153 1827887 1807652 1789600
4626 1789600 1788427 1767086 1765912 1751434 1731491 1703390 1719930 1730084 1683145 1693024 1678184 1653411
4614 1653411 1661908 1646572 1621829 1646527 1638790 1619348 1585965 1646730 1610208 1603951 1628894 1592613
4602 1592613 1617651 1616381 1605349 1622525 1652729 1638179 1680404 1709940 1746964 1773614 1773459 1780575
4590 1780575 1790789 1806624 1785874 1768281 1752576 1731453 1699148 1663035 1633521 1623487 1598762
4579 1598762 1542671 1540210 1507795 1500786 1478938 1474723 1462882 1445844 1467509 1451941 1470174 1436448
4567 1436448 1444616 1427825 1413223 1393851 1392010 1357822 1364886 1334714 1354117 1340727 1349670 1325442
4555 1325442 1309088 1302399 1276574 1298473 1287940 1255503 1288499 1282717 1251551 1266584 1268332 1230691
4543 1230691 1211553 1246993 1204832 1241741 1194512 1220063 1211354 1188869 1182906 1164716 1162136 1137106
4531 1137106 1138708 1140093 1153791 1143148 1114587 1108280 1125199 1130032 1159798 1146178 1150643 1183602
4519 1183602 1176921 1172503 1163258 1149693 1155915 1128289 1136767 1132520 1132948 1104454 1097214 1074804 1080277
4506 1080277 1084168 1066058 1049322 1068969 1063725 1077666 1089712 1080878 1088146 1106272 1109458 1115744 1136693
4493 1136693 1142532 1141098 1134213 1169348 1176139 1181647 1174625 1141239 1157547 1163366 1131572 1154157 1138957
4480 1138957 1118931 1117834 1133702 1128825 1120119 1138327 1107581 1136805 1170840 1189724 1215410 1235339
4468 1235339 1239422 1231132 1266572 1281879 1321737 1331027 1321510 1340317 1364626 1384952 1402595 1379427
4456 1379427 1383534 1396891 1385301 1363430 1364879 1382171 1369213 1357352 1349864 1357535 1329153 1343831
4444 1343831 1352944 1375866 1394676 1431528 1456588 1461219 1481465 1512558 1516798 1550348 1572344 1574766
4432 1574766 1640128 1692167 1749160 1746313 1810380 1837986 1866524 1890951 1905270 1920805 1931414 1958292
4420 1958292 1957601 1991436 1999527 1978906 2019653 1977604 1976562 1971997 1965549 1980953 1955388 1996458 2019264
4407 2019264 2048522 2093218 2122340 2175469 2213349 2305631 2390382 2416367 2448598 2482933 2499077
4396 2499077 2522283 2568626 2578456 2601433 2667793 2754640 2909819 3054437 3322134 3652063 3924503
4385 3924503 4112461 4175055 4164686 4065903 3941730 3879322 3797775 3797709 3751146 3764377 3812995 3846273
4373 3846273 3932471 4001789 4065695 4138847 4243871 4317450 4408416 4561033 4658601 4864107 5060346
4362 5060346 5308309 5709345 6289888 6974027 7581599 7989764 8228053 8323031 8358354 8372050
4352 8372050 8488398 8704888 9039975 9497531 10122239 10885736 11814324 12834079 13809026
4343 13809026 14556846 14937188 14844557 14398824 13651744 12633304 11572265 10533545 9557895
4334 9557895 8728248 8071836 7612001 7348397 7211139 7062643 6944125 6887045 6718234 6604096
4324 6604096 6579360 6739261 6903660 6948918 6809011 6565954 6244627 5826741 5385906 4981798
4314 4981798 4643682 4327659 4067595 3908453 3716727 3567939 3453204 3361301 3295386 3229406
4304 3229406 3228939 3201206 3195891 3126595 3072683 3001010 2927456 2864341 2868521 2905361 3066884 3210004
4292 3210004 3289424 3247891 3218065 3128455 2965755 2841927 2714988 2636320 2522260 2442441 2388822
4281 2388822 2323665 2284396 2252629 2210991 2208056 2191205 2214820 2177047 2161186 2151014 2152053 2206166
4269 2206166 2260187 2380185 2659680 3050762 3399803 3539025 3538297 3394964 3121744 2917175
4259 2917175 2676955 2468566 2352698 2199868 2121281 2091040 2115199 2196207 2301362 2403868
4249 2403868 2555098 2618784 2659504 2574192 2507735 2406312 2344781 2295676 2239799 2250860 2365292
4238 2365292 2559584 2749343 2804328 2800076 2749480 2634040 2520800 2407146 2356048 2290036 2225367
4227 2225367 2175770 2141794 2205083 2278531 2482128 2748353 2984385 3111159 3151404 3026993
4217 3026993 2835017 2646961 2462381 2260915 2147059 2039481 2033642 2093997 2189852 2202102
4207 2202102 2177991 2098336 1997326 1899418 1757116 1718030 1589308 1548881 1551730 1496019 1494716
4196 1494716 1573728 1639877 1741172 1848785 1916063 1915359 1889381 1821980 1683728 1602663 1517937
4185 1517937 1466922 1442046 1474227 1529705 1559529 1567767 1551953 1510162 1432967 1368291 1311293 1236463
4173 1236463 1185422 1174462 1134426 1102607 1031334 1043838 1028789 1003525 973337 978035 964032 949388
4161 949388 931955 929352 924957 918869 910964 889269 889659 869278 897455 841308 818020 848421 856891
4148 856891 806018 823058 785956 801099 808379 814565 833998 839879 835347 842121 862645 881390 859056
4135 859056 880214 891466 936452 976988 1011170 1039159 1059362 1104292 1124865 1087556 1057904 1012859
4123 1012859 979416 975278 943652 886315 885358 854201 873586 871055 895438 909228 880273 905742
4111 905742 924578 948920 969582 976037 1014357 1043007 1079231 1164868 1221031 1302897 1406281 1460171
4099 1460171 1458881 1480424 1459935 1403086 1419927 1352694 1269832 1225715 1224000 1230828 1166585 1211333
4087 1211333 1160474 1191220 1242632 1253100 1279097 1289302 1339947 1331174 1379660 1461263 1450142 1502586
4075 1502586 1565920 1616899 1691410 1752009 1781271 1835267 1905317 1955160 2022685 2052345 2058321 2077705
4063 2077705 2075754 2066794 2039713 2034246 2007278 2041087 2071643 2097698 2117364 2131478 2113868 2148513
4051 2148513 2182562 2204237 2220643 2244847 2268117 2305627 2344227 2425253 2542770 2637607 2825946
4040 2825946 3055831 3172761 3298446 3263953 3253437 3182741 3039959 2905677 2728884 2641985
4030 2641985 2508306 2429661 2404502 2404951 2344808 2338017 2349622 2356827 2373864 2385221 2408389 2398359
4018 2398359 2419504 2417656 2396890 2417706 2460115 2482443 2462798 2445219 2428172 2380456 2325211 2212132
4006 2212132 2145996 2053394 1974049 1919640 1836572 1846357 1795069 1751356 1710919 1692493 1647005 1597740
3994 1597740 1591808 1532671 1474533 1446879 1371347 1331230 1263020 1207304 1194219 1132715 1099393 1049806
3982 1049806 1009019 1022195 1008547 960674 920083 918388 918849 888341 874089 856600 822902 797764
3970 797764 780443 775527 749831 745841 713138 675303 686300 686921 643978 634856 617907 596992 628266
3957 628266 607258 601658 571177 568433 540337 568210 538645 532907 506946 509744 509740 521728 501739
3944 501739 505210 513912 478092 513696 531895 498736 495564 482947 456783 474060 439516 438965 388353
3931 388353 373786 390915 377119 358835 361762 382104 348478 347843 331181 327083 341217 340030 333936
3918 333936 324207 319148 324815 329166 331868 358117 329730 341742 333984 341302 326315 337745 282092
3905 282092 280968 269751 264438 242032 255656 251076 247179 229204 263456 224472 211321 232651
3893 232651 224367 197941 169503 216951 214301 198347 222510 175999 185162 200198 216875 217187 209639
3880 209639 218319 190112 207391 185395 195884 152083 141824 162310 177009 142992 124431 136411
3868 136411 145556 128199 155527 142111 107997 117176 106622 140677 123134 109647 94495 104055
3856 104055 108664 121124 101776 103143 119496 113722 105607 125131 89370 91241 102285 103175 98441
3843 98441 81231 89425 86898 86507 118862 93368 72785 75389 94976 76292 76956 106595 77714
3830 77714 99092 70735 86984 65481 62978 69902 75230 73599 81812 50568 55981 68950 87949
3817 87949 71628 70093 42210 64595 82010 95534 60129 72731 64437 57984 68339 43888
3805 43888 46679 44130 46772 79847 36848 32259 53821 81774 81746 77695 41131 57868 32895
3792 32895 66116 51041 55911 44255 35923 60319 62490 57870 55365 52043 11131 23445 52386
3779 52386 48111 49202 46768 51276 66402 45328 23750 40893 29122 36257 39061 35504 19441
3766 19441 40532 49878 12984 57623 49994 48514 47382 31692 56456 41268 39236 17648 5937
3753 5937 28716 55919 35409 29985 35011 32637 30972 4768 28603 21913 23279 16518 21415 25335
3739 25335 24282 32359 23758 14347 2060 22075 26225 6735 15910 13300 8613 16330 9552 50
3725 50 10848 14794 8397 9345 26288 -10086 -8937 -587 8991 -300 15115 3939 9500 2479
3711 2479 8460 13544 11521 -6125 -21578 15062 19717 27825 267 -3252 3533 11869 1841 5926
3697 5926 18770 -16963 6605 9538 6570 4348 5535 -4659 -8840 38038 6725 -21207 -11800
3684 -11800 -2925 -5348 21490 7002 2077 -12451 -7948 10890 17788 6991 -34123 9487 6031
3671 6031 -5474 9944 -267 -6159 -13922 -8095 6087 -3384 6948 -45840 -16116 11885 -4957
3658 -4957 -1413 -1520 -26566 -40234 435 1227 -14115 11368 -932 -11439 7210 9870 389
3645 389 2249 -12090 -9088 91 32796 -18801 -21055 -10898 -47541 373 -316 -36319 -23679
3632 -23679 -27457 2561 8678 -23919 -41561 4618 -941 -8074 -9263 -25162 -21814 -33302 11229
3619 11229 -10006 -18807 -37519 -32911 -9636 -12699 2085 -15911 -14142 -11689 -24873 3483 -34831
3606 -34831 -16800 -16179 -11260 -7794 -41643 -53808 -15353 -15742 1603 -12171 -41214 -37144 -48948
3593 -48948 -27 -10215 -23372 -27881 -22921 -27328 -12614 4423 -55674 -28408 -16004 -26782
3581 -26782 -22442 -23997 -26054 -29303 -30695 22561 -33162 -26124 -11734 -60834 -20285 -17717 -37119
3568 -37119 -42201 -46919 -37979 -8328 1708 -36954 -50504 -26999 -28084 6897 -34368 -15488 -51731
3555 -51731 -58245 -31157 -22642 -23278 -66556 -32650 -16031 -45785 -36182 -32262 -54293 -47616 -17781
3542 -17781 -45854 -77127 -59262 -45240 -63476 -29241 -26656 -32663 -23012 -50987 -31107 -11483
3530 -11483 -21013 -42178 -35362 -33532 -36471 -9608 -42993 -42809 -27617 -27026 -26124 -19036 -52487 -3766
3516 -3766 -33297 -22517 -18659 -23122 3073 -4243 -36621 -13314 -33289 -26977 -23258 -26015 -26997 -23535
3502 -23535 -60996 -25061 -18827 13232 -56838 -47441 -31176 -14583 70 284 -62008 -33577 -30164
3489 -30164 -26402 -31034 -46737 -43105 -26415 -16309 -33362 -43601 -54779 -35860 -33755 -32074 -42923
3476 -42923 -43387 -57838 -43767 -45010 -27743 -12733 -52174 -45714 -45796 -36043 -11844 -44352 -40548 1106
3462 1106 -9029 -63320 -27373 -25223 -23711 -30699 -26778 -38871 -44318 -22567 -21664 -29292 -59516 -28833
3448 -28833 -49076 -23681 -41797 -42714 -37942 -52899 -8599 -45537 -15873 -34641 -34071 -50674 -22678
3435 -22678 -37000 -42189 -33483 -28812 -23945 -26350 -47580 -36689 -51795 528 -42505 -28805 -32444
3422 -32444 -34153 -36377 -50136 -26645 -32755 -24896 -36432 -43169 4532 9359 -3765 -39758 189
3409 189 -11427 25347 -5807 15310 -15664 -1764 -20449 -3328 -12660 -49181 -6066 -19624
3397 -19624 -32758 -31687 -77302 -40405 -45731 -19346 -18150 -31488 -21577 -45971 -20869 -6833 -6128
3384 -6128 -45645 -60004 -43525 -28494 -22089 -49725 -82335 -56227 -34430 -23508 -27057 -66857
3372 -66857 -48340 -39277 -16268 -33146 -27980 -58633 -51542 -20021 -32629 -31290 -53667 -53489 -40038
3359 -40038 -38059 -46721 -63295 -53787 -61452 -36784 -55699 -31969 -63978 -50962 -38212 -45348 -43552
3346 -43552 -26989 -49356 -40987 -52214 -49974 -55194 -78397 -50729 -62336 -75103 -55719 -36848
3334 -36848 -68581 -61028 -52470 -37700 -42479 -40751 -25747 -29417 -42041 -43562 -24831 -34270 -11918
3321 -11918 -38867 -37317 -38550 -49906 -35895 -51784 -67517 -35031 -31049 -29660 -41329 -61948 -47669
3308 -47669 -46447 -38572 -32459 -46242 -19379 -19767 -47249 -52912 -30694 -53565 -48917 -55461 -58517 -50412
3294 -50412 -55126 -49320 -57906 -39927 -41053 -49796 -37176 -52068 -51788 -61086 -34814 -43910 -55071 -46267
3280 -46267 -45491 -62528 -40426 -58719 -46615 -46950 -58570 -36740 -52609 -58380 -53857 -60125 -54669
3267 -54669 -80174 -50197 -60835 -51402 -41061 -41851 -51852 -54343 -47715 -53470 -54744 -53115 -61415 -58814
3253 -58814 -50366 -34465 -61599 -74072 -26390 -42599 -38336 -56382 -42523 -43991 -78074 -22747
3241 -22747 -53367 -43044 -56803 -36085 -24150 -26575 -47277 -45870 -47198 -29049 -56951 -20362
3229 -20362 -38354 -54187 -46280 -45803 -60974 -40696 -50056 -41391 -40695 -54044 -53157 -22307 -55924 -63410
3215 -63410 -54524 -45072 -39073 -69829 -53551 -65239 -45807 -41653 -48555 -75251 -69242 -52365 -67415
3202 -67415 -52823 -45459 -73891 -79088 -75547 -42218 -22927 -51793 -57683 -68421 -85973 -54061 -26067
3189 -26067 -70679 -70915 -72082 -74641 -55734 -37547 -42434 -75675 -39389 -41595 -53688 -63531 -59211
3176 -59211 -75363 -50124 -59702 -21129 -48007 -59368 -67190 -21463 -57190 -52952 -66785 -53230
3164 -53230 -45499 -51916 -39640 -83272 -68827 -53013 -61469 -49324 -55654 -83568 -60894 -52404 -68460
3151 -68460 -43199 -50910 -68428 -58394 -71377 -42531 -50928 -62484 -63811 -53072 -75999 -60485
3139 -60485 -52717 -65849 -80159 -67793 -73590 -66421 -43474 -61913 -86106 -76493 -62553 -34755 -48756
3126 -48756 -59515 -69507 -58644 -48627 -76656 -58441 -73228 -79212 -46419 -37184 -56502 -60419 -65059
3113 -65059 -47937 -66687 -48353 -49506 -76733 -54177 -67115 -49152 -62869 -62320 -84370 -80505 -42997
3100 -42997 -68999 -61019 -62713 -60326 -69271 -59496 -37579 -63683 -47567 -52643 -49560 -53172 -72473
3087 -72473 -63522 -52720 -49079 -57504 -50241 -53062 -69690 -50196 -35000 -88682 -54868 -68702 -33650
3074 -33650 -63336 -76674 -71481 -78110 -59168 -71977 -50331 -56907 -82463 -58777 -81307 -28776
3062 -28776 -44632 -57629 -72279 -65484 -47899 -50409 -70277 -80260 -61013 -44547 -51853 -42817 -57849
3049 -57849 -56041 -53358 -28318 -38987 -60744 -55286 -51406 -63899 -48812 -80463 -56194 -63508 -66311
3036 -66311 -65994 -71356 -54361 -46381 -61873 -67481 -71752 -41496 -54831 -74144 -77045 -55576 -47664
3023 -47664 -64152 -20425 -82865 -43563 -63768 -48458 -62566 -79847 -72539 -75505 -69833 -56562
3011 -56562 -67906 -73941 -85718 -40841 -81990 -80479 -68868 -68070 -61155 -63146 -53979 -37162 -78124
2998 -78124 -72778 -49570 -60771 -60515 -85121 -55852 -68143 -81443 -62783 -64703 -57296 -62708 -76911
2985 -76911 -72627 -66091 -82238 -41167 -76967 -59813 -94614 -79078 -75731 -59021 -57850 -71610 -60979
2972 -60979 -80549 -58756 -74304 -58533 -58010 -55580 -79708 -52857 -59885 -63153 -55406 -59491 -63053
2959 -63053 -69614 -66087 -91805 -95488 -90648 -66910 -45153 -76257 -66130 -111261 -67516 -83706 -82834
2946 -82834 -48358 -70119 -77633 -63058 -56998 -55140 -67124 -44890 -65375 -65398 -62789 -68171 -53656
2933 -53656 -66791 -99333 -93075 -55422 -97278 -65276 -77265 -73936 -58041 -38828 -59372 -72145
2921 -72145 -81406 -61741 -61547 -57197 -74373 -71353 -55085 -75593 -34884 -64590 -67279 -68866 -80187
2908 -80187 -54103 -55868 -37211 -74785 -79732 -47784 -67214 -44365 -71820 -73828 -69307 -77502 -46434
2895 -46434 -82602 -59777 -63780 -89488 -51226 -61541 -64498 -64786 -87796 -63928 -78621 -69347 -85602
2882 -85602 -62698 -80342 -65419 -60090 -88318 -71502 -56266 -41316 -55367 -36357 -85053 -86847
2870 -86847 -56154 -49845 -65104 -74395 -49363 -82209 -58824 -60846 -77517 -75613 -85114 -67034 -59692
2857 -59692 -70097 -85323 -61857 -78183 -83627 -51467 -67042 -49738 -67374 -51735 -71653 -49660
2845 -49660 -76536 -71898 -73723 -51275 -62569 -76504 -64747 -82049 -55368 -88184 -83622 -38033
2833 -38033 -59796 -88490 -61193 -54630 -73247 -67920 -91001 -73131 -72965 -51014 -81467 -70212 -59343
2820 -59343 -82526 -67590 -66411 -54956 -73543 -50076 -81805 -73551 -77673 -58601 -95147 -44039
2808 -44039 -75867 -81445 -71286 -88679 -81208 -81229 -57282 -66314 -89961 -73010 -103475 -65905 -79470
2795 -79470 -73848 -63653 -76116 -77162 -75938 -60558 -75330 -73926 -71899 -84093 -60917 -82682 -88013
2782 -88013 -91326 -69321 -78595 -84840 -75273 -62228 -44885 -63262 -92497 -71229 -72518 -78116 -73783
2769 -73783 -77796 -112056 -83195 -70789 -74246 -69847 -70545 -91460 -75674 -37590 -70312 -95975 -102881
2756 -102881 -77899 -82113 -55812 -75195 -97675 -87608 -62468 -73661 -70283 -82161 -93185 -94405
2744 -94405 -85769 -57654 -55320 -64072 -92655 -78596 -74383 -77661 -78474 -77348 -85345 -101442 -72864 -88872
2730 -88872 -89582 -83142 -82858 -78832 -57127 -74044 -52963 -70462 -55476 -60445 -64526 -81809 -85434 -77561
2716 -77561 -71042 -95760 -88697 -79837 -91681 -68388 -75865 -81234 -72279 -61301 -87225 -65101 -69849
2703 -69849 -67560 -76051 -65179 -88558 -87531 -54174 -85770 -75355 -74384 -81703 -73414 -87205 -63426
2690 -63426 -46363 -78685 -83734 -90023 -101985 -84659 -75138 -98619 -82403 -78910 -63592 -55561 -74402
2677 -74402 -79293 -74654 -93643 -54953 -82036 -78986 -63572 -56356 -64207 -72513 -80350 -72128 -71655 -54028
2663 -54028 -89898 -83812 -64588 -76060 -76169 -46282 -49986 -70863 -63950 -82436 -67138 -66281 -85418
2650 -85418 -73160 -105162 -62545 -73757 -68176 -73792 -99629 -80724 -75981 -77401 -75560 -82316 -113523
2637 -113523 -80348 -67137 -69264 -80516 -71826 -89569 -78438 -81879 -71151 -82145 -94052 -96441
2625 -96441 -82452 -92828 -70159 -105021 -86279 -94958 -86802 -53565 -88210 -111293 -79425 -65823
2613 -65823 -110833 -91751 -81562 -88158 -51106 -69824 -88907 -92180 -73697 -85891 -74559 -91084
2601 -91084 -89722 -115933 -64329 -91070 -78009 -87214 -96593 -92464 -56083 -46805 -67234 -79921 -69583
2588 -69583 -62981 -64111 -67079 -61191 -69010 -93192 -80841 -87977 -68882 -82697 -79838 -83557 -75052 -79163
2574 -79163 -75118 -85870 -98655 -111052 -69677 -86736 -63845 -94810 -89651 -75792 -61610 -101862
2562 -101862 -101453 -86631 -78973 -76583 -65971 -72022 -96902 -61560 -97876 -67466 -58618 -69670 -108517
2549 -108517 -66785 -83650 -80912 -58514 -72770 -73447 -85762 -63539 -77556 -82103 -62698 -80849
2537 -80849 -86043 -76383 -64815 -44205 -77498 -95542 -79003 -78659 -78286 -65425 -72211 -96847 -79378
2524 -79378 -77747 -68510 -73768 -109909 -103211 -75364 -66554 -80719 -101957 -82887 -100824 -59165 -99667
2511 -99667 -103591 -89327 -114289 -67231 -55804 -67592 -94172 -83587 -87993 -74335 -69247 -75757 -111290
2498 -111290 -77448 -87516 -75274 -79256 -41358 -85399 -107057 -74495 -55576 -90566 -96202 -74838
2486 -74838 -103528 -58178 -51862 -81738 -100963 -88450 -73542 -62811 -79775 -70988 -93434 -93190 -78492
2473 -78492 -94093 -83392 -91073 -77192 -70279 -55908 -81472 -82006 -83437 -71605 -66037 -79695 -78486
2460 -78486 -73918 -87828 -76769 -78305 -73642 -64383 -101254 -90291 -83094 -95673 -71776 -100441 -80006
2447 -80006 -104114 -66980 -84614 -90274 -100144 -66465 -62801 -78266 -70877 -110989 -94529 -98359 -72697
2434 -72697 -78815 -68569 -87796 -104900 -87558 -103707 -103675 -91270 -96806 -108330 -109842 -63663 -75520
2421 -75520 -82207 -91222 -94317 -101049 -72880 -109505 -108812 -83800 -96934 -85755 -90636 -108436 -96104
2408 -96104 -81868 -109348 -91499 -57913 -73913 -79006 -119335 -111067 -98654 -66915 -82915 -106107
2396 -106107 -84902 -79001 -95465 -56621 -66954 -110010 -96404 -81579 -78905 -74632 -98435 -117439
2384 -117439 -97392 -57743 -65370 -80335 -84998 -86153 -83934 -72692 -91732 -91352 -111691 -106551 -72983
2371 -72983 -88853 -93366 -99498 -83449 -84304 -78433 -88023 -113523 -102241 -77632 -72026 -61540 -87105
2358 -87105 -93536 -111880 -76369 -83916 -84528 -90004 -110473 -102211 -81514 -80672 -82776 -85778 -110133 -103822
2344 -103822 -57336 -79246 -93246 -94761 -94122 -97040 -57180 -79533 -105553 -87852 -102403 -92661 -61636
2331 -61636 -66382 -93774 -82547 -93145 -62603 -70121 -86846 -119019 -86399 -86953 -77046 -108599 -107696
2318 -107696 -81930 -81026 -74972 -93614 -84987 -88765 -73537 -77997 -86271 -94077 -61014 -79083 -94780
2305 -94780 -90466 -68580 -96438 -81768 -83994 -76941 -78067 -85139 -54576 -104097 -75367 -92656 -108491
2292 -108491 -109415 -93224 -86984 -106179 -93589 -81443 -81571 -61003 -97165 -82767 -98015 -75075 -84205
2279 -84205 -87418 -115859 -84597 -97324 -88861 -69091 -99868 -102544 -78663 -72380 -71595 -83488 -86873
2266 -86873 -91192 -96844 -70610 -73574 -85937 -85698 -79460 -70432 -77116 -71356 -89470 -83132 -70288 -109289
2252 -109289 -109175 -120360 -106913 -88577 -68816 -82822 -99575 -91057 -107544 -88896 -79889 -101905
2240 -101905 -100110 -66893 -119895 -74837 -105595 -79383 -117107 -104885 -80508 -86410 -96418 -114497
2228 -114497 -93408 -93943 -105582 -88887 -96161 -109081 -106262 -97141 -83468 -103640 -108796 -78995 -98532
2215 -98532 -104283 -88758 -113062 -86582 -77392 -89220 -96406 -79054 -72571 -78218 -79653 -77643 -73637
2202 -73637 -52203 -102286 -65121 -66671 -96332 -73717 -77305 -76352 -101286 -76828 -87759 -86910 -80533
2189 -80533 -100558 -98932 -77835 -75046 -113937 -91401 -75975 -96466 -80310 -92491 -102966 -98852
2177 -98852 -80517 -82417 -84384 -103868 -119017 -115273 -85391 -76194 -81819 -102367 -96217 -91801 -78825
2164 -78825 -98298 -102192 -98491 -100890 -97377 -72883 -95658 -105419 -98745 -112082 -75241 -77273 -101404
2151 -101404 -117333 -73818 -81843 -90134 -84825 -102563 -85468 -93988 -72413 -82921 -70215 -91199
2139 -91199 -122080 -80925 -76133 -129094 -120210 -104242 -96434 -107654 -110151 -121370 -103198 -94358 -104569
2126 -104569 -86839 -100351 -107889 -103952 -95016 -100218 -73865 -96869 -81316 -88963 -79558 -75325 -85456
2113 -85456 -78685 -83738 -77251 -68796 -98097 -96552 -87809 -96697 -81719 -103713 -87128 -93367 -78667
2100 -78667 -98003 -87894 -100024 -68246 -79263 -86151 -81896 -63096 -71580 -53608 -89698 -73088
2088 -73088 -88823 -104214 -76448 -98673 -103085 -78494 -99020 -91343 -90630 -63739 -106757 -101883 -97879
2075 -97879 -85477 -77791 -81444 -96238 -83965 -79704 -77970 -60888 -92768 -88434 -76306 -68776 -61305
2062 -61305 -59475 -95163 -106260 -82208 -82027 -88901 -83994 -108833 -77336 -89080 -85554 -109719 -96439
2049 -96439 -92177 -79104 -87137 -109675 -87684 -108734 -78087 -63355 -79133 -117034 -103468 -89996
2037 -89996 -73811 -113713 -84539 -120575 -108185 -80660 -81539 -97856 -95916 -117479 -99864 -79551
$$ [...]
##END NTUPLES=NMR SPECTRUM
##END=
