##TITLE=abcd
##JCAMPDX= 6.0         $$ Bruker NMR JCAMP-DX V2.0
##DATA TYPE= NMR SPECTRUM
##DATA CLASS= NTUPLES
##ORIGIN= UXNMR, Bruker Analytische Messtechnik GmbH
##OWNER= root
$$ XWIN-NMR		Version 3.5
$$ Sat Aug  1 13:42:16 2026 Russian Standard Time (UT+4h)  servis@DPX200
##.OBSERVE FREQUENCY= 200.131235884673
##.OBSERVE NUCLEUS= ^1H
##.ACQUISITION MODE= SIMULTANEOUS
##.ACQUISITION SCHEME= undefined
##.AVERAGES= 16
##.DIGITISER RES= 18
##SPECTROMETER/DATA SYSTEM= spect
##.PULSE SEQUENCE= zg
##.SOLVENT NAME= MeOD
##.SHIFT REFERENCE= (INTERNAL, MeOD, 0, 16.4885)
##AUDIT TRAIL= $$ (NUMBER, WHEN, WHO, WHERE, WHAT)
$$ ##TITLE= Audit trail, XWIN-NMR		Version 3.5
$$ ##JCAMPDX= 5.01
$$ ##ORIGIN= Bruker BioSpin GmbH
$$ ##OWNER= servis
$$ F:\spectra/data/av/nmr/H1/1/pdata/1/auditp.txt
$$ ##AUDIT TRAIL=  $$ (NUMBER, WHEN, WHO, WHERE, WHAT)
(   1,<2026-08-01 13:41:50.01 +0400>,<servis>,<DPX200>,
      <created by zg, POWCHK disabled, PULCHK disabled
       terminated by command 'halt'
       configuration hash MD5:
       00 E9 B6 7A A2 85 ED C7 34 08 36 98 17 FE 4E 26
       data hash MD5: 32K
       85 5E 43 13 CE D7 8B 35 FD BC 76 C2 D3 18 AF A3>)
(   2,<2026-08-01 13:41:51.87 +0400>,<servis>,<DPX200>,
      <Start of raw data processing
       efp BC_mod = 2 LB = 0.05 FT_mod = 6 PKNL = 1 PHC0 = -416.9518 PHC1 = 3.101563 SI = 16K 
       data hash MD5: 16K
       61 15 52 56 64 B8 F8 55 A7 B1 FC 74 47 FC FD 66>)
$$ ##END=
$$ 
$$ hash MD5
$$ 33 31 3B 59 78 38 06 46 00 19 46 27 F0 D2 41 C3
##$RELAX= 
##$RELAX= 
##$RELAX= 
##$RELAX= 
##$RELAX= 
##$RELAX= 
##$RELAX= 
##$RELAX= 
$$ Bruker specific parameters
$$ --------------------------
##$DU= <F:\spectra>
##$EXPNO= 1
##$NAME= <H1>
##$PROCNO= 1
##$TYPE= <nmr>
##$USER= <av>
##$AMP= (0..31)
100 100 100 100 100 100 100 100 100 100 100 100 100 100 100 100 100 100 
100 100 100 100 100 100 100 100 100 100 100 100 100 100 
##$AQSEQ= 0
##$AQ_mod= 1
##$AUNM= <au_zg>
##$AUTOPOS= <>
##$BF1= 200.13
##$BF2= 200.13
##$BF3= 200.13
##$BF4= 200.13
##$BF5= 500.13
##$BF6= 500.13
##$BF7= 500.13
##$BF8= 500.13
##$BYTORDA= 1
##$CFDGTYP= 0
##$CFRGTYP= 5
##$CHEMSTR= <none>
##$CNST= (0..31)
1 1 145 1 1 1 1 1 1 1 1 1 1 1 1 1 1 1 1 1 1 1 1 1 1 1 1 1 1 1 1 1 
##$CPDPRG= <>
##$CPDPRG1= <>
##$CPDPRG2= <>
##$CPDPRG3= <>
##$CPDPRG4= <mlev>
##$CPDPRG5= <mlev>
##$CPDPRG6= <mlev>
##$CPDPRG7= <mlev>
##$CPDPRG8= <mlev>
##$CPDPRGB= <>
##$CPDPRGT= <>
##$D= (0..31)
0 2 0 0 0 0 0 0 0 0.06 0 0 0 0 0 0 0.0002 0 0 0 0 0 0 0 0 0 0 0 0 0 0 
0 
##$DATE= 1785577309
##$DBL= (0..7)
120 120 120 120 120 120 120 120 
##$DBP= (0..7)
150 150 150 150 150 150 150 150 
##$DBP07= 0
##$DBPNAM0= <>
##$DBPNAM1= <>
##$DBPNAM2= <>
##$DBPNAM3= <>
##$DBPNAM4= <>
##$DBPNAM5= <>
##$DBPNAM6= <>
##$DBPNAM7= <>
##$DBPOAL= (0..7)
0.5 0.5 0.5 0.5 0.5 0.5 0.5 0.5 
##$DBPOFFS= (0..7)
0 0 0 0 0 0 0 0 
##$DE= 6
##$DECBNUC= <off>
##$DECIM= 32
##$DECNUC= <off>
##$DECSTAT= 4
##$DIGMOD= 1
##$DIGTYP= 9
##$DL= (0..7)
0 120 120 120 120 120 120 120 
##$DP= (0..7)
$$ [...]
##$SUBNAM4= <"">
##$SUBNAM5= <"">
##$SUBNAM6= <"">
##$SUBNAM7= <"">
##$SUBNAM8= <"">
##$SUBNAM9= <"">
##$SW= 20.6817932712277
##$SWIBOX= (0..15)
0 0 3 0 0 0 0 0 0 0 0 0 0 0 0 0 
##$SW_h= 4139.07284768212
##$TD= 32768
##$TD0= 1
##$TE= 0
##$TE2= 300
##$TE3= 300
##$TEG= 300
##$TL= (0..7)
0 120 120 120 120 120 120 120 
##$TP= (0..7)
150 150 150 150 150 150 150 150 
##$TP07= 0
##$TPNAME0= <>
##$TPNAME1= <>
##$TPNAME2= <>
##$TPNAME3= <>
##$TPNAME4= <>
##$TPNAME5= <>
##$TPNAME6= <>
##$TPNAME7= <>
##$TPOAL= (0..7)
0.5 0.5 0.5 0.5 0.5 0.5 0.5 0.5 
##$TPOFFS= (0..7)
0 0 0 0 0 0 0 0 
##$TUNHIN= 0
##$TUNHOUT= 0
##$TUNXOUT= 0
##$USERA1= <user>
##$USERA2= <user>
##$USERA3= <user>
##$USERA4= <user>
##$USERA5= <user>
##$V9= 5
##$VALIST= <valist>
##$VCLIST= <CCCCCCCCCCCCCCC>
##$VD= 0
##$VDLIST= <DDDDDDDDDDDDDDD>
##$VPLIST= <PPPPPPPPPPPPPPP>
##$VTLIST= <TTTTTTTTTTTTTTT>
##$WBST= 1024
##$WBSW= 30
##$XGAIN= (0..3)
0 0 0 0 
##$XL= 0
##$YL= 0
##$YMAX_a= 162613
##$YMIN_a= -239943
##$ZGOPTNS= <>
##$ZL1= 120
##$ZL2= 120
##$ZL3= 120
##$ZL4= 120
##$ABSF1= 0
##$ABSF2= 0
##$ABSG= 0
##$ABSL= 0
##$ALPHA= 0
##$AQORDER= 0
##$ASSFAC= 0
##$ASSFACI= 0
##$ASSFACX= 0
##$ASSWID= 0
##$AUNMP= <proc_1d>
##$AZFE= 0.1
##$AZFW= 0.1
##$BCFW= 0
##$BC_mod= 2
##$BYTORDP= 0
##$COROFFS= 0
##$CY= 18.4799938201904
##$DATMOD= 1
##$DC= 0
##$DFILT= <>
##$DTYPP= 0
##$F1P= 9.9274215381318
##$F2P= -0.165520771350173
##$FCOR= 1
##$FTSIZE= 16384
##$FT_mod= 6
##$GAMMA= 0
##$GB= 0
##$INTBC= 1
##$INTSCL= 4.127829e-11
##$ISEN= 128
##$LB= 0.05
##$LEV0= 0
##$LPBIN= 0
##$MAXI= 10000
##$MC2= 0
##$MEAN= 0
##$ME_mod= 0
##$MI= 50
##$NCOEF= 0
##$NC_proc= -5
##$NLEV= 6
##$NOISF1= 3.799351
##$NOISF2= 2.8
##$NSP= 0
##$NTH_PI= 0
##$NZP= 0
##$OFFSET= 16.48848
##$PC= 4
##$PHC0= -416.9518
##$PHC1= 3.101563
##$PH_mod= 1
##$PKNL= yes
##$PPARMOD= 0
##$PSCAL= 4
##$PSIGN= 0
##$REVERSE= no
##$SF= 200.130005582386
##$SI= 16384
##$SIGF1= 3
##$SIGF2= 2
##$SINO= 400
##$SIOLD= 16384
##$SREGLST= <1H.CDCl3>
##$SSB= 0
##$STSI= 16384
##$STSR= 0
##$SW_p= 4139.07284768211
##$SYMM= 0
##$S_DEV= 0
##$TDeff= 32768
##$TDoff= 0
##$TI= <>
##$TILT= no
##$TM1= 0
##$TM2= 0
##$TOPLEV= 0
##$USERP1= <user>
##$USERP2= <user>
##$USERP3= <user>
##$USERP4= <user>
##$USERP5= <user>
##$WDW= 1
##$XDIM= 16384
##$YMAX_p= 314639373
##$YMIN_p= -429534
$$ End of Bruker specific parameters
$$ ---------------------------------
##NTUPLES= NMR SPECTRUM
##VAR_NAME=  FREQUENCY,     SPECTRUM/REAL,   SPECTRUM/IMAG
##SYMBOL=    X,             R,               I
##VAR_TYPE=  INDEPENDENT,   DEPENDENT,       DEPENDENT
##VAR_FORM=  AFFN,          ASDF,            ASDF
##VAR_DIM=   16384,         16384,           16384
##UNITS=     HZ,            ARBITRARY UNITS, ARBITRARY UNITS
##FACTOR=    0.252644378177508, 1,           1
##FIRST=     3299.83951724647, 0,            0
##LAST=      -839.233330435636, 0,           0
##MIN=       -839.233330435636, -429534,     0
##MAX=       3299.83951724647, 314639373,    0
$$ Real data points
##PAGE= N=1
##DATA TABLE= (X++(R..R)), XYDATA
$$ [...]
10787a17266P0969o3598J194m2455l84O4429p9665M8506k593p0331J04759M8096
$$ -117266 -46297 -109895 -108701 -151156 -151540 -87111 -166776 -118270 -120863 -191194 -86435 -38339
10775c8339m6824o2278N1215K3955j7701l3136M8468j23894O8806r731j921N4193
$$ -38339 -85163 -147441 -96226 -72271 -89972 -123108 -74640 -198534 -129728 -139459 -141380 -87187
10763h7187K3475M0485l3306K4675j6618M1303p287J3131j9381K6558j7987O0659
$$ -87187 -63712 -23227 -56533 -31858 -48476 -7173 -14460 -1329 -20710 5848 -12139 48520
10751D8520q3050Q7835k5563k934n11m4113j8974K0811l2430p8644R3043j246
$$ 48520 -34530 53305 27742 24808 24297 -19816 -38790 -17979 -50409 -129053 -36010 -37256
10739c7256j8411l8228M9145J6871M3286m4435R020l852j4825M9367p1294J4679
$$ -37256 -55667 -93895 -44750 -27879 15407 -29028 -20008 -23860 -38685 10682 -60612 -45933
10727d5933M1146l7278P750l0981J6951l7957N7318n6624Q4348n6503J4604L9183
$$ -45933 -4787 -42065 -34315 -65296 -48345 -86302 -28984 -85608 -1260 -57763 -43159 -3976
10715c976m3431k4837O2918K2768k9498o7507J19354r8210M5106j1970P5524o3511
$$ -3976 -47407 -72244 -9326 13442 -16056 -83563 35791 -62419 -17313 -29283 46241 -17270
10703a7270J1261J1565l8226M5161m6827j4211L6812O119m567N6995q3305L9226
$$ -17270 -6009 5556 -32670 12491 -34336 -48547 -11735 -5616 -10183 46812 -36493 2733
10691B733m3508N4854m1800K1676J6567o7363J8040N0976m1848l1873j3122M8017
$$ 2733 -40775 14079 -27721 -6045 10522 -56841 -38801 12175 -29673 -61546 -74668 -26651
10679b6651P9174j18362M0447j9300Q602n9494N2284P0655r3403O7074m6121J7532
$$ -26651 52523 -65839 -25392 -44692 -36090 -95584 -43300 27355 -66048 1026 -45095 -27563
10667b7563m4188Q7501k5919m0905Q5236n4224k2078k9277J9917K3239l651m3899
$$ -27563 -71751 15750 -10169 -51074 34162 -20062 -42140 -71417 -51500 -28261 -31912 -75811
10655g5811N7841p1906P4493k6330O3401k4766M160o3706K614K3000j230O288
$$ -75811 -17970 -89876 -15383 -41713 21688 -3078 1082 -62624 -60010 -37010 -38240 -31952
10643c1952m2263O4567l6592j4764J1054N156j9455L5478J1663j4018j3011N0242
$$ -31952 -74215 -9648 -46240 -61004 -49950 -44794 -64249 -28771 -17108 -31126 -44137 6105
10631F105p4082P9233m4578O1404j12944O7736K3730L1249j8052q5262N7292L0647
$$ 6105 -67977 11256 -33322 28082 -84862 -17126 6604 37853 19801 -65461 -8169 22478
10619B2478j02154R0134m8086n099k4357J9705O0244m9245L0552m3962k0636J004
$$ 22478 -79676 10458 -37628 -42727 -67084 -47379 12865 -36380 -5828 -49790 -70426 -69422
10607f9422K2667j4134J01446j46944P7044j0209j4202o362L6581p797J5939m9056
$$ -69422 -46755 -60889 40557 -106387 -29343 -39552 -53754 -60116 -23535 -31332 -15393 -64449
10595f4449k0801J8903L721P9957j00035L7449N2635o2082M068Q245n512Q950
$$ -64449 -85250 -66347 -62626 17331 -82704 -45255 7380 -54702 -50634 -42389 -47901 -38951
10583c8951j841J3969j8793O1899m0553O8388q9925M4474l0055k9692r060O2215
$$ -38951 -40792 -26823 -45616 16283 -24270 44118 -45807 -1333 -31388 -61080 -70140 -7925
10571g925m2184R537J5462M2626l4013L0470p4482J6224L8761r972l6778K2440
$$ -7925 -50109 -40572 -25110 17516 -16497 13973 -60509 -44285 -5524 -15496 -52274 -29834
10559b9834l8564K261O6333l3633l6307P2935k6462L0131o1493O4520m7190m4343
$$ -29834 -68398 -66137 196 -33437 -69744 3191 -23271 6860 -54633 9887 -37303 -81646
10547h1646N5280k5874J8074N0903n5205K402k6269J07184p2011K3265l4015L4267
$$ -81646 -26366 -52240 -34166 16737 -38468 -36066 -62335 44849 -27162 -3897 -37912 -3645
10535c645N0272r5633Q6965j1589o1691p62L002M7136l7147N8406o5685K4064
$$ -3645 46627 -49006 37959 26370 -35321 -36083 -33081 14055 -23092 35314 -30371 -6307
10523f307j1723K105l2492L6546n6245N3319K3432j2646m9077M1379j5381K2788
$$ -6307 -18030 -15925 -48417 -11871 -68116 -14797 8635 -4011 -53088 -11709 -27090 -4302
10511d302m9950P2164m0638L0183k913l2567L778J5357o6206J7265J9731q921
$$ -4302 -54252 17912 -22726 7457 4544 -28023 -24245 -8888 -75094 -57829 -38098 -47019
10499d7019L8614k2571k238L1825j7630m8413j4363M2102k2088k8823Q8069k0054
$$ -47019 -8405 -30976 -33214 -1389 -19019 -67432 -81795 -39693 -61781 -90604 -2535 -22589
10487b2589j0034M2564R250m7177J3393n2870J8951N3187Q191q7589J02266p3095
$$ -22589 -32623 9941 19191 -27986 -14593 -67463 -48512 4675 12866 -74723 27543 -45552
10475d5552P558j1673m4876O2568k6612N4132o322J498p0559K9614K2424K5299
$$ -45552 -37994 -49667 -94543 -31975 -58587 -4455 -10777 -9279 -79838 -50224 -27800 -2501
10463b501j2972M1273L5899m6174L95k2401M143q7072l877M4791M1713n1848l2970
$$ -2501 -15473 25800 61699 15525 15920 -6481 -2338 -89410 -93287 -48496 -6783 -58631 -91601
10450i1601J20068o6893L530N2309n6170L5818J7569m8508o229M2950J6049p932
$$ -91601 28467 -38426 -34896 17413 -38757 -2939 14630 -33878 -40107 2843 18892 10960
10438A0960q0027M2487k7161M3717k0145n361J2048M8946k4683L8030r7059r536
$$ 10960 -69067 -26580 -53741 -10024 -30169 -35530 -23482 25464 781 38811 -58248 -67784
10426f7784O3074n7300N0031J914m5020P2857l8605N8869m1860n938k042L0646
$$ -67784 -4710 -62010 -11979 -10065 -55085 17772 -20833 38036 -3824 -9762 -11804 18842
10414A8842j2631k3414l3523K4288J2768m319j420O7521r346l5238n3393J21579
$$ 18842 6211 -17203 -50726 -26438 -13670 -17989 -19409 48112 38766 3528 -49865 71714
10402G1714n1741p329J7140j6889O9285m6820M5394m623j095l412Q811M8947n6295
$$ 71714 19973 12644 29784 12895 82180 35360 80754 76131 75036 71624 80435 129382 73087
10389G3087P6469o9458Q7029J7407o202p9083R4153M6265J9142K7332n805o1562
$$ 73087 149556 80098 167127 184534 178332 99249 193402 239667 258809 286141 280336 218774
10377B18774M0838k3174j3007n1392K5181n0394J7818j8231M2549r8853k253R2303
$$ 218774 259612 236438 223431 172039 197220 146826 164644 146413 188962 90109 87856 180159
10365A80159p7240l0389O0766k8154k7438R463m4114l87j0978k0451j2692R8524
$$ 180159 102919 72530 133296 105142 77704 87167 43053 42666 31688 11237 -1455 97069
10353I7069l0733q5728Q564l0833K5777J04691l7529n4097K6336m1194O5643J8990
$$ 97069 66336 -19392 -10828 -41661 -15884 88807 51278 -2819 23517 -17677 47966 66956
10341F6956j2402k5980p0271Q4121K783Q547l3065o4115N506j9119j117P597L7901
$$ 66956 54554 28574 -41697 42424 45207 53754 20689 -43426 -37920 -57039 -58156 -50559 -12658
10328a2658l174O1887n9652j5221j3123L7794l6416J5200O8441J4780M4709j31495
$$ -12658 -15832 46055 -13597 -28818 -41941 -4147 -40563 -25363 43078 57858 102567 -28928
10316b8928M3408k7084L6686m1449k9234K4427m9310P0463o1516m957O1226J1800
$$ -28928 14480 -12604 24082 -17367 -46601 -22174 -71484 -1021 -62537 -67494 -6268 5532
10304E532M5522J3169j35396N3627J9209K9041k9278k6751L31L950M1697q4142
$$ 5532 51054 64223 -71173 -17546 1663 30704 1426 -25325 -24994 -21044 20653 -63489
10292f3489Q2186K9737m977q0630P8319j33936L7189N8816L5329p2258J3046j2889
$$ -63489 18697 48434 43457 -37173 41146 -92790 -55601 3215 38544 -33714 -20668 -33557
10280c3557l0711O6730M6246j06744m713M3330j0137k7422J693O9466l6855j575
$$ -33557 -64268 2462 48708 -58036 -62749 -19419 -29556 -56978 -55285 14181 -22674 -24249
10268b4249P741l0895M2263q7964R6928k721l7955m7615J5498L5160L4532Q164
$$ -24249 -16508 -47403 -5140 -93104 3824 1103 -36852 -84467 -68969 -33809 723 8887
10256H887q892n1543M1576n4451Q2160m6757j6847N0520k0320l9853n5321R3617
$$ 8887 -5 -51548 -9972 -64423 17737 -29020 -45867 4653 -15667 -55520 -110841 -17224
10244a7224J8717k0274m4544L4224N262j2326N3888m8936L077K1023n1198M0638
$$ -17224 1493 -18781 -63325 -29101 -23839 -36165 17723 -31213 -28136 -7113 -58311 -17673
10232a7673P3174j37882O6905n1840M2537k5685j4065M2083j7956J6165L5168
$$ -17673 55501 -82381 -15476 -67316 -24779 -50464 -64529 -22446 -40402 -24237 10931
10221A0931j9994l7940P8872m6956l446J0661j091n1227K8353j0698n5037J17824
$$ 10931 -9063 -47003 31869 -15087 -18533 -7872 -8963 -60190 -31837 -42535 -97572 20252
10209B0252k9061l4435N1023k5430j9533l6701J8565L0016N1696O0528l7343l8689
$$ 20252 -8809 -43244 7779 -17651 -37184 -73885 -55320 -25304 26392 86920 49577 10888
10197A0888O4188j17524Q9943j2481n3681n7684J326Q3908l2400J9491P53J502
$$ 10888 75076 -42448 47495 35014 -18667 -76351 -75025 8883 -23517 -4026 -3273 -1771
10185a771K7023M1828o0690l3935N4010m2725j7109J071n9398N7395P0910q0849
$$ -1771 25252 67080 6390 -27545 26465 -16260 -33369 -32298 -91696 -34301 36609 -44240
10173d4240k5143K2294l2915M9091R569q5814K8092j5125J00774M2668p4506K7740
$$ -44240 -69383 -47089 -80004 -30913 -21344 -107158 -79066 -94191 6583 49251 -25255 2485
10161B485r9198L6328K3261Q4733o6353m028L7536o2974K4515K9640j6016p1979
$$ 2485 -96713 -60385 -37124 47609 -18744 -22772 14764 -48210 -23695 5945 -10071 -82050
10149h2050J04906j4722k0883j9814L9595o6843J13146p3853m8157J08192p6599
$$ -82050 22856 8134 -12749 -32563 7032 -59811 53335 -20518 -68675 39517 -37082
10138c7082P6607n9595k0160l7464O0657K4746j581j9543L8913j05929j0540Q8141
$$ -37082 39525 -20070 -40230 -77694 -17037 7709 6128 -13415 25498 -80431 -90971 -2830
10126b830L9570l5020j9807j6252n4644R3419o5042Q7026j1798j5696j5508p3310
$$ -2830 36740 1720 -18087 -34339 -88983 4436 -60606 26420 14622 -1074 -16582 -89892
10114h9892R948J1364k846Q8796m3544n0463J06931p9427P227J9505k611l9468
$$ -89892 -79944 -68580 -71426 17370 -26174 -76637 30294 -49133 -41906 -22401 -25012 -64480
10102f4480Q6611o6739M9973l3398L3638j7801m6259J3827L9955L3712m4375L0510
$$ -64480 22131 -44608 5365 -28033 5605 -12196 -58455 -44628 -4673 29039 -15336 15174
10090A5174O4110n5592l7046K3474m6659Q4989p6040L8627K7151L9519m7582R334
$$ 15174 79284 23692 -13354 10120 -36539 48450 -27590 11037 38188 77707 30125 39459
10078C9459L8715l1660j1909j5725M8498P576l8138m3530P4398q3038K7186k5449
$$ 39459 78174 46514 34605 18880 67378 74954 36816 -6714 67684 -15354 11832 -13617
10066a3617K9232m1189M9443r2418N4829n3813N8924n3060R1029J1303n6205R1110
$$ -13617 15615 -25574 23869 -68549 -13720 -67533 -8609 -61669 29360 40663 -15542 75568
10054G5568j00619J8464k4746j2386M2025k0054k9883L5512j1985p185Q3230p6235
$$ 75568 -25051 -6587 -31333 -43719 -1694 -21748 -51631 -16119 -28104 -35289 47941 -28294
10042b8294K0420n7809M4522L6207o2808P526L9352J1896l5871J6088l6485L2695
$$ -28294 -7874 -65683 -21161 15046 -47762 -40236 -884 11012 -24859 -8771 -45256 -12561
10030a2561Q782M1019q1104M3255m4629k3229O5125o548k8595n265Q5704j04459
$$ -12561 -3779 37240 -43864 -609 -45238 -68467 -3342 -9890 -38485 -43750 41954 -62505
10018f2505N1132k0723m5565P6791k1589o0959J39602n2652m6554N4357o5353
$$ -62505 -11373 -32096 -77661 -870 -22459 -83418 56184 3532 -43022 11335 -54018
10007e4018J14384q7529P653Q1941l1292m5488n9584P9461K7297j01903M5452
$$ -54018 60366 -27163 -19510 62431 31139 -14349 -73933 5528 32825 -69078 -23626
9996b3626j7332j8010J6953j0107N3272r092J430p047q412k4788K5895Q4158o5361
$$ -23626 -40958 -58968 -42015 -52122 1150 -7942 -6512 -13559 -21971 -46759 -20864 63294 -2067
9983b067l7147j4100L3904Q5698o2058p7810P1903n5906O022M1795j5506L1579
$$ -2067 -39214 -53314 -19410 66288 4230 -73580 -1677 -57583 -51561 -9766 -25272 6307
9971F307m5528K6693N655j2968O67k0336j4572O0160k7309m6351Q9996K779p3136
$$ 6307 -39221 -12528 -6873 -19841 -19174 -39510 -54082 6078 -21231 -67582 22414 25193 -47943
9958d7943N8241j3293N378p4554M2297J2601J732J8154k7205j1924J31875j48806
$$ -47943 10298 -2995 2383 -72171 -29874 -17273 -15541 2613 -24592 -36516 95359 -53447
9946e3447O260M1327K5186l931n5417O0903o7770J9975o9710J22271o2932k3350
$$ -53447 -47187 -5860 19326 15395 -40022 20881 -46889 -26914 -96624 25647 -37285 -60635
9934f0635k77J7478R1877n7726p7240J35575q6606K0340j7133K8314l2111N0030
$$ -60635 -60912 -43434 48443 -9283 -86523 49052 -37554 -17214 -34347 -6033 -38144 11886
9922A1886n0603K0958l4103k4792L8729r529M9846J246j7714K2549O705o2853
$$ 11886 -38717 -17759 -51862 -76654 -37925 -47454 2392 3638 -14076 8473 15178 -47675
9910d7675O4805Q357l2981J8237l2059o5226Q0735M522l8366Q1209m3855j9909
$$ -47675 17130 25487 -7494 10743 -21316 -86542 -5807 -1285 -39651 41558 -2297 -22206
9898b2206n111L9043p7690N214l2020N0585k0703N3975j5790L7092l0692O820
$$ -22206 -27317 11726 -65964 -60750 -92770 -42185 -62888 -8913 -24703 12389 -18303 -11483
9886a1483K6591o3648M755L2187K5545j16191j9636J00350j9043j3842j5773N8504
$$ -11483 15108 -48540 -43785 -11598 13947 -102244 -121880 -21530 -40573 -54415 -70188 -11684
9874a1684K3401K1955j33911R2936J9169J6388j03069j7323O8140M6380q0829
$$ -11684 11717 33672 -100239 -7303 11866 28254 -74815 -92138 -23998 22382 -58447
9863e8447M1865j5541k1012L4142L673K1045p2172O649P8838k1460q2453R126
$$ -58447 -16582 -32123 -53135 -18993 -15320 5725 -66447 -59798 19040 -2420 -84873 -75747
9851g5747R4681m3448O3718k8528n0871N2650K0310j36936P6986o193M0445m8631
$$ -75747 18934 -24514 39204 10676 -40195 12455 32765 -104171 -27185 -33378 7067 -41564
9839d1564J5128J0963p0872R6134K6052j9097q573Q385k7994k0828n9091l8120
$$ -41564 -26436 -15473 -86345 9789 35841 16744 8171 16556 -11438 -32266 -91357 -129477
9827a29477J54476o0138j5943K8375Q2612j13131K4673J6039l7385N9329j20018
$$ -129477 24999 -35139 -51082 -22707 59905 -53226 -28553 -12514 -49899 9430 -110588
9816a10588Q0880k7907L5064M7072j0314r1020L9962P567k4184R901k9619J49332
$$ -110588 -29708 -57615 -22551 24521 14207 -76813 -36851 -29284 -53468 -43567 -73186 76146
9804G6146p1260m8561j609M2590K2918j06573R9693r5161P2129n2638K7587k2930
$$ 76146 4886 -43675 -45284 -2694 20224 -86349 13344 -81817 -9688 -62326 -34739 -57669
9792e7669n965l0474N3392K6569m0585N5919k0219k6352J9640N2955o7671M5920
$$ -57669 -63634 -94108 -40716 -14147 -54732 1187 -19032 -45384 -25744 27211 -40460 5460
9780E460o1283L5455R9p9003J07263l8858j1961L404J8127L301n3259J18998p1032
$$ 5460 -55823 -20368 -20269 -99272 7991 -30867 -42828 -39424 -21297 -17996 -71255 47743 -23289
9767b3289P1188j14540l2055M4503P189M4619j6566K6929K3998j42329P7715K6293
$$ -23289 47899 -66641 -98696 -54193 -47004 -2385 -18951 7978 31976 -110353 -32638 -6345
9755f345j07672Q5473L5172Q22L087p8496N6264o7094M7799l7458j2645O1640
$$ -6345 -114017 -28544 6628 7450 10537 -67959 -11695 -78789 -30990 -68448 -81093 -19453
9743a9453j9437L6221r315k3154o1886Q007P327P5998p5204Q4334p0661Q0888
$$ -19453 -38890 -2669 -11984 -35138 -97024 -89017 -81690 -5692 -80896 3438 -67223 13665
9731A3665j04961j3P4909N2550k0617n1773K7599m7430j7894L3478p220l9397
$$ 13665 -91296 -91309 -16400 36150 15533 -36240 -8641 -56071 -73965 -40487 -47707 -87104
9719h7104P8029p0246O4154m184k028k137Q7812p8396m4225J5491N3067L6995
$$ -87104 -9075 -79321 -15167 -19351 -21379 -23516 64296 -14100 -58325 -42834 10233 47228
9707D7228q7397M6705n5684N1412j4431J090l1156o438R9392r1076n051L3234
$$ 47228 -40169 6536 -49148 2264 -12167 -11077 -42233 -48671 50721 -40355 -45406 -12172
9695a2172K4421p9732l2511O8008N6104q8065N7616J3152m6389J7003K4663m4186
$$ -12172 12249 -67483 -99994 -31986 24118 -63947 -6331 6821 -39568 -22565 2098 -42088
9683d2088M3823k9832l7642L4385L0156J8544j1020J797R002l0042l1915R0555
$$ -42088 1735 -28097 -65739 -31354 -1198 17346 6326 8123 17125 -12917 -44832 45723
9671D5723k3075k1825o4735Q8948j9742r8169O6400N4266n0600L258R8999j01955
$$ 45723 22648 823 -63912 25036 5294 -92875 -26475 27791 -22809 -19551 79448 -22507
9659b2507L9947o7150K0139J7218k3360K3316K2942k0646N6908j00262L3423k3202
$$ -22507 17440 -49710 -29571 -12353 -35713 -12397 10545 -10101 46807 -53455 -20032 -43234
9647d3234j7342J335J1888l1613R3141K3895l4074k6117L4809Q223M195r964N0888
$$ -43234 -60576 -59241 -47353 -78966 14175 38070 3996 -22121 12688 20911 25106 15142 66030
9634F6030q8138R6292n945q0443p2673J11761o8721J1637L0897M7926j7370n7920
$$ 66030 -22108 74184 68239 -12204 -84877 26884 -41837 -30200 697 48623 31253 -26667
9622b6667J9331k2713p266p474L7877k2455j9888J6850o0382L3857O2271K878
$$ -26667 -7336 -30049 -37315 -44789 -6912 -29367 -49255 -32405 -92787 -58930 3341 6219
9610F219q520Q774k2360O0013j24427M6777M2373l0576P282J53k6587J4480k9163
$$ 6219 -2301 6473 -15887 44126 -80301 -33524 8849 -21727 -14445 -14292 -40879 -26399 -55562
9597e5562J9750M1954k9437O1815n8000l1512k4752K5958R7394l2447j4886N7192
$$ -55562 -35812 6142 -23295 38520 -19480 -50992 -75744 -49786 47608 15161 275 57467
9585E7467j02536L402N9000j23233J49963n5111L5319p9488R1072n264m5053q5736
$$ 57467 -45069 -41667 17333 -105900 44063 -11048 24271 -55217 35855 30591 -14462 -100198
9573a00198R2372L8331q2130M5356J4677j0426N970n1428L3075j7298m9741J43339
$$ -100198 -7826 30505 -51625 -6269 8408 -2018 3952 -47476 -14401 -31699 -81440 61899
9561F1899p3000l0787J750J3505o2388J7650P1317M8430r2813K0121l6843P7675
$$ 61899 -11101 -41888 -40138 -26633 -89021 -71371 -54 48376 -44437 -24316 -61159 16516
9549A6516n907m0944J494J2840l083M9008q3023K2033O0043j9037n1029M027M2365
$$ 16516 10609 -30335 -28841 -16001 -19084 29924 -53099 -31066 28977 9940 -41089 -37062 5303
9536E303q0471Q7668q3017J10625j26086J00400K2372n3854J8566M1692J421k8237
$$ 5303 -75168 12500 -70517 40108 -85978 14422 36794 -17060 1506 43198 44619 16382
9524A6382o2669K2176k5878k826Q2924p9109J3311j7180P3703m4185M8524n732
$$ 16382 -46287 -24111 -49989 -52815 30109 -49000 -35689 -52869 20834 -23351 25173 19441
9512A9441k6068k8984L3609J9391l6932O9131m0442l429k4240k8932J27486o0091
$$ 19441 -6627 -35611 -2002 17389 -19543 49588 9146 5717 -18523 -47455 80031 19940
9500A9940K0360o4446J6505r9067L3848O1025L099M8491n1262j3336M0139n4675
$$ 19940 40300 -24146 -7641 -106708 -72860 -11835 -8736 39755 -11507 -24843 15296 -39379
9488c9379L8237J0985n8864J1717M2594O4779j3299K1645j28829K3990n5237P3754
$$ -39379 -1142 9843 -49021 -37304 5290 70069 56770 78415 -50414 -26424 -81661 -7907
9476g907j3870J01518r9448K3526n2703M3793k02j8692j4083l8086O4797j5488
$$ -7907 -21777 79741 -19707 3819 -48884 -5091 -5293 -23985 -38068 -76154 -11357 -26845
9464b6845o415N8891n3316N2800l3773m4590P4005p814m9642N3488q6778K0168
$$ -26845 -33260 25631 -27685 25115 -8658 -53248 20757 12943 -36699 16789 -69989 -49821
9452d9821O6568j2260k3282n965p5446N9114M7196q655N2976n6601k0558K4348
$$ -49821 16747 4487 -18795 -24760 -100206 -41092 6104 -2551 50425 -6176 -26734 -2386
9440b386N997R431O4876p1558m5452L9692p358k6506J602Q9199m8624M1533o7379
$$ -2386 3611 13042 77918 6360 -39092 600 -6758 -33264 -31662 57537 8913 50446 -16933
9427a6933m3501L8414m9738p812J18207j02349O7721N0139p3484M245O5913p1608
$$ -16933 -60434 -22020 -71758 -79570 38637 -63712 4009 54148 -19336 -15091 50822 -20786
9415b0786O0797j2496J3682k7012n8613O1460K4140r7219j0501J8494O7728J4173
$$ -20786 40011 27515 41197 14185 -44428 17032 41172 -56047 -66548 -48054 19674 33847
9403C3847p496l0929Q395k4492l2358J9111K6888n1885N0787p1031P9330J7844
$$ 33847 26351 -4578 3817 -20675 -53033 -33922 -7034 -58919 -8132 -79163 167 18011
9391A8011M5542n3543J7941o4989O5454q6296L7485J2532J6736q3580L1138O7268
$$ 18011 63553 10010 27951 -37038 28416 -57880 -20395 -7863 8873 -74707 -43569 23699
9379B3699j5687l45K053j2432o3048R1150j13043K4273O8447k7273k0655N2875
$$ 23699 8012 7667 9720 -2712 -65760 25390 -87653 -63380 5067 -22206 -42861 10014
9367A0014K6654l9996p8049L6866R2545m9209Q918J2480m9829J8039K9606M1723
$$ 10014 36668 -3328 -81377 -44511 48034 -1175 7743 20223 -29606 -11567 18039 59762
9355E9762r1237L9509M9618l4204j05715P4425q7792Q4871m1720N3609Q306m3522
$$ 59762 -31475 8034 57652 23448 -82267 -7842 -95634 -10763 -52483 1126 9432 -34090
9343c4090J0264K2664J6083p0308M2268J6459q203L7902K4070n9366J3261o6271
$$ -34090 -23826 -1162 14921 -55387 -13119 3340 -4863 33039 57109 -2257 11004 -55267
9331e5267o3181P4492N3170M4186k4813m6168P2515m5701j4460J972l8488L9703
$$ -55267 -118448 -43956 9214 53400 28587 -17581 54934 9233 -5227 -3255 -41743 -2040
9319b040L4519k4423j264l4752M4374p8199J05258L5093m4790n0432N0258p4600
$$ -2040 32479 8056 6792 -27960 16414 -61785 43473 78566 33776 -16656 33602 -40998
9307d0998L7569j7344m2556J38245k9281j02281N8171k611K9404k158R792o2752
$$ -40998 -3429 -20773 -63329 74916 45635 -56646 1525 -1086 28318 26160 35952 -26800
9295b6800L0894j09766J28573j5008J2289j58L9146j00211K7975J4110Q505m881
$$ -26800 4094 -105672 22901 7893 20182 20024 59170 -41041 -13066 1044 9549 4668
9283D668Q5476l9782n0082J4085m4679o229K9543k3919J20045k6928n1360M3322
$$ 4668 90144 50362 280 14365 -30314 -36543 -7000 -30919 89126 62198 10838 54160
9271E4160j0920l5221j9399J4119J1762m6024K1580L8297j6233L1181j8990m6999
$$ 54160 43240 8019 -11380 2739 14501 -31523 -9943 28354 12121 43302 24312 -22687
9259b2687j7026N4980K9879o7788L8177l252o698k328n841K9484q2244J06026
$$ -22687 -39713 15267 45146 -22642 15535 12283 5585 3257 -2584 26900 -55344 50682
9247E0682m2331P4832p3982L471n2993o16J0158J06007j6817m3289N6335r0386
$$ 50682 8351 83183 9201 12672 -40321 -40937 -30779 75228 58411 15122 71457 -18929
9235a8929L8157P70o6814J07666o3061O6100p1132n9823L379L0549L0530l3227
$$ -18929 19228 19998 -46816 60850 -2211 63889 -7243 -67066 -63687 -33138 -2608 -35835
9223c5835J10689n1743P4710m3496o3269O0843j15780J8003M0108m4410K1614
$$ -35835 74854 23111 97821 54325 -8944 51899 -63881 -45878 -5770 -50180 -28566
9212b8566N5584k7486p37L3499n8825O3178l5065N8727k3549n6894J2922l9758
$$ -28566 27018 -468 -1205 32294 -26531 36647 1582 60309 36760 -20134 -7212 -46970
9200d6970L2594M8771l8314l1990O6048J5122J3304J0362o8325m559r767o0508
$$ -46970 -14376 34395 -3919 -35909 30139 45261 58565 68927 602 -3957 -13724 -74232
9188g4232O6154M0598k228K0453k0822P8483j01316j61561J64679n6147O9564
$$ -74232 -8078 32520 30292 50745 29923 108406 7090 -154471 10208 -45939 23625
9177B3625J8094j4879k2008m6842j4939M6863M423l909P0734J420m6765o4028
$$ 23625 41719 26840 4832 -42010 -56949 -10086 -5663 -9572 61162 62582 15817 -48211
9165d8211n902P8460k7252J628m8488R7302l0964J7468k2514L9072m7548l3855
$$ -48211 -54113 24347 -2905 -1277 -49765 47537 16573 34041 11527 50599 3051 -30804
9153c0804m0000P1410Q3649r1093K0287N678K9698r4693J6886J09156M168m0908
$$ -30804 -70804 606 84255 -6838 13449 19127 48825 -45868 -28982 80174 84342 43434
9141D3434j8520o854j7389J3827k2777l909R3579r1578K909L5583l1837M1757
$$ 43434 24914 18060 671 14498 -8279 -12188 81391 -10187 -7278 28305 -3532 38225
9129C8225r2583M0947K7973J2061j0958N0670m7946k7339L963M1779Q824j7250
$$ 38225 -54358 -13411 14562 26623 15665 66335 18389 -8950 -4987 36792 45616 28366
9117B8366N9423j7267m1792o8329N931K4831L4727p2535L3505O7513j5022M873
$$ 28366 87789 70522 28730 -39599 -33668 -8837 25890 -46645 -13140 54373 39351 44224
9105D4224r61P91n5012q536J495M5430L9129k8226n1956M9282l1752J3067R453
$$ 44224 43263 44054 -10958 -19494 -17999 27431 66560 38334 -13622 35660 3908 16975 26428
9092B6428j4560N1463p3536O0295k9198n5561J36328j18915J8180L420K4114J8766
$$ 26428 11868 63331 -10205 50090 20892 -34669 101659 -17256 924 4344 28458 47224
9080D7224p0774K2025N2835l0674O7116j05449N3316p4128R9595o3750J2498P537
$$ 47224 -23550 -1525 51310 20636 87752 -17697 35619 -38509 61086 -2664 9834 17371
9068A7371l28L5175k0829Q6607o0107k553p4020J2448L8657p9125P2892j4586
$$ 17371 17043 52218 31389 117996 57889 55336 -18684 -6236 32421 -46704 26188 11602
9056A1602m4059J7062M6404q073L534O854j3325l5020P344J39896r1270k4431
$$ 11602 -32457 -15395 31009 22936 26470 33324 19999 -15021 -7677 132219 40949 16518
9044A6518j3678L9744K0931j5512l0796L3883k2328j5704L5735j194l2802n9884
$$ 16518 2840 42584 63515 48003 17207 51090 28762 13058 48793 47599 14797 -45087
9032d5087M6125J2445K1210K7583o1573o20l411L6856K4354L647m7006K1269N5864
$$ -45087 1038 13483 34693 62276 703 83 -3328 33528 57882 61529 14523 35792 91656
9019I1656q6946Q8923j02131N2693o4783Q2400p0238J04610o3726M2929n9718
$$ 91656 4710 93633 -8498 44195 -20588 61812 -8426 96184 32458 75387 15669
9008A5669L9958k8181L8913o0899J22328l8036k7533m64M41l1151M9582l3325
$$ 15669 55627 27446 66359 5460 127788 89752 62219 61755 62196 31045 80627 47302
8996D7302O870l4273Q0965M7410l5622p4976k1926j524Q7025K2694k3318M752
$$ 47302 54172 19899 100864 148274 112652 37676 15750 14226 101251 123945 100627 105379
8984A05379k1470m1346l4378j0361J4346Q1969m969r097k9666O6515q0104N0041
$$ 105379 83909 42563 8185 -2176 12170 94139 89170 80073 50407 116922 36818 86859
8972H6859p513P59n7714j2137J9689L2383O024o6286P2202K0580m0917O5438j0241
$$ 86859 79346 80105 22391 10254 29943 62326 68350 2064 74266 94846 53929 119367 109126
8959A09126n0607L8611n3146M7226n9571M2350o3629N3746Q407K8370m4427N454
$$ 109126 58519 97130 43984 91210 31639 73989 10360 64106 72513 100883 56456 61910
8947F1910o5470K8056J4749K6517n161k2386j8617K5916l2243K7542p833J3574
$$ 61910 -3560 24496 39245 65762 60601 38215 19598 45514 13271 40813 32980 46554
8935D6554l592O3890k2698J0185j96249J29637l969k0644N3450J4554j3173o0876
$$ 46554 42962 106852 84154 94339 -101910 27727 23758 3114 56564 71118 57945 -2931
8923b931R2027j5830p8551Q4111o6613l4372Q8938j1970M3209p6809p0700L9936
$$ -2931 89096 73266 -5285 78826 12213 -22159 66779 54809 98018 21209 -49491 -9555
8911i555Q2031n5318K9710J03408j00420m0700K3394l8014n7341J80632q9487
$$ -9555 72476 17158 46868 150276 49856 9156 32550 -5464 -62805 117827 28340
8900B8340N5419j0754N8857p2147j1503J3094l267j1981N6942m1337l4919K6579
$$ 28340 83759 73005 131862 59715 48212 61306 58039 46058 103000 61663 26744 53323
8888E3323j8100j5951j7208n3472J38145j7131k9530N4344p7359N2395l1211n4885
$$ 53323 35223 19272 2064 -51408 86737 69606 40076 94420 17061 69456 38245 -16640
8876a6640m303J53560o6351n71m4035Q511O0151M5893j14914k4611M4186J02416
$$ -16640 -20943 132617 66266 65695 21660 30171 90322 136215 21301 -3310 40876 143292
8864A43292j61727Q9172j1914k9424J9393q310j6124K7012k6076R8959q5823K2455
$$ 143292 -18435 70737 58823 29399 48792 40482 24358 51370 25294 124253 38430 60885
8852F0885p9336K722L3358l9212K5217P9885J2352r0888M9761o0494M5148O7129
$$ 60885 -18451 -15729 17629 -21583 3634 83519 95871 4983 54744 -5750 39398 106527
8840A06527r2961n3954Q0162O9024r0072j1083P5019j0984k3061k9816N3101j0490
$$ 106527 13566 -40388 39774 108798 18726 7643 82662 71678 48617 18801 71902 61412
8828F1412j5035M2200q1339J2642M9804m1588k5555P610q165N9767J0008n6734
$$ 61412 46377 88577 7238 19880 69684 28096 2541 10151 1986 61753 71761 15027
8816A5027J07486p2492k5013k454K7427M7595K8598n9161j01672P4149N3790o6848
$$ 15027 122513 50021 25008 22554 49981 97576 126174 67013 -34659 39490 93280 26432
8804B6432m7047R1045N5309r6079Q467K2704K6109o9103Q5831r5515R1086o3433
$$ 26432 -20615 70430 125739 29660 38127 60831 86940 17837 103668 8153 99239 35806
8792C5806N7765j7909m9576M6977j6178m2927o1150J34687J6392r7062P6023J1697
$$ 35806 93571 75662 26086 73063 56885 13958 -47192 87495 103887 6825 82848 94545
8780I4545p8601M5030j9641k630M8992j1269K0068q3361o743O1075J2190q344
$$ 94545 15944 60974 41333 38703 87695 76426 96494 13133 6390 67465 79655 71311
8768G1311p647N5479k7793q3824K0981q587J0768j9949J50744j45894l7785o198
$$ 71311 63664 119143 91350 7526 28507 19920 30688 10739 161483 15589 -22196 -28394
8756b8394J77496o7862m2253l4417R6281m7127J6797n6879l463q424j0205Q3814
$$ -28394 149102 81240 38987 4570 100851 53724 70521 13642 10179 1755 -8450 75364
8744G5364n3998m651L1323K0784K3339l5055o3398L9257l6453K5606K246q541
$$ 75364 21366 16715 48038 68822 92161 57106 -6292 32965 -3488 22118 24364 15823
8732A5823m281L8239l112k2464J0819N0594n3238N9021j4526j2538N299J5408
$$ 15823 11542 49781 46669 24205 35024 85618 32380 91401 76875 64337 69636 85044
8720H5044k9519M6045R807l9393k1840P4955q096m4878l9947L1180R692l6652
$$ 85044 55525 101570 111377 71984 50144 125099 117003 72125 32178 63358 73050 36398
8708C6398M5840n5060P9830j6474N2465l9189m407K8804p0347L5597k3596K8768
$$ 36398 82238 27178 107008 90534 142999 103810 99403 128207 57860 93457 69861 98629
8696I8629J1627j00249O695J17127l7825J4574N8989o5075L0311K8542l9308j0301
$$ 98629 110256 10007 16702 133829 96004 110578 169567 104492 134803 163345 124037 113736
8684A13736L9718p3673j2237O0162k0695r892N7625l402N2018j07090j5401M146
$$ 113736 153454 79781 67544 127706 107011 97119 154744 151342 203360 96270 80869 85015
8672H5015L2256j8878j461M60r890J6016J5116n0574R0891o1329J0906k1894n7104
$$ 85015 117271 98393 96932 97392 87502 103518 118634 68060 158951 97622 108528 86634 29530
8659B9530Q7725O407j3072L5154l3083O186m222o0106l1618J47924r5481N7066
$$ 29530 117255 123662 110590 145744 112661 118847 114625 54519 22901 170825 75344 132410
8647A32410j6571j5188M7260j26189O3980n9392n967O6905m4265O2334L4718n2459
$$ 132410 115839 100651 147911 21722 85702 26310 20343 87248 42983 105317 140035 87576
8635H7576n845J0019j5778l2558L6323k5180K1057L5835p5106N4558J7910l665
$$ 87576 81731 91750 75972 43414 79737 54557 75614 111449 36343 90901 108811 105146
8623A05146l4175k3679K2207J6992q0099L713M6671p6485Q5866K5093k4557J0410
$$ 105146 70971 47292 69499 86491 6392 10105 56776 -19709 66157 91250 66693 77103
8611G7103n6890J9646K3255o581M6862r8999M5405J3159n8267P2578L5953j20667
$$ 77103 20213 39859 63114 56533 103395 4396 49801 62960 4693 77271 113224 -7443
8599g443J13426l0998J1018r702M0757m9155N0666p329p0273q555O8343m4698
$$ -7443 105983 74985 86003 76301 117058 67903 118569 111240 40967 32412 100755 56057
8587E6057N0056m6755Q0328l1936J3898J6316o6301O1879K1934r9066J50370q8028
$$ 56057 106113 59358 139686 107750 121648 137964 71663 133542 155476 56410 206780 118752
8575A18752J8764k5465J8386j9759l6764J04819o5709O620J6254J6807q9188J00724
$$ 118752 137516 112051 130437 110678 73914 178733 113024 119644 135898 152705 63517 164241
8563A64241o1799J41946q8705K9255L2009L8537n4061l005L6446m763L7764L7904
$$ 164241 102442 244388 155683 184938 216947 255484 201423 198418 234864 230101 267865 305769
8551C05769l5197k4490R2695j13473M5974K2355n5259R6157n9462M6072j06453
$$ 305769 270572 246082 338777 225304 271278 293633 238374 334531 275069 321141 214688
8540B14688J12346j2336L8300p0154K482m9089R402j4742N5491j20747M3158P3029
$$ 214688 327034 314698 352998 282844 285326 236237 245639 230897 286388 165641 208799 281828
8528B81828r5097M2061m3673P885L107M536k6441l0163M3561j4677j7310J4922
$$ 281828 186731 228792 185119 193004 196111 200647 174206 144043 187604 172927 155617 170539
8516A70539m8589K324r745M4222l1037k4688J9798q254L1671M3135p1045j4563
$$ 170539 121950 124274 114529 158751 127714 103026 122824 114570 146241 189376 118331 103768
8504A03768j7020L6661n3365N5577m629m3258p840L1684n4195R9452p3013K3742
$$ 103768 86748 123409 70044 125621 120992 77734 69894 101578 47383 146835 73822 97564
8492I7564m4153K4056K5579j7329j7190J2243j1905o418m085L2957q502m46l0034
$$ 97564 53411 77467 103046 85717 68527 80770 68865 62447 58362 91319 82817 82371 52337
8479E2337N4995k4147l9565L7890k3561L8159n5897j118n415L2501L2445J7045
$$ 52337 107332 83185 43620 81510 57949 96108 40211 39093 33678 66179 98624 115669
8467A15669J5855n2375J2545n9434L8695K227k3604j5885O4716l9251o715j8656
$$ 115669 131524 79149 91694 32260 70955 73182 49578 33693 98409 59158 52443 33787
8455C3787O0795m1823N7698K237n7926P382j45J9967m0555O0277k7509m3052L0597
$$ 33787 94582 52759 110457 112694 54768 62150 62005 81972 41417 101694 74185 31133 61730
8442F1730K985P219q9693R203Q7743p5207Q7333m2266r176N5798m7179o42O0298
$$ 61730 64715 71934 -17759 -8556 79187 3980 91313 49047 39871 95669 48490 47848 108146
8429A08146n3332O4950q915p9872k4905Q0576l7808K474K1422j7785k8652l3030
$$ 108146 54814 119764 110849 30977 6072 86648 48840 51314 72736 54951 26299 -6731
8417f731L6071O3935n3806L826O4490n0531l3491n4238N7548m9782J4710Q1619
$$ -6731 29340 93275 39469 43295 107785 57254 23763 -30475 27073 -22709 -7999 73620
8405G3620l3969K0385r583m6136M6605o767l4989L0274m534l8083M5046k2350
$$ 73620 39651 60036 50453 4317 50922 44155 9166 39440 34906 -3177 41869 19519
8393A9519O3223n4951M1737K6899j05734O2232K7803j01581J05762n3825K7435
$$ 19519 82742 27791 69528 96427 -9307 52925 80728 -20853 84909 31084 58519
8382E8519q7278J24163n3604L2805K916l097j9497k332L7732l8599r557K145N2397
$$ 58519 -28759 95404 41800 74605 77521 74424 54927 52595 90327 51728 42171 44316 96713
8369I6713k7684n126J2227j891l3134q470K9781j8703M1065q5791P3720l2764
$$ 96713 69029 63903 76130 74239 41105 32635 62416 43713 84778 -1013 72707 39943
8357C9943j5413J2878n2170J5747L2792j2136j2634N7516l4580L5737K0396o5350
$$ 39943 24530 37408 -14762 985 33777 21641 9007 66523 31943 67680 88076 22726
8345B2726l0021j3397K2787J4249J23472j45680K1881P0978n6996K391K5541P360
$$ 22726 -7295 -20692 2095 16344 139816 -5864 16017 86995 29999 32390 57931 65291
8333F5291o1818P6256m3554o818j8276J6830J3164J03621n6781o0396L5707J2532
$$ 65291 3473 79729 36175 29357 11081 27911 41075 144696 87915 27519 63226 75758
8321G5758j8200m0500L3694P1471q6959K8554L5857n7414L4815K0254k947K9287
$$ 75758 57558 17058 50752 122223 35264 63818 99675 42261 77076 97330 94383 123670
8309A23670n2683j5993J5473o464P598o6931J9088K1190O8820p5341j7103R615
$$ 123670 70987 54994 70467 64003 71601 4670 23758 44948 113768 38427 21324 30939
8297C0939j1278O1174j4912n3901j2057P8149N4954o6282M481K7274o0412M9520
$$ 30939 19661 80835 65923 12022 -35 78114 133068 66786 71267 98541 38129 87649
8285H7649K3702J4247m5417j7291k745J3324q8971P6591K2303o7245L0276q874
$$ 87649 111351 125598 80181 62890 60145 73469 -15502 61089 83392 16147 46423 37549
8273C7549k2036R3983o063M069n405j10608J13959q5275J9677k5983L2007k4168
$$ 37549 15513 109496 103433 107502 102097 -8511 105448 20173 39850 13867 45874 21706
8261B1706J3778n893K2984J130O9976q6405l5185J7712J4935O7661k6047k1221
$$ 21706 35484 29591 52575 53705 123681 37276 2091 19803 34738 102399 76352 55131
8249E5131p820k5675N1622m7844j7496L0491n232l4635K621M1053M954r798l501
$$ 55131 47311 21636 73258 25414 7918 38409 33177 -1458 1163 42216 47170 37372 33871
8236C3871l1418P4613q3046O2586L180p499K6209p3818L5371K961L8442j06879
$$ 33871 2453 77066 -5980 56606 59786 52287 78496 4678 40049 43010 81452 -25427
8224b5427P4302L6855l5470j4104K25N1311p7727m747L4494n83Q2571m2779Q305
$$ -25427 48875 85730 50260 36156 36381 87692 9965 5218 39712 39129 121700 78921 87226
8211H7226o2254P1207q6524L6299j6822L3458l5623R164R974k9294L2005n5475
$$ 87226 24972 96179 9655 45954 29132 62590 26967 36131 46105 16811 48816 -6659
8199f659K3480M238o6425J25861q102j25593J61343k33096J97401M4537J4930
$$ -6659 16821 21059 -45366 80495 72393 -53200 108143 -124953 72448 116985 131915
8188A31915P494j31206n680J53556j33614O6061l8113M7887L4518l2306O5362
$$ 131915 139409 8203 2523 156079 22465 88526 50413 98300 132818 100512 165874
8177A65874j20528Q2022l8864k4069l264l650N8952j1628l3323L8911j7716p1643
$$ 165874 45346 127368 88504 64435 61171 57521 116473 104845 71522 110433 92717 21074
8165B1074m1779R2629n7233j7748R3598j394n7888R7428m9950j446L1555L1477
$$ 21074 -20705 71924 14691 -3057 90541 89147 31259 128687 78737 77291 108846 140323
8153A40323n3490L6025q1182r82P2855o6215M8055l5406L5870l6822J9246k6743
$$ 140323 86833 122858 41676 40694 113549 47334 95389 59983 95853 59031 78277 51534
8141E1534J3182J5118l2150p714m019J27053q4908j7020L7601j12573J50240k6150
$$ 51534 64716 79834 47684 39970 35951 163004 78096 61076 98677 -13896 136344 110194
8129A10194k2361o6664O9427K9347o0558K5309j7604o7602M3316M2064J1064k5009
$$ 110194 87833 21169 90596 119943 59385 84694 67090 -512 42804 84868 95932 70923
8117G0923j0510N4961m8262n2668N8619n5852P675L7486m612o066M233J6619j361
$$ 70923 60413 115374 67112 14444 73063 17211 24886 62372 57760 51694 55927 72546 71185
8104G1185K9171k3022N6337m6779L4936L3127j09380k8365P2936O845N265j707
$$ 71185 100356 77334 133671 86892 121828 154955 45575 17210 90146 96991 102256 100549
8092A00549l8069j0554L1475M137m1957Q6808j00708K4606k1422P7394j44183
$$ 100549 62480 51926 83401 87538 45581 132389 31681 56287 34865 112259 -31924
8081c1924P6322J6477k0696l8180J3293M6664n0054Q7692J2493r0113L4699Q139
$$ -31924 44398 60875 40179 1999 15292 61956 11902 99594 112087 21974 56673 64812
8069F4812L93O5938o1624P1082m567j14739Q4451L0642q1894n0105N1266j1227
$$ 64812 65205 131143 69519 140601 136034 21295 105746 136388 54494 4389 55655 44428
8057D4428K6884l6387O2934Q57J7609n9942l668R354N48L0189o1202L1489q7943
$$ 44428 71312 34925 97859 98716 116325 56383 52715 62069 62617 92806 31604 63093 -24850
8044b4850R7485p642j8906K2918J3776l1065K580L2705J6352o0392R254K7101
$$ -24850 72635 64993 46087 69005 82781 51716 54296 87001 103353 42961 52215 79316
8032G9316p8774J00048k161K7772q2560K2550J9570R377n5766K3570N7909m5427
$$ 79316 542 100590 98429 126201 43641 66191 85761 95138 39372 62942 120851 75424
8020G5424p1766M0931j3238O1574k0547J9859p3176N1347k882N0607J030n9829
$$ 75424 3658 44589 31351 92925 72378 92237 19061 70408 67526 118133 119163 59334
8008E9334N4667q7952k454O8699l3944L1542l5269K7058L3867j3517o2129k2108
$$ 59334 114001 26049 23595 92294 58350 89892 54623 81681 115548 102031 39902 17794
7996A7794p060Q1549l869p6063j8253O9475k4797L3610k7762K517J7052J5113
$$ 17794 10734 92283 88414 12351 -5902 63573 38776 72386 44624 47141 64193 79306
7984G9306Q87o455M9176n1364Q915L3710n0212K5538j4372o2104O7875K2141J0688
$$ 79306 80193 73738 122914 71550 80465 114175 63963 89501 75129 13025 80900 103041 113729
7971A13729p7478Q8480q1064n5945Q2339j4368J4216K7355m691N7300k9001M118
$$ 113729 36251 124731 43667 -12278 70061 55693 69909 97264 92573 149873 120872 124990
7959A24990r1047P5235M8507m2305p0961J4414o683R8538R037M2705j20696K0561
$$ 124990 33943 109178 157685 115380 44419 58833 52150 150688 159725 202430 81734 102295
7947A02295P682j0712K6683r4183P0240M946K0548l5254J3219L4162q2967K3751
$$ 102295 109977 99265 125948 31765 102005 106951 127499 92245 105464 139626 56659 80410
7935H0410l551P4016r8449N6632N013m388j3660m9341K6235N3964l2059N6396
$$ 80410 76859 150875 52426 109058 114071 109683 96023 46682 72917 126881 94822 151218
7923A51218j92207R9960K2789m4451K441j8666L0943L7148j4017J9536l7490k680
$$ 151218 -40989 58971 81760 37309 39750 21084 52027 89175 75158 94694 57204 54524
7911E4524R0578n3474j1199j5086L2410p0297N7724l4703J7843o601j005K6779
$$ 54524 145102 91628 80429 65343 97753 27456 85180 50477 68320 61719 60714 87493
7899H7493O6443r9625N4517o6326J2843N5024j4607m2453M8937m1570Q458J6138
$$ 87493 153936 54311 108828 42502 55345 110369 95762 53309 102246 60676 69134 85272
7887H5272P854l2546J9108J0736j1011Q6362p71j17647P9298k6490p4939J25102
$$ 85272 93126 60580 79688 90424 79413 165775 165004 47357 126655 100165 25226 150328
7875A50328M921q2454Q0630o3635p1714M0659L8704l674J1928P358M808l830k5753
$$ 150328 155249 72795 153425 89790 18076 58735 97439 93765 105693 113051 117859 114029 88276
7862H8276L9338o7812k886J5066j9320K3390q7990m17596N91616j02431R2j7527
$$ 88276 127614 59802 56916 71982 52662 76052 -11938 -429534 162082 59651 59743 42216
7850D2216P5317k4238O0865p1330J8149l9371L7005M593j9322K1908M3325J6818
$$ 42216 117533 93295 154160 82830 100979 61608 98613 103206 83884 105792 149117 165935
7838A65935K557l5687n6363K0683J3873K5493q150J7828J1857l4632m4425M0157
$$ 165935 168492 132805 76442 97125 110998 136491 128341 146169 158026 123394 78969 119126
7826A19126K7497r3201K0623R6242l9250l6933j314P2264k5877m057O386P6358
$$ 119126 146623 53422 74045 170287 131037 94104 92790 165054 139177 135120 141506 217864
7814B17864j8216p9254K5445L1935j19224Q9010m8066R1844n3560J07320r3398
$$ 217864 199648 120394 145839 177774 58550 147560 99494 191338 137778 245098 151700
7803A51700K631M421r030J0384J5870p8560M8108Q369o3793N0084k8305N4135
$$ 151700 154331 158752 149722 160106 175976 97416 145524 153893 90100 140184 111879 166014
7791A66014k5774k6982r0224M7544Q7657q0611o694l1707M8181n4591L911K0235
$$ 166014 140240 113258 23034 70578 158235 77624 70930 39223 87404 32813 36724 56959
7779E6959M8364P108j9250j8262J9678J01506l8056M5206k5466n1324M2334M2796
$$ 56959 105323 112431 93181 74919 94597 196103 158047 203253 177787 126463 168797 211593
7767B11593j09900K8664O1322L3802j2747J8372j8784q2687Q3986o0273m366R8088
$$ 211593 101693 130357 191679 225481 212734 231106 212322 129635 213621 153348 148982 247070
7755B47070n1484M7602p4617Q7538r5637M2487Q7809j25370K4611j1229J4149
$$ 247070 195586 243188 168571 256109 160472 202959 290768 165398 190009 178780 192929
7744A92929r9339M2682R72M9146j7981j193k3793j7067Q6307o7155K5248K5942
$$ 192929 93590 136272 137244 186390 168409 167216 143423 126356 212663 145508 170756 196698
7732A96698m8497Q698M0547r60l6365J2298K7336j4595r228m85O7172j16544Q8402
$$ 196698 148201 156899 197446 196486 160121 172419 199755 185160 175932 175447 242619 126075 214477
7719B14477L0752o1936j2925N9852O006J0883q9191J23777l2191k4892j8044K4435
$$ 214477 245229 183293 170368 230220 236226 247109 157918 281695 249504 224612 206568 231003
7707B31003k9027o22M7303l7477j8012K4428L0021L985K7723j9760k0040n0113
$$ 231003 201976 201354 248657 211180 193168 217596 247617 251602 279325 259565 239525 189412
7695A89412M3058P1912m2295R492J3362K006J7722k8889j6390L9515J5761P6714
$$ 189412 232470 304382 262087 271579 284941 286947 304669 275780 259390 298905 314666 391380
7683C91380p0670M5189q9366N2759L867l8910K4523N4638n7724N4257J5141n2175
$$ 391380 320710 365899 276533 329292 333159 294249 318772 373410 315686 369943 385084 332909
7671C32909K0710m216m0974o7876Q3711J27860j15903r933L5826o3178m5338J28245
$$ 332909 353619 349403 308429 240553 324264 452124 336221 326288 362114 298936 253598 381843
7659C81843m28o9344K9042M039n5804L4364o384K2018r1263P4278N5770n360M9870
$$ 381843 381415 312071 341113 345152 289348 323712 317328 339346 248083 322361 378131 372771 422641
7646D22641K5202N9436q7629M7635o4448L5407k1906K7866m6430M6595j7118k1612
$$ 422641 447843 507279 419650 467285 402837 438244 416338 444204 397774 444369 427251 405639
7634D05639J10967r0253k4503J46790j37404K0226P0522r801K2784m1178J01094
$$ 405639 516606 426353 401850 548640 411236 431462 501984 492183 514967 473789 574883
7623E74883q8845J4156l2160K0899K9882o3339j2240N1363k2138M5981J217n4000
$$ 574883 486038 500194 468034 488933 518815 455476 443236 494599 472461 518442 519659 465659
7611D65659Q0038l2303k1488k607j4151O5815m6321l905k4692M6908L912m2707
$$ 465659 545697 513394 491906 489299 475148 540963 494642 490737 466045 512953 516865 474158
7599D74158O6063O5118K5722p5163l3515p593R1177q413n4288J03809o1197m1345
$$ 474158 540221 605339 631061 555898 522383 514790 605967 597554 543266 647075 585878 544533
7587E44533L1032L3671J4096K2518L2542j3922m2528M9901J28333l9142l9459
$$ 544533 575565 609236 623332 645850 678392 664470 621942 671843 800176 761034 721575
7576G21575j0217J11554o7877r791J0333J15056n0275K8762n7884P3074k6629
$$ 721575 711358 822912 755035 745244 755577 870633 820358 849120 791236 864310 837681
7565H37681j8525q900K9555M7959j3131R197m0674J33801k2776M5495k3412J04848
$$ 837681 819156 810256 839811 887770 874639 883836 843162 976963 954187 999682 976270 1081118
7553A081118p6943j4091Q024P6877o4874L5157k346L5346R6448J11561P8871M3480
$$ 1081118 1004175 990084 998108 1074985 1010111 1045268 1042922 1078268 1174716 1286277 1365148 1408628
7541A408628J09546J16883m2444Q619M166N8060m7396R8888p2514N1542q8034
$$ 1408628 1518174 1635057 1592613 1601232 1605398 1663458 1616062 1714950 1642436 1693978 1605944
7530A605944R3455j3872j6761k4955Q2493k1251J05754J3840j7239J36088j1536
$$ 1605944 1699399 1685527 1668766 1643811 1726304 1705053 1810807 1824647 1807408 1943496 1931960
7519A931960R9491J57896O9951J49013K4702P1819J0685j63610j4512r6959p4767
$$ 1931960 2031451 2189347 2259298 2408311 2433013 2504832 2515517 2351907 2337395 2240436 2165669
7508B165669M7739K8398O6024O6897J53582K5082K7832O3078m7850j6188O8430
$$ 2165669 2213408 2241806 2307830 2374727 2528309 2553391 2581223 2644301 2596451 2580263 2648693
7497B648693J291J8577J4875L672L1702J06200P9064J10869Q9352o9824M6476
$$ 2648693 2649984 2668561 2683436 2687108 2718810 2825010 2904074 3014943 3104295 3034471 3080947
7486C080947o2979l3426M578J23529K7170J85121K36479J65570M1926O1634M281
$$ 3080947 3017968 2984542 2989120 3112649 3139819 3324940 3561419 3726989 3768915 3830549 3834830
7475C834830q8374j37750L1793j37575j09861j9811q6628j7233R3355M8467L4480
$$ 3834830 3746456 3608706 3640499 3502924 3393063 3373252 3286624 3269391 3362746 3411213 3445693
7464C445693R7360R5470m516Q4207O5769J07994J24242J25956J82353K23135J77713
$$ 3445693 3543053 3638523 3634007 3718214 3783983 3891977 4016219 4142175 4324528 4547663 4725376
7453D725376M6561J48938J25327M182j9048O0775J28939j08453J46719J0601K6729
$$ 4725376 4771937 4920875 5046202 5050384 5031336 5092111 5221050 5112597 5259316 5269917 5296646
7442E296646O4627J46774M4664O7634O0780O1641P2386J43069O7085L1316Q451
$$ 5296646 5361273 5508047 5552711 5620345 5681125 5742766 5815152 5958221 6025306 6056622 6065073
7431F065073K5110P8971R4112O1627O2286Q5632J8407J18841k1083J52426P6951
$$ 6065073 6090183 6169154 6263266 6324893 6387179 6472811 6491218 6610059 6588976 6741402 6818353
7420F818353J21466J80842R0905O2134J37763J80410J70638J52861M0770J94383
$$ 6818353 6939819 7120661 7211566 7273700 7411463 7591873 7762511 7915372 7956142 8150525
7410H150525J58532J54574M1385K11763J32832J55848J78539J11266J97276J10789
$$ 8150525 8309057 8463631 8505016 8716779 8849611 9005459 9183998 9295264 9492540 9603329
7400I603329K09208J38688K08312J87711K91663K51466K23030K66299L28550K68828
$$ 9603329 9812537 9951225 10159537 10347248 10638911 10890377 11113407 11379706 11708256 11977084
7390A1977084L18561L35616K68362L23540K79754L35797K59472L25875L20666
$$ 11977084 12295645 12631261 12899623 13223163 13502917 13838714 14098186 14424061 14744727
7381A4744727K69622L06498L74464L22844N21898N01171L95384N37419M75716
$$ 14744727 15014349 15320847 15695311 16018155 16540053 17041224 17436608 17974027 18449743
7372A8449743N62774O53859O75608O89600O43499Q64926P57890Q18455R39578
$$ 18449743 19012517 19666376 20341984 21031584 21675083 22540009 23297899 24116354 25055932
7363B5055932J030695J097077J314971J430756J696967J870121J984698K235305
$$ 25055932 26086627 27183704 28498675 29929431 31626398 33496519 35481217 37716522
7355C7716522K415512K615266K994183L218625L662508M304045M971576N701405
$$ 37716522 40132034 42747300 45741483 48960108 52622616 56926661 61898237 67599642
7347F7599642O696340P736931Q893369J0195840J1822103J3644580J5764511J8229771
$$ 67599642 74295982 82032913 90926282 101122122 112944225 126588805 142353316 160583087
7339A60583087K0842050K3082531K4959219K4931029K3234417J8988075J2745688
$$ 160583087 181425137 204507668 229466887 254397916 277632333 296620408 309366096
7332C09366096N273277k402236r694251j5141089j8946732k0966289k1620288
$$ 309366096 314639373 312237137 302542886 287401797 268455065 247488776 225868488
7325B25868488k0949026j9615267j7789734j5742533j3946082j2179919j0545785
$$ 225868488 204919462 185304195 167514461 151771928 137825846 125645927 115100142
7318A15100142r344596q092165p199284o304063n720345n185593m456600m176504
$$ 115100142 105755546 97663381 90464097 84160034 78439689 73254096 68797496 64620992
7310F4620992l628464l237933k875911k498479k354130k178292j983228j817871
$$ 64620992 60992528 57754595 54878684 52380205 50026075 47847783 45864555 44046684
7302D4046684j812451j750411j503503j473795j461151j256527j289516j177083
$$ 44046684 42234233 40483822 38980319 37506524 36045373 34788846 33499330 32322247
7294C2322247j110569j013580r53625r52740q61097q50273p38439p57805p61919
$$ 32322247 31211678 30198098 29244473 28291733 27430636 26580363 25841924 25084119 24322200
7285B4322200o80250p09644n89614o22915n85191n53849n24353m95439n15702
$$ 24322200 23641950 22932306 22342692 21719777 21134586 20580737 20056384 19560945 19045243
7276A9045243m33283m90239l39204n12084k83503l86812l69098l63131l04391
$$ 19045243 18611960 18121721 17782517 17270433 16986930 16600118 16231020 15867889 15563498
7267A5563498m73843l25584k83630l37367l46934k84959k00488m06042k46181
$$ 15563498 15089655 14764071 14480441 14143074 13796140 13511181 13310693 12904651 12658470
7258A2658470k51791j87985k87965k62198j99529j59930k25365j94851k03427
$$ 12658470 12406679 12218694 11930729 11668531 11469002 11309072 11083707 10888856 10685429
7249A0685429j38770j89887r4854j78665j48426j55139j36194k10179j99247o6832
$$ 10685429 10546659 10356772 10261918 10083253 9934827 9779688 9643494 9433315 9234068 9167236
7239I167236j35925k29291j65704j98370p8152j99838j32338r7300j59071j52678
$$ 9167236 9031311 8802020 8636316 8437946 8359794 8159956 8027618 7930318 7771247 7618569
7229G618569q3675r5074j09674j00816l110j12525q4471j20613j7537o5973o5384
$$ 7618569 7534894 7439820 7330146 7229330 7226220 7113695 7029224 6908611 6891074 6825101 6759717
7218F759717m529q0274j08704q0571n8711o9202o6914k1170m9976n3952J9989
$$ 6759717 6755188 6674914 6566210 6485639 6426928 6357726 6290812 6269642 6219666 6165714 6185703
7207F185703p573n7196p546L5774m3237q6708L8616K2439n0073L6928l8727k9287
$$ 6185703 6178130 6120934 6113388 6149162 6105925 6019217 6057833 6080272 6030199 6067127 6028400 5999113
7195E999113K836m1874l837m3762N6034j04252l6300q994o0364L3579r3984K5248
$$ 5999113 6001949 5960075 5956238 5912476 5968510 5864258 5827958 5818964 5758600 5792179 5698195 5723443
7183E723443k3440J9011l0365l8676o6101n0390L3656m0542l5124j10306P1810
$$ 5723443 5700003 5719014 5688649 5649973 5583872 5533482 5567138 5526596 5491472 5381166 5452976
7172E452976P685n2225K8794Q9084K4801j0767l2630R3230k7084J0447M7921O3861
$$ 5452976 5460661 5408436 5437230 5526314 5551115 5540348 5507718 5600948 5573864 5584311 5632232 5696093
7160E696093k9941j7014P9315N2530K4001K6762P940j15825O5451L0191o6077
$$ 5696093 5666152 5649138 5728453 5780983 5804984 5831746 5839686 5723861 5789312 5819503 5753426
7149E753426l3610Q2956j7068L2411m641L9810M1850N7666K4000Q0979L3142m4864
$$ 5753426 5719816 5802772 5785704 5818115 5813474 5853284 5895134 5952800 5976800 6057779 6090921 6046057
7137F046057R7245J8301J3122O9843L381J18705J28J23125Q2687M1274O7363O0041
$$ 6046057 6143302 6161603 6174725 6244568 6247949 6366654 6366782 6489907 6572594 6613868 6681231 6741272
7125F741272J82426J05515Q5822J55824O146J61371Q7690M3949J49922J24091
$$ 6741272 6923698 7029213 7115035 7270859 7277005 7438376 7526066 7570015 7719937 7844028
7115G844028R1125J23362P5533J74866J57228P2430P2593K08523P983J71348K26795
$$ 7844028 7935153 8058515 8134048 8308914 8466142 8538572 8611165 8819688 8827671 8999019 9225814
7104I225814J94818J31485J58214J90610K48625J68400J97635J66292J67275J43485
$$ 9225814 9420632 9552117 9710331 9900941 10149566 10317966 10515601 10681893 10849168 10992653
7094A0992653J28991K02113J79147K03973K24202K35118K63945J49909K76092
$$ 10992653 11121644 11323757 11502904 11706877 11931079 12166197 12430142 12580051 12856143
7085A2856143J45334J82561J75754J33330K79020J22637J65593O0890K30574J6024
$$ 12856143 13001477 13184038 13359792 13493122 13772142 13894779 14060372 14121262 14351836 14367860
7075A4367860J01284J44444p274j5808k422L8405r7236n8290l7893j11705j53250
$$ 14367860 14469144 14613588 14606314 14590506 14588084 14626489 14529253 14470963 14433070 14321365 14168115
7064A4168115j05638j21132k20225j52284j63769k55590k45394l00910j60009
$$ 14168115 14062477 13941345 13721120 13568836 13405067 13149477 12904083 12603173 12443164
7055A2443164l53106j81267k66895l14401k80715k61108l35418k51148l25923
$$ 12443164 12090058 11908791 11641896 11327495 11046780 10785672 10450254 10199106 9873183
7046I873183k02945k50855l75955j98384k84733j88622l65536j39751k55008j82133
$$ 9873183 9670238 9419383 9043428 8845044 8560311 8371689 8006153 7866402 7611394 7429261
7036G429261k46940k65189j53212j95341k55384j42236k54231j91094n0470k37371
$$ 7429261 7182321 6917132 6763920 6568579 6313195 6170959 5916728 5725634 5675164 5437793
7026E437793j00035k55523q4483j27803j36287r3865k29390p9690j57854j24467
$$ 5437793 5337758 5082235 4997752 4869949 4733662 4639797 4410407 4330717 4172863 4048396
7016D048396o081j83924j47241k9847j72754Rj38461q0825l5672m5306k16633
$$ 4048396 4042315 3858391 3711150 3681303 3508549 3508558 3370097 3289272 3253600 3208294 2991661
7005B991661m9765l6973j4344j10412o7544m5740r5039r8394o8588K9080j09904
$$ 2991661 2941896 2904923 2890579 2780167 2712623 2666883 2571844 2473450 2404862 2433942 2324038
6994B324038m8778j42200Q706r4910K3993o7603p4211j49546M0435m8879M4367
$$ 2324038 2275260 2133060 2141766 2046856 2070849 2003246 1929035 1779489 1819924 1771045 1815412
6983A815412j46972P58o1306m5950m7499N7035j63119m6137M4130o4799m3974
$$ 1815412 1668440 1669198 1607892 1561942 1514443 1571478 1408359 1362222 1406352 1341553 1297579
6972A297579L9043o6859o2713J0483k1375j1817q4170p852j9810j377j12587R198
$$ 1297579 1336622 1269763 1207050 1217533 1196158 1184341 1100171 1092319 1072509 1071132 958545 967743
6960I67743P0486q8166k224m289L7281q6103J0159k4772r3628L3685K7556l3191
$$ 967743 1038229 950063 947839 943550 980831 894728 904887 880115 786487 820172 847728 814537
6948H14537j7799M7665j8545j3006m6363M2060r9785j3341j5642L7357k3568l9826
$$ 814537 796738 844403 825858 812852 766489 808549 708764 695423 679781 717138 693570 653744
6936F53744L3314m7150L598Q14K9399j01200M967L6204J0140p5563j3191J6445
$$ 653744 687058 639908 643506 644320 673719 572519 577486 613690 623830 548267 535076 551521
6924E51521o5779K3794o7531K5843L478N3346r9773Q7628j31868Q3695j16766
$$ 551521 485742 509536 442005 467848 471326 524672 424899 512527 380659 464354 347588
6913C47588J9781J7919L1542j12222K3957K5115k8252N2512M9105j06313O163
$$ 347588 367369 385288 416830 304608 328565 353680 325428 377940 427045 320732 326895
6902C26895n1526M6636r251l7988l2537P1948j7572L9478m5052m0317M0751L0948
$$ 326895 275369 322005 312754 274766 242229 314177 296605 336083 291031 250714 291465 322413
6890C22413o2990j0643K4386O537q9518Q171L4370J5975N557m7149Q3543n4468
$$ 322413 259423 248780 273166 279703 190185 198356 232726 248701 254258 207109 290652 236184
6878B36184j967m2002L9380j9813m353O536L9432n8062Q1098j03202J5685n8402
$$ 236184 234217 192215 231595 211782 207429 213965 253397 195335 276433 173231 188916 130514
6866A30514J69505r9957q0246p3920Q6086K9369L032o0545l9747Q1104n5843O7806
$$ 130514 300019 200062 119816 45896 131982 161351 164383 103838 64091 145195 89352 157158
6854A57158N6411j60213O9152L8335m1333q2723R0565J083m9812m7081P4625o9718
$$ 157158 213569 53356 122508 160843 119510 36787 127352 128435 78623 31542 106167 36449
6842C6449J44466j1375o9419J9177q5746O9535j528q3779P5886m3941P4650m8801
$$ 36449 180915 169540 100121 119298 33552 103087 101559 17780 93666 49725 124375 75574
6830G5574m2903Q7057k7358k4616k6371K3861L6157o2488N0447m5129M9163K1106
$$ 75574 32671 119728 92370 67754 41383 65244 101401 38913 89360 44231 93394 114500
6818A14500n7767k297M5746Q634J4771q6416N3332L264p3426P9223j07305O3798
$$ 114500 56733 54436 100182 108816 123587 37171 90503 93767 20341 99564 -7741 56057
6806E6057N5660l7064n7829R2342o6490M1997l8842N301l6114M1587N6038q5290
$$ 56057 111717 74653 16824 109166 42676 84673 45831 51132 15018 56605 112643 27353
6794B7353N790o277p4787O1350J396J0732j8778M3523q1401j9467M0153O8276
$$ 27353 33143 26866 -47921 13429 14825 25557 6779 50302 -31099 -50566 -10413 57863
6782E7863o2999K728L7629m9894O8055O2907n9580j4529K2485q37p3646L2795
$$ 57863 -5136 -2408 35221 -14673 53382 116289 56709 42180 64665 63828 -9818 22977
6770B2977J29l3806N16P4799K9187p2376O6521o5412O0265m4489J9240n449p7490
$$ 22977 23106 -10700 -10184 64615 93802 21426 87947 22535 82800 38311 57551 52102 -25388
6757b5388m6483J28742j0245l9209n036J27033q5930N8044M2490k8737j26461
$$ -25388 -71871 56871 46626 7417 2381 129414 43484 101528 144018 115281 -11180
6746a1180Q0254M8713k9556K8715m8292P9174P012r0436J19018n4237n6409k6449
$$ -11180 69074 117787 88231 116946 68654 147828 154840 64404 183422 129185 72776 46327
6734D6327L5436o3910R3132k0193r8905O183K0969K9985k2662j7757R6239k0371
$$ 46327 81763 17853 110985 90792 -8113 -1930 19039 49024 26362 8605 104844 84473
6722H4473p8514O29l3374N1119q6110R3317p100J3142m9511N3414p191P00k8430
$$ 84473 5959 6588 -26786 24333 -61777 31540 24440 37582 -11929 41485 34294 34994 6564
6709F564N7966l8252n063K3313m4865j3304J0808O0237n5630M3208J5304K9963
$$ 6564 64530 26278 21215 44528 -337 -13641 -2833 57404 1774 44982 60286 90249
6697I0249r9098K8870J03284j25239O6869L2631o5914L418l162o258Q2413o7329
$$ 90249 -8849 20021 123305 -1934 64935 97566 31652 35070 31908 25650 108063 40734
6685D0734n40p1851J28254m4180M4854j25168R9323N0122l226L1385p8933o660
$$ 40734 40194 -31657 96597 52417 97271 -27897 71426 121548 118322 149707 70774 64114
6673F4114Q1879o6499O0483j4625n4410K7882L5815n4566L3097m0580k3709j8287
$$ 64114 145993 79494 139977 125352 70942 98824 134639 80073 113170 72590 48881 30594
6661C0594N5472O0745l2963K3921o786N185p258R30j0019l8160L0350j557J5180
$$ 30594 86066 146811 113848 137769 130983 136168 128910 129840 119821 81661 112011 110454 125634
6648A25634l2786M0841K1499q9109L943Q8770j7832q9981M1081P2389K3034j07497
$$ 125634 92848 133689 155188 66079 70022 158792 140960 50979 92060 164449 187483 79986
6636G9986R0106Q0806r4050K1063N1022r1642o423L6835K8889m017o8079M2436
$$ 79986 170092 250898 156848 177911 228933 137291 130868 167703 196592 192575 124496 166932
6624A66932l4492K316M4594O6655o5133l9460J22654l3028r283M0448l3967k0755
$$ 166932 132440 134756 179350 246005 180872 141412 264066 231038 221755 262203 228236 207481
6612B07481O8742J7909p4057n0698J66653n8700N350p7145J08952n8758p7459
$$ 207481 276223 294132 220075 169377 336030 277330 282680 205535 314487 255729 178270
6601A78270M9379R233k324O7224j0947M2859r5250O2081k2720Q6143r807j9632
$$ 178270 227649 236882 234558 301782 290835 333694 238444 300525 277805 363948 354141 334509
6589C34509N9503l5627o0743O8767n512l2071J6657N3790p6843j7852J02810m1030
$$ 334509 394012 358385 297642 366409 360897 328826 345483 399273 322430 304578 407388 366358
6577C66358k7166M2464m131n3194L4996P53m252j3954J2393N6120k6323k9571
$$ 366358 339192 381656 377525 324331 359327 360080 355828 341874 354267 410387 384064 354493
6565C54493P0448M479m6681K3229L4929n4119o1382Q5363m5838J2117Q6282J2080
$$ 354493 424941 429420 382739 405968 440897 386778 325396 410759 364921 377038 463320 475400
6553D75400l5689m2547P1558m1187m1709J3421R4071m3379k350R1657m317m5615
$$ 475400 439711 397164 468722 427535 385826 399247 493318 449939 447589 539246 534929 489314
6541D89314m8186R9345n2693j2596P5743p2963J269J26308m8026Q5067j08887
$$ 489314 441128 540473 487780 475184 550927 477964 479233 605541 557515 642582 533695
6530E33695J23394N0829r0085k5450J20211o07k5361J9541K1486K4166P9513p877
$$ 533695 657089 707918 617833 592383 712594 711987 686626 706167 727653 751819 831332 823455
6518H23455J3891p4430J30955k6725j4667k2633Q3960M0204K687J22522l7345
$$ 823455 837346 762916 893871 867146 852479 829846 913806 954010 956697 1079219 1041874
6507A041874O0031N6000Q9087L8646l2694J59506K9908p520j3963R7991n8209
$$ 1041874 1101905 1157905 1246992 1285638 1252944 1412450 1442358 1434838 1420875 1518866 1460657
6496A460657J40558J5592J29254N9512R1985Q3682J32398J65322K90567J97792
$$ 1460657 1601215 1616807 1746061 1805573 1897558 1981240 2113638 2278960 2569527 2767319
6486B767319N83539O47497P92409N88693N04306M76306N43748O38583R58646P87623
$$ 2767319 3350858 3998355 4790764 5379457 5883763 6360069 6903817 7542400 8501046 9288669
6476I288669M16037K00145K95958L82443P75588R10676M49317j584m26319k96134
$$ 9288669 9704706 9904851 10200809 10583252 11358840 12269516 12718833 12717249 12290930 11994796
6466A1994796l61138j80018k19141m35914p14007o93698p11992m65375l95063
$$ 11994796 11633658 11453640 11234499 10798585 10084578 9390880 8678888 8213513 7818450
6457G818450n58394n85832n14386o24906o15920n89439m92821n18808k84973k58065
$$ 7818450 7260056 6674224 6159838 5534932 4919012 4329573 3836752 3317944 3032971 2774906
6447B774906k28322k31804l6707q7547j20130j2916o2675o0005n0711J5896l0330
$$ 2774906 2546584 2314780 2278073 2190526 2070396 2057480 1994805 1934800 1884089 1899985 1869655
6436A869655k0940q3674L493p3989j14107k0678j00750p3663M8610n7862k3771
$$ 1869655 1848715 1765041 1768534 1694545 1580438 1559760 1459010 1385347 1433957 1376095 1352324
6425A352324q3442K8054j8345j17201j4364k1023k3560m3648M6824N2600N8128
$$ 1352324 1268882 1296936 1278591 1161390 1147026 1126003 1102443 1058795 1105619 1158219 1216347
6414A216347L5816Q1955J19284L8142K0534L3111r8414j9747l9279j34193j14596
$$ 1216347 1252163 1334118 1453402 1491544 1512078 1545189 1446775 1427028 1387749 1253556 1138960
6403A138960q904k9185j29909j4338O420o0504o3994M55j6783j29808O427k368
$$ 1138960 1130056 1100871 970962 956624 963044 902540 838546 839001 822218 692410 698837 696469
6391F96469j5726M2998n0355Q193P3130j6513J19222O2168o8052j1220n9258M4215
$$ 696469 680743 723741 673386 681579 754709 738196 857418 919586 851534 840314 781056 825271
6379H25271j50569j0856l2167n2632j768Q3397j31791k4774J658j2804l2971n922
$$ 825271 674702 663846 631679 579047 577279 660676 528885 504111 505769 492965 459994 454072
6367D54072p6215L0489p363J7571M525q809m5532M63N3977r2777M0533p1710Q9480
$$ 454072 377857 408346 400983 418554 423079 414270 368738 369201 423178 330401 370934 299224 388704
6354C88704p9242k4518K8301n8015K1682R4303q7208m4151N1089M8225j1091l0829
$$ 388704 309462 284944 313245 255230 276912 371215 284007 239856 290945 339170 328079 297250
6342B97250J4196P785r4942Q4717L1414M7392j04884R9669j09964K7037L6320
$$ 297250 311446 319231 224289 309006 340420 387812 282928 382597 272633 299670 335990
6331C35990L0299m0039k3614L6569l3724m0763N0351N752M3640k4419L7394l9315
$$ 335990 366289 326250 302636 339205 305481 264718 315069 320821 364461 340042 377436 338121
6319C38121l1447Q7788q9185O607J8864Q5626Q4q8139J0188K1362k3224l1637
$$ 338121 306674 394462 305277 311884 330748 416374 416458 328319 338507 359869 336645 305008
6307C05008N5811l3413O4061J3420J771o6030J6103O7797j28341M3126M219Q7299
$$ 305008 360819 327406 391467 404887 406658 340628 356731 424528 296187 339313 343532 430831
6295D30831o4994L2797K1252m0558j0541R0883j18141O9268l402M269J4505m1100
$$ 430831 365837 398634 419886 379328 368787 459670 341529 410797 407395 411664 426169 385069
6283C85069n8539R7844k4041N0464J6772j2589k4424J25826j07905M7645o5103
$$ 385069 326530 424374 400333 450797 467569 454980 430556 556382 448477 496122 431019
6272D31019R9650o161n9035N2420N5712L6648l9820l3709K9726P8600k9628L8867
$$ 431019 530669 524508 465473 517893 573605 610253 570433 536724 566450 645050 615422 654289
6260F54289J2062J3061N3048O104j3733J7163O5219L1543j5945M4501M1027Q064
$$ 654289 666351 679412 732460 738564 724831 741994 807213 838756 822811 867312 908339 916403
6248I16403J4812O4071J29695L241J28125J01397R3757J70309J30402J29041L0631
$$ 916403 931215 995286 1124981 1128222 1256347 1357744 1451501 1621810 1752212 1881253 1911884
6237A911884J75289N6686J3262N6308L0108l2303l5984m6648j1884j57182k0135
$$ 1911884 2087173 2143859 2157121 2213429 2243537 2211234 2175250 2128602 2116718 1959536 1939401
6226A939401L9538M343n7383J16757L5928K1543k138J45230K08060O3866K00410
$$ 1939401 1978939 1983282 1925899 2042656 2078584 2100127 2097989 2243219 2451279 2515145 2715555
6215B715555J57744K06388J60044L73270K07912L22279K90423L28058K13379J42848
$$ 2715555 2873299 3079687 3239731 3613001 3820913 4143192 4433615 4761673 4975052 5117900
6205E117900K06712k6445k5325j54321q2903j30788k14728k8448j40248j25814
$$ 5117900 5324612 5298167 5272842 5118521 5035618 4904830 4690102 4661654 4521406 4395592
6195D395592J9124K61n573M3428n841r166L6137r01O2866M0355R2508J25920K16191
$$ 4395592 4414716 4414977 4409404 4452832 4446991 4437825 4473962 4473061 4535927 4576282 4668790 4794710 5010901
6182E010901J54083K13538L96289J73524K20712J99197J90821P3495M816N424
$$ 5010901 5164984 5378522 5774811 5948335 6169047 6368244 6559065 6632560 6637376 6642800
6172F642800j07313n9554j16678k3717j01471p543J03599m2988N5240N207J07555
$$ 6642800 6535487 6475933 6359255 6335538 6234067 6226524 6330123 6287135 6342375 6347582 6455137
6161F455137r9072m3376j4539p0310j42113q7229n7406n338K1181m053J5530P0815
$$ 6455137 6356065 6312689 6298150 6227840 6085727 5998498 5941092 5935754 5956935 5952882 5968412 6039227
6149F039227R1168R9901j947J2505q5562k3762j32650j43215j28093j72629j15574
$$ 6039227 6130395 6230296 6228349 6240854 6155292 6131530 5998880 5855665 5727572 5554943 5439369
6138E439369j15027j25594j21048J1918m2562p982m9898q0318j54664j19988j46026
$$ 5439369 5324342 5198748 5077700 5089618 5047056 5039074 4989176 4908858 4754194 4634206 4488180
6127D488180j24780j05722k50997q6474j01213j48379j60876k7952k0829j23533
$$ 4488180 4363400 4257678 4006681 3920207 3818994 3670615 3509739 3481787 3460958 3337425
6117C337425q3252j03286j31075j23811l0313j61717n3862j39433r9306n9858
$$ 3337425 3254173 3150887 3019812 2896001 2865688 2703971 2650109 2510676 2411370 2351512
6107B351512j79548k2266p7483p1059o6537L3989j24233q503l0934p8567o8191
$$ 2351512 2171964 2149698 2072215 2001156 1934619 1968608 1844375 1835872 1804938 1726371 1658180
6096A658180J05949J5942l4992n3260J83597j195P7631L7822J36465R3413M8207
$$ 1658180 1764129 1780071 1745079 1691819 1875416 1874221 1951852 1989674 2126139 2219552 2267759
6085B267759N8917Q8615l0782J1794K4718m8536q9503r0188o4930J173j67925
$$ 2267759 2326676 2415291 2384509 2396303 2421021 2372485 2282982 2192794 2127864 2129037 1961112
6074A961112J08909j23974Q5907o115Q5305k8650N1198R8633J07544M4475J77020
$$ 1961112 2070021 1946047 2031954 2025839 2111144 2082494 2133692 2232325 2339869 2384344 2561364
6063B561364P8641P6779K18613K29513J97551K57547J53941J27968R1781J08906
$$ 2561364 2640005 2716784 2935397 3164910 3362461 3620008 3773949 3901917 3993698 4102604
6053D102604J07416J7664l8490j7077o0261o4050r3336O118l6707p0588j03989
$$ 4102604 4210020 4227684 4189194 4172117 4111856 4047806 3954470 3960588 3923881 3853293 3749304
6042C749304L2993o685m2871j6155K3288L9918p6863K1950J6285K2744J70098
$$ 3749304 3782297 3775612 3732741 3716586 3739874 3779792 3702929 3724879 3741164 3763908 3934006
6031C934006J21497M8945J26238J00893J10760L5396j0607L166j8285q9104q3110
$$ 3934006 4055503 4104448 4230686 4331579 4442339 4477735 4467128 4470294 4452009 4362905 4279795
6020D279795r2909j52787m6298K3951j14776p936k3368l2257r3529j9759L9589
$$ 4279795 4186886 4034099 3987801 4011752 3896976 3889040 3865672 3833415 3739886 3720127 3759716
6009C759716R01j01857l0580j06714n6307o6651p4802j86084l9200o1491l1267
$$ 3759716 3760617 3658760 3628180 3521466 3465159 3398508 3323706 3137622 3098422 3036931 3005664
5998C005664p9716j22717l3005n2171q2447L546j5785p9006o265p7399L0113j42365
$$ 3005664 2925948 2803231 2770226 2718055 2635608 2639154 2623369 2544363 2538098 2460699 2490812 2348447
5986B348447l2584k960p9475q2400o5350o2940k6741r6482j2426q6976r5610P9705
$$ 2348447 2315863 2312903 2233428 2151028 2085678 2022738 1995997 1899515 1887089 1800113 1704503 1784208
5974A784208j8392q5557j1011O8526o3062p15N4780o218P7047R7034J76641J92707
$$ 1784208 1765816 1680259 1669248 1737774 1674712 1673997 1728777 1722559 1799606 1896640 2073281 2265988
5962B265988J82443K99462R6727J73208R8990K75226L08928L44496L66126J58715
$$ 2265988 2448431 2747893 2844620 3017828 3116818 3392044 3700972 4045468 4411594 4570309
5952D570309R7398K7476M6169J68459M37979K93178O2321m2699j01317l19819
$$ 4570309 4667707 4695183 4741352 4909811 5347790 5640968 5703289 5660590 5559273 5239454
5942E239454k10989q8993J0658p7394j90545l35019j94889l21740k91612j90647
$$ 5239454 5028465 4939472 4950130 4872736 4682191 4347172 4152283 3830543 3538931 3348284
5932C348284j27036j82774k22533k02229k20573k74881k18895k25544j62884j62453
$$ 3348284 3221248 3038474 2815941 2613712 2393139 2118258 1899363 1673819 1510935 1348482
5922A348482j24604o9153j04187L0912Q164q1096o3158p8811o0342L2904j07481
$$ 1348482 1223878 1154725 1050538 1081450 1089614 1008518 945360 866549 806207 839111 731630
5911G31630l622k4983K5728r3133K4772Q233p8984K3332k3898L4811j2286J9732
$$ 731630 728008 703025 728753 635620 660392 668625 589641 612973 589075 623886 611600 631332
5899F31332j08876k698N0444o5862j1260P0547k2932p3821m8636Q6824r0664l3815
$$ 631332 522456 519758 570202 504340 493080 563627 540695 466874 418238 505062 414398 380583
5887C80583P5477K0487n4439J1242q5100M199N2569P5225n3486n2824j4632O2737
$$ 380583 456060 476547 422108 433350 348250 352449 405018 480243 426757 373933 359301 422038
5875D22038j8794J8627l723m222m5810M2820p6778K1878o224Q5882j3880r4511
$$ 422038 403244 421871 418148 413926 368116 410936 334158 356036 349812 435694 421814 327303
5863C27303M5505O9847q5299j9603N9172Q395p0547L8264l0622O3357p0535K5339
$$ 327303 372808 442655 357356 337753 396925 405320 334773 373037 342415 405772 335237 360576
5851C60576K075M283K3967k7465R1664K1903q0799j7810R9793m8564M9886L3810
$$ 360576 362651 366934 390901 363436 455100 477003 396204 378394 478187 429623 479509 513319
5839E13319R998O4168n1851K4663R5402J08981J3240j5018J03305O1908M4730
$$ 513319 523317 587485 535634 560297 655699 764680 777920 762902 866207 928115 972845
5828I72845K7691N7427K5002R1114J550j5025P1429l2322J03050J0526o290O4421
$$ 972845 1000536 1057963 1082965 1174079 1175629 1160604 1232033 1199711 1302761 1313287 1306997 1371418
5816A371418J4451M8193j0993J49655N5194J10000n6602J52461N0242J3102N8614
$$ 1371418 1385869 1434062 1423069 1572724 1627918 1737918 1681316 1833777 1884019 1897121 1955735
5805A955735J17477p1177J9303J8848l7958j04019l5236j6760j02042r2490l6523
$$ 1955735 2073212 2002035 2021338 2040186 2002228 1898209 1862973 1846213 1744171 1651681 1615158
5794A615158r4405l8030p3288N4684q0150l6028m8133k6268r5335K1362k1073
$$ 1615158 1520753 1482723 1409435 1464119 1383969 1347941 1299808 1273540 1178205 1199567 1178494
5783A178494M305K1329M1755j14249J6704m2211p449r8477j02851K4098k7694
$$ 1178494 1182799 1204128 1245883 1131634 1148338 1106127 1098678 1000201 897350 921448 893754
5772H93754p5267k2034q3095q0166l5190m9043O122j8975k5909K0779p5921n9676
$$ 893754 818487 796453 713358 633192 598002 548959 555081 536106 510197 530976 455055 395379
5760C95379M4194n6666L4065m3491l4652K6390p2305L7863K2659r2120j4669M5007
$$ 395379 439573 382907 416972 373481 338829 365219 292914 330777 353436 261316 246647 291654
5748B91654l8125N766J0206J8118l0593n3560Q4387l1645k1967J0637m4776J959
$$ 291654 253529 259295 269501 287619 257026 203466 287853 256208 234241 244878 200102 202061
5736B02061j872J1566M5712p1845R4510q7180K6473j7860L9980J079n1134N9555
$$ 202061 200189 211755 257467 185622 280132 192952 219425 201565 241545 242624 191490 251045
5724B51045j7948m4420J4055K4544n9646k2898J28921j62n9837M2220m5537k9843
$$ 251045 233097 188677 202732 227276 167630 144732 273653 273491 213654 255874 210337 180494
5712A80494J1130j7102J01195j30266K4080L5179m6875K4661r729Q2930p6942
$$ 180494 191624 174522 275717 145451 169531 204710 157835 182496 172767 255697 178755
5701A78755L1185P4249r339o3953M7205j30239P6795j2683P5726j2523q9694J9564
$$ 178755 209940 284189 274850 210897 258102 127863 204658 191975 267701 255178 165484 185048
5689A85048Q0745q5861k3153J5715M9003M76k1862l9057K2065J9482k2782J854
$$ 185048 265793 179932 156779 172494 221497 221973 200111 161054 183119 202601 179819 181673
5677A81673J20892r1730P0341k3024k1773Q1208O929o4848l5663L5687K1188m8515
$$ 181673 302565 210835 281176 258152 236379 317587 324516 259668 224005 259692 280880 232365
5665B32365R333J6892J13195j59164R6105j9348k1548n367J488P2958q4378R708
$$ 232365 241698 258590 371785 212621 308726 289378 267830 262463 263951 336909 252531 262239
5653B62239L1407k495k5840J15211j2415J2198o9589Q0055j2692J04144N175J68150
$$ 262239 293646 291151 265311 380522 368107 380305 310716 390771 378079 482223 487398 655548
5641F55548p2137N6580R8753p499K9826j7589o9121L7256p2121n099m8304M1065
$$ 655548 583411 639991 738744 731245 761071 743482 674361 711617 639496 634397 586093 627158
5629F27158J9533N1669m4270J9824k8721J22007m5662J3888K5170P8440M3975
$$ 627158 646691 698360 654090 673914 645193 767200 721538 735426 760596 839036 883011
5618H83011J18788K5253J51012R4124J65584P0103K23454P2046R5884J7727Q6508
$$ 883011 1001799 1027052 1178064 1272188 1437772 1507875 1731329 1803375 1899259 1916986 2003494
5607B003494j3834r0618l7464j05763q5748j5618r0401o4859m1564J0410m3888
$$ 2003494 1989660 1899042 1861578 1755815 1670067 1654449 1564048 1499189 1457625 1468035 1424147
5596A424147J932P724M8239K8908l269O7435J35161J38864J07936J80185K10965
$$ 1424147 1426079 1433803 1482042 1510950 1507681 1575116 1710277 1849141 1957077 2137262 2348227
5585B348227K13011J49387K13087K47219J14161J61927K7940o5661J1760k18092
$$ 2348227 2561238 2710625 2923712 3170931 3285092 3447019 3474959 3409298 3421058 3202966
5575C202966j27098k70315r5716j21389j64851j58491k7852p9802r2339j3518
$$ 3202966 3075868 2805553 2709837 2588448 2423597 2265106 2237254 2157452 2065113 2051595
5565B051595K2522n7295L2692Q158K54481m8192R9101K47984J37412J19123K20764
$$ 2051595 2074117 2016822 2049514 2057672 2312153 2263961 2363062 2611046 2748458 2867581 3088345
5554C088345J94316J46867J81801J70270j21093p4825j22473j18621j05914k66555
$$ 3088345 3282661 3429528 3611329 3781599 3660506 3585681 3463208 3344587 3238673 2972118
5544B972118j50306k03248j65500j63099p4362j82201j906j34418j9442m0814
$$ 2972118 2821812 2618564 2453064 2289965 2215603 2033402 2031496 1897078 1877636 1836822
5534A836822K2501q0381N6836J1833k8012K5538J69326J0372J50300J36334M0966
$$ 1836822 1859323 1778942 1835778 1847611 1819599 1845137 2014463 2024835 2175135 2311469 2352435
5523B352435K3891J05381n2640m0763q3297j18278n1482j74374j21775r2292j63553
$$ 2352435 2376326 2481707 2429067 2388304 2305007 2186729 2135247 1960873 1839098 1746806 1583253
5512A583253j24250j0539r9194m1476m1385K361n5528q6603O5589l7250m6327
$$ 1583253 1459003 1448464 1349270 1307794 1266409 1268770 1213242 1126639 1192228 1154978 1108651
5501A108651M8714P0902j20517P2457k0326j0094J435R4734q0271k961j5490k9317
$$ 1108651 1157365 1228267 1107750 1180207 1159881 1149787 1151222 1245956 1165685 1162724 1147234 1117917
5489A117917j68034K8441m3981k6541l0673r252r306p0410o690j9743Q4868j11427
$$ 1117917 949883 978324 934343 907802 877129 867877 858571 788161 781471 761728 846596 735169
5477G35169K9125K7169r108q9471P3481p0725k1233j1509L3429n7893N4754n6178
$$ 735169 764294 791463 782355 692884 766365 695640 674407 662898 696327 638434 693188 637010
5465F37010P2667m9717N0111l8790j915m5211R6095m6986J9739l0718L8807L2867
$$ 637010 709677 659960 710071 671281 669366 624155 720250 673264 693003 662285 701092 733959
5453G33959J38727o5452O9183P4590L5460r757L7071j5278J1965l2382q1748K4897
$$ 733959 872686 807234 876417 951007 986467 976710 1013781 998503 1010468 978086 896338 921235
5441I21235L7114M6614r2684J05262n8244o565M2633k4267K8057R9496N9951o287
$$ 921235 958349 1004963 912279 1017541 959297 952732 995365 971098 999155 1098651 1158602 1152315
5429A152315k8507J65284P5007O3803J45357R3732Q0764N8496l4342J07720m2444
$$ 1152315 1123808 1289092 1364099 1427902 1573259 1666991 1747755 1806251 1771909 1879629 1837185
5418A837185j01640r512M5134m2982J04639k1470M1142J1364J35534K0456P1267
$$ 1837185 1735545 1726033 1771167 1728185 1832824 1811354 1852496 1863860 1999394 2019850 2091117
5407B091117J00800J40117P7607J03158J40266J09555L01016K08872K01055K73796
$$ 2091117 2191917 2332034 2409641 2512799 2653065 2762620 3063636 3272508 3473563 3747359
5397C747359J78931K23566N3849R0513J43532j4286R770P3979L7540J33719J72144
$$ 3747359 3926290 4149856 4203705 4294218 4437750 4423464 4433234 4507213 4544753 4678472 4850616
5386D850616O0669K33960Q7181R5414J21235J77354J44762J99801K75850L10910
$$ 4850616 4911285 5145245 5232426 5327840 5449075 5626429 5771191 5970992 6246842 6557752
5376F557752K34004J59073M32611K16045K44408K04601J37458L295n5678j40857
$$ 6557752 6791756 6950829 7383440 7599485 7843893 8048494 8185952 8189247 8133569 7992712
5366G992712q3874k11025j705k7891o4222O9524l5431o6346j33325p2440r7356
$$ 7992712 7908838 7697813 7696108 7668217 7603995 7673519 7638088 7571742 7438417 7365977 7268621
5355G268621k7152q8773L9987Q792Q9627J6651J68960k1866K5743J2593o2815
$$ 7268621 7241469 7152696 7192683 7201475 7291102 7307753 7476713 7454847 7480590 7493183 7430368
5344G430368k72907j80018l26414k70859l18292j99250k41242j26928j68508q9972
$$ 7430368 7157461 6977443 6651029 6380170 6061878 5862628 5621386 5494458 5325950 5235978
5334E235978k22238k30615j02114j83978k94004o8441k28239k0152j61093n6619
$$ 5235978 5013740 4783125 4681011 4497033 4203029 4134588 3906349 3886197 3725104 3668485
5324C668485j61172j45262p3922r5356k8656j91701l6553j51460j62860j89531
$$ 3668485 3507313 3362051 3288129 3192773 3164117 2972416 2935863 2784403 2621543 2432012
5314B432012j00088j67222j8968j38322r8164j40617l7254p7188q5343m6685L2516
$$ 2432012 2331924 2164702 2145734 2007412 1909248 1768631 1731377 1654189 1568846 1522161 1554677
5303A554677j08339r4105j2954Q5000j33684n8300j6432l5001r8064J2584K7850
$$ 1554677 1446338 1352233 1339279 1424279 1290595 1232295 1215863 1180862 1082798 1095382 1123232
5292A123232k4102k6169m0789k4298j2095r3203p614l2361r0220L6367K3386m6124
$$ 1123232 1099130 1072961 1032172 1007874 995779 902576 894962 862601 772381 808748 832134 786010
5280G86010l6195N6756p1272j01835j5679Q234K1233k4462N3537m1622n8494l4131
$$ 786010 749815 806571 735299 633464 617785 626019 647252 622790 676327 634705 576211 542080
5268E42080Q1999j48068P5241l2085K6850k6540k0504k7017P0958j13357j1494
$$ 542080 624079 476011 551252 519167 546017 519477 498973 471956 542914 429557 418063
5257D18063N129M2583n1801k1914N5686o0962J135o023q3668N9264L0926j19590
$$ 418063 423192 465775 413974 392060 447746 386784 387919 381896 298228 357492 388418 268828
5245B68828J9699j4475J2163q583k0563L5627k7347N478K9358r5180R6247o4263
$$ 268828 288527 274052 286215 277632 257069 292696 265349 270827 300185 205005 301252 236989
5233B36989J38K1919K1028k2768M1591m7242K3808r2569J7971r524J7560K2662
$$ 236989 237127 259046 280074 257306 298897 251655 275463 182894 200865 191341 208901 231563
5221B31563n1214N3858K132n9731m4052P6947o3074K6919j0053N4248j5433o2877
$$ 231563 180349 234207 236339 176608 132556 209503 146429 173348 163295 217543 202110 139233
5209A39233K4930j9464M8383J2852m0880p730L3370l4666n824J6618J4562k6947
$$ 139233 164163 144699 193082 205934 165054 157324 190694 156028 150204 166822 181384 154437
5197A54437N4045r6442l4210J20141p8209K9335l6551J8998J6922m8265O1920
$$ 154437 208482 112040 77830 197971 119762 149097 112546 131544 148466 100201 162121
5186A62121O4221p9130J2847k6148K9244j15770J41485M696j6459K133P876o2422
$$ 162121 226342 147212 160059 133911 163155 47385 188870 193566 177107 179240 187116 124694
5174A24694M203K5429m743k7955O3743p1460P5605k8923k6777k8977Q5594l9993
$$ 124694 128897 154326 149583 121628 185371 113911 189516 160593 133816 104839 190433 150440
5162A50440J1892m1021j9525L5316N3350o2479L9760p525j9014R2909p1742M8279
$$ 150440 162332 121311 101786 137102 190452 127973 167733 160208 141194 234103 162361 210640
5150B10640n2854p5252R5892n241J0593N5068l4835l9748k667o1263O9180k4168
$$ 210640 157786 82534 178426 173185 183778 238846 204011 164263 161596 100333 169513 145345
5138A45345n020K0244J9117l3381l5946P9970o8799O6787L266l6811l6478Q2479
$$ 145345 140325 160569 179686 146305 110359 190329 121530 188317 191583 154772 118294 200773
5126B00773n1214L3357k2929P20M5853o2400k771Q6767n9337k608K5472L3603
$$ 200773 149559 182916 159987 160707 206560 144160 141389 228156 168819 166211 191683 225286
5114B25286j04908J1268l9930J53437q3326m0281k2542J05699n9227l8188j373
$$ 225286 120378 131646 91716 245153 161827 121546 99004 204703 145476 107288 105915
5103A05915Q3472j21118J57170p1132N5126m9359L1035p2157L2002J1465L3176
$$ 105915 189387 68269 225439 154307 209433 160074 191109 118952 150954 162419 195595
5092A95595l4354M8792j09270N2061P2765p7836m0628K8489j2201N3409K4050
$$ 195595 161241 210033 100763 152824 225589 147753 107125 135614 123413 176822 200872
5081B00872r2312O6160l9585k3861P0090m3866j9084P5171q6355L1866l2957L7728
$$ 200872 108560 174720 135135 111274 181364 137498 118414 193585 107230 139096 106139 143867
5069A43867m1311O2496o6837M5989N4880j2622n1350l4404m0924J24359r3003
$$ 143867 102556 165052 98215 144204 199084 186462 135112 100708 59784 184143 91140
5058I1140L054M1981j3032j9094Q530n5535J06335p9574J1046m55M0876n5026
$$ 91140 94194 136175 123143 104049 112579 57044 163379 83805 94851 94396 135272 80246
5046H0246L053M9598J4145n6344J0678l0126l8292O2754M3862l3935j6736k939
$$ 80246 83299 132897 147042 90698 101376 71250 32958 95712 139574 105639 88903 85964
5034H5964L6738m2125N2253p5786O1140q4004P0178p15m2870Q357J8875N3480
$$ 85964 122702 80577 132830 57044 118184 34180 104358 103643 60773 69130 88005 141485
5022A41485o7221J18262q7928J6381n6796J7390N2422k5120J6875R4183n016j36789
$$ 141485 74264 192526 104598 120979 64183 81573 133995 108875 125750 219933 214917 78128
5010G8128Q5844J328p9806Q6577o8369O8140j6441J1777L633o973j5427o1980
$$ 78128 163972 165300 85494 172071 103702 171842 155401 167178 170811 163838 148411 86431
4998H6431J25454l4262o9058J1210k9875Q9238n525J5046l4758M846P2214q0431
$$ 86431 211885 177623 108565 119775 89900 179138 173613 188659 153901 158747 230961 150530
4986A50530L3992L8617L1505j28088R5464m2853Q6892m9362K4356o991N0948q5421
$$ 150530 184522 223139 254644 126556 222020 179167 266059 216697 241053 234062 285010 199589
4974A99589O2838m1833j6659N6497k5585J6665J02585n1536Q4847Q5777j12688
$$ 199589 262427 220594 203935 260432 234847 251512 354097 302561 387408 473185 360497
4963C60497J06879r2955N8402K3791j73760J13565J0390k4516l0011J8981j8393
$$ 360497 467376 374421 432823 456614 282854 396419 406809 382293 352282 371263 352870
4952C52870J4744J6329P7501m7142o2142N2590P5818k1179J9829J1494J9963j8012
$$ 352870 367614 383943 461444 414302 352160 404750 480568 459389 479218 490712 510675 492663
4940D92663P4855M4603J39703n024M3513M5277l0677j4772l1803o0728K5798k5410
$$ 492663 567518 612121 751824 746800 790313 835590 804913 790141 758338 697610 723408 697998
4928F97998K2739J4476k7793L4306O0526p3698L8712j6715O6058J40415K8604
$$ 697998 720737 735213 707420 741726 802252 728554 767266 750551 816609 957024 985628
4917I85628N4309R047N6715N9049N3611J43885J32736J5541J43271Q883M6581
$$ 985628 1039937 1048984 1105699 1164748 1218359 1362244 1494980 1510521 1653792 1662675 1709256
4906A709256m4048r6406j02084p6439j86017o717k04379K237j79055n3320q1485
$$ 1709256 1665208 1568802 1466718 1390279 1204262 1197545 993166 995403 816348 763028 681543
4895F81543r567q531k0618m5569k4145m7949m9577l8120N9908k5248n083K1977
$$ 681543 671976 663445 642827 597258 573113 525164 475587 437467 497375 472127 467044 489021
4883D89021n0178M5422j8127m6742K8011p8276J19339q8834M9446k6682R48O9063
$$ 489021 438843 484265 466138 419396 447407 369131 488470 399636 449082 422400 423348 492411
4871D92411j11128M407P5714l3153o0303k7256n010k3889q5530Q8925q1407L6934
$$ 492411 381283 385690 461404 428251 367948 340692 335682 311793 226263 315188 233781 270715
4859B70715J11866r2383M7136p2039L3750L0621k693p880M6768m2858k7502L7623
$$ 270715 382581 290198 337334 265295 299045 329666 326973 319093 365861 323003 295501 333124
4847C33124m4488K219M1688m7013q269L0908L09j4544l6909N1968L6635o3609
$$ 333124 288636 290855 332543 285530 277261 308169 308478 293934 257025 308993 345628 282019
4835B82019j7908j0389l3113m6701J7872L5535J5592o2871N8189K7189m8424M0887
$$ 282019 264111 253722 220609 173908 191780 227315 242907 180036 238225 265414 216990 257877
4823B57877n6472M1354O522p485m7677N6263j0537L7151p2852Q7932o2846K7478
$$ 257877 201405 242759 249281 241796 194119 250382 239845 276996 204144 292076 229230 256708
4811B56708m1069n266k19J8204J3841m6228J28528q5057r9061J39808n9911N3659
$$ 256708 215639 210373 210154 228358 242199 195971 324499 239442 140381 280189 220278 273937
4799B73937j3969M7498P902M708M3422j9348Q041p3126K6525k5997Q8549j25159
$$ 273937 259968 307466 315368 320076 363498 344150 352191 279065 305590 279593 368142 242983
4787B42983M4878L9816n3735m1915n009M680l8619M2920L4182l0686O8335m7272
$$ 242983 287861 327677 273942 232027 227018 231698 193079 235999 270181 239495 307830 260558
4775B60558N3798m857l313j1037M5414k5296J14022M5772M2360k6063J6243r0245
$$ 260558 314356 309499 306186 295149 340563 315267 429289 475061 517421 491358 507601 417356
4763D17356k7706n3184j07620N5142n2069j3535M6131p7507l2071P1255k9253
$$ 417356 389650 336466 228846 283988 231919 218384 264515 187008 154937 226192 196939
4752A96939N110J943l3095L6877m6939k8738K4138K1891j708m322N4208l3406
$$ 196939 202049 203992 170897 207774 160835 132097 156235 178126 176418 172096 226304 192898
4740A92898J799J8333J7495J4576k5588L6118m8216l5024J9867n2152K4972R59
$$ 192898 194697 213030 230525 245101 219513 255631 207415 172391 192258 140106 165078 166037
4728A66037L3980n4881M0001j18218J5480K1082n5059P4097o0738Q0378m4232
$$ 166037 200017 145136 185137 66919 82399 103481 48422 122519 61781 142159 97927
4717I7927m4737M1596O7649q6722J4384J6753m7398m872J05916n1539m5623K756
$$ 97927 53190 94786 162435 75713 90097 106850 59452 54580 160496 108957 63334 66090
4705F6090n8561P8991j5088K2403j6863k8932J5961L8939o6359O7438k2764j3406
$$ 66090 7529 86520 71432 93835 76972 48040 64001 102940 36581 104019 81255 67849
4693F7849J05K4838N0102l0112k7052M5576j1521l0299L5585q6573P6322l3019
$$ 67849 67954 92792 142894 112782 85730 131306 119785 89486 125071 38498 114820 81801
4681H1801K627N5973n388m0941j9833O0076p5765Q5475K8328l5992n7691L2273
$$ 81801 84428 140401 135013 94072 74239 134315 58550 144025 172353 136361 78670 110943
4669A10943Q1889m2728k752k0182P7322p9713Q3022r0693N4202o3036R1530o017
$$ 110943 192832 150104 147352 127170 204492 124779 207801 117108 171310 108274 199804 193787
4657A93787m2863n320N8970p5884O204P7044j6946k1593M8719J5305n8011K8422
$$ 193787 150924 145604 204574 128690 134894 211938 194992 173399 222118 237423 179412 207834
4645B07834N319O0340o1144n9152R2350j06756R3429K5933j8218M4750K9567q615
$$ 207834 213153 273493 212349 153197 245547 138791 232220 258153 239935 284685 314252 305637
4633C05637k438k4133q857L262m998K3306K1297l8006L7237J4547N0229m3309
$$ 305637 303199 279066 270209 273471 268473 291779 313076 275070 312307 326854 377083 333774
4621C33774j8718N2604K141J863j04563P2584O3219P7074n9675n173K0995r37
$$ 333774 315056 367660 369801 371664 267101 339685 402904 479978 420303 415130 436125 435188
4609D35188p8968N0452L4660o7385N650K7677m2714j2156p2043L295M2250N4641
$$ 435188 356220 406672 441332 373947 379597 407274 364560 352404 280361 283656 325906 380547
4597C80547Q76l56q6097J07132k3174k6068l017L520J4332J1375j184j5223j4701
$$ 380547 381423 381067 294970 402102 378928 352860 349843 353363 367695 379070 377886 362663 347962
4584C47962N4547j03641j0215j0148l1555n317N2197q704L6876m7936J5590m7577
$$ 347962 402509 298868 288653 278505 246950 241633 293830 285126 322002 274066 289656 242079
4572B42079L4457p7405J12964q1290k0936o7262R3460o4223O2860k7394L0188
$$ 242079 276536 199131 312095 230805 209869 142607 236067 171844 234704 207310 237498
4561B37498m28m3080P829k1937K5938k00883J16590Q529L3787k4972L3283q2920
$$ 237498 237070 193990 201819 179882 205820 4937 121527 130056 163843 138871 172154 89234
4549H9234L2416l4569N2333o3979o148N7423j2468r1640J15345r2753J9537K6746
$$ 89234 121650 87081 139414 75435 69287 126710 114242 22602 137947 45194 64731 91477
4537I1477L5635j07201R410K1152N9373j17761Q8878j233l730m1706j2164J5898
$$ 91477 127112 19911 29321 50473 109846 -7915 80963 79730 76000 34294 22130 38028
4525C8028J6636N20p7253J09616p2813K975j034n1798R9240j2203j9458J8402
$$ 38028 54664 55184 -22069 87547 14734 17709 16675 -35123 64117 51914 32456 50858
4513E0858j8695j563N490m5940L604K3104M3415m4530L4242m6611O2164m7188
$$ 50858 32163 30600 36090 -9850 -6246 16858 60273 15743 49985 3374 65538 18350
4501A8350q6958J18721q1962P1830K867m6829j5112K0977m5590J2230p446N1891
$$ 18350 -68608 50113 -31849 39981 42848 -3981 -19093 1884 -43706 -31476 -38922 12969
4489A2969k2211p326j0165j4420O7275n3121K5471J8630l3655K4077o7119Q1287
$$ 12969 -9242 -16568 -26733 -41153 26122 -26999 -1528 17102 -16553 7524 -59595 21692
4477B1692l1508r172m1925L3668P1272n4398J5375r45l3874m4571P7952L6251
$$ 21692 -9816 -18988 -60913 -27245 44027 -10371 5004 4059 -29815 -74386 3566 39817
4465C9817j32751K5675L6990l375j6082M4529K7465m8809K3344n4654O4368k5442
$$ 39817 -92934 -67259 -30269 -33644 -49726 -5197 22268 -26541 -3197 -57851 6517 -18925
4453a8925r118N8908j2996m1696L5576n1320k9826L6914l1299K4879j2773M3624
$$ -18925 -28043 30865 17869 -23827 11749 -39571 -69397 -32483 -63782 -38903 -51676 -8052
4441h052l702l378n751j1945N566r547k7097J1967n032o4419J33663r2127N6294
$$ -8052 -11754 -15132 -20883 -32828 -27262 -36809 -63906 -51939 -56971 -121390 12273 -79854 -23560
4428b3560j3621k1j2441k3289M8148n4498j003j796R632K8554j7063M0224j3059
$$ -23560 -37181 -37202 -49643 -72932 -24784 -79282 -80285 -82081 -72449 -43895 -60958 -20734 -33793
4415c3793L599n303n21O957J1017M1907j8177q092o8074J14108p0837r2502P9103
$$ -33793 -30194 -35497 -36018 -29061 -18044 23863 5686 -2406 -70480 43628 -27209 -119711 -40608
4402d0608j3132N0422r4865Q5016l961K3638l7422K6196j00619Q9954o9371N1280
$$ -40608 -53740 -3318 -98183 -13167 -17128 6510 -30912 -4716 -105335 -15381 -84752 -33472
4390c3472K1164j3473m9150Q3072j8122k6610O5727j10820K5450J1972Q1372n4279
$$ -33472 -12308 -25781 -74931 8141 -9981 -36591 29136 -81684 -56234 -44262 37110 -17169
4378a7169k0676l5690P273M5811j9600r1788J52473p1423O4496j02838N3556n8570
$$ -17169 -37845 -73535 -66262 -20451 -40051 -131839 20634 -50789 13707 -89131 -35575 -94145
4366i4145M6212J1666m3962J2443O3182j4860n5264K4842K1443n3457J3203P0464
$$ -94145 -47933 -36267 -80229 -67786 -4604 -19464 -74728 -49886 -28443 -81900 -68697 1767
4354A767k3461M4949m6184l524L9681j02242j3020J02588j4117l3694R918k8643
$$ 1767 -21694 23255 -22929 -26453 13228 -89014 -102034 554 -13563 -47257 -37339 -65982
4342f5982j4246J8054P8140n3159K555O4477q8297m3002J22275p2271P4576j00151
$$ -65982 -80228 -62174 15966 -37193 -34638 29839 -58458 -101460 20815 -51456 23120 -77031
4330g7031R552Q1055j1921p7907M0034j2686l7869M066J662L8166J840J9662M7662
$$ -77031 -67479 13576 1655 -76252 -36218 -48904 -86773 -82707 -81045 -42879 -41039 -21377 26285
4317B6285o2131o5117N8768j03701P5260J6693m5500O7512L712K0148m5739j2846
$$ 26285 -35846 -100963 -42195 -145896 -70636 -53943 -99443 -31931 -28219 -8071 -53810 -66656
4305f6656J5312o8925N0050K7277L2012k5021j6553K7359j5730n899k2254L5758
$$ -66656 -51344 -120269 -70219 -42942 -10930 -35951 -52504 -25145 -40875 -46774 -69028 -33270
4293c3270l3102P1367l8490K41m7720M6468p6342O2364J0655N4408l0575l4015
$$ -33270 -66372 4995 -33495 -33254 -80974 -34506 -110848 -48484 -37829 16579 -13996 -48011
4281d8011L0453J5340l4684J6036m7558K9861q3543O0441m2389J48488j15550
$$ -48011 -17558 -2218 -36902 -20866 -68424 -38563 -122106 -61665 -104054 44434 -71116
4270g1116M1958J2125n5759N4028n009n1518l3276K6183l8535Q1486J7902l8160
$$ -71116 -29158 -17033 -72792 -18764 -23773 -75291 -108567 -82384 -120919 -39433 -21531 -59691
4258e9691M6621K6281o1549j410J9823l4741k9194o3896k730J62147m6039K7659
$$ -59691 -13070 13211 -48338 -49748 -29925 -64666 -93860 -157756 -160486 1661 -44378 -16719
4246a6719j9n394K883p5823P0560r7892K2819J05407m9692m5453L332L7201l6207
$$ -16719 -16738 -22132 -19249 -95072 -24512 -122404 -99585 5822 -43870 -89323 -85991 -48790 -84997
4233h4997L3612o677K3592n2766J9201m5780N4390k9265O754p028N9599M5995
$$ -84997 -51385 -58062 -34470 -87236 -68035 -113815 -59425 -88690 -81936 -88964 -29365 16630
4221A6630j9946J41J8241L827M552k4325Q936n9078Q4577n8833L0549j6621N371
$$ 16630 -3316 -3175 15066 18893 23445 -880 8056 -51022 33555 -25278 5271 -11350 -5979
4208e979l1830J2635P3284j04131K5268K0808j4019k4109j0391J9026m2470K8676
$$ -5979 -37809 -25174 48110 -56021 -30753 -9945 -23964 -48073 -58464 -39438 -81908 -53232
4196e3232Q712K6833O9686n9133Q331p4214P180N5564n238j1911l7579P5350m0458
$$ -53232 -44520 -17687 51999 -7134 1197 -73017 -65837 -10273 -15511 -27422 -65001 10349 -30109
4183c0109l0950M7101k7602M4966o3249J7779J869q1283K3119N5014m9167L3808
$$ -30109 -61059 -13958 -41560 3406 -59843 -42064 -40195 -121478 -98359 -43345 -92512 -58704
4171e8704N70O225l9483O8227n0848O5971p4923M1010j0057j0463N0175o5666
$$ -58704 -58134 -51909 -91392 -23165 -74013 -8042 -82965 -41955 -52012 -62475 -12300 -77966
4159g7966O0400o4459k438J14075j02675J14191p2148K7830j0631m03K4753l0421
$$ -77966 -17566 -82025 -84463 29612 -73063 41128 -31020 -3190 -13821 -14224 10529 -19892
4147a9892k671J24220j8376k3419P475J0724l5719l4113N7644q355n6266J4792
$$ -19892 -22563 101657 83281 59862 67337 78061 42342 8229 65873 57518 1252 16044
4135A6044J6273p1589L3851Q162j4380k8871O530j1717O346m184P8778n6950m2874
$$ 16044 32317 -39272 -5421 2741 -11639 -40510 -33980 -45697 -39351 -43535 35243 -21707 -64581
4122f4581j2990N9651k1928k5387q260Q3323k0654o734n2551M1173O480P1973
$$ -64581 -77571 -17920 -39848 -65235 -73495 9828 -10826 -17560 -70111 -28938 -22458 49515
4110D9515p5326L2347r579j7812q244j7871N143N1215o4037L0070M5580o2545
$$ 49515 -25811 6536 -3043 -20855 -29099 -46970 -41827 9388 -54649 -24579 21001 -41544
4098d1544O4973n9504j9578J3454N005O5694l0078J334j6454k4625l9057J04885
$$ -41544 23429 -36075 -55653 -42199 -37194 28500 -1578 -244 -16698 -41323 -80380 24505
4086B4505r0718O0716K7499k3114J1791j3572m751r605K6247j0321l4718N8064
$$ 24505 -66213 -5497 22002 -1112 10679 -2893 -7644 -17249 8998 -1323 -36041 22023
4074B2023Q1016o4133o1l3159p4622Q6829L1449o556j2070K3496J0064j06800
$$ 22023 103039 38906 38845 5686 -68936 17893 49342 42786 30716 54212 64276 -42524
4062d2524P6678p2496l3602M4663l4620Q6228m1904p562j5245L288L277J5361
$$ -42524 34154 -38342 -71944 -27281 -61901 24327 -17577 -25139 -40384 -37096 -33819 -18458
4050a8458K6290j0408J0764J058J7711m4568L3978k1841m5435R0536J0118p6310
$$ -18458 7832 -2576 8188 9246 26957 -17611 16367 -5474 -50909 39627 49745 -26565
4038b6565M9133q468M6805o5538Q5531k2223j511o1952Q1312R184l6097n4349
$$ -26565 22568 14100 60905 -4633 80898 58675 57164 -4788 76524 85708 49611 -4738
4026d738N1532N0366l8121j9514P2459o603J6778J0294n2039O3910m8043j1210
$$ -4738 46794 97160 59039 39525 111984 105381 122159 132453 80414 144324 96281 85071
4014H5071M2285q8222L8462K9227K3078l2094N4117m3107m1617J11514j09156
$$ 85071 127356 39134 77596 106823 129901 97807 151924 108817 67200 178714 69558
$$ [...]
##END NTUPLES=NMR SPECTRUM
##END=
