##TITLE=abcd
##JCAMPDX= 6.0         $$ Bruker NMR JCAMP-DX V2.0
##DATA TYPE= NMR SPECTRUM
##DATA CLASS= NTUPLES
##ORIGIN= UXNMR, Bruker Analytische Messtechnik GmbH
##OWNER= root
$$ XWIN-NMR		Version 3.5
$$ Sat Aug  1 13:37:08 2026 Russian Standard Time (UT+4h)  servis@DPX200
##.OBSERVE FREQUENCY= 200.131235884673
##.OBSERVE NUCLEUS= ^1H
##.ACQUISITION MODE= SIMULTANEOUS
##.ACQUISITION SCHEME= undefined
##.AVERAGES= 32
##.DIGITISER RES= 18
##SPECTROMETER/DATA SYSTEM= spect
##.PULSE SEQUENCE= zg
##.SOLVENT NAME= DMSO
##.SHIFT REFERENCE= (INTERNAL, DMSO, 0, 16.4885)
##AUDIT TRAIL= $$ (NUMBER, WHEN, WHO, WHERE, WHAT)
$$ ##TITLE= Audit trail, XWIN-NMR		Version 3.5
$$ ##JCAMPDX= 5.01
$$ ##ORIGIN= Bruker BioSpin GmbH
$$ ##OWNER= servis
$$ F:\spectra/data/av/nmr/H1/1/pdata/1/auditp.txt
$$ ##AUDIT TRAIL=  $$ (NUMBER, WHEN, WHO, WHERE, WHAT)
(   1,<2026-08-01 13:36:35.03 +0400>,<servis>,<DPX200>,
      <created by zg, POWCHK disabled, PULCHK disabled
       configuration hash MD5:
       00 E9 B6 7A A2 85 ED C7 34 08 36 98 17 FE 4E 26
       data hash MD5: 32K
       4F 39 49 AA 3C DE 81 1D 45 3A 67 BE D8 42 EE A1>)
(   2,<2026-08-01 13:36:36.53 +0400>,<servis>,<DPX200>,
      <Start of raw data processing
       efp BC_mod = 2 LB = 0.05 FT_mod = 6 PKNL = 1 PHC0 = -416.9518 PHC1 = 3.101563 SI = 16K 
       data hash MD5: 16K
       26 58 72 12 08 9A DA D0 A3 A6 10 C4 14 49 08 D0>)
$$ ##END=
$$ 
$$ hash MD5
$$ CB 49 C0 21 36 58 D9 11 93 EF 4C 5F 3B 1E AB 6E
##$RELAX= 
##$RELAX= 
##$RELAX= 
##$RELAX= 
##$RELAX= 
##$RELAX= 
##$RELAX= 
##$RELAX= 
$$ Bruker specific parameters
$$ --------------------------
##$DU= <F:\spectra>
##$EXPNO= 1
##$NAME= <H1>
##$PROCNO= 1
##$TYPE= <nmr>
##$USER= <av>
##$AMP= (0..31)
100 100 100 100 100 100 100 100 100 100 100 100 100 100 100 100 100 100 
100 100 100 100 100 100 100 100 100 100 100 100 100 100 
##$AQSEQ= 0
##$AQ_mod= 1
##$AUNM= <au_zg>
##$AUTOPOS= <>
##$BF1= 200.13
##$BF2= 200.13
##$BF3= 200.13
##$BF4= 200.13
##$BF5= 500.13
##$BF6= 500.13
##$BF7= 500.13
##$BF8= 500.13
##$BYTORDA= 1
##$CFDGTYP= 0
##$CFRGTYP= 5
##$CHEMSTR= <none>
##$CNST= (0..31)
1 1 145 1 1 1 1 1 1 1 1 1 1 1 1 1 1 1 1 1 1 1 1 1 1 1 1 1 1 1 1 1 
##$CPDPRG= <>
##$CPDPRG1= <>
##$CPDPRG2= <>
##$CPDPRG3= <>
##$CPDPRG4= <mlev>
##$CPDPRG5= <mlev>
##$CPDPRG6= <mlev>
##$CPDPRG7= <mlev>
##$CPDPRG8= <mlev>
##$CPDPRGB= <>
##$CPDPRGT= <>
##$D= (0..31)
0 2 0 0 0 0 0 0 0 0.06 0 0 0 0 0 0 0.0002 0 0 0 0 0 0 0 0 0 0 0 0 0 0 
0 
##$DATE= 1785576994
##$DBL= (0..7)
120 120 120 120 120 120 120 120 
##$DBP= (0..7)
150 150 150 150 150 150 150 150 
##$DBP07= 0
##$DBPNAM0= <>
##$DBPNAM1= <>
##$DBPNAM2= <>
##$DBPNAM3= <>
##$DBPNAM4= <>
##$DBPNAM5= <>
##$DBPNAM6= <>
##$DBPNAM7= <>
##$DBPOAL= (0..7)
0.5 0.5 0.5 0.5 0.5 0.5 0.5 0.5 
##$DBPOFFS= (0..7)
0 0 0 0 0 0 0 0 
##$DE= 6
##$DECBNUC= <off>
##$DECIM= 32
##$DECNUC= <off>
##$DECSTAT= 4
##$DIGMOD= 1
##$DIGTYP= 9
##$DL= (0..7)
0 120 120 120 120 120 120 120 
##$DP= (0..7)
150 150 150 150 150 150 150 150 
##$DP07= 0
##$DPNAME0= <>
$$ [...]
##$SUBNAM4= <"">
##$SUBNAM5= <"">
##$SUBNAM6= <"">
##$SUBNAM7= <"">
##$SUBNAM8= <"">
##$SUBNAM9= <"">
##$SW= 20.6817932712277
##$SWIBOX= (0..15)
0 0 3 0 0 0 0 0 0 0 0 0 0 0 0 0 
##$SW_h= 4139.07284768212
##$TD= 32768
##$TD0= 1
##$TE= 0
##$TE2= 300
##$TE3= 300
##$TEG= 300
##$TL= (0..7)
0 120 120 120 120 120 120 120 
##$TP= (0..7)
150 150 150 150 150 150 150 150 
##$TP07= 0
##$TPNAME0= <>
##$TPNAME1= <>
##$TPNAME2= <>
##$TPNAME3= <>
##$TPNAME4= <>
##$TPNAME5= <>
##$TPNAME6= <>
##$TPNAME7= <>
##$TPOAL= (0..7)
0.5 0.5 0.5 0.5 0.5 0.5 0.5 0.5 
##$TPOFFS= (0..7)
0 0 0 0 0 0 0 0 
##$TUNHIN= 0
##$TUNHOUT= 0
##$TUNXOUT= 0
##$USERA1= <user>
##$USERA2= <user>
##$USERA3= <user>
##$USERA4= <user>
##$USERA5= <user>
##$V9= 5
##$VALIST= <valist>
##$VCLIST= <CCCCCCCCCCCCCCC>
##$VD= 0
##$VDLIST= <DDDDDDDDDDDDDDD>
##$VPLIST= <PPPPPPPPPPPPPPP>
##$VTLIST= <TTTTTTTTTTTTTTT>
##$WBST= 1024
##$WBSW= 30
##$XGAIN= (0..3)
0 0 0 0 
##$XL= 0
##$YL= 0
##$YMAX_a= 328711
##$YMIN_a= -463769
##$ZGOPTNS= <>
##$ZL1= 120
##$ZL2= 120
##$ZL3= 120
##$ZL4= 120
##$ABSF1= 0
##$ABSF2= 0
##$ABSG= 0
##$ABSL= 0
##$ALPHA= 0
##$AQORDER= 0
##$ASSFAC= 0
##$ASSFACI= 0
##$ASSFACX= 0
##$ASSWID= 0
##$AUNMP= <proc_1d>
##$AZFE= 0.1
##$AZFW= 0.1
##$BCFW= 0
##$BC_mod= 2
##$BYTORDP= 0
##$COROFFS= 0
##$CY= 18.4799938201904
##$DATMOD= 1
##$DC= 0
##$DFILT= <>
##$DTYPP= 0
##$F1P= 9.9274215381318
##$F2P= -0.165520771350173
##$FCOR= 1
##$FTSIZE= 16384
##$FT_mod= 6
##$GAMMA= 0
##$GB= 0
##$INTBC= 1
##$INTSCL= 4.127829e-11
##$ISEN= 128
##$LB= 0.05
##$LEV0= 0
##$LPBIN= 0
##$MAXI= 10000
##$MC2= 0
##$MEAN= 0
##$ME_mod= 0
##$MI= 50
##$NCOEF= 0
##$NC_proc= -4
##$NLEV= 6
##$NOISF1= 3.799351
##$NOISF2= 2.8
##$NSP= 0
##$NTH_PI= 0
##$NZP= 0
##$OFFSET= 16.48848
##$PC= 4
##$PHC0= -416.9518
##$PHC1= 3.101563
##$PH_mod= 1
##$PKNL= yes
##$PPARMOD= 0
##$PSCAL= 4
##$PSIGN= 0
##$REVERSE= no
##$SF= 200.130005582386
##$SI= 16384
##$SIGF1= 3
##$SIGF2= 2
##$SINO= 400
##$SIOLD= 16384
##$SREGLST= <1H.CDCl3>
##$SSB= 0
##$STSI= 16384
##$STSR= 0
##$SW_p= 4139.07284768211
##$SYMM= 0
##$S_DEV= 0
##$TDeff= 32768
##$TDoff= 0
##$TI= <>
##$TILT= no
##$TM1= 0
##$TM2= 0
##$TOPLEV= 0
##$USERP1= <user>
##$USERP2= <user>
##$USERP3= <user>
##$USERP4= <user>
##$USERP5= <user>
##$WDW= 1
##$XDIM= 16384
##$YMAX_p= 305462730
##$YMIN_p= -242338
$$ End of Bruker specific parameters
$$ ---------------------------------
##NTUPLES= NMR SPECTRUM
##VAR_NAME=  FREQUENCY,     SPECTRUM/REAL,   SPECTRUM/IMAG
##SYMBOL=    X,             R,               I
##VAR_TYPE=  INDEPENDENT,   DEPENDENT,       DEPENDENT
##VAR_FORM=  AFFN,          ASDF,            ASDF
##VAR_DIM=   16384,         16384,           16384
##UNITS=     HZ,            ARBITRARY UNITS, ARBITRARY UNITS
##FACTOR=    0.252644378177508, 1,           1
##FIRST=     3299.83951724647, 0,            0
##LAST=      -839.233330435636, 0,           0
##MIN=       -839.233330435636, -242338,     0
##MAX=       3299.83951724647, 305462730,    0
$$ Real data points
##PAGE= N=1
##DATA TABLE= (X++(R..R)), XYDATA
$$ [...]
9670f4393k4612M3955l8953j6165k04J4884L4899J5644N2750n6106K1201J0265
$$ -64393 -89005 -45050 -84003 -100168 -100372 -85488 -50589 -34945 17805 -38301 -17100 -6835
9658f835m7594k8006R7395j14929Q3258m5639K1348o595L6009m8667k1716L4961
$$ -6835 -54429 -82435 14960 -99969 -16711 -62350 -41002 -47597 -11588 -60255 -81971 -47010
9646d7010P347j5276L0041l5051N0125o1717r307K1463L0905k7707L2351j3600
$$ -47010 -39663 -54939 -24898 -59949 -9824 -71541 -80848 -59385 -28480 -56187 -23836 -37436
9634c7436K5432j4330j2199l6435L9067m4522j6071Q4562k2574K8826l7485Q944
$$ -37436 -12004 -26334 -38533 -74968 -35901 -80423 -96494 -11932 -34506 -5680 -43165 -34221
9622c4221J16J3994l1633J8333j0263R755k454K2631J3583n2706m064o1537Q7291
$$ -34221 -34105 -20111 -51744 -33411 -43674 -33919 -36373 -13742 -159 -52865 -56929 -118466 -31175
9609c1175j7288k4362j6792N5313n1441K3628K9897j8823j2461N9186m0103o191
$$ -31175 -48463 -72825 -89617 -34304 -85745 -62117 -32220 -51043 -63504 -4318 -44421 -50612
9597e0612J3005P051J1801n2898p758N0315l8152K3354j2716L3488P078j9659
$$ -50612 -37607 -30556 -18755 -71653 -79411 -29096 -67248 -43894 -56610 -23122 -16044 -35703
9585c5703l8732K2180O5100j6202q0829O1765P71k0270P193l9047M539j8550J8196
$$ -35703 -74435 -52255 12845 -3357 -84186 -22421 -21650 -41920 -34727 -73774 -69235 -87785 -69589
9572f9589J8205Q261r458r201M5385r383J6526l2766J3145o941j8484L7309k2405
$$ -69589 -51384 -43123 -52581 -61782 -16397 -25780 -9254 -42020 -28875 -35816 -54300 -16991 -39396
9559c9396K3040O185j7296l6923m4601N9651Q698J2960p9422Q8034l4593M6371
$$ -39396 -16356 -10171 -27467 -64390 -108991 -49340 -40642 -27682 -107104 -19070 -53663 -7292
9547g292L697m5104K5760l8459J590K6494j8460m139k171N1290k3187k476l0404
$$ -7292 -3595 -48699 -22939 -61398 -59808 -33314 -51774 -55913 -58084 -6794 -29981 -32457 -62861
9534f2861L5817L360j8588k9920K8828j3912K6119p527k7607k8662Q9118n2951
$$ -62861 -27044 -23684 -42272 -72192 -43364 -57276 -31157 -38684 -66291 -94953 -5835 -58786
9522e8786J9940k643k3055L8272l2043O706k0652J657M1728k3008J6041j380k773
$$ -58786 -38846 -41489 -64544 -26272 -58315 -51609 -72261 -70604 -28876 -51884 -35843 -37223 -39996
9509c9996J4086k7069r519l9589L0943J296M2306N3366q1323P822L404q874n750
$$ -39996 -25910 -52979 -62498 -102087 -71144 -69848 -27542 25824 -55499 -47677 -44273 -53147 -58897
9496e8897J0342k9603L4480j3629J8966N88k6740j926j9721K7695J54P6435j6278
$$ -58897 -48555 -78158 -43678 -57307 -38341 -37753 -64493 -66419 -86140 -58445 -58291 18144 1866
9483A866m1258l073j9438J6165K6535p9409L8431J4140L82K3501m4294J0163l454
$$ 1866 -39392 -42465 -61903 -45738 -19203 -98612 -60181 -46041 -45659 -22158 -66452 -56289 -59743
9470e9743j2171j02k22J8634L9091j006p8227K8846Q169K3835k2770K3867l3139
$$ -59743 -71914 -72016 -72238 -53604 -14513 -15519 -93746 -64900 -56731 -32896 -55666 -31799 -64938
9457f4938P9386l3542r535j2966L505l1022L7245k575l5464L1170j7614J5012
$$ -64938 14448 -19094 -28629 -41595 -38090 -69112 -31867 -34442 -69906 -38736 -56350 -41338
9445d1338k7908M0732M0990q9288P2383j0100q8866M7658K6582m6193M7304L912
$$ -41338 -69246 -28514 12476 -76812 -4429 -14529 -103395 -55737 -29155 -75348 -28044 -24132
9433b4132k4610N817J6105n2569M2334K6087j4943j6681J6310k0971p438J218
$$ -24132 -48742 -42925 -26820 -79389 -37055 -10968 -25911 -42592 -26282 -47253 -54691 -53473
9421e3473k3703N2550J4123n4592J2358K0854K3205p4216J9285k1729J3196O2074
$$ -53473 -77176 -24626 -10503 -65095 -52737 -31883 -8678 -82894 -63609 -85338 -72142 -10068
9409a0068N708k1582l2870n6177O9025M2649j4388k5189L2577m3937L6781j1676
$$ -10068 -4360 -25942 -58812 -114989 -45964 -3315 -17703 -42892 -10315 -54252 -17471 -29147
9397b9147p94j0128j1417K8287j7397j2566J5496j6299K9486l5739K7805j7661
$$ -29147 -29941 -40069 -51486 -23199 -40596 -53162 -37666 -53965 -24479 -60218 -32413 -50074
9385e0074k8400N9678l0018l9561M7678k0352K8377l2486J7331L4141p4806o546
$$ -50074 -78474 -18796 -48814 -88375 -40697 -61049 -32672 -65158 -47827 -13686 -88492 -95038
9373i5038M4461J0585j0013J20L7723n3300J4953m9584J7951N6585k861l1797
$$ -95038 -50577 -39992 -50005 -49885 -12162 -65462 -50509 -100093 -82142 -25557 -28418 -60215
9361f0215M1195j2005o8109Q0718p61l4682o925m887j097M1455j8244k6802J0682
$$ -60215 -19020 -31025 -99134 -18416 -19177 -53859 -60784 -65671 -66768 -25313 -43557 -70359 -59677
9348e9677N0956q1824K8183J1453N838L7217j8676m4505J5751O3086p5442j429
$$ -59677 -8721 -90545 -62362 -50909 -45071 -7854 -26530 -71035 -55284 7802 -67640 -69069
9336f9069L5342k6194Q205J3456M5634k8187J1101j3726l9757r354M2924R88J5083
$$ -69069 -33727 -59921 -51716 -38260 7374 -20813 -9712 -23438 -63195 -72549 -29625 -28637 -13554
9323a3554k3498K9644l2290j2896l6329Q1047m1732o1717N4754N9882j9216P699
$$ -13554 -37052 -7408 -39698 -52594 -88923 -7876 -49608 -111325 -56571 3311 -15905 -8206
9311h206k00p5803M3647J4773N129j9853M0175m4427J6332m4324k1059N5284J5675
$$ -8206 -8406 -84209 -40562 -25789 -20660 -40513 -338 -44765 -28433 -72757 -93816 -38532 -22857
9298b2857m9657K8597j872K0697K344l2927N303M5797j5084m6359l710P0246j643
$$ -22857 -72514 -43917 -45789 -25092 -22748 -55675 -50372 -4575 -19659 -66018 -69728 518 -1125
9285a125l6347M8560j5600m2105M9950m0233n3279P1206j4584k4457M0804o251
$$ -1125 -37472 11088 -4512 -46617 3333 -36900 -90179 -18973 -33557 -58014 -17210 -23461
9273b3461l7299L5993J5808m6744K8789n1463J4333Q4806n7631j5042O4759m4849
$$ -23461 -60760 -24767 -8959 -55703 -26914 -78377 -64044 20762 -36869 -51911 12848 -32001
9261c2001m6116N4593M9972m960r110K5769n6869O872J331l6729j0947N6379Q509
$$ -32001 -78117 -23524 26448 21488 12378 38147 -18722 -11850 -10519 -47248 -58195 -1816 6693
9248F693j9598M2410m44p580M2608o1195M7757k9542R053J5063o918O445k4836
$$ 6693 -12905 29505 29061 21481 64089 2894 50651 21109 30162 45225 38307 44752 19916
9235A9916Q3620r1249Q8225M633j0329J2364J9045j153L6070k4999L8959k1248
$$ 19916 103536 12287 100512 105145 94816 107180 126225 125072 161142 136143 175102 153854
9223A53854J4631O9102K624M6131k1495l4575l3251L7792o8045J2446j4706J1166
$$ 153854 168485 237587 240211 286342 264847 230272 197021 234813 166768 179214 164508 175674
9211A75674l4789O1297p9512q064K3849q1864K5797l5890m030j1392N0139J5713
$$ 175674 140885 202182 122670 114606 138455 56591 82388 46498 42468 31076 81215 96928
9199I6928r2254N5717N175k8645l1277J3174n435N192j0777J672k8281q014j0825
$$ 96928 4674 60391 65566 36921 5644 18818 13383 18575 7798 9470 -18811 -26825 -37650
9186c7650L1893K1487J3673k2160j6920l2979K9206n4883J9809Q9790o2971m660
$$ -37650 -5757 15730 29403 7243 -9677 -42656 -13450 -68333 -48524 41266 -21705 -26365
9174b6365M2399j817m857l4562K7459l4574N191O514K9497k8201M8761l5529L1037
$$ -26365 16034 14217 9360 -25202 2257 -32317 -27126 -20612 8885 -19316 29445 -6084 24953
9161B4953l4497j4347j0984j1211J0844m2088O6123P029N390k5130K880l4648
$$ 24953 -9544 -23891 -34875 -46086 -35242 -77330 -11207 -4178 1212 -23918 -21038 -55686
9149e5686N5882J6817k6145N8947n3950K8541l4351l7886k9412N8286L468K6129
$$ -55686 196 17013 -9132 49815 -4135 24406 -9945 -47831 -77243 -18957 -15489 10640
9137A0640o8578J4845P555L0047L366j9181n4649j0297Q5905k5796J7204k5092
$$ 10640 -57938 -43093 -35538 -5491 -2125 -21306 -75955 -86252 -347 -26143 -8939 -34031
9125c4031k482m1233L2784j0346K6312q5782O0384Q1425p6879R478N3584M373
$$ -34031 -36513 -77746 -44962 -55308 -28996 -114778 -54394 27031 -49848 -40370 13214 17587
9113A7587p3822K5857L222p977m9805M3615J9858J0282o8316J7839J0659P614
$$ 17587 -56235 -30378 -27156 -35133 -84938 -41323 -21465 -11183 -79499 -61660 -51001 -43387
9101d3387l5169J0159K6075k6821O3850K2697k4132l7091K5733m9115N8190j2398
$$ -43387 -78556 -68397 -42322 -69143 -5293 17404 -6728 -43819 -18086 -67201 -9011 -21409
9089b1409l8049L1597J2644l2050j2781k2380L9197n3574J14596o0973O9405n8466
$$ -21409 -59458 -27861 -15217 -47267 -60048 -82428 -43231 -96805 17791 -43182 26223 -32243
9077c2243j8250L054k7014K6664q072j1637J1388k019M9031M1966o1229j6893
$$ -32243 -50493 -47439 -74453 -47789 -55861 -67498 -56110 -58129 -9098 32868 -28361 -45254
9065d5254l9914J1271J1841O1983j3621K369k1805k7567P9748l6393k9693L5525
$$ -45254 -85168 -73897 -62056 -73 -13694 -11325 -33130 -60697 19051 -17342 -47035 -11510
9053a1510j6321m176m3571P4107k6400J9044j0932J3341L836k5748q307M5197
$$ -11510 -27831 -32007 -75578 -1471 -27871 -8827 -19759 -6418 -2582 -28330 -36637 8560
9041H560j1854L1686J5323o4112L3807m2312O1589o1850p098O477L6854m6361
$$ 8560 -3294 28392 43715 -20397 13410 -28902 32687 -29163 -36261 -29784 7070 -39291
9029c9291j6356L9991n6157N6335m2062L001K5468j708k7696O424k1431K4498
$$ -39291 -55647 -15656 -71813 -15478 -57540 -54539 -29071 -30779 -58475 -52051 -73482 -48984
9017d8984j1207J7074M3640k8929N419N2554p8110K6439M694j8059k481l1119
$$ -48984 -60191 -43117 523 -28406 -22987 29567 -48543 -22104 -17410 -35469 -37950 -69069
9005f9069N1525m6427J5814o921L7238l4854k5840K7590J8528O981m4883J7274
$$ -69069 -17544 -63971 -48157 -55078 -17840 -52694 -78534 -50944 -32416 -25435 -70318 -53044
8993e3044k1906R8805m4687K5434l1347K8295r800j7942J0616j9996R790n733
$$ -53044 -74950 23855 -20832 4602 -26745 1550 -8250 -26192 -15576 -35572 -25782 -31515
8981c1515R928j5842L963m2755J1259K254j4376L7467L9923n4678J1132n1722
$$ -31515 -21587 -37429 -33466 -76221 -64962 -62708 -77084 -39617 306 -54372 -43240 -94962
8969i4962O1404M1648j9228m7715J3709L0398l3442J8128p084j2577L9814l4825
$$ -94962 -33558 8090 -11138 -58853 -45144 -14746 -48188 -30060 -37144 -49721 -9907 -44732
8957d4732M6069m1340K1397l3925K4776J578q152L2194l5785L1176r014n6817
$$ -44732 1337 -40003 -18606 -52531 -27755 -26177 -34329 -2135 -37920 -6744 -15758 -72575
8945g2575N8382n4070R488J5524K0728j3970o225N8901m1887l0398P806J1513
$$ -72575 -14193 -68263 -58775 -43251 -22523 -36493 -42718 16183 -25704 -56102 -48296 -36783
8933c6783k0942O0691j4678K601P0361o8465k7731J8361J1265k6784J9150q144
$$ -36783 -57725 2966 -11712 -9111 61250 -7215 -34946 -16585 -5320 -32104 -12954 -21098
8921b1098K1828k6396Q3405k5427p723K7972q3671M4408J4016n24r2843O2389
$$ -21098 730 -25666 57739 32312 24589 52561 -31110 13298 27314 26790 -66053 -3664
8909c664K295Q248Q633q5754P4090L3769j00933M8692j6361k2339K2729M4157
$$ -3664 -1369 6879 15512 -70242 3848 37617 -63316 -14624 -30985 -53324 -30595 13562
8897A3562n8574Q304j2093R537o434J84j3956J7159m5783R7814p7592J4808K5130
$$ 13562 -45012 -36708 -48801 -39264 -45698 -45514 -59470 -42311 -88094 9720 -67872 -53064 -27934
8884b7934K4067n3636M9729m7053L299O1364n2964j1113J0816K718o385O4755
$$ -27934 -3867 -57503 -7774 -54827 -51528 9836 -43128 -54241 -43425 -40707 -47092 17663
8872A7663m5093k4167M1223O02l125J698o1733O7022n140Q2n0160M6577j5382
$$ 17663 -27430 -51597 -10374 -9772 -12897 -11199 -72932 -5910 -11050 -10968 -61128 -14551 -29933
8859b9933p5328J20541j9767m9053j4731M8930O683L8477m7332l2128M0961k2372
$$ -29933 -105261 15280 -4487 -53540 -68271 -19341 -12658 25819 -21513 -53641 -12680 -35052
8847c5052L583K3891p596k6517K4445n8293Q7924l08l3733j2333L1910n5583J2556
$$ -35052 -31469 -7578 -15174 -41691 -17246 -75539 12385 12077 -21656 -33989 -2079 -57662 -45106
8834d5106K4072J7068J822o5774J5802j4283k3281R7879L7285k0829o973j0287
$$ -45106 -21034 -3966 -2144 -67918 -52116 -66399 -89680 8199 45484 24655 17682 7395
8822G395q5142J00556l4181p0990Q0414k0347J6820j4645j2589l8560N2268j9188
$$ 7395 -77747 22809 -11372 -82362 -1948 -22295 -5475 -20120 -32709 -71269 -19001 -38189
8810c8189M0580l0373m808M2915m29q2734M4626m7200J9179M583k5729N7948K9385
$$ -38189 2391 -27982 -32790 10125 9696 -73038 -28412 -75612 -56433 -51850 -77579 -19631 9754
8797I754k2803K607J5266j4635J7031l3930n1016L4840M646l4995R0814m763P921
$$ 9754 -13049 -10442 4824 -9811 7220 -26710 -77726 -42886 -38240 -73235 17579 12816 20737
8784B0737q9476L4388k5677J8425j8670Q456K8613l998K8443p2803J4298j307
$$ 20737 -68739 -34351 -60028 -41603 -60273 -51817 -23204 -27202 1241 -71562 -57264 -58571
8772e8571N2448k0343n1076N3449m9791J9889M0264l8129N1420q1017O9677j231
$$ -58571 -6123 -26466 -77542 -24093 -73884 -53995 -13731 -51860 -440 -81457 -11780 -13011
8760a3011m4546P2494p5450J588O6581l2013r681M972j3182J9469l259r958k3181
$$ -13011 -57557 14937 -60513 -58925 7656 -24357 -34038 -29066 -42248 -22779 -26038 -35996 -59177
8747e9177J0191L7161k0533j4091J2365L884J4599l3210Q49m096J3634L280l9493
$$ -59177 -48986 -11825 -32358 -46449 -34084 -30200 -15601 -48811 -47962 -52058 -38424 -35144 -74637
8734g4637Q1206o5148P1091N534n4136j3052P295k1712l2517P0122j2356l6681
$$ -74637 6569 -58579 12512 18046 -36090 -49142 -41847 -63559 -96076 -25954 -38310 -74991
8722g4991N4186k0342L2113j6071k3150N2481p3865M646J4161M255K8372J3166
$$ -74991 -20805 -41147 -9034 -25105 -48255 4226 -69639 -64993 -50832 -46577 -18205 -5039
8710e039l583l1795m5189L5826O1714n4314R97L4342n1740O990J8909l6059K1698
$$ -5039 -8622 -40417 -85606 -49780 11934 -42380 -41383 -7041 -58781 -51791 -32882 -68941 -47243
8697d7243j0831q194L6935l2767L8746m1298K0660n674L582k1475J930j0606P6477
$$ -47243 -58074 -66268 -29333 -62100 -23354 -64652 -43992 -49666 -46084 -67559 -65629 -76235 242
8684B42l9125k5278K605Q635q823k8937n150N9016o170j448j3600N3995L233m0395
$$ 242 -38883 -64161 -61556 -52921 -61744 -90681 -95831 -36815 -42985 -44433 -58033 -4038 -805 -41200
8670d1200J4798J234r344J5149l5275J796J5657k103j1973m716K2963j1029J3755
$$ -41200 -26402 -25168 -34512 -19363 -54638 -52842 -37185 -39288 -51261 -55977 -33014 -44043 -30288
8657c0288j383l1526N8409J0940p4433n603L9859P30j9009Q2459o3875l4591P4530
$$ -30288 -31671 -63197 -4788 6152 -68281 -73884 -34025 -33295 -52304 30155 -33720 -68311 6219
8644F219N350o1538K2348J3628k2175K3713P776j3081n476m2856K4332j9731N180
$$ 6219 11569 -49969 -27621 -13993 -36168 -12455 -4679 -17760 -23236 -66092 -41760 -61491 -56311
8631e6311K1666k2227N254K7411l9415N5492o0468k2993R4804n5375J7484R521
$$ -56311 -34645 -56872 -51618 -24207 -63622 -8130 -68598 -91591 3213 -52162 -34678 -25157
8619b5157l3499K374J6437r874j3490J26714j38123K9684K5825q986j8102j0861
$$ -25157 -58656 -56282 -39845 -49719 -63209 63505 -74618 -44934 -19109 -28095 -46197 -57058
8607e7058Q042J7509k1544J9177k7268L0955L1119m9134K0895p404n1576L9439
$$ -57058 -49016 -31507 -53051 -33874 -61142 -30187 932 -48202 -27307 -34711 -86287 -46848
8595d6848L819J7511k1814O2050q0803K3721L8078p6078L5950O4578n6279O77
$$ -46848 -43029 -25518 -47332 14718 -66085 -42364 -4286 -80364 -44414 20164 -36115 -35438
8583c5438o5180J09097l2577Q1704j01015K1290k0095R583J7413K2033o1724J9787
$$ -35438 -100618 8479 -24098 57606 -43409 -22119 -42214 -32631 -15218 6815 -54909 -35122
8571c5122M150K5308q5153Q6075L478l7731K053k7026j3113Q1769q438o9303M5471
$$ -35122 -30972 -5664 -90817 -4742 -1264 -38995 -36942 -63968 -77081 4688 -3750 -73053 -27582
8558b7582K3923k2790R307K8691n4448j0401L0799k7580P2901p9303j459L9582
$$ -27582 -3659 -26449 -17142 11549 -42899 -53300 -22501 -50081 22820 -56483 -57942 -18360
8546a8360q592o29M7919J5219m1827j4093j6681k8992J0686K9719R687M973j9909
$$ -18360 -26952 -27581 20338 35557 -6270 -20363 -37044 -66036 -55350 -25631 -15944 -10971 -30880
8533c0880P4617n4334L0261j35012L1702j58692J36058J4952J6627M0134n608
$$ -30880 43737 -10597 19664 -115348 -83646 -242338 -106280 -91328 -74701 -34567 -40175
8522d0175q551M0671p441j3999l1241p756L5833K9075l7189K8514o0843j435J04030
$$ -40175 -48726 -8055 -15496 -29495 -60736 -68492 -32659 -3584 -40773 -12259 -73102 -74537 29493
8509B9493k3987p1799N5341k6286r141K3147l339n7423P2441J214o5385K8232
$$ 29493 5506 -66293 -10952 -37238 -46379 -23232 -26571 -83994 -11553 -10339 -75724 -47492
8497d7492L7856j4619k9789R095j6983p670K1041J6562j3908K2516K421k6031
$$ -47492 -9636 -24255 -54044 -44949 -61932 -69602 -48561 -31999 -45907 -23391 -20970 -47001
8485d7001M3000k4411K7066j00077R1758k7271J8940R075k5510K1555K3662l5606
$$ -47001 -4001 -28412 -1346 -101423 -9665 -36936 -17996 -8921 -34431 -12876 10786 -24820
8473b4820L5369o8857N0909k4380o656o2259Q5615K3680l3823l443L3012k9227
$$ -24820 10549 -58308 -7399 -31779 -38435 -100694 -15079 8601 -25222 -28665 4347 -24880
8461b4880j4070K6054j4825L3478J0395j01049O9092M036j7934j6877j2712L2266
$$ -24880 -38950 -12896 -27721 5757 16152 -84897 -15805 -11769 -29703 -46580 -59292 -27026
8449b7026l5954K7940k6155K9868J1389m6347O1969J6046k7303k5426L548J5763
$$ -27026 -62980 -35040 -61195 -31327 -19938 -66285 -4316 11730 -15573 -40999 -37451 -21688
8437b1688j371L2214q008m4430M0450k1028N928q51J9573n2491K6272K7342k5399
$$ -21688 -23059 9155 1147 -43283 -2833 -23861 -17933 -18784 789 -51702 -25430 1912 -23487
8424b3487K4600n8919j2726L2775K1909l2285M0371J4953k1725M5600j34695N4843
$$ -23487 1113 -57806 -70532 -37757 -15848 -48133 -7762 7191 -14534 31066 -103629 -48786
8412d8786L3518j3373K6553k3700Q3m3196K2318J4979P4210j17139R6297m0714
$$ -48786 -15268 -28641 -2088 -25788 -25705 -68901 -46583 -31604 42606 -74533 21764 -18950
8400a8950m0438N3445l5306l2472O2798m1234l6568N9534l1079M5329o0940M6183
$$ -18950 -59388 -5943 -41249 -73721 -10923 -52157 -88725 -29191 -60270 -14941 -75881 -29698
8388b9698q268N4319k5231l4491L2467l9012j4808P5457m8289K0500O948m2998
$$ -29698 -37966 16353 -8878 -43369 -10902 -49914 -64722 10735 -37554 -17054 -10106 -53104
8376e3104N8498n2803Q989M6313P080l8369j694L2915o9744n090J12268l8402
$$ -53104 5394 -47409 -38420 7893 14973 -23396 -25090 7825 -61919 -67009 45259 6857
8364F857o1868M5883L7898r7379M221N7307m3376j611N2964l9212o265q400n4649
$$ 6857 -55011 -9128 28770 -68609 -64388 -7081 -50457 -52068 896 -38316 -44581 -52981 -107630
8351a07630P7888R131k4276R2679m7398j213n3160P3109q3437N6580J1434k2968
$$ -107630 -29742 -20611 -44887 47792 394 -819 -53979 19130 -64307 -7727 3707 -19261
8339a9261l5130L5334k758o5128O9239L5438l3750k1295N9162o9576J4379j9484
$$ -19261 -54391 -19057 -21815 -86943 -17704 17734 -16016 -37311 21851 -47725 -33346 -52830
8327e2830J6271M0609l7794K0329k240q290R216Q906J8475k8417N087K6217j365
$$ -52830 -36559 4050 -33744 -13415 -15655 -23945 -14729 -5823 12652 -15765 -10678 15539 14174
8314A4174J9197k0210J207J2136j02055M1829N1837k9581J6743k4485M7557q3921
$$ 14174 33371 13161 14368 26504 -75551 -33722 18115 -11466 5277 -19208 28349 -55572
8302e5572N193N7762n9208N5287p8342L2943m6178P2781l8309M3905K7894q4298
$$ -55572 -50379 7383 -51825 3462 -74880 -41937 -88115 -15334 -53643 -9738 18156 -66142
8290f6142K0572M235N3378n3972K1481j0884l4442N5869K2037K321l8386K829
$$ -66142 -45570 -41335 12043 -41929 -20448 -31332 -65774 -9905 12132 14453 -23933 -21104
8278b1104n7007O7494o8329M2421K6856k4184N577K8616L610k9842j3479Q11j3896
$$ -21104 -78111 -10617 -78946 -36525 -9669 -33853 -28276 340 3950 -25892 -39371 -38560 -52456
8265e2456o1L2291r5937P7385L9814n4763J6205K5767M2921n3244K396j0843R295
$$ -52456 -52517 -20226 -116163 -38778 1036 -53727 -37522 -11755 31166 -22078 -19682 -30525 -21230
8252b1230k3421M4700k3281O514m420m724O1719q1967k8829N1003j7340L6269
$$ -21230 -44651 49 -23232 -16718 -21138 -25862 35857 -46110 -74939 -23936 -41276 -5007
8240e007L0582p8799M9392M683j4686J0295L3722J0943o1407l4472M0716j4505
$$ -5007 25575 -53224 -3832 851 -13835 -3540 30182 41125 -20282 -54754 -14038 -28543
8228b8543l5154L1184j303M2154r315l3461L1701k7568M3972o2063j0652L7258
$$ -28543 -63697 -32513 -33816 8338 -977 -34438 -2737 -30305 13667 -48396 -59048 -21790
8216b1790k1783q627N783N1651k0171l6975K8257L7504n2745J7885R76j2992P859
$$ -21790 -43573 -52200 -46417 5234 -14937 -51912 -23655 13849 -38896 -21011 -20035 -33027 -25168
8203b5168p80n4865O6393J8534J6620m0104r4263N885M9853l6708N733O77485
$$ -25168 -25948 -80813 -14420 4114 20734 -19370 -113633 -107748 -57895 -94603 -88870 588615
8191E88615n81254L2821j6339J4696n1934l868m07J2285o632m5913K9356L7676
$$ 588615 7361 40182 23843 38539 -13395 -17263 -17670 -5385 -12017 -57930 -28574 9102
8179I102k4960M620j3761K3606n6359O66R1795m2436K734L6373k0287l4746J7103
$$ 9102 -15858 -11238 -24999 -1393 -57752 -57086 34709 -7727 -4993 31380 11093 -23653 -6550
8166f550P9m069O3918q319p0887m5L6057j3643m516m5788Q4850n5307L4608p335
$$ -6550 -6471 -10540 53378 45059 -25828 -25873 10184 -3459 -7975 -53763 31087 -24220 10388 3053
8152C053m904k1104N300R802j1994K0039k729L2089M984o2854j0715M5223k6731
$$ 3053 -1851 -22955 -17655 -7853 -19847 192 -2537 29552 34536 -28318 -39033 6190 -20541
8139b0541L810K926O055M2273p9909R649O5601l7833p14K9209k7292K4838j1748
$$ -20541 -16731 -13805 -7750 34523 -45386 -35737 29864 -7969 -8683 20526 -6766 18072 6324
8126F324j4590m2205m490O2449m1498L9733l8679K669n3784K6445Q7695m2411
$$ 6324 -8266 -50471 -54961 7488 -34010 5723 -32956 -30287 -84071 -57626 30069 -12342
8114a2342l0605P897L0272J023n2643M8874k0500K5263k7064K9044n2226N4404
$$ -12342 -42947 -35050 -4778 -3755 -56398 -7524 -28024 -2761 -29825 -781 -53007 1397
8102A397q012O095l2994M5218j02403R4503l179n9057L9822j2710K3468l6986
$$ 1397 -6615 -520 -33514 11704 -90699 3804 625 -58432 -18610 -31320 -7852 -44838
8090d4838k9988P7317K7898q228n0080M6813p7053M6756K6883m0792L9510P002
$$ -44838 -74826 2491 30389 22161 -27919 18894 -58159 -11403 15480 -25312 14198 21200
8078B1200m6498J0032o75J5624n702k8297K7083o402j5428K682L6140j0652K819
$$ 21200 -25298 -15266 -15941 -317 -6019 -34316 -7233 -13635 -29063 -26381 9759 -893 1926
8065A926j0897k1370r383Q2438p7150N6939k2700J7534j465J0695k0290J4240
$$ 1926 -8971 -30341 -39724 42714 -34436 22503 -197 17337 15872 26567 6277 20517
8053B0517N2371q4350O393O2508r3033L7742k4334J9349P831l6040j2847L4621
$$ 20517 72888 -11462 -5069 57439 -35594 2148 -22186 -2837 4994 -31046 -43893 -9272
8041i272M091M0846j04260O0047k8319J9960L4057m7252J9994k6632J00665o4856
$$ -9272 -5181 35665 -68595 -8548 -36867 -16907 17150 -30102 -10108 -36740 63925 -931
8029i31l074L7834o3760O4839l8494J1840L8440n5770l6091j6482N0190j5709
$$ -931 -4005 33829 -29931 34908 -3586 8254 46694 -9076 -45167 -61649 -11459 -27168
8017b7168L2112k0485m0908J25218o0937k0402O0202o8208K7657l1310k3106L651
$$ -27168 4944 -15541 -56449 68769 7832 -12570 47632 -20576 7081 -24229 -47335 -43684
8005d3684j110P7998k1823J0803k9381j3416J513p556J4537J7198L4827L8748
$$ -43684 -44794 33204 11381 22184 -7197 -20613 -19100 -26656 -12119 5079 39906 78654
7993G8654r1396k1011J3954n0593M9883n1507O2704O0058n0100K645p04k8891
$$ 78654 -12742 -33753 -19799 -70392 -20509 -72016 -9312 50746 646 3291 2587 -26304
7981b6304l750L7535k3748k4023R2064n6070m3895O5863l8072O4492q5593O1251
$$ -26304 -30054 7481 -16267 -40290 51774 -4296 -48191 17672 -20400 44092 -41501 19750
7969A9750j0960m7289M5420p298l4942P7403p789n090m3861K9853l7659O7835
$$ 19750 8790 -38499 6921 -377 -35319 42084 34295 29205 -14656 15197 -22462 45373
7957D5373k4145k3175N592Q944M633L405j5266k4410L5008m8512Q2677o3864L3675
$$ 45373 21228 -1947 3645 12589 17222 20627 5361 -19049 15959 -32553 50124 -13740 19935
7944A9935r829n0214R6506k3983K706k6704k3565O1353n3453J8057l2118Q715
$$ 19935 10106 -40108 56398 32415 35121 8417 -15148 46205 -7248 10809 -21309 -12594
7932a2594K2424j1283M4827q2641N1435L5904o4417K3269l4438j3712N5028J0511
$$ -12594 9830 -1453 43374 -39267 12168 48072 -16345 6924 -27514 -41226 13802 24313
7920B4313J4893n2582K7559K033Q733j2238K1768o811p340k44K515l6169L1928
$$ 24313 39206 -13376 14183 16216 24949 12711 34479 27668 20328 20084 22599 -13570 18358
7907A8358n281N360j498r284p368L009J7683K5331l2845J6754p5203P9188j2199
$$ 18358 13077 18437 16939 7655 287 3296 20979 46310 13465 30219 -44984 34204 22005
7894B2005k1518O3281m6691j1823j05m986m016o5826M5143J6223J1871K9487l4468
$$ 22005 487 63768 17077 5254 5149 163 -3853 -69679 -24536 -8313 3558 33045 -1423
7881a423P7486r0854K0661N7443p4041O7670j11913P3875O3919q5146J2449J8306
$$ -1423 76063 -14791 5870 63313 -10728 56942 -54971 18904 82823 -2323 10126 28432
7869B8432k6444N1807k6353K2020n2067K3787l6997K6991M5034o5142Q5740n9718
$$ 28432 1988 53795 27442 49462 -2605 21182 -15815 11176 56210 -8932 76808 17090
7857A7090q4252m5690K09434k52987J61419k5260N6205n069K0513M919j9825J4458
$$ 17090 -67162 -112852 96582 -156405 5014 -20246 35959 30890 51403 56322 36497 50955
7845E0955n9651O4079Q17q111L2387p8010Q5867p9422j7287Q9670o8793M0518
$$ 50955 -8696 55383 56200 48089 80476 2466 88333 8911 -8376 81294 12501 53019
7833E3019N8574l8501m5704k4991O7449o7533J1461O1330L9357l4272K3654J2195
$$ 53019 111593 73092 27388 2397 69846 2313 13774 75104 114461 80189 103843 116038
7821A16038l175o5038k6310L7231L8791k3566j0873m7424M0969k7953K6136r0596
$$ 116038 112863 47825 21515 58746 97537 73971 63098 15674 56643 28690 54826 -35770
7809c5770K9697M1601R363l740j3250M3277P447n4443j231N9678o5760J0652L2894
$$ -35770 -6073 35528 44891 41151 27901 71178 78625 24182 22951 82629 16869 27521 60415
7796F0415o8081M2909J966m4117K4596K6734J0463l1024Q409K458p7600N5412
$$ 60415 -7666 35243 37209 -6908 17688 44422 54885 23861 32270 34728 -42872 12540
7784A2540L2592q6688L6651q106K5234r188L6849K9435k0171m7385L4232j5832
$$ 12540 45132 -41556 -4905 -13011 12223 3035 39884 69319 49148 1763 35995 20163
7772B0163l1015M738J3024M4004m4406Q648K803j3727J4966j5532J3559j01481
$$ 20163 -10852 -6114 6910 50914 6508 15156 17959 4232 19198 3666 17225 -84256
7760h4256Q1023K9865n2562O0530k1179J3728n082J7042j4465M6642j7452p0255
$$ -84256 -3233 26632 -25930 34600 13421 27149 22067 39109 24644 71286 53834 -16421
7748a6421M5071J4962j1386M7736q8453J6627Q379O3907m1001j3120K7557j0940
$$ -16421 28650 43612 32226 79962 -8491 8136 16515 80422 39421 26301 53858 42918
7736D2918O053k3739K5578j8485o529k6002J1690j7188N340P813K410k1719N5587
$$ 42918 48971 25232 50810 32325 25796 -206 11484 -5704 -364 7449 9859 -11860 43727
7723D3727k8941K8892l9396O4152m97o2883L9324j0467l2231q160M9179m6070
$$ 43727 14786 43678 4282 68434 67937 5054 44378 33911 1680 -6480 42699 -3371
7711c371J9943J6366o1l4597M4109K7136p9423k4482M6251n052n223L7693J02
$$ -3371 16572 32938 32877 -1720 42389 69525 -9898 -34380 11871 6819 1596 39289 39391
7698C9391l0845M5097k3574l2706K3028K2973l1461j2261k6261O7148k5436L5951
$$ 39391 8546 53643 30069 -2637 20391 43364 11903 -358 -26619 40529 15093 51044
7686E1044k7894L688k6346R722o003j5770M1387J5500n0432O5532k2776m8267
$$ 51044 23150 26838 492 10214 4211 -11559 29828 45328 -5104 60428 37652 -10615
7674a0615O0647j4497p808K1199o9026l47M1189l6585L5052N10J329K6251k6275
$$ -10615 50032 35535 27727 48926 -20100 -20447 20742 -15843 19209 19719 21048 47299 21024
7661B1024O806j0967k0936L6400m3986j2827P1074Q457j3770o314J2561j9575
$$ 21024 27830 16863 -4073 32327 -11659 -24486 46588 55045 41275 34961 47522 27947
7649B7947J6451j8302k3226M1500N935k9179R382j9601N868j949J7056J000M9429
$$ 27947 44398 26096 2870 44370 50305 21126 30508 10907 16775 14826 31882 32882 82311
7636H2311n2899j3870n9204Q4240l2264k1146R1888k1589l1773j8155N4805m8474
$$ 82311 29412 15542 -43662 40578 8314 -12832 79056 57467 25694 7539 62344 13870
7624A3870L6985m5418L9441q4211P5746l206N385j5386J1153J6634m7380R240
$$ 13870 50855 5437 44878 -39333 36413 33207 38592 23206 34359 50993 3613 12853
7612A2853J9480j2678J4108M7401n8054N2512l7349J4882j2363l8172K4932O9780
$$ 12853 32333 19655 33763 81164 23110 75622 38273 53155 40792 2620 27552 97332
7600I7332q6506Q760k8363O0495K27l898l3363J758P4212l6687k2466L632L0346
$$ 97332 10826 19586 -8777 51718 51945 48047 14684 16442 90654 53967 31501 35133 65479
7587F5479n8136q073q230N1273m5423O0993j9062k378J5832n0128J8510r586L454
$$ 65479 7343 -730 -8960 42313 -3110 57883 38821 36443 52275 2147 20657 11071 14525
7574A4525p725K4957L5692j8296M1496o8035R475N3953l5893j4991j1608p308
$$ 14525 6800 31757 67449 49153 90649 22614 32089 86042 50149 35158 23550 16242
7562A6242L3129K9302J0970l8323l39J5055k2795K3131n6550Q6679M849o2139
$$ 16242 49371 78673 89643 51320 50981 66036 43241 66372 9822 96501 101350 39211
7550C9211L8099k1183k2694M4519r559K5754l155M0793j17604k010J01842l3675
$$ 39211 77310 56127 33433 77952 68393 94147 90992 131785 14181 12171 114013 80338
7538H0338l0272J8122P1726m7756j746N281k0718Q008K975m023N1706m4895J8047
$$ 80338 50066 68188 139914 92158 90412 95693 74975 82983 85958 81935 133641 88746 106793
7525A06793K3313k4650q146k3966M6550l2109N6050m3809q6954Q0078j5994J460
$$ 106793 130106 105456 97310 73344 119894 87785 143835 100026 13072 93150 77156 78616
7513G8616M9199m0372q235n2798J4644M0451n7945P1395m4038K3171N816q443
$$ 78616 127815 87443 79208 26410 41054 81505 23560 94955 50917 74088 79904 71461
7501G1461J0448J5302n9943J7205N1730n8833j3102N3689l5014L1359j2L2262
$$ 71461 81909 97211 37268 54473 106203 47370 34268 87957 52943 84302 84290 116552
7489A16552m6256J596k5252p964K0778K5734j3612P144L540o4122K7888l0741
$$ 116552 70296 71892 46640 38676 59454 85188 71576 78720 82260 18138 46026 15285
7477A5285M3519M4815r1935j5922L8029K0595k6680m0429J8331N2734n7462N5314
$$ 15285 58804 103619 11684 -4238 33791 54386 27706 -12723 5608 58342 880 56194
7465E6194K4774k8517m3881J3775r819M4492r296k4221P6176o7831m732P2300
$$ 56194 80968 52451 8570 22345 12526 57018 47722 23501 99677 31846 27114 99414
7453I9414j00630L7012n139r319K5182N8028k9525l3560O5349m6112m7041J9554
$$ 99414 -1216 35796 30657 21338 46520 104548 75023 41463 106812 60700 13659 33213
7441C3213K7510l0055L5027L7413k1719p1260L5730r424j906k5718M6955O6610
$$ 33213 60723 30668 65695 103108 81389 10129 45859 36435 34529 8811 55766 122376
7429A22376n6634k8390J8161M9062o3123R240M6991m6521O6544q318p3255L46
$$ 122376 65742 37352 55513 104575 41452 50692 97683 51162 117706 109388 36133 36479
7417C6479O2315k6980n510J0382L6134p8732O2673j6073M0819m413q43l2737P2481
$$ 36479 98794 71814 66304 76686 112820 34088 96761 80688 121507 117094 116251 83514 155995
7404A55995m7672j7711K4614J1547L4251k0658K4476L2912j9175L4729J0107L331
$$ 155995 108323 90612 115226 126773 161024 140366 164842 197754 178579 213308 223415 226746
7392B26746L8431p1890O4785J3397o5718O9919L7288m3581K4497n595j5920J3194
$$ 226746 265177 193287 258072 271469 205751 275670 312958 269377 293874 288279 272359 285553
7380B85553j3409J425K0275M49q5675L9753l0974L6279p0512m6891K4495L8736
$$ 285553 272144 273569 293844 294293 208618 248371 217397 253676 183164 136273 160768 199504
7368A99504P576j02017M3910j2199Q2116m9472n1904L1988n6788R354Q358k5497
$$ 199504 207080 105063 148973 136774 218890 169418 117514 149502 92714 102068 110426 84929
7356H4929R064j9091k1722R949O891M536n275O0117p7017L6212Q733l9693J5412
$$ 84929 93993 74902 53180 63129 70020 74556 69281 129398 52381 88593 97326 57633 73045
7343G3045L8209p2764p970K3831k4087P7819p534K5008o0980l334O475k2521K4642
$$ 73045 111254 38490 30520 54351 30264 108083 100549 125557 64577 61243 67718 45197 69839
7330F9839j0100j5688J1779m5620Q0951l8715J1588k1831m901k9085r207Q3072
$$ 69839 59739 44051 55830 10210 91161 52446 64034 42203 37302 8217 -990 82082
7318H2082M2761j11875L9238K6858m7848l2507R0927l3159j6571M0196l2545P9613
$$ 82082 124843 12968 52206 79064 31216 -1291 89636 56477 39906 80102 47557 127170
7306A27170p0633k9873L9424k0208m454m79k850l892M6692o8058J5161N299K6363
$$ 127170 56537 26664 66088 45880 41426 40947 38097 34205 80897 12839 28000 33299 59662
7293E9662j6793k3692n148M353k6368M7535J6008j9361q022J7857m513o461j0060
$$ 59662 42869 19177 14029 18382 -7986 39549 55557 36196 28174 46031 41518 35057 24997
7280B4997l643N7297P500k4633J1478p3702K1126j681P13Q258L6302k0497l054
$$ 24997 21354 78651 86151 61518 72996 -706 20420 18739 19452 27710 64012 43515 40461
7267D0461q764k2958K7967K2493o2335O1635l1225J606K0690K923j0056q589J141
$$ 40461 31697 8739 36706 59199 -3136 58499 27274 28880 49570 52493 42437 33848 34989
7254C4989m925j0671l168K6871K2944l0846m481j1948M775L5621J112j8337L3951
$$ 34989 30064 19393 16225 43096 66040 35194 30713 18765 23540 59161 60273 41936 75887
7241G5887n3129J9194K8315p6745Q3510o9173Q628K5167n3029L1084M3601l2571
$$ 75887 22758 41952 70267 -6478 77032 7859 16487 41654 -11375 19709 63310 30739
7229C0739O558k2424j4754K473K1491J6132P387k148m0483P1970n5705J1622J3688
$$ 30739 37297 14873 119 2592 24083 40215 47602 45454 4971 76941 21236 32858 46546
7216D6546j7515o959L999p620n089k042k1988K418J5360J9424j1668O180K6337
$$ 46546 29031 22072 26071 18451 13362 11320 -10668 -8250 7110 26534 14866 21046 47383
7203D7383o2414O7961k2537M3999n8981O8742k2592m3450L42Q075J4378k2439
$$ 47383 -15031 52930 30393 74392 15411 84153 61561 18111 18453 26528 40906 18467
7191A8467K1440o664P3308o8506k4441L3265l0178L5196l9447O736K8632n8653
$$ 18467 39907 33243 106551 38045 13604 46869 16691 51887 12440 19176 47808 -10845
7179a0845k9762Q5025l4762J8773j2897L2061r62j5802n2891L2074L9337j3580
$$ -10845 -40607 44418 9656 28429 15532 47593 46631 30829 -22062 10012 49349 35769
7167C5769j9197P551m04Q9494m8550o3582M3473J6139k9811j6275l9780N2688
$$ 35769 16572 24123 23719 113213 64663 1081 44554 60693 30882 14607 -25173 27515
7155B7515M2989n1127J2934N1412j02705M6863R046l7492j897O3125k0104j1477
$$ 27515 70504 19377 32311 83723 -18982 27881 36927 -565 -2462 60663 40559 29082
7143B9082l0755N2241m5956L6615j0053j7050K2929J8698p4743M6629m3506Q3394
$$ 29082 -1673 50568 4612 41227 31174 14124 37053 55751 -18992 27637 -15869 67525
7131F7525k2036m1505M491N8357j1775l6471k1060N3466j3067j1741L3612l8501
$$ 67525 45489 3984 8475 66832 55057 18586 -2474 50992 37925 26184 59796 21295
7119B1295N0565n1696L9195k1660O404j2844O380P646J9669k7008J2819j3539
$$ 21295 71860 20164 59359 37699 44103 31259 37639 45285 64954 37946 50765 37226
7107C7226j7148j911L7778q2970N5369L5662k9478J5170K0774j18240J09482j7803
$$ 37226 20078 18167 55945 -27025 28344 64006 34528 49698 70472 -47768 61714 43911
7095D3911n7891K3937O6872k7999j6340K3117P935l2074L1223k0708j1361J1836
$$ 43911 -13980 9957 76829 48830 32490 55607 63542 31468 62691 41983 30622 42458
7083D2458Q476j4252n3984N3575j3482P269j8701K1245O4618k4827m6650K4487
$$ 42458 50934 36682 -17302 36273 22791 30060 11359 32604 97222 72395 25745 50232
7071E0232n4716j1127N0489o573J4611P923J6020p2839K2310j0195M3874J1327
$$ 50232 -4484 -15611 34878 28305 42916 50839 66859 -5980 16330 6135 50009 61336
7059F1336o465j9620K2787k0374j7343L0971m8297K4516l8952M1211k8101N0528
$$ 61336 54871 35251 58038 37664 20321 51292 2995 27511 -11441 29770 1669 52197
7047E2197l881k9466k0866K2919k9357M2322J4546J1135L813o4915K165R5850
$$ 52197 48316 18850 -2016 20903 -8454 33868 48414 59549 63362 -1553 612 96462
7035I6462l8644k2862l8040K2381K3126J3170j4397L1762j3877J9996l0604j3025
$$ 96462 57818 34956 -3084 19297 42423 55593 41196 72958 59081 79077 48473 35448
7023C5448J5688k0048L2123n0238L8545m3995L4455K9840m025k7476L76j656o301
$$ 35448 51136 31088 63211 12973 51518 7523 41978 71818 67793 40317 40693 39037 32736
7010C2736o194J5442J023L3222m7591K2825J4511o5836L6036l4131O376j4670
$$ 32736 26542 41984 43007 76229 28638 51463 65974 138 36174 2043 8419 -6251
6998f251M8656L844J0118o7807O7598m5130J5922J3212k9346L0530J1705n152
$$ -6251 42405 46249 56367 -11440 56158 11028 26950 40162 10816 41346 53051 47899
6986D7899j6795r646Q489j2517M5464o9678M0819J9599k1035L5780r3836P0096
$$ 47899 31104 21458 29947 17430 62894 -6784 34035 53634 32599 68379 -25457 44639
6974D4639K7103m7546J5228n6375L7331N8053n4485O1426q2431J05740m9045p368
$$ 44639 71742 24196 39424 -16951 20380 78433 23948 85374 2943 108683 59638 52270
6962E2270k0787K0918J872l6546K1684N803l4084Q5451m5923k9492L1575L742
$$ 52270 31483 52401 54273 17727 39411 45214 11130 96581 50658 21166 52741 56483
6950E6483o623j3343j5138J3236l2981N2416j29q246P663k8789N7170o9127L488
$$ 56483 49860 36517 21379 34615 1634 54050 53921 45675 53338 24549 81719 12592 16080
6937A6080R719K3986J9782L43o064o4783J2284O9568j8850q739L0895q5731n3630
$$ 16080 25799 49785 69567 69910 63846 -937 11347 80915 62065 53326 84221 -1510 -55140
6924e5140Q0811m5673P2409p536N0830o9992Q8901l8744n8535P433k5579L8349
$$ -55140 25671 -20002 52407 44871 95701 25709 114610 75866 17331 24764 -815 37534
6912C7534o307R325k4961j9L5638L300j7286j2117k0486K5800k5852N2345l0319
$$ 37534 31227 40552 15591 15572 51210 54510 37224 25107 4621 30421 4569 56914 26595
6899B6595j168j0102M2932o460j97l2861L450m2035N4992N4553r1619O9341l1469
$$ 26595 25427 15325 58257 51797 51600 18739 22189 -19846 35146 89699 -1920 67421 35952
6886C5952m250p596M4600j2521o2170O4582o1050M9074l0147J16162j09826M5377
$$ 35952 31702 24106 68706 56185 -5985 58597 -2453 46621 16474 132636 22810 68187
6874F8187L067o4754L7356J4048l2648N6136r5961O6036j6454K2398M3946l6158
$$ 68187 71254 6500 43856 57904 25256 81392 -14569 51467 35013 57411 101357 65199
6862F5199n740k170m0072L8030p4663R4204k189n5844l060M1674k5945R375N6799
$$ 65199 59459 57289 17217 55247 -19416 74788 72599 16755 13695 55369 29424 38799 95598
6849I5598l2168m1048p168K5411k5102P5211k6523j8801P4726o0285K4382p800
$$ 95598 63430 22382 15214 40625 15523 90734 64211 45410 120136 59851 84233 76433
6837G6433j1990n4513L7588P3116j00063J4288L5591k0332m0211P984K0195m269
$$ 76433 64443 9930 47518 120634 20571 34859 70450 50118 9907 17891 38086 33817
6825C3817Q2587n1684K2739l183M815l9160j951j1986Q3370o4192o8062L6806
$$ 33817 116404 64720 87459 84276 89091 49931 47980 35994 119364 55172 -12890 23916
6813B3916R246l5324J6423R0392n5512m45Q1742r6747L9227l4069O549L0113p0776
$$ 23916 33162 -2162 14261 104653 49141 48696 130438 33691 72918 38849 45398 75511 4735
6800D735O0699j9271j751P180m0356l2019K4144P1714j0046m1285L5227J8185
$$ 4735 65434 46163 44412 51592 11236 -20783 3361 75075 65029 23744 58971 77156
6788G7156o9812l864M5347k0193J5231M3094r269o9651O6763l1513q448J789K4640
$$ 77156 7344 3480 48827 28634 43865 86959 77690 8039 74802 43289 34841 36630 61270
6775F1270o0038M6001P113p925l962M6104n3328o932M6974r138j9832L6668k8921
$$ 61270 1232 47233 54346 46421 42459 88563 35235 28303 75277 66139 46307 82975 54054
6762E4054l4627J9615O8866m9921J0986n6222L6138M29K1996J9711m7599L0097
$$ 54054 19427 39042 107908 57987 68973 12751 48889 49318 71314 91025 43426 73523
6750G3523l1041l1076N270N0145m186J6051q4276M7617m892L6784l1761K1062
$$ 73523 42482 11406 16676 66821 62635 78686 -5590 42027 37135 73919 42158 63220
6738F3220l2254K1080Q100l4755o476L3691R120o4665M4946j4176J4660J4967
$$ 63220 30966 52046 60146 25391 18915 52606 61726 -2939 42007 27831 42491 57458
6726E7458l3294k0650J53067j10579N4451j5252k2038n4913N2128J5683n2108
$$ 57458 24164 3514 156581 46002 100453 85201 63163 8250 60378 76061 23953
6715B3953P2616k3294m1113N0894k0623k2080M6436p2120N5516n3968L0677o9256
$$ 23953 96569 73275 32162 83056 62433 40353 86789 14669 70185 16217 46894 -22362
6703b2362L7247P2542j8253r849R0723p3234p2042L1444R415M9679n7114L2306
$$ -22362 14885 87427 69174 59325 150048 76814 4772 36216 45631 95310 38196 70502
6691G0502J9070m6192K0882J4853k3312L5804l2392j3897j1545N1573j1471Q322
$$ 70502 89572 43380 64262 79115 55803 91607 59215 45318 33773 85346 73875 82197
6679H2197K3820k1254N2227j7440k9095M3683j32537P3420j3282j1723j9589O3906
$$ 82197 106017 84763 136990 119550 90455 134138 1601 75021 61739 50016 30427 94333
6667I4333j8001J1254k5241J105N757j5692K1934M954J216m8621L8736m14J3211
$$ 94333 76332 87586 62345 63450 69207 53515 75449 80403 81619 32998 71734 71320 84531
6654H4531M7297n9450K8535o946l6793M9245p6077Q5157l9379J7024J0708k3084
$$ 84531 131828 72378 100913 93967 57174 106419 30342 115499 76120 93144 103852 80768
6642H0768q116J606K4980n0104J9421P6681p9246K9889k1803n016N5050J2893
$$ 80768 72652 74258 99238 49134 68555 145236 65990 95879 74076 69060 124110 137003
6630A37003m0871J946K1433l7791k381j2423J9961L0491N710Q196M3701p8401
$$ 137003 96132 98078 119511 81720 79339 66916 86877 117368 123078 131274 174975 96574
6618I6574K7283K0135o9364P1406l3033l2846N6706J6627j3903N0600l9970q034
$$ 96574 123857 143992 74628 146034 113001 80155 136861 153488 139585 190185 150215 142181
6606A42181K2941m3116K6508p567n361O6561q4693J3359P1982l3327j9322R347
$$ 142181 165122 122006 148514 140947 135586 202147 117454 130813 202795 169468 150146 159493
6594A59493r032K1423n6379L1087K4731j1720j9932j2386N5418j7584P123j4847
$$ 159493 150461 171884 115505 146592 171323 159603 139671 127285 182703 165119 172242 157395
6582A57395M824l4208k1022k2993M9548J6404k7041O2945k3025M9014l6038j4678
$$ 157395 162219 128011 106989 83996 133544 149948 122907 185852 162827 211841 175803 161125
6570A61125M1386l5488P05M1694m5133l6826Q0796n7958M2428k8150J4616K1934
$$ 161125 202511 167023 167728 209422 164289 127463 208259 150301 192729 164579 179195 201129
6558B01129K0242o7544J9948K58k4893M9358l126O582j9847l4786q626M0902l1491
$$ 201129 221371 153827 173775 174033 149140 198498 195372 201954 182107 147321 138695 179597 148106
6545A48106K9412p543L0575R909o9584R4750o0364J8227m1069O6310k6185L4533
$$ 148106 177518 169975 200550 210459 140875 235625 175261 193488 152419 218729 192544 227077
6533B27077n7206L9098J2168j058j4121l847j371J255P8076n0245l6704Q0576
$$ 227077 169871 208969 221137 220079 205958 202111 200740 201995 280071 229826 193122 273698
6521B73698l3768l6310O9372k8958p876o8100J01014l1326K1780M8778k0147p4867
$$ 273698 239930 203620 272992 244034 236158 168058 269072 237746 259526 308304 288157 213290
6509B13290L9816Q349J2637P587L7491L633q13m4390J7637K1637r0006M4999O8191
$$ 213290 253106 261455 274092 281679 319170 322803 321990 277600 295237 316874 226868 271867 340058
6496C40058j3047j9538O0129n1433L9197j3024n3396K0238K9866j326j4182l7413
$$ 340058 327011 307473 367602 316169 355366 342342 288946 309184 339050 337724 323542 286129
6484B86129J25024o7732M1690r59m3595K8683J8103O204m976N5308m9963q103
$$ 286129 411153 343421 385111 384152 340557 369240 387343 393547 388571 443879 393916 385813
6472C85813N2818q3898P8003M661p2614N6420N5562J171m7285Q737m4080J2843
$$ 385813 438631 354733 432736 437397 364783 421203 476765 477936 430651 439388 395308 408151
6460D08151m361J4093K6382M9312L2578q8507J3686k1173J02918j3693n013m2238
$$ 408151 403790 417883 444265 493577 526155 437648 451334 430161 533079 519386 514373 472135
6448D72135L4965J1496j9625K5810L2999o1259N6641k3521K366R2023J657k7001
$$ 472135 507100 518596 498971 524781 557780 496521 553162 529641 532007 624030 625687 598686
6436E98686j2601M641L5648q701k0263P0426p244j7413o483M8612J5879K5861
$$ 598686 586085 590726 626374 617673 597410 667836 660592 643179 636696 685308 701187 727048
6424G27048p535O0088m5512k7268P3771o9914L9289K0427K1277n969J139Q3956
$$ 727048 719513 779601 734089 706821 780592 710678 749967 770394 791671 785702 786841 870797
6412H70797m1792M9513r2317P0761K9231r7145J9634R8096p9298L0917L2132o3734
$$ 870797 829005 878518 786201 856962 886193 789048 808682 906778 827480 858397 890529 826795
6400H26795J7639J13274l3638q6474J30418o3445L0913J5489J5704P1962L1567
$$ 826795 844434 957708 924070 837596 968014 904569 935482 950971 966675 1038637 1070204
6389A070204M139r344J3644M3654J06587P0455Q9960L5389N3605J4155k7647L4441
$$ 1070204 1074343 1064999 1078643 1122297 1228884 1299339 1389299 1424688 1478293 1492448 1464801 1499242
6377A499242q622L83q0057R287l154l2560K9082o1014P0629O2030k7005R0129
$$ 1499242 1490620 1491003 1410946 1420233 1417079 1384519 1413601 1352587 1423216 1485246 1458241 1548370
6365A548370M0575Q5279L0401R6581Q9452O3223R0087K09392J37171Q8433J7517
$$ 1548370 1588945 1674224 1704625 1801206 1890658 1953881 2043968 2253360 2390531 2478964 2496481
6354B496481l5518q2544n5264o6876p3407n709K1853J23581O5336J9970P400K3876
$$ 2496481 2460963 2378419 2323155 2256279 2182872 2177163 2199016 2322597 2387933 2407903 2415303 2439179
6342B439179j7279o4713p3837J0565N947J721K7932o074O4136J02796Q3374N8567
$$ 2439179 2421900 2357187 2283350 2293915 2299862 2301583 2329515 2323441 2387577 2490373 2573747 2632314
6330B632314N5229J803m6494L1583J9943M6007Q3992J15537K27067J67754J78585
$$ 2632314 2687543 2689346 2642852 2674435 2694378 2740385 2824377 2939914 3166981 3334735 3513320
6319C513320Q9903M544l6705p3266j25094j27349r9447o1487r4865L5026n3031
$$ 3513320 3603223 3607767 3571062 3497796 3372702 3245353 3145906 3084419 2989554 3024580 2971549
6308B971549J4159K1687r937N0271J24687j7405O4354L1445O8419J00070J50592
$$ 2971549 2985708 3007395 2997458 3047729 3172416 3155011 3219365 3250810 3319229 3419299 3569891
6297C569891J85608J22385J46960P2986P8140M9160o629K055L5545L0575k0664
$$ 3569891 3755499 3877884 4024844 4097830 4175970 4225130 4218501 4220556 4256101 4286676 4266012
6286D266012N6940M5748K8744M9548M5741N0943O1460L9218N4350P0797J16521
$$ 4266012 4322952 4368700 4397444 4446992 4492733 4543676 4605136 4644354 4698704 4769501 4886022
6275D886022O3785P3126M1649L5425P6346Q7943M2814N5025J30566O5704R8461
$$ 4886022 4949807 5022933 5064582 5100007 5176353 5264296 5307110 5362135 5492701 5558405 5656866
6264E656866O4459R8209R6975O6236J58293R0640R4801R6478R9711P8134J64811
$$ 5656866 5721325 5819534 5916509 5982745 6141038 6231678 6326479 6422957 6522668 6600802 6765613
6253F765613R6232J01565J70509P2222J37409J04234J23106J45981J63126J29104
$$ 6765613 6861845 6963410 7133919 7206141 7343550 7447784 7570890 7716871 7879997 8009101
6243H009101J69811J60023J75739K13919K08345J98571K05621K23850J78675L00327
$$ 8009101 8178912 8338935 8514674 8728593 8936938 9135509 9341130 9564980 9743655 10043982
6233A0043982K61664K88529K46856K61489K83401K62838K92547K85395L44124
$$ 10043982 10305646 10594175 10841031 11102520 11385921 11648759 11941306 12226701 12570825
6224A2570825L02114L32636L29287M02347M50449L76932M77806M62517M46049
$$ 12570825 12872939 13205575 13534862 13937209 14387658 14764590 15242396 15704913 16150962
6215A6150962N90915N82370N56344O49989O23151P11904P27902P51254Q24162
$$ 16150962 16741877 17324247 17880591 18530580 19153731 19865635 20593537 21344791 22168953
6206B2168953R06351R59209R62097J086944J132498J235639J286764J501739J514271
$$ 22168953 23075304 24034513 24996610 26083554 27216052 28451691 29738455 31240194 32754465
6197C2754465J859164J915695K195885K462771K724200L111937L482026M001141
$$ 32754465 34613629 36529324 38725209 41187980 43912180 47024117 50506143 54507284
6189E4507284M518052N149192N914975O643179P750128Q841426J0187773J1859109
$$ 54507284 59025336 64174528 70089503 76732682 84482810 93324236 103512009 115371118
6181A15371118J3727552J5943580J8413163K0911298K2985959K4132861K3667691
$$ 115371118 129098670 145042250 163455413 184366711 207352670 231485531 255153222
6174B55153222K1105428J6399759J0010465K793856m455421j0817191j5828359
$$ 255153222 276258650 292658409 302668874 305462730 301007309 290190118 274361759
6167B74361759j9145523k0829348k1076583k0285632j8935948j7128719j5264888
$$ 274361759 255216236 234386888 213310305 193024673 174088725 156960006 141695118
6160A41695118j3406422j1772180j0171324q851373p755350o733872n904029n251304
$$ 141695118 128288696 116516516 106345192 97493819 89738469 83004597 77100568 71849264
6152G1849264m569159m055958l591881l305220k978655k585817k480977k176730
$$ 71849264 67280105 63224147 59632266 56327046 53348391 50762574 48281597 46104867
6144D6104867k075369j902572j742589j546582j546374j420398j258723j251546
$$ 46104867 44029498 42126926 40384337 38837755 37291381 35870983 34612260 33360714
6136C3360714j108171j066746j010175r46656r38258p84172p35355q44778o98354
$$ 33360714 32252543 31185797 30175622 29228966 28290708 27506536 26771181 25926403 25228049
6127B5228049o43422o73878o05500o12618n74651n47302n75455n01035m72469
$$ 25228049 24584627 23910749 23305249 22692631 22117980 21570678 20995223 20494188 20021719
6118B0021719m97450m79295m70951m29434l48624m53125l65891l82051k87388
$$ 20021719 19524269 19044974 18574023 18144589 17795965 17342840 16976949 16594898 16307510
6109A6307510l95944l20051l49290k81725k53074l21919l48479j60892k82235
$$ 16307510 15911566 15591515 15242225 14960500 14707426 14385507 14037028 13876136 13593901
6100A3593901l21349k02921k60390k17910k42773k17087k32568j86710k22211
$$ 13593901 13272552 13069631 12809241 12591331 12348558 12131471 11898903 11712193 11489982
6091A1489982j99263j78183j79094k01743j62038j50366j76432j32656j59900
$$ 11489982 11290719 11112536 10933442 10731699 10569661 10419295 10242863 10110207 9950307
6082I950307j62322j39534j24396j67955j13308j08783j49498j00366j33237j53554
$$ 9950307 9787985 9648451 9524055 9356100 9242792 9134009 8984511 8884145 8750908 8597354
6072H597354n7627j08804j55216o3181q9637j27564r8579p3975q5408p1402j05562
$$ 8597354 8539727 8430923 8275707 8212526 8122889 7995325 7896746 7822771 7737363 7665961 7560399
6061G560399j30540n8609o9744r0688q6647l7519m2577q4218q8585l5564r5129
$$ 7560399 7429859 7371250 7301506 7210818 7124171 7086652 7044075 6959857 6871272 6835708 6740579
6050F740579l1732k2687j21578m8572J8316j16701M2887n6737l6007n0253J6504
$$ 6740579 6708847 6686160 6564582 6516010 6534326 6417625 6460512 6403775 6367768 6317515 6334019
6039F334019j19273P9998j1033o0987n2135r4003p312p161j01206o7066k7601
$$ 6334019 6214746 6294744 6283711 6222724 6170589 6076586 6069274 6062113 5960907 5893841 5866240
6028E866240o1643j8567M472j58039J2920o9300L4969K420m4170L3841k9731m8360
$$ 5866240 5804597 5786030 5790502 5632463 5645383 5576083 5611052 5613472 5569302 5603143 5573412 5525052
6016E525052L388j5857p022M7547j3604j0216M8392J6805j9660k1644m0825j2209
$$ 5525052 5528440 5512583 5505561 5553108 5539504 5529288 5577680 5594485 5574825 5553181 5512356 5500147
6004E500147J9724Q271o8479M0307L65o4415J2197M6454j2738P059M1641M6454
$$ 5500147 5519871 5528142 5459663 5499970 5500335 5435920 5448117 5494571 5481833 5488892 5530533 5576987
5992E576987k4508N9403m4915J0177P6475L2358j6695Q6779L5114P6347o546K8323
$$ 5576987 5552479 5611882 5566967 5577144 5653619 5685977 5669282 5756061 5791175 5867522 5860976 5889299
5980E889299K2544K5198M7602O5252N4253j4197P4496P1288N0429L0484L7574
$$ 5889299 5911843 5937041 5984643 6049895 6104148 6089951 6164447 6235735 6286164 6316648 6354222
5969F354222O5155R2088R348J56282L2483J10232M2346N7182N7067J32540J34839
$$ 6354222 6419377 6511465 6520813 6677095 6709578 6819810 6862156 6919338 6976405 7108945 7243784
5958G243784L8044J68774K2744J70782P3405R0491J59988J07830J08678J58478
$$ 7243784 7281828 7450602 7473346 7644128 7717533 7808024 7968012 8075842 8184520 8342998
5948H342998J36326J65713J10860J72291J10295J40152J60947J22554K41158J42747
$$ 8342998 8479324 8645037 8755897 8928188 9038483 9178635 9339582 9462136 9703294 9846041
5938I846041J86627J08596J70753K08645J85664J64477J87252J52470K30293J88169
$$ 9846041 10032668 10141264 10312017 10520662 10706326 10870803 11058055 11210525 11440818 11628987
5928A1628987J76855J58387J79160K52742R5147K09158J28992J54204J71628J47964
$$ 11628987 11805842 11964229 12143389 12396131 12491278 12700436 12829428 12983632 13155260 13303224
5918A3303224J70619Q0603J37471L0501Q5388J21875M7825R52k0043K835j1404
$$ 13303224 13473843 13554446 13691917 13722418 13807806 13929681 13977506 13978458 13958415 13961250 13949846
5907A3949846q3565k9281j41866q1550j59104j71164j18537j78715k06800k08371
$$ 13949846 13866281 13837000 13695134 13613584 13454480 13283316 13164779 12986064 12779264 12570893
5897A2570893k86628j98503k62556k28159j99929k78938l32267j75880k87144
$$ 12570893 12284265 12085762 11823206 11595047 11395118 11116180 10783913 10608033 10320889
5888A0320889k57247k95941j52756l25564k95314k32334j95860k63366k39996
$$ 10320889 10063642 9767701 9614945 9289381 8994067 8761733 8565873 8302507 8062511
5879H062511j88895k95894k16915k10905k53560j54890j70496k28594j71518j79379
$$ 8062511 7873616 7577722 7360807 7149902 6896342 6741452 6570956 6342362 6170844 5991465
5869E991465j82949j99637j00869k49887p5073j56495j80341r6441j23271j34805
$$ 5991465 5808516 5608879 5508010 5258123 5183050 5026555 4846214 4749773 4626502 4491697
5859D491697j46581j37760n9081j07120j07108j04776j38403l1390j44211p2549
$$ 4491697 4345116 4207356 4148275 4041155 3934047 3829271 3690868 3659478 3515267 3442718
5849C442718r8237j34926p8223n4660j10644p8048j5187q4052r0688p221n4815
$$ 3442718 3344481 3209555 3131332 3076672 2966028 2887980 2872793 2788741 2698053 2690832 2636017
5838B636017q5455q741j38617o6128K4238q9334r7515l8207o427j20165M1778
$$ 2636017 2550562 2541821 2403204 2337076 2361314 2271980 2174465 2136258 2129831 2009666 2051444
5827B051444p4155j11525P733l4856o6033k6752o2308j6292K406p7097R115m6566
$$ 2051444 1977289 1865764 1873497 1838641 1772608 1745856 1683548 1667256 1669662 1592565 1601680 1555114
5815A555114p2279l5246J026m6892K0343O318j09402j7496l8450m8671j2772n2112
$$ 1555114 1482835 1447589 1448615 1401723 1422066 1428384 1318982 1301486 1263036 1214365 1201593 1149481
5803A149481O2974j5441m4107J3336j31136J0713K6607j7504m1184k8739l0489
$$ 1149481 1212455 1197014 1152907 1166243 1035107 1045820 1072427 1054923 1013739 985000 954511
5792I54511J8317n8193M3476q0431Q861n0733J0955o9240N7347l8366J5833L00
$$ 954511 972828 914635 958111 877680 886541 835808 846763 777523 834870 796504 812337 812637
5780H12637j3637p3720N3653j34874K6526P853k6265K1025n2252Q662k6640K8544
$$ 812637 799000 725280 778933 644059 670585 678438 652173 673198 620946 629608 602968 631512
5768F31512J6711r7793L9886m477m8800R675m8606R172L5498m3467k0252q045
$$ 631512 648223 550430 590316 585839 537039 546714 498108 507280 542778 499311 479059 471014
5756D71014k1236j0519K6473p9434J9195J7683m3630J1145m621j9616J548k4845
$$ 471014 449778 439259 465732 386298 405493 423176 379546 390691 386070 366454 368002 343157
5744C43157N7315p4246J3986L0165l7354m9988L4831m0440L4410k2103l30o569
$$ 343157 400472 326226 340212 370377 333023 283035 317866 277426 311836 289733 289403 282834
5732B82834j0861K2801m0661N6069j2602j11132J05579k2313K4873r3729N9309
$$ 282834 271973 294774 254113 310182 297580 186448 292027 269714 294587 200858 260167
5721B60167l143n9777j0345N2533J5023j16835L9254K6733m2538O1352K3322l3758
$$ 260167 257024 197247 186902 239435 254458 137623 176877 203610 161072 222424 245746 211988
5709B11988r5153N5572q192m401P600j886j8393L0430M054L6176o9846J6812j4914
$$ 211988 116835 172407 164215 159814 167414 165528 147135 177565 181619 217795 147949 164761 149847
5696A49847m0227O0848l0039j2J9154o987J9552j1762l1524J3531k9730Q714J8352
$$ 149847 109620 170468 140429 140417 159571 152584 172136 160374 128850 142381 112651 121365 139717
5683A39717n4652l006R323M2613k8729J1647j1108L5420r3552K4598L5931j2919
$$ 139717 85065 82059 91382 133995 105266 116913 105805 141225 47673 72271 108202 95283
5671I5283l8374N4529j8160L563k8076L2216p0215O1379m3927J4641J3652k5827
$$ 95283 56909 111438 93278 96841 68765 100981 30766 92145 48218 62859 76511 50684
5659E0684k1611P1342k4388k2863N3657m8439j9492J7564k8367M4784k026k6163
$$ 50684 29073 100415 76027 53164 106821 58382 38890 56454 28087 72871 70845 44682
5647D4682L0202l7658N536M0724o6392M7703k7369M302L8679l9255M4060J8143
$$ 44682 74884 37226 42762 83486 17094 64797 37428 41730 80409 41154 85214 103357
5635A03357l1437r64L3763n8692j4872O1822r4721K6079P8949j562m6130J2654
$$ 103357 71920 70956 104719 46027 31155 92977 -1744 24335 103284 101722 55592 68246
5623F8246r244j8247J1301k0243k7998N3286J3932k5719n356n4006P3763L807
$$ 68246 59002 40755 52056 31813 3815 57101 71033 45314 39958 -14048 59715 63522
5611F3522j8529o875J089J4802j8553K9640n9886N4719m0684M0175p8230N3558
$$ 63522 44993 38118 39207 54009 35456 65096 5210 59929 19245 59420 -18810 34748
5599C4748L7923o1509M2772N6731m6047L8251k1537n5400L4085M3322L3264k2237
$$ 34748 72671 11162 53934 110665 64618 102869 81332 25932 60017 103339 136603 114366
5587A14366n4964N3466j2479l5572O8864p7620K797O404K5365L0141Q322J1644
$$ 114366 59402 112868 100389 64817 133681 56061 58858 65262 90627 120768 129090 140734
5575A40734m0395j5142o0144Q1712J6920l2610K0918j5172q7670K5943P6336l6231
$$ 140734 100339 85197 25053 106765 123685 91075 111993 96821 9151 35094 111430 75199
5563G5199k0974K1542l6711M7469J2577r6843J11040r9322K1082l1677N6885K2639
$$ 75199 54225 75767 39056 86525 99102 2259 113299 13977 35059 3382 60267 82906
5551H2906m9834M0319k4883q178m0639M1622J3900j3471K6743l9835Q675L3375
$$ 82906 33072 73391 48508 40330 -309 41313 55213 41742 68485 28650 37325 70700
5539G0700k9527O4330n2571L2462k3606o468j0404J6800M4657m6595J4652k3308
$$ 70700 41173 105503 52932 85394 61788 55320 44916 61716 106373 59778 74430 51122
5527E1122R790j697j471N620m2852K8405m5949P4530K3768q0706O2119l7547J2164
$$ 51122 60912 59215 57744 63364 20512 48917 2968 77498 101266 20560 82679 45132 57296
5514E7296k7535M8254J9428L514k1826k6996J0882J3552N313K6078K644m2434
$$ 57296 29761 78015 97443 100957 79131 52135 63017 76569 81882 107960 110604 68170
5502F8170j6851N943Q601J3822L3950o9879R1821q0960N5503k2768L6649j9573
$$ 68170 51319 57262 65863 79685 113635 43756 135577 54617 110120 87352 124001 104428
5490A04428j6152J6854n0807Q8634m7892j3596L7205k1034K9077j3761J9258J7076
$$ 104428 88276 105130 54323 142957 95065 81469 118674 97640 126717 112956 132214 149290
5478A49290L1654K697o2810N455N5023K8956k061n8903j4394l5785O1525J6552
$$ 149290 180944 183641 120831 126286 181309 210265 208204 149301 134907 99122 160647 177199
5466A77199k4430M4280n6526K7666K1715j1062L2037P022J9707k1256J8913m3907
$$ 177199 152769 197049 140523 168189 189904 178842 210879 217901 237608 216352 235265 191358
5454A91358K5743L8042J236J1678K9163p9347j3692N1759K2537J2985l8987l5738
$$ 191358 217101 255143 256379 268057 297220 217873 204181 255940 278477 291462 252475 216737
5442B16737M1796p578m1101L9784q778m348K8357k6191J0810M4607M2807k4278
$$ 216737 258533 250955 209854 249638 240860 236512 264869 238678 249488 294095 336902 312624
5430C12624J8962J7883l2787L6725m1681J8116j1144q074l6698j5282M3655L3090
$$ 312624 331586 349469 316682 353407 311726 329842 318698 310624 273926 258644 302299 335389
5418C35389m5169O763l9936O4288J1635n8670L3230J5939L2008k4876M8564n3363
$$ 335389 290220 296983 257047 321335 332970 274300 307530 323469 355477 330601 379165 325802
5406C25802K4873j2363K6394K7376k9365J5614P953M781q4133M5157L2551l6092
$$ 325802 350675 338312 364706 392082 362717 378331 386284 391065 306932 352089 384640 348548
5394C48548M1120k3904K7382M3970n6128N968M6516n3532J4481j1200l1133J00557
$$ 348548 389668 365764 393146 437116 380988 386956 433472 379940 394421 383221 352088 452645
5382D52645R781m9979Q7701n8391k8248M2225N8229n7297O2298j4850N6665L3084
$$ 452645 462426 412447 500148 441757 413509 455734 513963 456666 518964 504114 560779 593863
5370E93863m7057K4106O1669N6899k1252k8318N3808R398J0244P9187r123K6207
$$ 593863 546806 570912 632581 689480 668228 639910 693718 703116 713360 792547 783424 809631
5358H09631q273L3076P073O9067m9877M5873L8824J5654R9941P8341J2624M4193
$$ 809631 801358 834434 841507 910574 860697 906570 945394 961048 1060989 1139330 1151954 1196147
5346A196147O0995j0671R3642P602M6719O4441O4605j8433R1171O643J02819J09512
$$ 1196147 1257142 1246471 1340113 1347715 1394434 1458875 1523480 1505047 1596218 1602861 1705680 1815192
5334A815192J9239P8119J96119L0015K45370J68550L94222O28900O50474P43249
$$ 1815192 1834431 1912550 2108669 2138684 2384054 2552604 2946826 3575726 4226200 4969449
5324D969449N13544M89686M61885M95382Q30921Q30614O51964L06822K04586K04631
$$ 4969449 5482993 5972679 6434564 6929946 7760867 8591481 9243445 9550267 9754853 9959484
5314I959484M77171Q44706P42982K46769j59637m18162m38022k48097j54215k50205
$$ 9959484 10436655 11281361 12024343 12271112 12111475 11693313 11255291 11007194 10852979 10602774
5304A0602774n46049o47179p04415o76656m59932l68435m39554n36747n37159
$$ 10602774 10056725 9409546 8705131 8028475 7568543 7200108 6760554 6223807 5686648
5295E686648o31764n57847n37660n33509l99073k94319k70907j91528q9260p8353
$$ 5686648 5054884 4497037 3959377 3425868 3026795 2732476 2461569 2270041 2180781 2102428
5285B102428j61030l1219p6047n4571o4382J6339M5468l9515l9311j3886l0526
$$ 2102428 1941398 1910179 1834132 1779561 1715179 1731518 1776986 1737471 1698160 1684274 1653748
5274A653748r3830j17440K5484o3337r1656p454q89q7811j1876K6660o8651J928
$$ 1653748 1559918 1442478 1467962 1404625 1312969 1305515 1304626 1216815 1204939 1231599 1162948 1164876
5262A164876j9415n7384M0413p0196L7265K2794K8218N5634J08483N8163J15644
$$ 1164876 1145461 1088077 1128490 1058294 1095559 1118353 1146571 1202205 1310688 1368851 1484495
5251A484495N8527n5249J2831r5831j13850n6306r7174l5260P782j04656p1389
$$ 1484495 1543022 1487773 1500604 1404773 1290923 1234617 1137443 1102183 1109965 1005309 933920
5240I33920k8528r286K993p7795m1010n6059k3056l4857O2816k0225J8578m981
$$ 933920 905392 896106 899099 821304 780294 724235 701179 666322 729138 708913 727491 722510
5228G22510J34212j3847Q563P8021o5127J4440p4056j00895L5153r9145R583j4224
$$ 722510 856722 842875 851438 929459 864332 878772 804716 703821 738974 639829 649412 635188
5216F35188q0366L4071p7375r156k499p7k6271k8462J0441m0866K1952m8623L0824
$$ 635188 554822 588893 511518 502362 499863 499786 473515 445053 455494 414628 436580 387957 418781
5203D18781m2252M0927l2094j9843N602k273J7610m6044L2105n1892P0441p9574
$$ 418781 376529 417456 385362 365519 371121 368848 386458 340414 372519 320627 391068 311494
5191C11494j6847J01673q5143j6906N8720o2906M0846J4740l5047j2352J5289
$$ 311494 294647 396320 311177 294271 352991 290085 330931 345671 310624 298272 313561
5180C13561N6698k9140k2459j2142K4774P758j00406P7186L19m2178Q4715n2871
$$ 313561 370259 341119 318660 306518 331292 339050 238644 315830 316149 273971 358686 305815
5168C05815M654J5121M3765o1430j7539R407O1911p5007O7000l1846l0656O6942
$$ 305815 310469 325590 369355 307925 290386 299793 361704 286697 353697 321851 291195 358137
5156C58137l1047k8895K862k54L3570k5993M9488l1990m3714M1898j0619j3130
$$ 358137 327090 298195 301057 300803 334373 308380 357868 325878 282164 324062 313443 300313
5144C00313Q1074m394k9511l8367O9974k8282k632J4843L075L4235n6379N0511
$$ 300313 381387 376993 347482 309115 379089 350807 348175 363018 366093 400328 343949 394460
5132C94460m0530M5028Q679Q228k8012j6500K3107n677k7793N4399q219j2921
$$ 394460 353930 398958 407637 415865 387853 371353 394460 388783 360990 415389 407170 394249
5120C94249Q19J4151M9787l4592O2749k8768k1768J7253Q309O4402j2063J3846
$$ 394249 395068 409219 459006 424414 487163 458395 436627 453880 462189 526591 514528 528374
5108E28374O4667o6485M3374N3709L3655n9421O6398n7363M5066k4087N5245J0290
$$ 528374 593041 526556 569930 623639 657294 597873 664271 606908 651974 627887 683132 693422
5096F93422M1386K6903k7954L4942N0944M6745R3736Q035M4126K4857Q7454J06701
$$ 693422 734808 761711 733757 768699 819643 866388 960124 968159 1012285 1037142 1124596 1231297
5084A231297J73189Q6035J01102J53470P8846K00199J1096J25760O404k6408N0768
$$ 1231297 1404486 1490521 1591623 1745093 1823939 2024138 2035234 2160994 2167398 2140990 2191758
5073B191758m5653N02n7178o1541n747q8975r031L4572n1957R6659l2005J12035
$$ 2191758 2146105 2146607 2089429 2027888 2022141 1933166 1924135 1958707 1906750 2003409 1971404 2083439
5061B083439O3331Q2811J99081Q2670J72393J32503K73562K46477K85234L06609
$$ 2083439 2146770 2229581 2428662 2511332 2683725 2816228 3089790 3336267 3621501 3928110
5051C928110L08227L44220J87496K41607K25253N6490L9028p9631r8462j33498
$$ 3928110 4236337 4580557 4768053 5009660 5234913 5291403 5330431 5250800 5152338 5018840
5041E018840k06434j25048j09568j35839k59j03552m76N2604r259j6619O2432
$$ 5018840 4812406 4687358 4577790 4441951 4441692 4338140 4337664 4390268 4381009 4364390 4426822
5030D426822J6021k6852J13727R4292N2646J74695J19723K66981K44890K54307
$$ 4426822 4442843 4415991 4529718 4624010 4676656 4851351 4971074 5238055 5482945 5737252
5020E737252K74230K19511J81041J76653N1897K8896k3105j19330o3856j37397
$$ 5737252 6011482 6230993 6412034 6588687 6640584 6669480 6646375 6527045 6463189 6325792
5010F325792k6076k9061l0882K5170R1486k029j2796J18726j19847o4912j0327
$$ 6325792 6299716 6270655 6239773 6264943 6356429 6354400 6341604 6460330 6340483 6275571 6265244
4999F265244j50804p7313n8790n0560n0946k609P0172M1447O8411R7459q66J4006
$$ 6265244 6114440 6037127 5978337 5927777 5876831 5874222 5944394 5985841 6054252 6151711 6150845 6164851
4987F164851M1225m4646m9311k01923j30296j68225j24379j37628o5106j23837
$$ 6164851 6206076 6161430 6112119 5910196 5779900 5611675 5487296 5349668 5284562 5160725
4977E160725j45407M2498l3550m9938m4543q1185p6203k37818o4603k11543j29112
$$ 5160725 5015318 5057816 5024266 4974328 4929785 4848600 4772397 4534579 4469976 4258433 4129321
4966D129321r1189k22452j18455o4899j14011q3717q1188j19537q237j25643p6727
$$ 4129321 4038132 3815680 3697225 3632326 3518315 3434598 3353410 3233873 3225636 3099993 3023266
4955C023266p6081j73652m8039j21498q3339j56181n0087r9938m0288j65715n5895
$$ 3023266 2947185 2773533 2725494 2603996 2520657 2364476 2314389 2214451 2174163 2008448 1952553
4944A952553p3412m052p3862L3497j14934L386R0596q9655M5165R0352l6083J3796
$$ 1952553 1879141 1875089 1801227 1834724 1719790 1723176 1813772 1724117 1769282 1859634 1823551 1837347
4932A837347P9602O2960J05793P3990J52326P7886J6394O7368j182n7641k0603
$$ 1837347 1916949 1979909 2085702 2159692 2312018 2389904 2406298 2473666 2472484 2414843 2394240
4921B394240l7979k3315j48777n5302j0525q3753N1771J3743o5649o730Q8997
$$ 2394240 2356261 2332946 2184169 2128867 2118342 2034589 2086360 2100103 2034454 2027724 2116721
4910B116721K3359M1528J34211M6074J17221N8869J84026J02307K00517J60153
$$ 2116721 2140080 2181608 2315819 2361893 2479114 2537983 2722009 2824316 3024833 3184986
4900C184986K36637J96641J62094J60241J17877J51144K7245r443m8607j307q765
$$ 3184986 3421623 3618264 3780358 3940599 4058476 4209620 4236865 4227422 4178815 4177508 4168743
4889D168743j55923k8224l0358o8898o822j0023l4766k0782k3533j2981p8570
$$ 4168743 4012820 3984596 3954238 3885340 3878518 3868495 3833729 3812947 3789414 3776433 3697863
4878C697863N7974k5782k2656M9330Q8321O1005J39648N9385J42265R0747J77901
$$ 3697863 3755837 3730055 3707399 3756729 3845050 3906055 4045703 4105088 4247353 4338100 4516001
4867D516001M5745l2803m2955l6438j45818j10070p1237n2724j72385L3170l7880
$$ 4516001 4561746 4528943 4485988 4449550 4303732 4193662 4122425 4069701 3897316 3930486 3892606
4856C892606n1415j799n3181J6038k3360l5783J6111j34578l0988r4588j00805
$$ 3892606 3841191 3839392 3786211 3802249 3778889 3743106 3759217 3624639 3593651 3499063 3398258
4845C398258n8649j03348o8815q1012j35364l7309j16796r523q7825L4755j41147
$$ 3398258 3339609 3236261 3167446 3086434 2951070 2913761 2796965 2787442 2699617 2734372 2593225
4834B593225o51j4850j09252n7135M7574m4017n8765k4035p4618r9288O948j07176
$$ 2593225 2592574 2577724 2468472 2411337 2458911 2414894 2356129 2332094 2257476 2158188 2165136 2057960
4822B057960m639o3566n2938q2462K9970r2510j5719j9387n0123P995p7428L1320
$$ 2057960 2053321 1989755 1936817 1854355 1884325 1791815 1776096 1756709 1706586 1714581 1637153 1668473
4810A668473n261L8022O4670N4120P3347J92188K29289J92988K16510R3892J26408
$$ 1668473 1663212 1701234 1765904 1820024 1893371 2085559 2314848 2507836 2724346 2818238 2944646
4799B944646J37321K27456L84471L51208K58455R2790N2414J13102K6483L05622
$$ 2944646 3081967 3309423 3693894 4045102 4303557 4396347 4448761 4561863 4588346 4893968
4789D893968L40967K29268L8449l3838k17721l08078j43018K6634o3923r6927
$$ 4893968 5234935 5464203 5502652 5468814 5251093 4943015 4799997 4826631 4762708 4665781
4779D665781k39769j84715l34885k76405k49629k31594j44314j06260k88744k00599
$$ 4665781 4426012 4241297 3906412 3630007 3380378 3148784 3004470 2898210 2609466 2408867
4769B408867k34905k81769j82206j89316r2506j59804o6867p4171j15647n6008
$$ 2408867 2173962 1892193 1709987 1520671 1428165 1268361 1201494 1127323 1011676 955668
4759I55668n1226m0502l5193J8220q4301j764j0459p3072M2121k3477o3443J1731
$$ 955668 904442 863940 828747 846967 762666 760902 750443 677371 719492 696015 632572 644303
4747F44303k8346k6954j6897K4473q008k8519k6722P655R961M1618r6825o310
$$ 644303 615957 589003 572106 596579 588571 560052 533330 540985 550946 592564 495739 489429
4735D89429j9477J6393M744r8634J07645q2527j5118L6341O2151q2855O186j9161
$$ 489429 469952 486345 491089 392455 500100 417573 402455 438796 500947 418092 424278 405117
4723D05117M5220l613p0541M7428k9061j140j054K2448J996k6094j9335q046K250
$$ 405117 450337 446724 376183 423611 394550 393410 392356 414804 416800 390706 371371 363325 365575
4710C65575M4235l0453M8606n2525Q712N135r520L9160o7912N1233p393o5661
$$ 365575 409810 379357 427963 375438 384150 389285 379765 418925 351013 402246 394853 329192
4698C29192K225M5457L623J141n0423P8491p172L5940k2666M3908n202R946L468
$$ 329192 331417 376874 380497 381638 331215 409706 402534 438474 415808 459716 454514 464460 467928
4685D67928J1780j8112O7790K904n1280J09359Q095K0697R1813k983M2116Q7463
$$ 467928 479708 461596 529386 532290 481010 590369 598464 619161 710974 707991 750107 837570
4673H37570M84R5855Q2096k1562m132J55239l9600O0258L4598j030L379Q4646
$$ 837570 838054 933909 1016005 994443 990311 1145550 1105950 1166208 1200806 1199776 1203155 1287801
4661A287801K7407M0603j7143L7607P2020K3753N5133M9479M1101J22700q741
$$ 1287801 1315208 1355811 1338668 1376275 1448295 1472048 1527181 1576660 1617761 1740461 1731720
4650A731720J17652J03077K9397L5843N7859j0363P953M267j00103r9029m7802
$$ 1731720 1849372 1952449 1981846 2017689 2075548 2065185 2073138 2077405 1977302 1878273 1830471
4639A830471j02552k052p0039r1112j8078r8677o3967L7034n6630m2654l7311
$$ 1830471 1727919 1725867 1655828 1564716 1546638 1447961 1383994 1421028 1364398 1321744 1284433
4628A284433o388J6101m0528r855n5714N0248j04307K8514j1525j03062L4082
$$ 1284433 1278045 1294146 1253618 1243763 1188049 1238297 1133990 1162504 1150979 1047917 1081999
4617A081999j30420L5290r1031j15626k1864j3284p8721m3549j307p9678m6457
$$ 1081999 951579 986869 895838 780212 758348 745064 666343 622794 621487 541809 495352
4606D95352P5457o6179n2964K8363n6342m8781k0472o030O7451n9174j9518j3674
$$ 495352 570809 504630 451666 480029 423687 374906 354434 348404 415855 356681 337163 323489
4594C23489n8969Q055K094M0554n7792k587K452J8490j7180j3898M8558p2723
$$ 323489 264520 272575 274669 315223 257431 254844 257296 275786 258606 244708 293266 220543
4582B20543p641N4426n1395M3961J5018n9618M498J2224K5400o3733O408K3775
$$ 220543 212902 267328 215933 259894 274912 215294 219792 232016 257416 193683 200091 223866
4570B23866J0934K0171o4392j8188P4338m0050p0461R5488q8784N7287O182P567
$$ 223866 234800 254971 190579 172391 246729 206679 136218 231706 142922 200209 206391 213958
4558B13958n3411N7828N4082o8624N389J3341k3248q125j9128N1884r043j729
$$ 213958 160547 218375 272457 203833 209222 222563 199315 191190 172062 223946 214903 213174
4546B13174L8757j6267j3468l2662K4775L867l9042j5557P8989n0522m2769P1767
$$ 213174 251931 235664 222196 189534 214309 218176 179134 163577 242566 192044 149275 221042
4534B21042l9206l9280Q3309k9543n6398N2116K6285m9994M4384J9217l4358K0740
$$ 221042 181836 142556 225865 196322 139924 192040 218325 168331 212715 231932 197574 218314
4522B18314O848r448j3916M3535n737N566l1948R104N5413n1548N4073k3520M9901
$$ 218314 225162 215714 201798 245333 239596 245162 213214 222318 277731 226183 280256 256736 306637
4509C06637N386k8925J248k5941J091j9041m2659R5914N1055o4616k1318O5123
$$ 306637 312023 283098 284346 258405 259496 240455 197796 293710 344765 280149 258831 323954
4497C23954l2689j7277N8385m8174J7834K3102n2753K7899J5788J20835n086J0623
$$ 323954 291265 273988 332373 284199 302033 325135 272382 300281 316069 436904 431818 442441
4485D42441L6987N5075O5313j4336J22575l0865j2914N4023j51m57n1799J1538
$$ 442441 479428 534503 599816 585480 708055 677190 664276 718299 718148 717691 665892 677430
4473F77430o3948O681J4886R422N948J4013n4101O7961L3249P340o116M6577J02843
$$ 677430 613482 620163 635049 644471 650419 664432 610331 678292 711541 718881 712765 759342 862185
4460H62185j6788J00387J94226j4703K28635J00796Q8157J80153J31932N2986
$$ 862185 845397 945784 1140010 1125307 1353942 1454738 1542895 1723048 1854980 1907966
4450A907966J15483K5179n765j40180j1365j09233q7416j15396p3859o624K2483
$$ 1907966 2023449 2048628 2042863 1902683 1891318 1782085 1694669 1579273 1505414 1498790 1521273
4439A521273l2550p7103K7227k5517R751P4482j2900J39899J44856J37637J05819
$$ 1521273 1488723 1411620 1438847 1413330 1423081 1497563 1484663 1624562 1769418 1907055 2012874
4428B012874K15252J88353J89984J76510K67532J27892J72761J18352P0309o8508
$$ 2012874 2228126 2416479 2606463 2782973 3050505 3178397 3351158 3469510 3539819 3471311
4418C471311j20214j45395q5566k72429j89666j79924j31751q7314r3195m0226
$$ 3471311 3351097 3205702 3120136 2847707 2658041 2478117 2346366 2259052 2165857 2125631
4408B125631j12738j2988J7419K9785j7959J32799K4938Q6378J72400J33644J72390
$$ 2125631 2012893 1999905 2017324 2047109 2029150 2161949 2186887 2273265 2445665 2579309 2751699
4397B751699K35404J65416K22659K11605Q3056P7258l0070l1809j87613j07651
$$ 2751699 2987103 3152519 3375178 3586783 3669839 3747097 3717027 3685218 3497605 3389954
4387C389954k71605j81132j91449k30556r4182j81496j08487o3228j09270l3970
$$ 3389954 3118349 2937217 2745768 2515212 2421030 2239534 2131047 2067819 1958549 1924579
4377A924579m5126k4479j9713n4493L5734M55l1076J34091R4971J21417R0350
$$ 1924579 1879453 1854974 1835261 1780768 1816502 1816957 1785881 1919972 2014943 2136360 2226710
4366B226710M0502P9113O2671L7849o8691l2777n2908j21841j42077q5309j58698
$$ 2226710 2267212 2346325 2408996 2446845 2378154 2345377 2292469 2170628 2028551 1943242 1784544
4355A784544r5478j87395m4280o9534p5278k4795j9374j40257j2901K523l8355
$$ 1784544 1689066 1501671 1457391 1387857 1312579 1287784 1268410 1128153 1115252 1117775 1079420
4344A079420L5575L4522L315k4660L8027k970l8056p205M7104L2578r2640j325
$$ 1079420 1114995 1149517 1152832 1128172 1166199 1163229 1125173 1117968 1165072 1197650 1105010 1103685
4332A103685k9782o7075j9735k1736p8195Q369l7071r093o5926K0978J8109m2197
$$ 1103685 1073903 1006828 987093 965357 887162 895531 858460 849367 783441 804419 822528 780331
4320G80331p3255L9119n6332q187L3938O555o906o191k8708L4709o6560l103K3567
$$ 780331 707076 746195 689863 681676 715614 722169 715263 709072 680364 715073 648513 645410 668977
4307F68977l2837P560q457L4911j8534O1827j0055j3098J7911k3504m350K7118
$$ 668977 636140 643700 635243 670154 651620 713447 703392 690294 708205 684701 680351 707469
4295G07469J5779J20501l1625J29086J343L0109l5500M6011n794n8157m926J7906
$$ 707469 723248 843749 812124 941210 942553 972662 937162 983173 977379 919222 914296 932202
4283I32202n7482L9511R844n853N515J4015L9226Q015K1489L5847K2345J0078
$$ 932202 874720 914231 924075 918222 923737 937752 976978 984993 1006482 1042329 1064674 1074752
4271A074752N9043M0784J44938M3558P6393J43677J29156M5393L0188K4595j097
$$ 1074752 1133795 1174579 1319517 1363075 1439468 1583145 1712301 1757694 1787882 1812477 1811380
4260A811380k1297k8767r954J7323l680M1559M5279j6459P5456P2697n918P1099
$$ 1811380 1790083 1761316 1751362 1768685 1765005 1806564 1851843 1835384 1910840 1983537 1977619 2048718
4248B048718J40848R8327J47667J46530J07089J88907J72220K51549K51757K24958
$$ 2048718 2189566 2287893 2435560 2582090 2689179 2878086 3050306 3301855 3553612 3778570
4238C778570L12787Q4134J31208O7789o091K7544M3032Q0414O4727R2297J49024
$$ 3778570 4091357 4175491 4306699 4374488 4368397 4395941 4438973 4519387 4584114 4676411 4825435
4227D825435J74775J30613P0675J94905J45580J24278J98463K20744J88988K96795
$$ 4825435 5000210 5130823 5201498 5396403 5541983 5666261 5864724 6085468 6274456 6571251
4217F571251K78246K77574L44429K23853K04139J79050J14590J7629j31764j08070
$$ 6571251 6849497 7127071 7471500 7695353 7899492 8078542 8193132 8210761 8078997 7970927
4207G970927j24666j60503M577o3099l486j4543M055j06336k6392j44628r8116
$$ 7970927 7846261 7685758 7690335 7627236 7623750 7609207 7613262 7506926 7480534 7335906 7237790
4196G237790o3038n6140L7479K4126J15475J19963Q2647L9688k8270k9198j42014
$$ 7237790 7174752 7118612 7156091 7180217 7295692 7415655 7498302 7537990 7509720 7480522 7338508
4185G338508k25742k41733k76395l14891k74328k45537k30688j77008o1803k52886
$$ 7338508 7112766 6871033 6594638 6279747 6005419 5759882 5529194 5352186 5290383 5037497
4175E037497j35081j57100j75777k18371j29306k10139j09021j32125j16261j28071
$$ 5037497 4902416 4745316 4569539 4351168 4221862 4011723 3902702 3770577 3654316 3526245
4165C526245m7361j82488j6046j24137j27115j07649j10153j50179r4644j40373
$$ 3526245 3478884 3296396 3280350 3156213 3029098 2921449 2811296 2661117 2566473 2426100
4155B426100j49889j03535j42769o6797j03233M449j26621j03467m9130o2798
$$ 2426100 2276211 2172676 2029907 1963110 1859877 1864326 1737705 1634238 1585108 1522310
4145A522310m1984n242j25038M5288o1837k0974j28210L4666N1339n0941p7435
$$ 1522310 1480326 1475084 1350046 1395334 1333497 1312523 1184313 1218979 1270318 1219377 1141942
4134A141942m7561K8824n4708m2032j9791n9768p019o5646K0792p1384J588M0792
$$ 1141942 1094381 1123205 1068497 1026465 1006674 946906 939887 874241 895033 823649 825237 866029
4122H66029o6977m4886p823o468n7682N2568k06q4990j3781Q095k0112k4338j1282
$$ 866029 799052 754166 746343 739875 682193 734761 734555 649565 635784 643879 623767 599429 588147
4109E88147l1471L7351k2392K9337o0361k163O673n9627L404O966K082j3948l5720
$$ 588147 556676 594027 571635 600972 540611 538448 545121 485494 488898 495864 497946 483998 448278
4096D48278j9818k1016j138m0343N7981k8427K082K0793p0006n6004N3217j7276
$$ 448278 428460 407444 406306 365963 423944 395517 397599 418392 348386 292382 345599 328323
4084C28323r739L6292l5772N235R853j2380R29n920q280m3229j4051M7171J6859
$$ 328323 318584 354876 319104 324339 334192 321812 322741 316821 308541 265312 251261 298432 315291
4071C15291l6652q834J9536p857j8622m4552q120L9719l8918k0666R5291o0100
$$ 315291 278639 269805 289341 281484 262862 218310 210190 249909 210991 190325 285616 225516
4059B25516J8705m1829J8698j4932L805l0442q23P1228p2063M1048L150n4609
$$ 225516 244221 202392 221090 206158 209963 179521 178698 249926 177863 218911 222061 167452
4047A67452J8560K6573k2590j9634j0465P0360p5134o914J4270N918lK4774m3685
$$ 167452 186012 212585 189995 170361 159896 230256 155122 148208 162478 168396 168393 193167 149482
4034A49482k6675N3591P964n9032O8940o6058k8459O5429m5977M8229j020L8665
$$ 149482 122807 176398 184362 125330 194270 128212 99753 165182 119205 167434 166414 205079
4022B05079n9324L6936l2276O7332q2835J3264J1206M0801o5882J5698M4997q4615
$$ 205079 145755 182691 150415 217747 134912 148176 159382 200183 134301 149999 194996 110381
4010A10381M7540k1731L5890J5777P272K2286q8117P0848m6749l282m567L9287
$$ 110381 157921 136190 172080 187857 195129 217415 129298 200146 153397 150115 145548 184835
3998A84835j7313L0670K825j1414k333l9484l4001P9397k4073l8299P1468r3498
$$ 184835 167522 198192 201017 189603 187270 147786 113785 193182 169109 130810 202278 108780
3986A08780N9978L9860q3699M3756N464M9236m9523k9618M3024l6586O9651k1150
$$ 108780 168758 208618 124919 168675 174139 223375 173852 144234 187258 150672 220323 199173
3974A99173l2271k0703J9764O3290p8654L2468l3524j0279O3707p5145M3833l8117
$$ 199173 166902 146199 165963 229253 150599 183067 149543 139264 202971 127826 171659 133542
3962A33542J0390j1432J8149N0954m3351M6505j0946J3836k5430k9269N127P67
$$ 133542 143932 132500 150649 201603 158252 204757 193811 207647 182217 152948 158075 158842
3950A58842K5927k4818L9926l5561j7869J9679L9545k9715k4376N0496m1976Q533
$$ 158842 184769 159951 199877 164316 146447 166126 205671 175956 151580 202076 160100 168633
3938A68633K4857r0803N0206M0125p9538N294J876J7968m466M5750m6081l683
$$ 168633 193490 102687 152893 193018 113480 118774 120650 138618 134152 179902 133821 130138
3926A30138N2666j4101j2765R696n0894k1265J7081O0431P37n5885k2008M4632
$$ 130138 182804 168703 155938 165634 114740 93475 110556 170987 171724 115839 93831 138463
3914A38463m5771K5523K5771K7981k0022m2233m3558P4841k9605K224M1301p6559
$$ 138463 92692 118215 143986 171967 151945 109712 66154 140995 111390 113614 154915 78356
3902G8356Q7406O834p1056J6934J6017l7346k1897P2570m1937P2815q0081M1045
$$ 78356 165762 172596 101540 118474 134491 97145 75248 147818 105881 178696 98615 139660
3890A39660j9281l275M1908m7595L4000J2168k0840J1116n075k4573k4635K0979
$$ 139660 120379 117104 159012 111417 145417 157585 136745 147861 142786 118213 93578 114557
3878A14557k5208J3311K9248j2130M4564j9238o7282O9466j3585m2114j1883k4230
$$ 114557 89349 102660 131908 119778 164342 145104 77822 147288 133703 91589 79706 55476
3866E5476N9207L2511q8326O1402M1404q9030P290J5062P3215k1523M901p5019
$$ 55476 114683 147194 58868 120270 161674 72644 79934 94996 168211 146688 151589 76570
3854G6570L2783N2291m2320N0914l4182K3655O5207j24800O5485l9780K8252J1132
$$ 76570 109353 161644 119324 170238 136056 159711 224918 100118 165603 125823 154075 165207
3842A65207j2725R399k828j7992K6542j6129n6712M3465R3573j24502k625R1626
$$ 165207 152482 161881 159053 141061 167603 151474 94762 138227 231800 107298 104673 196299
3830A96299o2613N5851K2264l3633J18376l2522r7150r430N5670K8299J952L8751
$$ 196299 133686 189537 211801 178168 296544 264022 166872 157442 213112 241411 243363 282114
3818B82114n1585M571r857N6340j6150J5422p258l9158P1890K198J2372P5060
$$ 282114 230529 235100 225243 281583 265433 280855 273597 234439 306329 308527 320899 395959
3806C95959K3505j6933k2616N7139j05144P9788k9841Q987j0005p692l1845N1721
$$ 395959 419464 402531 379915 437054 331910 411698 381857 390844 380839 373147 341302 393023
3794C93023m5233k3646M8314M7552o0640M2047K0829L0952L4240N1855l4348N0814
$$ 393023 347790 324144 372458 420010 359370 401417 422246 453198 487438 539293 504945 555759
3782E55759l7598K7359J17809N4119Q4143J1485J3650m2408j013K3598q9124m7974
$$ 555759 518161 545520 663329 717448 801591 813076 826726 784318 783305 806903 717779 669805
3770F69805O4093l8007k3849P1942j5363O4703K6170j6484J2843J04083P6395
$$ 669805 733898 695891 672042 743984 728621 793324 819494 803010 815853 919936 996331
3759I96331j5646O1833l1222O1607J41014q018J49455J34093R0651P1081K8533
$$ 996331 980685 1042518 1011296 1072903 1213917 1205899 1355354 1489447 1580098 1651179 1679712
3748A679712J5101q3617j0018j48485j17318j25514n5904j20934j10478o5580
$$ 1679712 1694813 1611196 1601178 1452693 1335375 1209861 1153957 1033023 922545 856965
3738H56965j18623j402m9673l2403q9726k9060j6534J796m4073L2503j2627M5682
$$ 856965 738342 736940 687267 654864 565138 536078 519544 521340 477267 509770 497143 542825
3726E42825r2271k5716j1118M8622l2493l1223k6441P531P3190p044j6660l520
$$ 542825 450554 424838 413720 462342 429849 398626 372185 379716 452906 445862 429202 425682
3714D25682J1292o9144P5435q8400j3848O8966j8000o6748K7495R417n7722O1543
$$ 425682 436974 367830 443265 354865 341017 409983 391983 325235 352730 362147 304425 365968
3702C65968o4020O410J1793K2588p4709L5178K3637m817J3813m0346R9390o6162
$$ 365968 301948 308358 320151 342739 268030 303208 326845 322028 335841 295495 394885 328723
3690C28723K3664n1594J1737K0096j8821l5400Q675N535J1342n085l2142K8616
$$ 328723 352387 300793 312530 332626 313805 278405 287080 292615 303957 298872 266730 295346
3678B95346L9667r2160K5584j7682n6236N513J2664R1846q4952J9591K9260o5690
$$ 295346 335013 242853 268437 250755 194519 200032 212696 304542 219590 239181 268441 202751
3666B02751M6246l3606l9285L8247J7948m1762Q714Q2335m1787M1758M1351m3839
$$ 202751 248997 215391 176106 214353 232301 190539 199253 281588 239801 281559 322910 279071
3654B79071j825K3449k7217M2817l0415q0835Q2770K6238o1815r298M0692L217
$$ 279071 277246 300695 273478 316295 285880 205045 287815 314053 252238 242940 283632 286849
3642B86849L5636k4094k0117N680N5652O7381j7444n8937Q264K5516o6142Q3470
$$ 286849 322485 298391 278274 283954 339606 406987 389543 330606 338870 364386 298244 381714
3630C81714r9658O011J4777k8923L489n603p218K6910k5550k4328L6657l1701
$$ 381714 282056 288067 302844 273921 277410 271807 264589 291499 265949 241621 278278 246577
3618B46577N803M587J4413l2547M7456O019P6246Q3758J8957Q477L1314p0988
$$ 246577 252380 256967 271380 238833 286289 292308 368554 452312 471269 479746 511060 440072
3606D40072q2571J327m6206K2022q2446J5647k9368k8122O282K153m7889N1314
$$ 440072 357501 358828 312622 334644 252198 267845 238477 210355 216637 218790 170901 222215
3594B22215k6809m4272L3587Q959M258J7056l6125k9494J9505j3000J1069J06496
$$ 222215 195406 151134 184721 193680 197938 214994 178869 149375 168880 155880 166949 273445
3582B73445k0736j0453J2988n8782r435J7432K0109k7102k2382m5347m6720O5682
$$ 273445 252709 242256 255244 196462 187027 204459 224568 197466 175084 129737 83017 148699
3570A48699o2412L5048k1601O676K1545l6591Q8539l8157n6875k1600K1344J6445
$$ 148699 86287 121335 99734 106410 127955 91364 179903 141746 84871 63271 84615 101060
3558A01060L418m3366M7430J6188l2329n5953L897J6288N903n554K7027j137J4222
$$ 101060 104478 61112 108542 124730 92401 36448 40345 56633 62536 56982 84009 82872 97094
3545I7094j5029M597K5337j3539m9384Q3968p5462K6194o313J7766p6590O2532
$$ 97094 82065 86662 111999 98460 49076 133044 57582 83776 77463 95229 18639 81171
3533H1171J5163J0969k6877L1010m5906L3323l400l7316M8028K1008J6887k0171
$$ 81171 96334 107303 80426 111436 65530 98853 95453 58137 106165 127173 144060 123889
3521A23889o275J2285K564R550l7704l6213N3920j5210M3832p2745J852R2091
$$ 123889 117614 129899 132463 142013 104309 68096 122016 106806 150638 77893 79745 171836
3509A71836l4675j5057l759K3480j9330j5930M4683J9905k6565l9651N0623J1247
$$ 171836 137161 122104 118345 141825 122495 106565 151248 171153 144588 104937 155560 166807
3497A66807N2963p3443K4413L8533p6363L8280k5023p712M9813N611N3826k3106
$$ 166807 219770 146327 170740 209273 132910 171190 146167 138455 188268 193879 247705 224599
3485B24599L5293m8092K7611k2550P1161j7258m6518O4922l7844m807j0042Q9650
$$ 224599 259892 211800 239411 216861 288022 270764 224246 289168 251324 246517 236475 326125
3473C26125l2309M0067p0355K9219M7687m8003J7302Q2419p5929J0682m4013N7130
$$ 326125 293816 333883 263528 292747 340434 292431 309733 392152 316223 326905 282892 340022
3461C40022L1860j9282L7432k7660J0706M4435m5726N1362m5624Q0607k5404m5359
$$ 340022 371882 352600 390032 362372 373078 417513 371787 423149 377525 458132 432728 387369
3449C87369K4863q580M7676o9228j2043j7038l6675K917m552j5130Q093L0127
$$ 387369 412232 403652 451328 382100 370057 353019 316344 319261 314709 299579 307672 337799
3437C37799P763k4629L451O6922q477o750Q06q719L7378k4818k1950L39j4371
$$ 337799 345562 320933 324384 391306 382829 376079 376885 368166 405544 380726 358776 359115 344744
3424C44744k6234P681L6221p2199k8314l7962M7376k7161J2722j6032J2035m3284
$$ 344744 318510 326191 362412 290213 261899 223937 271313 244152 256874 240842 252877 209593
3412B09593O217L081L6813l2030L8914m1117m2084P2746l7250m2710J5446k5287
$$ 209593 215810 218891 255704 223674 262588 221471 179387 252133 214883 172173 187619 162332
3400A62332Q686m300n8831M0646K0811l1669J9299k3625j1342M9599n3021k4400
$$ 162332 171018 166718 107887 148533 169344 137675 156974 133349 122007 171606 118585 94185
3388I4185O1577p7707J9926j7001l9565O7750n5595L3811n876P316m4723L2004
$$ 94185 155762 78055 97981 80980 41415 109165 53570 87381 81505 88821 44098 76102
3376G6102L8638k0584o2386K3961m8795Q2427k0479l4083j8914L9899l7591L9433
$$ 76102 114740 94156 31770 55731 6936 89363 68884 34801 15887 55786 18195 57628
3364E7628q019o2173L5031O1673l5805j2343L5642p0568L1086k512k668p939K9026
$$ 57628 49609 -12564 22467 84140 48335 35992 71634 1066 32152 29640 26972 19033 48059
3351D8059j3908J782l0187N3944q4309K4826M150N928J5153l8114O3515o0024
$$ 48059 34151 35933 5746 59690 -24619 207 4357 10285 25438 -12676 50839 -9185
3339i185L0432L0689p8137J750J2808N814l028K2193l0559j1818N6422k9353K9462
$$ -9185 21247 51936 -26201 -24451 -11643 -5829 -8857 13336 -17223 -29041 27381 -1972 27490
3326B7490o80q3283M8934M374K4980J4607m5264L4828m767m3167O4773j00795
$$ 27490 26810 -56473 -7539 -3165 21815 36422 -8842 25986 21219 -21948 42825 -57970
3314e7970R1611n3152j7481M7697m2429J6139p11m9233M9028p091j2607k1356
$$ -57970 33641 -19511 -36992 10705 -31724 -15585 -16296 -65529 -16501 -23592 -36199 -57555
3302e7555N2095m5525O9844m6821m1228L4073K1453l1116J3211J1315K11j107
$$ -57555 -5460 -50985 18859 -27962 -69190 -35117 -13664 -44780 -31569 -20254 -20043 -21150
3290b1150j3048j9251R6982o0961J8550J9688q0784J8798N272R876j3384j4118
$$ -21150 -34198 -53449 43533 -17428 1122 20810 -59974 -41176 -35904 -26028 -39412 -53530
3278e3530J2283p956m9394R2065q668k7166J7724l8550J8379R565K4257k3294
$$ -53530 -41247 -49203 -98597 -6532 -15200 -42366 -24642 -63192 -44813 -35248 -10991 -34285
3266c4285K9978j5645l7473N9473N50q3493M3666K5965L599l5780J4125o492k781
$$ -34285 -4307 -19952 -57425 2048 2598 -80895 -37229 -11264 -7665 -43445 -29320 -35812 -38593
3253c8593L6944o8020j718L3560l6721P4115k3416j1684q952J5690l1799l0719
$$ -38593 -1649 -69669 -71387 -37827 -74548 -433 -23849 -35533 -44485 -28795 -60594 -91313
3241i1313K1199N798J6184K8166J6504j2771m921P827k2120O791l3819J6817K5918
$$ -91313 -70114 -64316 -48132 -19966 -3462 -16233 -21154 -13327 -35447 -28656 -62475 -45658 -19740
3228a9740o2338l2032R3733l598j4729k906m6069K7492K1126r347J3033K8493
$$ -19740 -82078 -114110 -20377 -23975 -38704 -41610 -87679 -60187 -39061 -48408 -35375 -6882
3216f882L9439o8094j4837J0245j5153O4896p2209r142L9115l2448M6144R857
$$ -6882 32557 -35537 -50374 -40129 -55282 9614 -62595 -71737 -32622 -65070 -18926 -9069
3204i069l3907N826R491r488k8991M6356M800l5561K2241j1503K3687p0852P4221
$$ -9069 -42976 -37150 -27659 -37147 -66138 -19782 -14982 -50543 -28302 -39805 -16118 -86970 -12749
3191a2749j120o7247J08070q2923l6056Q5691j9020j1247n847n3402Q1267l3828
$$ -12749 -13869 -81116 26954 -55969 -92025 -6334 -25354 -36601 -42448 -95850 -14583 -48411
3179d8411K7666l870j1977P787o5269N5840m7264L0504N1925p2681j6138j6496
$$ -48411 -20745 -24615 -36592 -28805 -94074 -38234 -85498 -54994 -3069 -75750 -91888 -108384
3167a08384J06846q0291R4127n2882m9828J1705P4489n8369l1091R0331j4149
$$ -108384 -1538 -81829 12298 -40584 -90412 -78707 -4218 -62587 -93678 -3347 -17496
3156a7496l4131M285R041k9066K0667o888O5986n0337o0912N2984m578l4794K6341
$$ -17496 -51627 -47342 -38301 -67367 -46700 -53588 12398 -37939 -98851 -45867 -50445 -85239 -58898
3143e8898K6095j6070N0180l4405k8362J8850M7150n0647k0120o539l743k0363
$$ -58898 -32803 -48873 1307 -33098 -61460 -42610 4540 -46107 -66227 -72766 -76509 -96872
3131i6872L8065P1715m1875l3171K8515l7488L4329k7657K2102J1163q610m3170
$$ -96872 -58807 12908 -28967 -62138 -33623 -71111 -36782 -64439 -42337 -31174 -39784 -82954
3119h2954o829R5383o7994k0588R3831o6530L5355M9801o9392J8923L3059q8925
$$ -82954 -89783 5600 -62394 -82982 10849 -55681 -20326 29475 -39917 -20994 12065 -76860
3107g6860n315Q8463N157n2692K2765p9778P5574j0652n6152O9068m892j8438
$$ -76860 -82175 6288 11445 -41247 -18482 -98260 -22686 -33338 -89490 -20422 -25314 -43752
3095d3752l5249O7359k9209m9628J7303O8494m6156O5776p1449k8437Q5017o231
$$ -43752 -79001 -11642 -40851 -90479 -73176 -4682 -50838 14938 -56511 -84948 69 -6162
3083f162l7309l8977N1960J5682n3032K9532o122k543J9230o710O635K6543l8643
$$ -6162 -43471 -82448 -30488 -14806 -67838 -38306 -44428 -46971 -27741 -34451 -27816 -1273 -39916
3070c9916J5349j6972m3870K1588K9953p2178P2208K1505p3809J8908M4176K4841
$$ -39916 -24567 -41539 -85409 -63821 -33868 -106046 -33838 -12333 -86142 -67234 -23058 1783
3058A783p6983N6811j7064j7404J8601r685k0942N3041j0640k3095P69k8520O4286
$$ 1783 -75200 -18389 -35453 -52857 -34256 -43941 -64883 -11842 -22482 -45577 -44808 -73328 -9042
3045i042q156o138j8105m0888J3528K3835J0129J7496l5163K3968k934l562k6018
$$ -9042 -17198 -23336 -41441 -82329 -68801 -44966 -34837 -17341 -52504 -28536 -31470 -35032 -61050
3032f1050K9787M7805m3066j6497J9934l5480j0926L8685n3456K3597L0057l2157
$$ -61050 -31263 16542 -26524 -43021 -23087 -58567 -69493 -30808 -84264 -60667 -30610 -62767
3020f2767N5712m0702K6209P43n6524J4769O0255o1484K6661j3560J2988M6811
$$ -62767 -7055 -47757 -21548 -20805 -77329 -62560 -2305 -63789 -37128 -50688 -37700 9111
3008I111n91l0086l2842N3785q083k7384l0191J04237p0596n4l69J3592m4105
$$ 9111 8520 -21566 -54408 -623 -8706 -36090 -66281 37956 -32640 -32694 -33063 -19471 -63576
2995f3576K9285k1649l29M859L3530K8770K0634l4669L6992N1721k5523M0861
$$ -63576 -34291 -55940 -56269 -51410 -17880 10890 31524 -3145 33847 85568 60045 100906
2983A00906k4954L2783p4644J2850J8352p1450K7410l6149k581n86k2798L8207
$$ 100906 75952 108735 34091 46941 65293 -6157 21253 -14896 -17477 -18063 -40861 -2654
2971b654J0870n288o3472N6250m865j7715O708L8772l0545p648l8765k8666O4942
$$ -2654 8216 2928 -60544 -4294 -9159 -26874 -20166 18606 -11939 -19587 -58352 -87018 -22076
2958b2076m0645K737M1058j1937k0504L1270j234N5676m0521M2612l6396m2011
$$ -22076 -62721 -59984 -18926 -30863 -51367 -20097 -21331 34345 -6176 36436 40 -41971
2946d1971j869Q300J3260L6145l7120j557L1225l9904r616K1650j712m1362L1273
$$ -41971 -43840 -35540 -22280 13865 -23255 -24812 6413 -33491 -43107 -21457 -23169 -64531 -33258
2933c3258k3184J9384M5139q054R101l9170r700J4844L6305n3653J1370P4177
$$ -33258 -56442 -37058 8081 27 9128 -30042 -39742 -24898 11407 -42246 -30876 43301
2921D3301q9279Q855O6656o9453M6276m0111J5337Q292k3876L3921k6836K6822
$$ 43301 -45978 -37123 29533 -39920 6356 -33755 -18418 -10126 -34002 -81 -26917 -95
2909i5k3775L053L1428n374n4024P1728J4533j4269N798k3686j4706k6856M8289
$$ -95 -23870 -20817 10611 5237 -48787 22941 37474 23205 29003 5317 -9389 -36245 12044
2896A2044k6152M2801L814L584l1833J0838j1629j5883J4659j7397L8076J6981
$$ 12044 -14108 28693 32507 36091 4258 15096 3467 -12416 2243 -15154 22922 39903
2884C9903o1503j8641O4972O764k1747J3258m295m7682N0868K2472m1638n28O0300
$$ 39903 -21600 -40241 24731 31495 9748 23006 18711 -28971 21897 44369 2731 2203 62503
2871F2503k843j7448l449M5057p0875Q281K789J5356n193L9080l0092J5109J8372
$$ 62503 59660 42212 38763 83820 12945 21226 24015 39371 34178 73258 43166 58275 76647
2858G6647L9355k3080n530l8957J9936k3958K3802k3665L6094k0990N2650k9008
$$ 76647 116002 92922 87392 48435 68371 44413 68215 44550 80644 59654 112304 83296
2846H3296K0758K8368j1138k4510K4611p7163J8464P9807m0718K919K7819j538
$$ 83296 104054 132422 121284 96774 121385 44222 62686 142493 101775 104694 132513 130975
2834A30975L317j0287l1593L2782l199k1809N2569l1273O902J7582j3874N7992
$$ 130975 134292 124005 92412 125194 121995 100186 152755 121482 128384 145966 132092 190084
$$ [...]
##END NTUPLES=NMR SPECTRUM
##END=
