##TITLE=abcd
##JCAMPDX= 6.0         $$ Bruker NMR JCAMP-DX V2.0
##DATA TYPE= NMR SPECTRUM
##DATA CLASS= NTUPLES
##ORIGIN= UXNMR, Bruker Analytische Messtechnik GmbH
##OWNER= root
$$ XWIN-NMR		Version 3.5
$$ Sat Aug  1 13:39:16 2026 Russian Standard Time (UT+4h)  servis@DPX200
##.OBSERVE FREQUENCY= 200.131235884673
##.OBSERVE NUCLEUS= ^1H
##.ACQUISITION MODE= SIMULTANEOUS
##.ACQUISITION SCHEME= undefined
##.AVERAGES= 8
##.DIGITISER RES= 18
##SPECTROMETER/DATA SYSTEM= spect
##.PULSE SEQUENCE= zg
##.SOLVENT NAME= CDCl3
##.SHIFT REFERENCE= (INTERNAL, CDCl3, 0, 16.4885)
##AUDIT TRAIL= $$ (NUMBER, WHEN, WHO, WHERE, WHAT)
$$ ##TITLE= Audit trail, XWIN-NMR		Version 3.5
$$ ##JCAMPDX= 5.01
$$ ##ORIGIN= Bruker BioSpin GmbH
$$ ##OWNER= servis
$$ F:\spectra/data/av/nmr/H1/1/pdata/1/auditp.txt
$$ ##AUDIT TRAIL=  $$ (NUMBER, WHEN, WHO, WHERE, WHAT)
(   1,<2026-08-01 13:38:50.48 +0400>,<servis>,<DPX200>,
      <created by zg, POWCHK disabled, PULCHK disabled
       terminated by command 'halt'
       configuration hash MD5:
       00 E9 B6 7A A2 85 ED C7 34 08 36 98 17 FE 4E 26
       data hash MD5: 32K
       64 4E 07 D6 D7 B1 DE 3C C1 29 D1 17 7F E8 E4 37>)
(   2,<2026-08-01 13:38:52.29 +0400>,<servis>,<DPX200>,
      <Start of raw data processing
       efp BC_mod = 2 LB = 0.05 FT_mod = 6 PKNL = 1 PHC0 = -416.9518 PHC1 = 3.101563 SI = 16K 
       data hash MD5: 16K
       35 B6 FB 00 04 3D 57 FD F8 61 6C 36 BD 84 B1 3D>)
$$ ##END=
$$ 
$$ hash MD5
$$ 74 FD 7B 39 40 47 AC 65 7E 5F B2 5E B4 9F 59 4B
##$RELAX= 
##$RELAX= 
##$RELAX= 
##$RELAX= 
##$RELAX= 
##$RELAX= 
##$RELAX= 
##$RELAX= 
$$ Bruker specific parameters
$$ --------------------------
##$DU= <F:\spectra>
##$EXPNO= 1
##$NAME= <H1>
##$PROCNO= 1
##$TYPE= <nmr>
##$USER= <av>
##$AMP= (0..31)
100 100 100 100 100 100 100 100 100 100 100 100 100 100 100 100 100 100 
100 100 100 100 100 100 100 100 100 100 100 100 100 100 
##$AQSEQ= 0
##$AQ_mod= 1
##$AUNM= <au_zg>
##$AUTOPOS= <>
##$BF1= 200.13
##$BF2= 200.13
##$BF3= 200.13
##$BF4= 200.13
##$BF5= 500.13
##$BF6= 500.13
##$BF7= 500.13
##$BF8= 500.13
##$BYTORDA= 1
##$CFDGTYP= 0
##$CFRGTYP= 5
##$CHEMSTR= <none>
##$CNST= (0..31)
1 1 145 1 1 1 1 1 1 1 1 1 1 1 1 1 1 1 1 1 1 1 1 1 1 1 1 1 1 1 1 1 
##$CPDPRG= <>
##$CPDPRG1= <>
##$CPDPRG2= <>
##$CPDPRG3= <>
##$CPDPRG4= <mlev>
##$CPDPRG5= <mlev>
##$CPDPRG6= <mlev>
##$CPDPRG7= <mlev>
##$CPDPRG8= <mlev>
##$CPDPRGB= <>
##$CPDPRGT= <>
##$D= (0..31)
0 2 0 0 0 0 0 0 0 0.06 0 0 0 0 0 0 0.0002 0 0 0 0 0 0 0 0 0 0 0 0 0 0 
0 
##$DATE= 1785577130
##$DBL= (0..7)
120 120 120 120 120 120 120 120 
##$DBP= (0..7)
150 150 150 150 150 150 150 150 
##$DBP07= 0
##$DBPNAM0= <>
##$DBPNAM1= <>
##$DBPNAM2= <>
##$DBPNAM3= <>
##$DBPNAM4= <>
##$DBPNAM5= <>
##$DBPNAM6= <>
##$DBPNAM7= <>
##$DBPOAL= (0..7)
0.5 0.5 0.5 0.5 0.5 0.5 0.5 0.5 
##$DBPOFFS= (0..7)
0 0 0 0 0 0 0 0 
##$DE= 6
##$DECBNUC= <off>
##$DECIM= 32
##$DECNUC= <off>
##$DECSTAT= 4
##$DIGMOD= 1
##$DIGTYP= 9
##$DL= (0..7)
0 120 120 120 120 120 120 120 
##$DP= (0..7)
$$ [...]
##$SUBNAM4= <"">
##$SUBNAM5= <"">
##$SUBNAM6= <"">
##$SUBNAM7= <"">
##$SUBNAM8= <"">
##$SUBNAM9= <"">
##$SW= 20.6817932712277
##$SWIBOX= (0..15)
0 0 3 0 0 0 0 0 0 0 0 0 0 0 0 0 
##$SW_h= 4139.07284768212
##$TD= 32768
##$TD0= 1
##$TE= 0
##$TE2= 300
##$TE3= 300
##$TEG= 300
##$TL= (0..7)
0 120 120 120 120 120 120 120 
##$TP= (0..7)
150 150 150 150 150 150 150 150 
##$TP07= 0
##$TPNAME0= <>
##$TPNAME1= <>
##$TPNAME2= <>
##$TPNAME3= <>
##$TPNAME4= <>
##$TPNAME5= <>
##$TPNAME6= <>
##$TPNAME7= <>
##$TPOAL= (0..7)
0.5 0.5 0.5 0.5 0.5 0.5 0.5 0.5 
##$TPOFFS= (0..7)
0 0 0 0 0 0 0 0 
##$TUNHIN= 0
##$TUNHOUT= 0
##$TUNXOUT= 0
##$USERA1= <user>
##$USERA2= <user>
##$USERA3= <user>
##$USERA4= <user>
##$USERA5= <user>
##$V9= 5
##$VALIST= <valist>
##$VCLIST= <CCCCCCCCCCCCCCC>
##$VD= 0
##$VDLIST= <DDDDDDDDDDDDDDD>
##$VPLIST= <PPPPPPPPPPPPPPP>
##$VTLIST= <TTTTTTTTTTTTTTT>
##$WBST= 1024
##$WBSW= 30
##$XGAIN= (0..3)
0 0 0 0 
##$XL= 0
##$YL= 0
##$YMAX_a= 115604
##$YMIN_a= -84923
##$ZGOPTNS= <>
##$ZL1= 120
##$ZL2= 120
##$ZL3= 120
##$ZL4= 120
##$ABSF1= 0
##$ABSF2= 0
##$ABSG= 0
##$ABSL= 0
##$ALPHA= 0
##$AQORDER= 0
##$ASSFAC= 0
##$ASSFACI= 0
##$ASSFACX= 0
##$ASSWID= 0
##$AUNMP= <proc_1d>
##$AZFE= 0.1
##$AZFW= 0.1
##$BCFW= 0
##$BC_mod= 2
##$BYTORDP= 0
##$COROFFS= 0
##$CY= 18.4799938201904
##$DATMOD= 1
##$DC= 0
##$DFILT= <>
##$DTYPP= 0
##$F1P= 9.9274215381318
##$F2P= -0.165520771350173
##$FCOR= 1
##$FTSIZE= 16384
##$FT_mod= 6
##$GAMMA= 0
##$GB= 0
##$INTBC= 1
##$INTSCL= 4.127829e-11
##$ISEN= 128
##$LB= 0.05
##$LEV0= 0
##$LPBIN= 0
##$MAXI= 10000
##$MC2= 0
##$MEAN= 0
##$ME_mod= 0
##$MI= 50
##$NCOEF= 0
##$NC_proc= -6
##$NLEV= 6
##$NOISF1= 3.799351
##$NOISF2= 2.8
##$NSP= 0
##$NTH_PI= 0
##$NZP= 0
##$OFFSET= 16.48848
##$PC= 4
##$PHC0= -416.9518
##$PHC1= 3.101563
##$PH_mod= 1
##$PKNL= yes
##$PPARMOD= 0
##$PSCAL= 4
##$PSIGN= 0
##$REVERSE= no
##$SF= 200.130005582386
##$SI= 16384
##$SIGF1= 3
##$SIGF2= 2
##$SINO= 400
##$SIOLD= 16384
##$SREGLST= <1H.CDCl3>
##$SSB= 0
##$STSI= 16384
##$STSR= 0
##$SW_p= 4139.07284768211
##$SYMM= 0
##$S_DEV= 0
##$TDeff= 32768
##$TDoff= 0
##$TI= <>
##$TILT= no
##$TM1= 0
##$TM2= 0
##$TOPLEV= 0
##$USERP1= <user>
##$USERP2= <user>
##$USERP3= <user>
##$USERP4= <user>
##$USERP5= <user>
##$WDW= 1
##$XDIM= 16384
##$YMAX_p= 332745054
##$YMIN_p= -244903
$$ End of Bruker specific parameters
$$ ---------------------------------
##NTUPLES= NMR SPECTRUM
##VAR_NAME=  FREQUENCY,     SPECTRUM/REAL,   SPECTRUM/IMAG
##SYMBOL=    X,             R,               I
##VAR_TYPE=  INDEPENDENT,   DEPENDENT,       DEPENDENT
##VAR_FORM=  AFFN,          ASDF,            ASDF
##VAR_DIM=   16384,         16384,           16384
##UNITS=     HZ,            ARBITRARY UNITS, ARBITRARY UNITS
##FACTOR=    0.252644378177508, 1,           1
##FIRST=     3299.83951724647, 0,            0
##LAST=      -839.233330435636, 0,           0
##MIN=       -839.233330435636, -244903,     0
##MAX=       3299.83951724647, 332745054,    0
$$ Real data points
##PAGE= N=1
##DATA TABLE= (X++(R..R)), XYDATA
$$ [...]
13280b1024O2558r5434J9297m173k6124p2417R0061n0106R0986q6713J25427j05780
13268g3442J3589L5952n2209R0000o6120N1628p4522n6190J69965j83451R8504
13257d6296P8559q0598j6203M8177p310J2497L6766k7405k5447P5363j89108R5846
13245d5159l8452M4994O3824j52588O1760P1355P1091j64188P6912j5520M2692
13234A6721r939r6048N8173J7297m9292R3905j09370L7820L3399p0101J21771
13223D4336j06165N3095o4005J8733k6394J9300k4389M5745J6535R395N3644k7386
13211A2444p9345K5432j8096J00040r0226j02937J10164j5977M8645q4131J15037
13200B1050j23012Q4791l6734j0120P3017j8438l9907J021L6833l2030O1223j24966
$$ y = [-21024, 41534, -53900, -34603, -38776, -64900, -137317, -47256, -97362, -6376, -93089, 32338, -73442, -59853, -23901, -76110, 13890, -52230, -602, -75124, -131314, 38651, -144800, -46296, 32263, -48335, -64538, -16361, -23671, -11174, 25592, -1813, -27260, 48103, -141005, -45159, -83611, -38617, 25207, -127381, -65621, 5734, 76825, -87363, -10451, -25971, 16721, 6782, -89266, -31093, -13796, -63088, 30817, -78553, -40733, -7334, -77435, 44336, -61829, -8734, -72739, -54006, -80400, -61100, -85489, -39744, -23209, -13814, 39830, 12444, -66901, -41469, -59565, 40475, -49751, -152688, -42524, -58501, -9856, -93987, 21050, -101962, -17171, -53905, -64025, 8992, -9446, -49353, -48332, -11499, -43529, 17694, -107272]
13188a07272O3110j411j4985j3314O6998q4677K4396m9004J28909l1314o0336
13177g8900N1155k6653J1779P5553p5456m0162J14234p5126n722K486P7640p7022
13165d6194q7665O1000J06806j00881L558J01289q1522j8773O2476o5407O1554
13154c759K296k3298J6412m1759K3031l8336O372P4040j0378r1629J26961j4269
13142B5684K7976n9672j6463j6413O2005k7103o2122P859L8700q0249J3856O7098
13130a8844N3255k8094Q0035k04774M1510J2306l7377L3236k8347O8189M158J23017
13118I8270q5035l2703O13L9028j13477N6374k7094N0512j04039J9393N6287n738
13106d7609J0479o9247K0086J679P2361R976j1067k8391j4277j4268K0308r4683
$$ y = [-107272, -44162, -45573, -60558, -73872, -6874, -91551, -67155, -116159, 12750, -18564, -78900, -27745, -54398, -42619, 32934, -42522, -82684, 31550, -43576, -49298, -46812, 30828, -46194, -133859, -72859, 33947, -66934, -63376, 37913, -43609, -62382, 94, -65313, -3759, -1463, -24761, -8349, -50108, -27077, -65413, -59041, 14999, 4621, -87008, 39953, 25684, 53660, -6012, -22475, -38888, 23117, -3986, -66108, -58249, -19549, -99798, -85942, -18844, 34411, 6317, 86352, -118422, -76912, -64606, -101983, -68747, -97094, -28905, -24747, 98270, 13235, -19468, -18855, 20173, -93304, -36930, -64024, -13512, -117551, -98158, -41871, -47609, -37130, -106377, -86291, -84612, -12251, -2275, -13342, -41733, -56010, -70278, -49970, -144653]
13094a44653J36107J1486j8758O835p5610J13483j28156K8888L0475R3095j24034
13083g0842N080O4946M35n9617p34m355Q7169l8875n3571L7615j0108n015R705
13070c8167L8679n6261P5312k0604M2182q1804J5213k8993N5130n6642K0634l8591
13058g3912J11008j21051J02923n3437m1210L139M7996j3356m9274J09893n2563
13047b9844J291Q1315o440j3946j5088j53937O4108K00977j57922J07206j08987
13036c1267o6492M5638Q9083r4215K4050j8279O6884j4053o0857L8932Q5601j20201
13024e5176M3876R1025q4299k5967m8549J71367m8141o1259m1643j00760J70687
13013A1161q1873L3611N2181j7857m8926J23936l8068n3256L0344P2592K0326
$$ y = [-144653, -8546, 2940, -15818, -8983, -84593, 28890, -99266, -70378, -39903, 53192, -70842, -65762, -816, -381, -59998, -60732, -65087, 22082, -16793, -70364, -32749, -42857, -47872, -38167, 512, -55749, 19563, -1041, 41141, -40663, -25450, -54443, 687, -55955, -35321, -73912, 37096, -83955, 18968, -34469, -75679, -72540, -24544, -37900, -87174, 22719, -29844, -28553, 52762, 46322, 32376, 17288, -136649, -72541, 128436, -29486, 77720, -31267, -97759, -52121, 36962, -57253, -33203, -51482, 15402, 1349, -59508, -20576, 65025, -55176, -11300, 79725, -4574, -30541, -79090, 92277, 44136, -17123, -58766, -159526, 11161, -70712, -37101, 15080, -2777, -51703, 72233, 34165, -19091, 11253, 83845, 104171]
13002A04171j04926N0220l5102j3690N2139P3998o6433j8600Q6569m5964N5319
12991A37701m5004j4660o785K6923J36355J792k8600N5539k0890N5506j4601J0950
12979B94226o7121l2304p4212K2961P6629j05047p9571N0524K3005q5841J12979
12968A36228o9667O7997J7658j31912K4531L5179O456n9335m2324O0019L0442
12957G5272m1226p9887M0757R4473j21978L1206j8974M2626q043J1554o1938L1140
12945e018N8313k6313J6225j5780j1328q1210m745k9200K1429M7527P8741j03821
12933e5180K9595N0961m5091Q2680n5779j3399q6898J211M1093L5258R5016j13057
12921c3590L2649n8285R6150k0450n3233J4193R1699q0313P961k790R4337P3359
$$ y = [104171, -755, 49465, 14363, 673, 52812, 126810, 60377, 41777, 128346, 82382, 137701, 92697, 78037, 71252, 98175, 234530, 236322, 207722, 263261, 242371, 297877, 283276, 294226, 227105, 194801, 120589, 143550, 220179, 115132, 35561, 86085, 109090, 23249, 136228, 66561, 134558, 152216, 20304, 44835, 80014, 86470, 27135, -15189, 44830, 75272, 34046, -45841, -5084, 89389, -32589, -1383, -20357, 22269, 14226, 25780, -36158, -5018, 53295, 26982, 43207, 27427, 16099, -65111, -69856, -99056, -77627, -30100, 48641, -55180, -25585, 25376, -19715, 62965, 7186, -6213, -93111, -91900, -50807, -15549, 79467, -33590, -941, -59226, 36924, 16474, -36759, -22566, 69133, -11180, -3219, -6009, 88328, 161687]
12909A61687j55312J8652l1367q5386J55743j26534J6118Q5429o7018N1895J8606
12898D2513o8278J7030J342m5532R8131m9034J403q6671M0590Q2291j30513J16713
12886A9985r8901j555J31312l478k3047j30909N9004L8435K719P853k3753N6324
12874C3989l6547k0524q949P6683n9710q3090M8338J360Q0802m5887R6753r3388
12862a0170n3871l2874O8153n2656L0076l1401J6718J26655o7024p2378J62075
12851H3303k21816O4364L8996m329J6693L2411m9749n2739Q9447J0899L4513j24225
12839h2232J06636l8905o7047P9741N9565p7975o7114J43059r2559n7328J32868
12828C8709k7498j23103Q8447Q611L7878j93571J06276K3283J7106P4148j36554
$$ y = [161687, 6375, 25027, -6340, -91726, 64017, -62517, -46399, 39030, -27988, 23907, 42513, -25765, -8735, -7393, -52925, 45206, -3828, -2425, -89096, -48506, 33785, -96728, 19985, -78916, -80471, 50841, 47363, 24316, -106593, -47589, -9154, -6435, 1418, -22335, 33989, -2558, -23082, -32031, 44652, -15058, -98148, -49810, -48450, 32352, -13535, 83218, -10170, -64041, -96915, -28762, -81418, -51342, -82743, -66025, 60630, -6394, -78772, 83303, -138513, -74149, -35153, -39482, -22789, 9622, -40127, -92866, -3419, 7480, 41993, -82232, 24404, -14501, -81548, -1807, 57758, -20217, -87331, 55728, -36831, -94159, 38709, 11211, -111892, -23445, -14834, 23044, -170527, -64251, -40968, -23862, 50286, -86268]
12817h6268N1093Q0689p3791J3631n0586O7182m5344p6111J32708j18370J46686
12806D1519j0135J576O6662q8995O091R4711r5383n844m7597K042L6842o4548
12794f3059l1047M2002J1316J7732r0902M2001Q2222j31538O9975j7139N3722
12783a4715p5087J27147n5125j2318j43503J01166l621P9569k3078l3958p6709
12772a30232J55478j20200Q842J17580j23520j0010P0620M7700m5092n268N0983
12761A6881r0091J1003Q2246p2794M0104J04658p4756q4270O8721p9187k662k2385
12749a02532N0649j8114N6255L2576j26018J27447M4042j81930J18861R1080n6873
12738C5443m6697J9905M4461j00789N4066N225Q1499j46296J6685o3473N9018
$$ y = [-86268, -35175, 45514, -28277, -14646, -65232, 1950, -43394, -119505, 13203, -105167, 41519, 31384, 32960, 99622, 10627, 16718, 111429, 16046, 10202, -37395, -35353, 1489, -63059, -94106, -52104, -40788, -23056, -113958, -71957, 10265, -121273, -51298, -68437, -14715, -89802, 37345, -17780, -30098, -173601, -72435, -76056, 3513, -19565, -53523, -130232, 25246, -94954, -86112, 31468, -92052, -102062, -31442, 16258, -28834, -34102, 16881, -73210, -62207, 20039, -52755, -12651, 92007, 17251, -67019, 1702, -77485, -80147, -102532, -51883, -69997, -13742, 18834, -107184, 20263, 64305, -117625, 1236, 92316, 35443, -11254, 8651, 53112, -47677, 6389, 11614, 93113, -53183, -36498, -99971, -40953]
12727d0953l7351J2094P0614m137q7588J8080L2303o3551Q4931k7245K2144j24161
12715a44820J14562K7550p5380p569P8763o0820J7973J7394N5622j09982N4722
12704c1985m1976K9093m8792J21401r5022R2548j8743o2744P7217p9608j7224
12693g5835Q1580n172M0829j28021J33811o743L538o9193N2433O4554p8960J0799
12681B3620j1900l5878M2960m2554J3728J3870L9886o1772L3650p6144K9320N4510
12669B3296j36799R97M1031J01321p2255L5646k7372j5566J6196R8524j31096
12658f6077j796p5072K43051q4678j3541p5202r889J07858J294Q37j18720P149
12646h4786Q6586n8491J41179J6570l9620q8066p0929O2436n4426M9946J5926
$$ y = [-40953, -78304, -66210, 4404, 267, -87321, -69241, -36938, -100489, -15558, -42803, -20659, -144820, -30258, -2708, -78088, -85657, -6894, -67714, -49741, -32347, 23275, -86707, -31985, -73961, -44868, -93660, 27741, -67281, 25267, 6524, -56220, 20997, -58611, -75835, 5745, 573, 41402, -86619, 47192, 40449, 43987, -25206, 27227, 91781, 12821, 23620, 11720, -24158, 18802, -23752, -10024, 3846, 43732, -18040, 15610, -60534, -31214, 23296, -113503, -112506, -71475, 29846, -42409, -6763, -34135, -49701, -33505, 65019, -66077, -67873, -142945, 100106, 15428, 1887, -73315, -83204, 24654, 25948, 26785, -91935, -84786, 1800, -56691, 84488, 101058, 61438, -26628, -97557, -35121, -89547, -39601, -23675]
12635b3675J5827l1108L7268Q8174r2254k7397o459M8344P5704j82947Q945K3641
12623f5937m7980J396L2458Q0675l3501k7655N6144o142N6263m266l4290l2793
12611b5628J3005K1104o8713J263J1217O2871m1506Q6039r0940J8387p1449J29441
12599D5091p1202M2820j6850n953L6035m2186k1791O054J9899N5589l0976r8389
12587h1859J40172j4541o0931L8473q6919n5960M4360Q6259j02297O7369O576
12576a9298J3964q9219Q2220l849K2401k7599p7744O8677j09655J23550j7113
12565c3665j01150R7606O1145p8075K8840O0156p2590J0714J3823l9111J08578
12554E6271j37417M3540Q491R9464j04311J8483o3726J18146l7205j05884Q8644
$$ y = [-23675, -7848, -38956, -1688, 86486, -5768, -33165, -39624, 8720, 84424, -98523, -89578, -65937, -113917, -112521, -80063, 612, -32889, -60544, -4400, -10542, 45721, 41455, 7165, -25628, -12623, 8481, -60232, -58969, -47752, 15119, -26387, 59652, -31288, -12901, -84350, 45091, -26111, 16709, -141, -6094, 29941, -12245, -34036, -27982, -8083, 47506, 16530, -81859, 58313, 43772, -17159, 21314, -65605, -121565, -77205, 9054, -93243, -25874, -19298, -5334, -94553, -12333, -16182, 6219, -21380, -99124, -30447, -140102, -16552, -33665, -134815, -37209, 23936, -54139, -25299, 34857, -37733, -27019, -13196, -52307, 56271, -81146, -37606, -29115, 70349, -33962, -15479, -79205, 38941, 1736, -104148, -15504]
12543a5504n2012M5807K8566m5902K0270o117j9744M237N4626j43743K14582j05075
12531b0009m1452j8877l2494J11284n3891j2782N4303l1936M1982M4747n6350
12520a5475J2786O090J0794P14N7940r5835J3462l1300k4543L13K8613l8899O6543
12507h797o9359M8048K2542l5921P5997k0797q7940M3602R605o6482P8228J0374
12495i00r559L6076l5674k0498l7393j1271Q3983n7160L806l2409K8909L2012
12483b0078r055J5744M420n8655J05195p5885r537n5270J43699o5777j6017M3068
12471A852q032o3250K3616r083J5012r585J46618j35859j9296K5337p4198J09461
12459B593r041l3782p474k1555L3682L069k7634j09612J16203L2097q75P929l9031
$$ y = [-15504, -67516, -21709, 6857, -39045, -18775, -24892, -44636, -40399, 14227, -129516, 85066, -20009, -61461, -80338, -112832, -1548, -55439, -68221, -13918, -45854, -3872, 40875, -15475, -2689, 3401, 14195, 14909, 72849, -22986, -9524, -40824, -65367, -65054, -36441, -75340, -8797, -78156, -30108, -7566, -43487, 32510, 11713, -76227, -32625, -23020, -89502, -11274, -900, -10459, 25617, -10057, -30555, -67948, -79219, 4764, -52396, -48590, -80999, -52090, -20078, -29133, -13389, -8969, -67624, 37571, -38314, -47851, -103121, 40578, -25199, -41216, 1852, -6180, -69430, -45814, -54897, -39885, -49470, 97148, -38711, -58007, -32670, -106868, 2593, -6448, -40230, -47704, -69259, -35577, -32508, -60142, -169754, -53551, -21454, -22329, -14400, -53431]
12446e3431J8217J3404o5505o523J08104r1946P7458o9978k7941J04303o0286
12435e4124l5974J0408L3272m2323J01523o9882L8933l2422O8685m5309n3366
12424h0579N0684M2183P267p0221J9061M4496j4294O560q233p3187Q3794l7656
12412c0125L7750m3359j6079J08865j33140k4617J1123J41787j58443l8164N7397
12401h7005P3943o3637J15106p160p143q4014J32647r5036k8898O9501n5136O6421
12389B9589n6261k4080K2318j06584Q0030N2283n4362m4076R3155P1155j83458
12378a20291J54372q5786j2516J3367O641j8252L8064J6002l0804N4669l6475
12367b1009L1278j26607J10477j7541L5625n0376o143P27J05639j44767L7972
$$ y = [-53431, -35214, -21810, -87315, -93838, 14266, -77680, -222, -70200, -98141, 6162, -54124, -90098, -79690, -46418, -88741, 12782, -57100, -18167, -50589, 18096, -27213, -80579, -29895, 12288, 19555, -50666, -31605, 12891, -1403, 5157, -3076, -76263, 7531, -30125, 7625, -35734, -51813, 57052, -76088, -100705, -89582, 52205, -106238, -144402, -87005, -13062, -76699, 38407, 31247, 24104, -59910, 72737, -22299, -51197, 18304, -36832, 29589, -26672, -50752, -28434, -135018, -54988, -2705, -57067, -101143, -7988, 63167, -120291, 34081, -51705, -64221, -50854, -44213, -62465, -24401, -8399, -39203, 15466, -21009, 10269, -116338, -5861, -23402, 12223, -38153, -44296, -43569, 62070, -82697, -44725]
12356d4725N5900Q0512j79354J12400M35j11146M8614o0260O8547n3940Q6171
12345C154j18591J05101o8076k3218N0196q343J28552j54466R5929k1402j3296
12334b4460j8931m6872O5565l3513P9006j10780Q6221Q6615j24949k4997P6874
12323I779q0432N6755j7491k4793k6301J56614q7758K0854O6919j3679j37507
12312g7040M3163K164J5370n0815J4352K6963p7282J25183n4989J03868j00653
12301b9716J01487p6767k2535l2738o276k5633N9271l3896l3194R9589J5368l6081
12289b1121p0128R1173q5231Q7992K5208j88356J06176L147K8114j2837j0847
12278d6710R534m3086M8446j51Q9804j5733m7097o5279l3545J5997J40522m6995
$$ y = [-44725, 11175, 91687, -87667, 24733, 25168, -85978, -37364, -97624, -29077, -83017, 3154, -115437, -10336, -78412, -101630, -51434, -59777, 68775, -85691, 10238, -11164, -24460, -43391, -90263, -24698, -58211, 20795, -89985, -3764, 82851, -42098, -67095, 9779, -70653, -13898, -31389, -56182, -82483, 74131, -13627, 7227, 74146, 60467, -77040, -33877, -31713, -16343, -67158, -52806, -25843, -103125, 22058, -32931, 70937, -29716, 71771, -4996, -27531, -60269, -66545, -92178, -32907, -66803, -99997, -408, 14960, -21121, -91249, -76, -85307, 2685, 27893, -160463, -54287, -51140, -23026, -35863, -46710, -37176, -80262, -31816, -31967, 57837, 42104, -4993, -70272, -103817, -87820, 52702, 5707]
12266E707r291r878r3254J08614N8291j23525N1128k1103K778N782K5129j00627
12254a00249N3441Q8278r8533K345M9564N539l7207r939L0514l9391P343j0796
12242e9091K7123J5458P0800m4536M6291j05750J17959j11279J03420j00437Q5165
12231D5123j17227N1243n9728J3652L5728L4015m7058l720l1770N6130K2936r7985
12219i8661O6405m654N3527o0797L139K2283J4438m1753R074j288j8769P0936
12207A3880j37815J29322M1529o6849j1295l3840l3547P5759O8070q6323L9620
12196a489j9091M0013K6871j28158L9388L8227Q1750j03468J7994l1811Q2921
12185D3147R0828j95922Q568N5945K2768l7080m8053l5474J21089p7044P0715
$$ y = [5707, -3584, -13462, -106716, 1898, 60189, -63336, -12208, -33311, -30533, -24751, 378, -100249, -46808, 41470, -57063, -54718, -5154, 385, -36822, -46761, -16247, -55638, -48295, -59091, -31968, -16510, 54290, 9754, 56045, -49705, 68254, -43025, 60395, -40042, 45123, -72104, -20861, -80589, -66937, -31209, 2806, -44252, -47972, -79742, -23612, -676, -98661, -32256, -36910, 16617, -44180, -41041, -18758, -4320, -46073, -36999, -38287, -57056, 13880, -123935, 5387, 46916, -19933, -31228, -65068, -98615, -22856, 45214, -41109, -1489, -20580, 19433, 46304, -81854, -42466, -4239, 77511, -25957, -7963, -39774, 43147, 133975, -61947, -53379, 2566, 25334, -11746, -59799, -95273, 25816, -51228, 19487]
12174A9487l0922k387J38954j4195j55262O5684m9762R9696o5900K0879R3292
12163A19564j86432M4943k6229J8778p5004N1525j7299N4830R435J5856o621N4401
12151E7747j3942n6951K3137k4317M6160j06907J09969J6230N990j7071m0343
12140b98J8426J0263j37607J53401j54739q787J49408o6519Q1093l6726M9917
12129E7832j24549n0098J70114o7745M0943r7667P2666p4579O1011P5093q7530
12118b4509l8468L3980N6568l8186j1741j5514k9968M6186k831o1974Q3896n3480
12106e6041K2318K4860J7365j14214Q0684l7033N4154J0225m9858j0610l877O5773
12094C746o8257K5685k077q1293K28800k02900M9725R515n1999K6115N3351k5800
$$ y = [19487, -11435, -13822, 125132, 110937, -44325, 21359, -28403, 71293, 5393, 26272, 119564, -66868, -21925, -48154, -29376, -104380, -52855, -70154, -15324, -5889, 9967, 3346, 57747, 43805, -13146, 9991, -14326, 31834, -75073, 34896, 51126, 57116, 40045, -298, 18128, 28391, -109216, 44185, -110554, -119341, 30067, -36452, 44641, 7915, 57832, -66717, -116815, 53299, -14446, 26497, -71170, 1496, -73083, -12072, 63021, -24509, -62977, -28997, 27571, -10615, -22356, -37870, -67838, -21652, -24483, -86457, -2561, -56041, -33723, -8863, 8502, -105712, -25028, -62061, -7907, 2318, -47540, -58150, -62027, 3746, -64511, -38826, -40903, -122196, 106604, -96296, -46571, -37056, -89055, -62940, -9589, -35389]
12082c5389L4738l6907Q7524J5041r0190M1768Q3648j03714j14403O4813R6822
12071D3751q294o9159L6497n5647n901Q5937o4798M4538n359J03779k4339j19962
12059c8957J9462L847p7791O6377n2723j3052O9508l3141O3876J40140j67681
12048b0135J3821M5767k5353o9218N5519j16228J9946J25174j13425N9702p4813
12037i9243M1276J01428K5787q1086k6928j7955k9491O7676P7937k1107q1501
12026d3207k7589J57179j54330P1391m5712P4285k447r8689N9318j5092j5927
12015d0820n5525K5740L4507j9812l1726J1706J5809J19036o5863l150j4902J3246
12003a1754P4328p7097o8827P9770J1056L9001o0724l2372O7636o4112M950L0799
$$ y = [-35389, -651, -37558, 49966, 65007, -25183, 16585, 100233, -3481, -117884, -53071, 43751, 35457, -33702, 2795, -52852, -58753, 27184, -37614, 6924, 1565, 105344, 81005, -38957, -19495, -15648, -93439, -27062, -79785, -92837, -23329, -56470, 7406, 147546, -20135, -6314, 39453, 14100, -55118, 401, -115827, -95881, 29293, -84132, -24430, -99243, -57967, 43461, 69248, -11838, -38766, -56721, -86212, -18536, 59401, 38294, -43207, -70796, 86383, -67947, 3444, -42268, 32017, 29570, -69119, -9801, -24893, -40820, -96345, -70605, -36098, -55910, -87636, -75930, -60121, 58915, -6948, -10098, -25000, -11754, 62574, -14523, -83350, -3580, 7476, 46477, -14247, -46619, 21017, -43095, -38145, -7346]
11991g346j17788R9054n469n6475Q134L2516P8709P8251p4219j8155J6591m8516
11979a4713p499q039N6291m0366n4932R3042r2743Q2602o4776P8386L0240l7671
11967A9822L8708q690j33739L8563N8063M2501K4283r2536O5924j12624j8517
11956g8242N2422j190M2266m8397o6434P9713r4587M6613J64073r6557L6637j20822
11944h4505J22058J7513j35742P0129O3105j3019k5764o3226N6153J0646n1675
11933c4327o6631K5354n670R9570j4018p3159J26003j21784J21094l3249m4896
11922b1713Q4713j69889J54166o3206P9414o1691O885k6206m3540J12778m1932
11911I779L1779n4552K3374k883r3071J57373j58190P1625N0168k5384K3740o7728
$$ y = [-7346, -125134, -26080, -31549, -88024, -79890, -47374, 31335, 109586, 35367, 17212, 33803, -14713, -22212, -30251, 26040, -14326, -69258, 23784, -68959, 13643, -51133, 27253, 57493, 19822, 58530, 49840, -83899, -45336, 12727, 55228, 79511, -13025, 52899, -59725, -78242, -25820, -27010, 15256, -33141, -99575, -19862, -114449, -67836, 96237, -320, 36317, -84505, 37553, 55066, -80676, -10547, 52558, 39539, 13775, -49451, 6702, 17348, -34327, -100958, -75604, -81274, 18296, 4278, -68881, 57122, -64662, 56432, 23183, -21713, 63000, -106889, 47277, -15929, 63485, 1794, 8679, -17527, -61067, 51711, 9779, 41558, -12994, 10380, 7497, -85574, 71799, -86391, -14766, 35402, 10018, 33758, -33970]
11899c3970O8976j237L4726m833n5297O3593q1336j2219L3382q3552j6832J03695
11887A5096j5885J1789o8017O9475p9867J12490o8950P9582q649o0630R20O255
11875f391j12566J08390n8379K1356Q0652m2593J1998J5184j0635L1615k3845
11864A4786m669N384m2083Q3237j47709M8702K4037O0886m9465J1933L614N5014
11852F3667O5980j61666M6702O6721R587k9698r5547M3370n1578K4063q0443M5396
11840e3446L9160P5458k11401J85448n5506l5307J51958r9975k8014n9527P1603
11829a9549K3222K5944j64333J30460j931l308J7342M5513o794N5980j82185J28967
11817D9328j03836J00937j39743J27574o2231j1223P2728j5254m653r680K6061
$$ y = [-33970, 35006, 33769, 68495, 63662, 8365, 71958, -9378, -21597, 11785, -71767, -88599, 15096, -789, 11000, -57017, 12458, -67409, 45081, -23869, 55713, 47064, -13566, -12646, -6391, -118957, -10567, -68946, -47590, 33062, -9531, 2467, 17651, 7016, 38631, 14786, 10117, 15501, -26582, 56655, -91054, -42352, -18315, 42571, -6894, 5039, 8653, 63667, 129647, -32019, 14683, 81404, 90991, 61293, -34254, 9116, -42462, -18399, -98842, -53446, -14286, 61172, -150229, 35219, -20287, -55594, 96364, -3611, -31625, -91152, -19549, 3673, 29617, -134716, -4256, -6187, -9495, 7847, 53360, 46566, 102546, -79639, 49328, -54508, 46429, -93314, 34260, -27971, -39194, 33534, 18280, 13627, 3947, 30008]
11806C0008K4567j19634j223q429J34525j04793j7360P1952k2964J2870o2430
11795f2911P9512J4491m236o4563K7958M3244J0889k4936o3814N7048q2495Q4177
11783A4364J481j21437J16845m8643N038J8841j4553K4625j5527q135k8829k5903
11771h1833J16059J87r7742K2313K5042N4040L129j2958k4546P2769P252j50338
11759f6626L6567K579N0937N6381l4199n8437j8449M9636m1279M8332p7587J01794
11747D9649j9977O903n8953m8735J25675m6976p8946K4370J06771n6505o8690
11736f5414J2249m2331P0447m476J3602O7001p0274J84561j94945J7357P7453
11725F5230k5300n618o8017P6454j10187k2427L9499J35032o2070k8395m1725
$$ y = [30008, 54575, -65059, -66282, -74711, 59814, -44979, -62339, 9613, -13351, -481, -62911, 16601, 31092, 26856, -37707, -9749, 33495, 44384, 19448, -44366, 12682, -69813, 14364, 15845, -105592, 11253, -37390, -32352, -13511, -28064, -3439, -18966, -27101, -55930, -81833, 34226, 34413, -63329, -41016, -15974, 38066, 41195, 28237, 3691, 76460, 83712, -66626, -30059, -27480, 23457, 79838, 45639, -12798, -31247, 18389, -22890, 25442, -52145, 49649, 29672, 36575, -22378, -71113, 54562, 7586, -71360, -46990, 59781, 3276, -65414, -53165, -95496, -25049, -29525, -15923, 51078, -19196, 165365, -29580, -12223, 65230, 39930, 34312, -33705, 42749, -67438, -89865, -50366, 84666, 22596, -5799, -47524]
11714d7524L5211M1452q0826J38010m5195l824K0146o7144J00312j22772k7431
11703e9585J08241P831o75m2229j05576N1106k5362O2305N2436l0891K7951m6758
11691a206K0109l1022Q1610n5075o1344K4997R5173n7599j1036q9167O5015j1390
11679c0935M275P3644J9542r7270R9529J8644j42786P4568P409Q4779r0218O1750
11667H2931n6462K4416j15432Q765L4364J6602p5288J38627n3102n4034J12928
11656F4315R370o877n5991j15265J31552P186M2461m1673N951K7071l3072N0614
11644H5642k6798O4399r2751N3900p3791L2708O0327q7053M3348j9224M47J558
11632D2712j2360q1807J05280n6489P5596n0346j2960J4212M2526o657p7702K8680
$$ y = [-47524, -12313, 29139, -51687, 86323, 41128, 37304, 57450, -9694, 90618, -32154, -59585, 48656, 56487, 55812, 13583, -91993, -40887, -66249, -3944, 48492, 17601, 45552, -1206, 18903, -12119, 69491, 14416, -46928, -21931, 73242, 15643, 4607, -84560, -19545, -30935, -26660, 46984, 66526, -30744, 68785, 87429, -55357, 19211, 26620, 111399, 21181, 82931, 26469, 50885, -64547, -55782, -21418, -4816, -80104, 58523, 5421, -48613, 64315, 73685, 66808, 10817, -104448, 27104, 34290, 76751, 35078, 41029, 68100, 35028, 85642, 58844, 123243, 30492, 84392, 10601, 43309, 103636, 16583, 59931, 40707, 41154, 42712, 30352, -51455, 53825, -2664, 72932, 22586, 9626, 23838, 66364, 59707, -17995, 10685]
11620A0685n5065j2280M1215N0837p9440L6979O5984n0255M8910o2172K7139N9091
11608H1628j10714J42297j37166J24201q2463J1394O0554k7065L8942k3344L4076
11597A12340n3078N1805q1708n1864J09346j6108M9382n2481K8268O2573j12051
11586D6424J09527P580j12226j32178J50611J6378o9645J2189J12855m7928o8763
11575B4824j7966J5959L9975J5823P960l6856J2146J2509m3863J16683j47548
11564c54L3640K022L8952k0551N9498k5161n4387N1988r709p2097l6687k2154
11552e5000J35459k266k4931o7192Q0783l0778j28446J38235k830m0954R5464
11541I7544K5672j28832n1071O3542Q7796o1940K2576P5070o7074k6779p8981
$$ y = [10685, -44380, -56660, -15445, 35392, -44048, -7069, 58915, 8660, 57570, -4602, 22537, 81628, -29086, 113211, -23955, 100246, 17783, 29177, 89731, 62666, 101608, 78264, 112340, 59262, 111067, 29359, -22505, 86841, 70733, 120115, 67634, 95902, 158475, 46424, 155951, 163531, 51305, -80873, 69738, 86116, 16471, 28660, 141515, 93587, 24824, 6858, 22817, 62792, 78615, 86575, 49719, 61865, 74374, 30511, 147194, -354, 33286, 35308, 74260, 53709, 113207, 88046, 33659, 85647, 75938, 3841, -32846, -55000, 80459, 78193, 53262, -13930, 66853, 36075, -92371, 45864, 43034, 2080, 97544, 123216, -5616, -56687, 6855, 94651, 32711, 55287, 130357, 63283, 36504, -42477]
11530d2477P4552q716L5722J7544k7855M274k3187K0978L636K7358o5955q461
11518G413L2383o9341R5862l5643p0805Q6522N6011j56466J33022n7020k0423
11507A515K1451j9655O3236r1124K9701k5696N1746N520q4521P0115r787j9924
11495g423J5981J21982n9723l7115j5119k708J17683n7522j18167Q5577q1936
11484c8490R9524r6936J12720N986n2052o0208J38834p6741R096o1766J30122
11473A10089N2293j30630K2351K7826n2181k3579P4170j09661P9668j0517l1157
11462H672K9574O6486l9385L6858N601j35156R1485l8489q2580J14370K3107j1765
11450F8778k9340N4941L3225j24335L9280R4581o5745k5728j0721L9538j9465
$$ y = [-42477, 32075, 23359, 59081, 76625, 48770, 53044, 29857, 50835, 54471, 81829, 15874, 7413, 39796, -29545, 66317, 30674, -40131, 46391, 102402, -54064, 78958, 21938, 1515, 22966, 3311, 66547, -24577, 5124, -20572, 31174, 36694, -47827, 22288, 12501, -7423, 8558, 130540, 70817, 33702, 18583, 15875, 133558, 76036, -42131, 43446, -38490, 61034, -35902, 76818, 82804, 30752, -29456, 109378, 32637, 41733, -20033, 110089, 162382, 31752, 54103, 81929, 29748, 6169, 80339, -29322, 50346, 39829, 8672, 38246, 104732, 65347, 102205, 107806, -27350, 64135, 25646, -56934, 57436, 80543, 68778, 39438, 94379, 127604, 3269, 42549, 137130, 71385, 45657, 34936, 74474, 55009]
11439E5009K7109l2919n0117L2248K2858o0230O6180q8653J31497m1128k0317
11428D1537j3175m6551L6231m7160J97306j45641J6972n9876l4384J02574m8823
11417i90k7288P2839r075L4216j2419l3669j33686J10651J0897M5257q25k1047
11405C4861n8230J04662L453r5716J09873K9491m8240L0087p9239j5840J8595
11394C3757N184N2201q5987R3475j05096k1261K6143O2633K4196j40427K0719
11383c4463M2675N8406m6918J6830l1348L1972n2500J49568n5384o3820L9685
11372E4703n8201N5257N707q908j1375j3646R64L3438L4119j61n6973R4734n1286
11359G8372p884k4550M8666j3258L5949o4982r2677P4622j4668N8382j05351J21937
$$ y = [55009, 82118, 49199, -918, 31330, 54188, -6042, 60138, -28515, 102982, 61854, 41537, 28362, -18189, 18042, -29118, 168188, 22547, 39519, -20357, -54741, 47833, -990, -28278, 44561, 35486, 69702, 57283, 23614, -110072, 579, 11476, 56733, 55908, 34861, -23369, 81293, 84746, -10970, 98903, 128394, 80154, 110241, 31002, 15162, 33757, 38941, 91142, 5155, 98630, -6466, -27727, -1584, 61049, 85245, -55182, -34463, 8212, 66618, 19700, 36530, 5182, 37154, -15346, 134222, 78838, 15018, 54703, -3498, 51759, 57466, 48558, 37183, 23537, 24501, 57939, 92058, 91897, 34924, 129658, 78372, 70488, 45938, 94604, 81346, 117295, 52313, -40364, 34258, 19590, 77972, -27379, 94558]
11347I4558p8756O2660j02742L9868n060J2536l0632Q0918Q5J1434K134r28l3902
11334E2173n8265L0959J00475m6013p456J6874p4642L8160o7976J00057k5126
11323E9220q8348J58912q4752L3977P1234p0569L1396K7368m3227l8518K7863
11312H4556k5999r8L6344n0288k234K1075N8133k4005k3115n4535P8835r1583
11300G086R9692l2509L934p2377J05124m4908o1587L4104O0891R6551j22108R6739
11288A70632o1137k239N8015j11893M9898R282j9896O5250R908q9123J29769j34246
11276G4220M5576j34895O0097J62079j17601n3968L9121L7846j36152J33473k2719
11265H7077N5011k4830l1622j05930R5507j2703P8026m7223o3059Q0797L7080
$$ y = [94558, 15802, 78462, -24280, 15588, 10528, 23064, -7568, 73350, 73435, 84869, 87003, 86075, 52173, -6092, 24867, 125342, 79329, 71873, 88747, 14105, 52265, -15711, 84346, 59220, -29128, 129784, 45032, 79009, 150243, 79674, 111070, 138438, 95211, 56693, 84556, 58557, 58459, 94803, 44515, 42281, 63356, 121489, 97484, 74369, 19834, 98669, 7086, 106778, 74269, 78203, 5826, 110950, 66042, 4455, 38559, 99450, 196001, 73893, 170632, 109495, 107256, 165271, 53378, 103276, 112558, 92662, 157912, 167820, 78697, 208466, 74220, 119796, -15099, 44998, 207077, 89476, 35508, 74629, 112475, -23677, 109796, 87077, 142088, 117258, 85636, -20294, 75213, 62510, 140536, 93313, 30254, 111051, 148131]
11254A48131N672j32952J28017j41008R093O1403K1489n2564o414j2932J4291
11243D2226J57209j47458n4554R5423m409M0154p2664L7217M9716j9982o0410
11232F2468j2333l9060O4293j17006J40766l934m7068J4142M3770n554m3928n4713
11220A843j508Q5730m1194K807j5502M9566J8486l5809M1748l7036n5265O0507
11208G4373L5500N074r5060l5895R6010m398J5663K4915k3099j2734L1018j30549
11196a9182K1410J05411M4816m0322n0655J17050p2353O6265j74334K7081J2535
11185C7722M0628J8909k2592J5576N6982r809k4239n6092J184R2974m0131J4203
11173A25315N3576n0354J7333K7075k4604N9495j2505l6510j3144k8627J03259
$$ y = [148131, 153803, 20851, 148868, 7860, 16953, 78356, 99845, 47281, 40867, 27935, 42226, 199435, 51977, -2577, 92846, 88437, 128591, 55927, 93144, 142860, 122878, 62468, 50135, 11075, 75368, -41638, 99128, 95194, 48126, 62268, 106038, 100484, 56556, 1843, 335, 86065, 44871, 47678, 32176, 81742, 100228, 64419, 106167, 69131, 13866, 74373, 109873, 114947, 19887, -16008, 80002, 75604, 91267, 116182, 93083, 80349, 111367, -19182, 2228, 107639, 152455, 112133, 61478, 178528, 106175, 172440, -1894, 25187, 37722, 78350, 97259, 74667, 90243, 147225, 137416, 113177, 57085, 58269, 151243, 111112, 125315, 178891, 128537, 145870, 172945, 148341, 207836, 195331, 158821, 145677, 117050, 220309]
11162B20309m3340O4033m8982P7110L5837m3780k6988O0703m0117K7849Q385K1613
11150C12632j945m9294L2773q906J4343o3309L2835Q042J4873j3481J9921m3902
11138B54582k7995p0551L2144P5077O695L3087m5169q6129j1980M2091p6470j9352
11126A06030J8842m5717O5851l4051o4875Q7821l1297n1640l1103R7104K8172
11115A45137J0239q027m2131o3459J22029j77474J18185M4152j22137R7560j25378
11104a304L7657N1302q9101J21805p8394n815o5813J45198l4156J1598m2115m5240
11092E622K2066l130O5048J9710n2720m711J4151K8511r0982J12612r5275K4018
11080D4920K9096M3646n1855j16874J62493m5094N1514p9092J19110p4029J3929
$$ y = [220309, 176969, 241002, 192020, 269130, 304967, 261187, 234199, 294902, 254785, 282634, 291019, 312632, 310687, 261393, 294166, 285260, 299603, 236294, 269129, 277171, 292044, 278563, 298484, 254582, 226587, 156036, 188180, 263257, 269952, 303039, 257870, 171741, 159761, 201852, 125382, 106030, 124872, 79155, 145006, 110955, 46080, 133901, 102604, 50964, 19861, 116965, 145137, 155376, 147349, 105218, 41759, 163788, -13686, 104499, 148651, 26514, 124074, -1304, 36353, 87655, -1446, 120359, 41965, 36150, -29663, 115535, 81379, 92977, 50862, 5622, 27688, 24558, 89606, 109316, 56596, 51885, 66036, 94547, 3565, 116177, 20902, 44920, 74016, 117662, 65807, -51067, 111426, 66332, 117846, 38754, 157864, 83835, 97764]
11069I7764j05162J11725l4155k8616J6174M3387m7701K7467j2353L4604j27829
11058b4695O2564k5483P4843r8313J05159j14228J6406M5091P5707o4126R3677
11047A46602r7836K7218o8676J3145J225j6426o371R4773K9988m5093k7979o8513
11035a7943P3220n2096J31271j00314L042M1000P5598n5803Q057l0394j9863L839
11023E9614k4869m8746l427M3718j0406J24830j45302P2007j10487q311J24938
11012G3559j0494q7599k5161j9624J66331r519o3997J1503L3817n6074J2920j2384
11000A3278Q6545j36627R0942K0428q1727P2116j6037m2260P3856p3270Q2145
10989H9389J05409j72598l7509l9755J56525k6687o8960m7914M4877j313K6889
$$ y = [97764, -7398, 104327, 70172, 41556, 57730, 101117, 53416, 80883, 68530, 103134, -24695, 37869, 12386, 87229, -11084, 94075, -20153, -3747, 41344, 117051, 52925, 146602, 48766, 75984, 7308, 20453, 21678, 5252, -1119, 93654, 123642, 78549, 50570, -17943, 55277, 3181, 134452, 34138, 37180, 78180, 153778, 97975, 106032, 75638, 55775, 59614, 34745, -14001, -17428, 26290, 15884, 140714, -4588, 67419, -43068, -51379, 73559, 63065, -24534, -49695, -69319, 97012, 87493, 23496, 34999, 68816, 12742, 25662, 13278, 99823, -36804, 54138, 74566, -7161, 64955, 48918, 6658, 80514, 7244, 89389, 194798, 22200, -15309, -55064, 101461, 74774, 5814, -42100, 2777, 1464, 28353]
10978B8353m0842m7760J39762r601j5426k5973L4970R5841j78198N3969j08115
10967g3020P8665J13509m2740j35171Q7961Q9860m9367n9492M6263p217k3626
10956B5625L2179k6748L9548N3110l3788j01775L1928k3037K647N8648o4878Q0700
10944G4159m7191J2428r0578L9958J0762K2489R9064n1921q5164N0970k9830J04019
10932A09165p9652k0399J10523q3803R174K8140j10650O6962J8147P6482l3688
10921I0401j15145O4877K9790l9229j15512P9357P1888J060M1914j51890O2697
10910B0208O7191m3284M4143K257L2469q3853L5284J3689l3987O2818P0114j44990
10898D2059J18751j25371L8364m7566j9457m1817Q9173m1168o0667K0346J10044
$$ y = [28353, -12489, -60249, 79513, 69912, 54486, 28513, 63483, 159324, -18874, 35095, -73020, 5645, 119154, 76414, -58757, 29204, 119064, 69697, 10205, 56468, 49251, 25625, 57804, 31056, 70604, 123714, 89926, -11849, 20079, -2958, -311, 58337, -6541, 74159, 26968, 39396, -51182, -11224, -462, 22027, 121091, 69170, -15994, 34976, 5146, 109165, 29513, 9114, 119637, 35834, 45008, 73148, -37502, 29460, 47607, 124089, 90401, -24744, 40133, 69923, 30694, -84818, -5461, 66427, 67487, 109401, -42489, 20208, 87399, 44115, 88258, 90515, 122984, 39131, 74415, 88104, 54117, 116935, 187049, 42059, 160810, 35439, 73803, 26237, 6780, -35037, 54136, 12968, -47699, -27353, 82691]
10887H2691q9658m667n2432J91599j33630J04692l327q4170M8887l8384J7076
10876C8677k6719K885K0300P3224j59462N3808K059n5791j20158K94967j05058
10865A8732n0122Q0850j9675L3668j7286L7620m2883Q1241q6023K0591m2920J9297
10853C3090m4213N7525o7533L4221J9872n2141P3934o5744J11156r1167J67127
10842A76127q4845j25057K5617K185P2543l9896P4144m3988j0382j2834K4282
10831E7896j0933m4126J38629M1081j88569Q435j1359J56479l0632m7062L8793
10820A08632l8587L0008m4497l7169P6312k4184k4906o7401R0442q3341l7185
10809e1876O5282P474M9612L758o9983N5457n7006m2952J12487p773n5988j6791
$$ y = [82691, -6967, -11634, -64066, 127533, -6097, 98595, 95268, 11098, 59985, 21601, 38677, 11958, 14843, 35143, 108367, -51095, 2713, 4772, -51019, -171177, 123790, 18732, -31390, 49460, 29785, 63453, 46167, 83787, 40904, 122145, 36122, 56713, 13793, 33090, -11123, 46402, -21131, 13090, 32962, -19179, 54755, -10989, 100167, 9000, 176127, 91282, -33775, -8158, -5973, 66570, 26674, 100818, 56830, 46448, 33614, 57896, 46963, 2837, 141466, 182547, -6022, 2413, -8946, 147533, 116901, 69839, 108632, 70045, 100053, 55556, 18387, 94699, 70515, 45609, -21792, 68650, -14691, -51876, 13406, 20880, 70492, 74250, 4267, 59724, 2718, -40234, 72253, 64480, 8492, -8299]
10797h299R2792J6402m0106n0881k2178M778L8564m9877N0587P293l5483M8519
10785E2111j07101J11104J6862l4816P7969j0573o3287p395p947K8274m3360Q4071
10773I5912r8869n6657M2420N8477r872j04969J74829j11301J00260O0790o5873
10762H5147O032k0634L7340o7706L6678l8950K2941j9555Q3675n9155J41859j62872
10750D4800L8939q5738l7449J52394k2239q3906Q7708o7852L5280q715q808o4920
10738b0506K8330L3502L5731k6635O501M7830o9156K3401J9818j23172L5781l1083
10726c9658L6012O2925K4776J1929Q6684q9664k8932L7473K2825m7401L4027p5629
10714C5367k8963O3519j7403K9625k0065M9892m7118l3769l9751Q3432l3310j0574
$$ y = [-8299, 84493, 100895, 60789, 9908, -12270, -7492, 31072, -18805, 31782, 39075, 3592, 52111, -54990, 56114, 72976, 38160, 116129, 105556, 42269, 34874, 26927, 55201, 11841, 95912, -2957, -59614, -17194, 41283, 31411, -73558, 101271, -10030, 90230, 151020, 85147, 91179, 70545, 107885, 40179, 76857, 37907, 60848, 41293, 124968, 65813, 207672, 44800, 83739, -1999, -39448, 112946, 90707, 6801, 94509, 26657, 61937, 53222, 44414, -20506, 7824, 41326, 77057, 50422, 56923, 104753, 35597, 58998, 78816, -44356, -8575, -39658, -3646, 59279, 84055, 95984, 182668, 93004, 64072, 101545, 124370, 76969, 110996, 35367, 6404, 69923, 52520, 82145, 62080, 111972, 64854, 31085, -8666, 74766, 41456, 30882]
10702C0882j8946o5736J45041N4601L3343r9440j4027q0525N1708K9067p2652
10691f684Q2659k8851J7982N376o1537J4249k7334n4184J05562n1332N5744l4238
10679A7412P1772q4481R9962q8083R4753p5612Q8738j29984J92063k62776J94948
10668A18712j07373M1375l0105L2058R618L960k7370J31860l1287o1280N6296
10657A36464j46810R9546j43582J12055M4522o6995O3769r2680J01958q2274L7429
10646F3402L9872n3049q5959l2148J13169L8232j41501M930R2243J3750R860j7556
10634D5245m6482J28603p8930r283O9291l057r9335R6171k1278j23722N3520K8817
10622C9560J3559M897k348J01784q6694k8684P8517j5396k4031n6684Q8387J9078
$$ y = [30882, 11936, -53800, 91241, 145842, 179185, 79745, 65718, -14807, 36901, 65968, -6684, 75975, 47124, 65106, 70482, 8945, 23194, -4140, -58324, 47238, -4094, 51650, 17412, 89184, 4703, 104665, 16582, 111335, 35723, 124461, -5523, 186540, -76236, 118712, 11339, 52714, 22609, 54667, 64285, 68245, 40875, 172735, 141448, 80168, 136464, -10346, 89200, -54382, 57673, 102195, 35200, 98969, 6289, 108247, 25973, 63402, 103274, 50225, -35734, -67882, 45287, 83519, -57982, -53052, 39191, 52941, 62801, 45245, -1237, 127366, 48436, 39153, 108444, 105387, 6052, 102223, 80945, -42777, 10743, 39560, 53119, 58016, 55668, 157452, 70758, 42074, 120591, 105195, 81164, 24480, 112867, 131945]
10610A31945o0494K0667M1044j01347o6578J20915j0778m2741J01612k9569j46001
10599d1325M1455Q9085q156K6535p9668J27665j14576L1986k5602R870K2625q1887
10587a993R7273m7502P2315o2223m060m8872M1495p2480J51071p6550M6153l5063
10575E9564j0756k369M3383j9404j2696L3079k4695m8643N7794J4578m0542j9954
10563B9339l6811O3454j5035J5057o8618M9568m059J7245j3482M1401k1045J34210
10551A91224o2661j47504P0175P1053k7688p2057J05556j04711M7663k9008P1241
10540A13283L2797r0305l2607K7780K9543Q1538O4907j22641l2303K1987M2894
10529A36873o382p5907P8150j1168r3807Q703R2357o4668k3891j0705M380M5145
$$ y = [131945, 71451, 92118, 133162, 31815, -34763, 86152, 75374, 32633, 134245, 104676, -41325, 130, 89215, 81059, 107594, 27926, 155591, 41015, 73001, 47399, 57269, 79894, -1993, 95280, 47778, 120093, 57870, 53810, 4938, 46433, -26047, 125024, 48474, 94627, 59564, 48808, 46439, 89822, 70418, 57722, 90801, 66106, 17463, 75257, 89835, 49293, 29339, -7472, 55982, 40947, 56004, -12614, 36954, 32895, 50140, 36658, 78059, 57014, 191224, 128563, -18941, 51234, 122287, 94599, 22542, 128098, 23387, 71050, 42042, 113283, 146080, 55775, 23168, 50948, 80491, 162029, 226936, 104295, 71992, 93979, 136873, 130491, 54584, 132734, 121566, 27759, 36462, 128819, 64151, 40260, 29555, 33935, 79080]
10517G9080N1160j19363N0653m810P7696n1607M9298r8552O4352l3511P5715k53
10505A39858o7283m7518P045N3261n8133K9810P3830K686j41037N8388k7397M1436
10493F4946L2404m3442Q3660l2497n067l7537J60480m0157j39568Q4576R225J8953
10481A55976K9344j05392K1134j11304O5169M1804j63916P8173R6477q5579j8675
10470C211R0894j82175R9354J20984o1098R1017o6218J9383m2163j0056N2977
10459A16110j8761n0580K0196J3868P157O2467J6058o6238Q859r021L6232r3302
10447D3045O3941L8037M9117q5123K563m2786P832k5822J25193l1435P6439p5288
10435A45713m2621n5300R9467j5342k8934j6753P8869N1292j19815N2699l4937
$$ y = [79080, 130240, 10877, 61530, 56720, 134416, 82809, 132107, 33555, 97907, 64396, 140111, 139858, 72575, 25057, 32102, 85363, 27230, 57040, 130870, 133556, -7481, 50907, 23510, 64946, 97350, 53908, 137568, 105071, 100004, 62467, 222947, 182790, 43222, 127798, 137023, 155976, 185320, 79928, 101062, -10242, 54927, 96731, -67185, 10988, 107465, 21886, 3211, 94105, -88070, 11284, 132268, 71170, 162187, 95969, 115352, 73189, 63133, 116110, 97349, 46769, 66965, 80833, 87990, 150457, 166515, 100277, 109136, 100115, 136347, 43045, 106986, 145023, 194140, 109017, 111580, 68794, 76626, 50804, 175997, 144562, 221001, 145713, 103092, 47792, 147259, 131917, 102983, 86230, 165099, 216391, 96576, 149275, 114338]
10424A14338N452q4314O6694l3803J17370r3203J00252l0477q0928J47597j50905
10413G8073L4225K9727m0652K4633l1688K6644M63J1890J2478o4386O2190l7274
10401A06323Q7377r484M3016r3740Q2362r9316P2202j03779J65597j34747N1228
10390A67039q7062J19292m3856l8499O188p9221J09857N1501m9353L4116J4946
10379B04948o7266m2528J2771O9087k7731R1406k06318O8718K0520O3208o8619
10368A18196J16N0754m7794L1445r4669R8756J9827K4794q7630J24485r3748p9100
10356F5432J38358M3622j29846Q4743m6407R2515j5985J767l0006J17550j99440
10345A22303Q2360N2322l2927o5678L3325N1639m5667M827o7157P9864k7389j7188
$$ y = [114338, 119790, 35476, 102170, 68367, 185737, 92534, 192786, 162309, 81381, 228978, 78073, 112298, 142025, 101373, 126006, 94318, 120962, 121425, 133315, 145793, 81407, 143597, 106323, 193700, 184216, 227232, 133492, 215854, 116538, 188740, 84961, 250558, 115811, 167039, 79977, 199269, 155413, 116914, 123102, 43881, 153738, 205239, 155886, 190002, 204948, 137682, 95154, 107925, 177012, 149281, 240687, 34369, 103087, 123607, 186815, 118196, 118312, 169066, 121272, 152717, 58048, 156804, 176631, 201425, 113795, 238280, 144532, 65432, 203790, 247412, 117566, 202309, 155902, 248417, 232432, 234199, 204193, 321743, 122303, 204663, 256985, 224058, 158380, 191705, 243344, 197677, 202504, 135347, 215211, 187822, 170634]
10333A70634O9679j0213N0551j05835m7341J05547R263m4565J5112l8138P4004
10322B48698l3484p3364Q7127k1542l8123J01337m8226k1256k1676o55R9301p4505
10310B03632j38512K17865M733q880k784L1215p7688q829n344M4373o0996R4187
10298B92972k0683j2143M6236l2638m3805L8715l3433P2313j4821k6308J9835
10287B86240p609k832R0542m4952N1143k06431J49304o8850J5438l818K0828o8165
10275B10838K8640R4517j11409O0769j5895N1013r20o8150J38631j58056L8259
10264B68237K1028K7210l1866N7704m5216O0841K6762m5123m6038o9256K64504
10253D88787j51606N6845j8926J993o3822L3125K6645n1932Q7415p3743L6605
$$ y = [170634, 240313, 230100, 280651, 174816, 127475, 233022, 242285, 197720, 212832, 174694, 248698, 215214, 141850, 228977, 207435, 169312, 270649, 222423, 201167, 179491, 178836, 278137, 203632, 65120, 282985, 287718, 278838, 276054, 307269, 229581, 220752, 215408, 259781, 198785, 292972, 272289, 260146, 306382, 273744, 229939, 268654, 235221, 307534, 292713, 266405, 286240, 278631, 275799, 366341, 321389, 372532, 166101, 315405, 246555, 261993, 258175, 279003, 210838, 239478, 333995, 222586, 283355, 267460, 318473, 317553, 249403, 388034, 229978, 268237, 289265, 316475, 284609, 342313, 297097, 357938, 384700, 339577, 293539, 224283, 488787, 337181, 394026, 375100, 377093, 313271, 346396, 373041, 321109, 408524, 334781, 371386]
10242C71386j4465j982O1926K1335J1388q8191J19728l5998P1894n90p1067K3478
10230D68842K727K0378l8860M346m3213N7659J22006m1406m1104l2518R4701m7690
10218E25868m3850J04747P368p9789P9817k5603J31060j03963P7065j09572K7063
10207E90211O1939Q134O3007j30458K0178K2817K0257R774k4709l3017L7538L6493
10195F82164n8331J04177j02686L2181o0256Q0226R1365r6276M8448J699L7220
10184G59931j23715P5795N9513J6355J2673o7948J4581L3002K0167K0017l1936
10173G88435k7347M3832K2949Q381Q2917j01849M4169j714J00866o5989j9738
10162H74912P2362R5039j58102N4835O2824Q1387l5069k6725R3049K6797k9646
$$ y = [371386, 356921, 354939, 416865, 438200, 449588, 361397, 481125, 445127, 517021, 516431, 445364, 468842, 471569, 491947, 453087, 457433, 414220, 471879, 593885, 552479, 511375, 478857, 573558, 525868, 482018, 586765, 594133, 514344, 594161, 568558, 699618, 595655, 672720, 563148, 590211, 652150, 660284, 723291, 592833, 613011, 635828, 656085, 665859, 641150, 608133, 645671, 682164, 623833, 728010, 625324, 657505, 597249, 677475, 768840, 672564, 721012, 722711, 759931, 636216, 712011, 771524, 787879, 800552, 732604, 747185, 780187, 800354, 820371, 788435, 761088, 804920, 827869, 836250, 919167, 817318, 861487, 859773, 960639, 894650, 874912, 947274, 1042313, 884211, 939046, 1001870, 1083257, 1048188, 1021463, 1114512, 1141309, 1111663]
10151A111663J3233O2119N8792J32422J9887J02832J09808n0825n8411M1072j5091
10140A527501p1424O6942j12608Q42M3489j8101j9185J90218q7753o7796O5971
10129A518096Q6556N0543M4556J24317L518J25395J1038J57122J98630J88524
10119B508295K9136m0688m706n9785l1420j06429M1479r6555Q1919M5490j5515
10108B351221J28185P0097J0417k2731j54003K6708M5839p5675k2921J20837K960
10097B480934O5564J28053Q4137Q509j0682L4968l1455J54557j11081q281J74192
10086B969415J91636J06217J20855L37120L8792N64j61673m0457M5448l05686
10076C302231O8167m0178p9085J4799m271l5874J28983o3755O401J40752R330
$$ y = [1111663, 1124896, 1187015, 1245807, 1378229, 1398116, 1500948, 1610756, 1559931, 1501520, 1542592, 1527501, 1456077, 1523019, 1410411, 1411253, 1454742, 1436641, 1417456, 1607674, 1519921, 1452125, 1518096, 1604652, 1655195, 1699751, 1824068, 1827586, 1952981, 1964019, 2121141, 2319771, 2508295, 2537431, 2496743, 2492037, 2432252, 2400832, 2294403, 2335882, 2239327, 2321246, 2366736, 2351221, 2479406, 2549503, 2559920, 2537189, 2383186, 2409894, 2455733, 2380058, 2357137, 2477974, 2480934, 2546498, 2674551, 2758688, 2767197, 2756515, 2791483, 2760028, 2914585, 2803504, 2795223, 2969415, 3161051, 3267268, 3388123, 3725243, 3764035, 3764599, 3602926, 3562469, 3607917, 3302231, 3370398, 3330220, 3251135, 3265934, 3261663, 3225789, 3354772, 3291017, 3297418, 3438170, 3447500]
10065C447500P391J78046p9608L36652j2210K62897P2687J47668O6827J22634
10055D550484P2129l4027p9494R4177J8044Q848O8634l5425O8493J69475L2618
10044D933956n7482O9008J06083P4523R9328R6881R1396R8884n4458J30930J60495
10033E749544N3776K0274J72068N9007J53184J01500M8701J52813R2039P2242
10023F675148J05072N0993K39219M1156Q6073J70064K17613n7002J93085K87507
10013H008928O2270J52954J28410K43246N8555J82199L15447K50557N7031J93951
10003I653548K03074K58760K04813L43783K35547J97462L12919L58834J43055
9994A1911795L73619K39532K43558L95018K91968K74275N11028L20284M69810
$$ y = [3447500, 3454891, 3632937, 3553329, 3889981, 3877771, 4140668, 4213355, 4361023, 4427850, 4550484, 4622613, 4588586, 4509092, 4603269, 4621313, 4630161, 4698795, 4663370, 4731863, 4901338, 4933956, 4876474, 4945482, 5051565, 5126088, 5225416, 5322297, 5413693, 5512577, 5458119, 5589049, 5749544, 5803320, 5823594, 5995662, 6054669, 6207853, 6309353, 6358054, 6510867, 6602906, 6675148, 6780220, 6831213, 7070432, 7111588, 7197661, 7367725, 7585338, 7528336, 7721421, 8008928, 8071198, 8224152, 8352562, 8595808, 8654363, 8836562, 9152009, 9402566, 9459597, 9653548, 9856622, 10115382, 10320195, 10663978, 10899525, 11096987, 11409906, 11768740, 11911795, 12285414, 12524946, 12768504, 13163522, 13455490, 13729765, 14240793, 14561077, 15030887]
9985A5030887M71468L93725M49611M79641N81347N44529O03262O30488N52299
9976A9737257O13658P74847P42166Q34919Q12585R15436R51483R81816J123196
9967B7487363J259163J121685J527758J436710J606815J942635J988863K189523
9959D0560515K443173K684528L170487L400681L834532M353225N160113N691732
9951G1298986O642528P545192Q747437J0210581J1940683J3971104J6243852J8985860
9943A65586223K1642387K4591976K6352963K6799036K5317008K1077189J4626300
9936C25993082O751972j469277r093912j5424620j9693670k2291127k3159108
9929B41613340k2623124k1219569j9449407j7349368j5411058j3526839j1833562
$$ y = [15030887, 15502355, 15896080, 16345691, 16825332, 17406679, 17951208, 18554470, 19184958, 19737257, 20350915, 21125762, 21867928, 22702847, 23515432, 24430868, 25382351, 26364167, 27487363, 28746526, 29868211, 31395969, 32832679, 34439494, 36382129, 38370992, 40560515, 43003688, 45688216, 48858703, 52259384, 56093916, 60447141, 65607254, 71298986, 77941514, 85486706, 94234143, 104444724, 116385407, 130356511, 146600363, 165586223, 187228610, 211820586, 238173549, 264972585, 290289593, 311366782, 325993082, 332745054, 331275777, 322181865, 306757245, 287063575, 264772448, 241613340, 218990216, 197770647, 178321240, 160971872, 145560814, 132033975, 120200413]
9922A20200413j0205855r078781p751108o877532o057123n422295m677132m117424
9914F6013163l697935l406925l001907k613134k495203k376934j987492k015627
9906D4418006j766914j584384j680772j358243j300861j352204j170655j192876
9898C3011097r94300r52036j142771p92151r59927p20077p75994p54653p87396
9889B5131792n31700p02779p25968n48124o49808n89262m05448n26209n35138
9880A9917356m27706m73374m35325m02200l97015m28135l78311l92565k68063
9871A6314662l42953m05116l70084j90007l76493k42127k05502l33124k54893
9862A3594363k08494k86999j76726l41937k60322k1627k94183j87748j43663k77085
$$ y = [120200413, 109994558, 100915777, 93164669, 86287137, 80230014, 74807719, 70130587, 66013163, 62315228, 58908303, 55906396, 53293262, 50798059, 48421125, 46433633, 44418006, 42651092, 41066708, 39385936, 38027693, 36726832, 35374628, 34203973, 33011097, 32016797, 31064761, 29921990, 29129839, 28169912, 27449835, 26673841, 25919188, 25131792, 24600092, 23897313, 23171345, 22623221, 21973413, 21384151, 20978703, 20452494, 19917356, 19489650, 19016276, 18580951, 18178751, 17781736, 17353601, 16975290, 16582725, 16314662, 15971709, 15566593, 15196509, 15006502, 14630009, 14387882, 14182380, 13849256, 13594363, 13385869, 13098870, 12922144, 12580207, 12319885, 12298258, 12004075, 11816327, 11672664, 11395579]
9852A1395579k94673j52051r7712k86864r1259j28518j72035j72004j76569k28764
9842I595130l1250Q000k26876r7716j37157j55762j16771m9874p601j95955p6675
9831H507493j9331j61486j43238j27751L392j11780p4848j16252l0200j55812
9821G570187q8953o1653J4692j12071j63355q982j08476q7317N2389o0153p3127
9810F873181j09065m4192j45975O0731j07568N9672l2865M5255O870o2758N3056
9799F596342k21761Q5304k4408o3894j02554Q352M3946q9062q2840m0407O687
9788F115705K68R299o6254m1305r7964N6683k4633q1203l0391R8985J1716j2854
9776E938052k4775K1872p5744J15544k2382m3254K313J27832q4216j9208o9316
$$ y = [11395579, 11100906, 10948855, 10851143, 10564279, 10473020, 10344502, 10172467, 10000463, 9823894, 9595130, 9563880, 9571880, 9345004, 9247288, 9110131, 8954369, 8837598, 8787724, 8780123, 8584168, 8507493, 8488162, 8326676, 8183438, 8055687, 8059079, 7947299, 7872451, 7756199, 7725999, 7570187, 7481234, 7419581, 7434273, 7322202, 7158847, 7149865, 7041389, 6954072, 7006461, 6946308, 6873181, 6764116, 6719924, 6573949, 6634680, 6527112, 6586784, 6553919, 6599174, 6606044, 6543286, 6596342, 6374581, 6459885, 6435477, 6371583, 6269029, 6277381, 6321327, 6232265, 6149425, 6109018, 6115705, 6115973, 6125272, 6059018, 6017713, 5919749, 5976432, 5951799, 5870596, 5840205, 5939190, 5950906, 5938052, 5913277, 5935149, 5859405, 5974949, 5952567, 5909313, 5911626, 6039458, 5955242, 5936034, 5866718]
9765E866718P3961p6730J1279J44926j37076O6605r1711l3387J20323L8567K2073
9754F005548M0904J2005J10154o7823J7469Q3094p579N2234m4078J80939P624
9743F390491M4427P0063O3190J9372K8252N8113R422O9810J33823q87J27867R4351
9731G108294r178M0581J46506L4269J65172k5904J55062J42291J13326J03905
9721G974324K12248P0667N2397M9872J36577J71747M9357K61450Q5665K28373
9711I292677R3762J63602J39940J34633K44982j5500L53362J28392J73952J53066
9701A0862868K85529K03448J39022K34892J52349K35587K39235K20333J06992
9692A2680255K00455L12304J69004Q7861K71509K76989R7603K18172J47756J35205
$$ y = [5866718, 5940679, 5863949, 5875228, 6020154, 5883078, 5949683, 5857972, 5824585, 5944908, 5983475, 6005548, 6046452, 6058457, 6168611, 6100788, 6118257, 6201351, 6193772, 6246006, 6201928, 6382867, 6390491, 6434918, 6504981, 6568171, 6587543, 6615795, 6673908, 6683330, 6753140, 6886963, 6886076, 7013943, 7108294, 7099116, 7139697, 7286203, 7320472, 7485644, 7459740, 7614802, 7757093, 7870419, 7974324, 8186572, 8257239, 8309636, 8359508, 8496085, 8667832, 8717189, 8978639, 9064304, 9292677, 9386439, 9550041, 9689981, 9824614, 10069596, 10054096, 10407458, 10535850, 10709802, 10862868, 11148397, 11351845, 11490867, 11725759, 11878108, 12113695, 12352930, 12573263, 12680255, 12880710, 13193014, 13362018, 13449879, 13721388, 13998377, 14095980, 14314152, 14461908, 14597113]
9682A4597113J51461Q9900J01140L4562J21705J94350k18174J01318o2245p451
9672A5103679j16117q2731M0666k18676o4317j90064k81111j42803k00374j44369
9662A3703783k95960k84579k26673k65778l75778k64452k83165k67146l09530
9653A1130722k42819k41803l80957j65185l55591k50211k89123k28803k83322
9644H692908j37360l43794k31537j86849k64972k06576j78728l79047j87848j75706
9634F400491j93387p7659j79097k09436j31191k45805j50496p4015j29014j09313
9624D901078j61322j39717j85843j03459j28535l2506j50834m0431j65935m9244
9614C743252r9253k03288q4865J9441j01853j7646k20007p8481m441j05727j18422
$$ y = [14597113, 14748574, 14838474, 14939614, 14974176, 15095881, 15290231, 15072057, 15173375, 15111130, 15103679, 14987562, 14904831, 14945497, 14726821, 14662504, 14472440, 14191329, 14048526, 13848152, 13703783, 13407823, 13123244, 12896571, 12630793, 12255015, 11990563, 11707398, 11440252, 11130722, 10887903, 10646100, 10265143, 10099958, 9744367, 9494156, 9205033, 8976230, 8692908, 8555548, 8211754, 7980217, 7793368, 7528396, 7321820, 7143092, 6764045, 6576197, 6400491, 6207104, 6129445, 5950348, 5740912, 5609721, 5363916, 5213420, 5139405, 5010391, 4901078, 4739756, 4600039, 4414196, 4310737, 4182202, 4149696, 3998862, 3958431, 3792496, 3743252, 3643999, 3440711, 3355846, 3375287, 3273434, 3255788, 3035781, 2957300, 2952859, 2847132, 2728710]
9603B728710p2584L4097r4280l6253r1304n7359J891o5818j11942p9784q3497
9592B071877p1875q38m7526o0134l576p9573j8687J5796q4419r6959J04040r5967
9580A632159q9306J02530n3431j4658j62088J0835l9223r3103J09918n0604l1561
9569A321468q0296r283j23594M1885l9056k7444k4685N2909L08j41525P3959l3909
9557A010737j27751J32362l6319m0011p5533K7515r1830Q588J37838j29307j8283
9546G98006r0428K7704m208K4896q8004J8883M0309q0418o9107L5779j7072o3061
9534E33279M6873K2621J0415L1100j24638q769Q1910L8925j11878l1197n8796
9523D29845J54791o9993k917l6373p996N538n2012K4435j02409O5173j0146M6216
$$ y = [2728710, 2656126, 2690223, 2595943, 2559690, 2468386, 2411027, 2412918, 2347100, 2235158, 2155374, 2071877, 2000002, 1999164, 1951638, 1891504, 1887928, 1808355, 1789668, 1805464, 1721045, 1624086, 1728126, 1632159, 1542853, 1645383, 1591952, 1577294, 1415206, 1426041, 1386818, 1293715, 1403633, 1353029, 1321468, 1241172, 1231889, 1108295, 1150180, 1111124, 1083680, 1058995, 1111904, 1112212, 970687, 1044646, 1010737, 882986, 1015348, 979029, 939018, 863485, 891000, 799170, 807758, 945596, 816289, 798006, 707578, 735282, 731074, 755970, 667966, 686849, 727158, 646740, 577633, 613412, 596340, 533279, 580152, 602773, 613188, 644288, 519650, 510881, 592791, 631716, 519838, 488641, 429845, 584636, 514643, 511726, 475353, 467357, 472895, 420883, 445318, 342909, 408082, 397936, 444152]
9511D44152k7379j8109m959r415M4397r3587L303N2946O053q7815p1661K9144
9499B67070K1569P3396r4242k5219R8853o9610j08558N5972J04649o4806k5237
9488B33837J8654k2343J3254n8738O9119J3898j77513O4313m4485J07563k4627
9477A92932m3900O9833l2222l8592R0354L7416r8516p6605J09390q8731R0147
9466B11506l946j06539O0481Q9300r8834l6415J4723j172P3999j21048Q1074K1183
9454A84312r8255K3258p3127l8203J34797o82m0889O2769j02479J39914j09631
9443H1784M2906j6047o5871M2705K8164l0804N1085n8333K6835k7259J8796M2946
9431A36907p4213R8858o0619J0318P937j5843r0928L831L5966J5928O9346n1308
$$ y = [444152, 416773, 398664, 393705, 384290, 428687, 335100, 338403, 391349, 397402, 309587, 237926, 267070, 288639, 362035, 267793, 242574, 341427, 271817, 163259, 219231, 323880, 259074, 233837, 252491, 230148, 243402, 184664, 253783, 267681, 90168, 154481, 109996, 217559, 192932, 149032, 218865, 186643, 148051, 238405, 275821, 177305, 100700, 210090, 121359, 211506, 207560, 101021, 161502, 250802, 151968, 115553, 130276, 129104, 203103, 82055, 163129, 184312, 86057, 109315, 36188, -2015, 132782, 132100, 91211, 153980, 51501, 191415, 81784, 124690, 108643, 42772, 85477, 113641, 82837, 133922, 75589, 102424, 75165, 93961, 136907, 62694, 161552, 100933, 111251, 119188, 103345, 12417, 16248, 52214, 68142, 137488, 86180]
9419H6180O4272j24248J6813L5507k5385J63185q2259j37262N2417k0812K7384
9408E5792k3045N5084j4839n4005O4744q5812M0914L5034M7199P370l9125J4084
9396A03395r7684N1335J56672j23274j14818O3151R2807j00960M2456p8829L9773
9385C4024k5990r977K0314l5961O1229K5680l5996l9693K1648L0321j4885N9633
9373I0347k4731L4096n2784j8322j7829R2L9680L4413n5754k5471M5596q8773
9361c9440J79083m2532l4473r1075J39261j134k5378K8705l999J2305k1868l1612
9349F7843M0351J3907M7554p3410l4082R1101j24893J32203k2172j9701j02269
9338A6432R9239j6749n3188Q3626k276j22938J17575l2616m9739j920k2677J3658
$$ y = [86180, 150452, 26204, 43017, 78524, 53139, 216324, 134065, -3197, 49220, 28408, 55792, 32747, 87831, 72992, 18987, 83731, -2081, 38833, 73867, 121066, 128436, 89311, 103395, 5711, 57046, 213718, 90444, -24374, 38777, 131584, 30624, 73080, -5749, 34024, 8034, -1943, 18371, -17590, 43639, 69319, 33323, -6370, 15278, 45599, 30714, 90347, 65616, 99712, 46928, 28606, 10777, 10869, 50549, 84962, 29208, 3737, 49333, -39440, 139643, 97111, 62638, -28437, 110824, 109690, 84312, 113017, 109018, 121323, 99455, 67843, 108194, 122101, 169655, 96245, 62163, 153264, 28371, 160574, 138402, 118701, 16432, 115671, 98922, 45734, 129360, 127084, 4146, 121721, 89105, 39366, 37446, 14769, 28427]
9326B8427j15758J28383n4690J3522N2414p0662J02891j22790N1251O2173j18516
9315d3355P8521J28936j79288R0949l2995p9159j8660L6362L4443P6392j23168
9304c1022Q1607m5658J1758l3123J02660o026p6715L0585N2517O250j7843M4474
9292A19464j31702O9585P0250n7513l8667J17084j45822J13332p2909K4931J4083
9281H2116o2655j0431P8753j45422J04037J8897J42673j45721j00723J03494M0713
9270A05731k1618k1015J6837o8583J6392Q8364J8162o6805m7203J29082m4195
9259A05149n1341J4677Q4481l8242M9618O867j67326J9817M2574P7558l4576N6709
9247A65965p1406L2818m1165O3965n9258j9128N4935M2590q5134N9969N3078p0677
$$ y = [28427, -87331, 41052, -13638, -116, 52298, -18364, 84527, -38263, 12988, 75161, -43355, 35166, 164102, -15186, 75763, 42768, -36391, -55051, -18689, 15754, 92146, -31022, 50585, 4927, 16685, -16438, 86222, 80196, 3481, 34066, 86583, 92833, 74990, 119464, -12238, 57347, 127597, 70084, 31417, 148501, 2679, 116011, 43102, 68033, 82116, 19461, 9030, 87783, -57639, 46398, 65295, 207968, 62247, -38476, 65018, 105731, 84113, 63098, 79935, 11352, 27744, 116108, 134270, 67465, 20262, 149344, 105149, 53808, 68485, 152966, 114724, 164342, 171209, 3883, 23700, 66274, 143832, 109256, 165965, 94559, 127377, 86212, 150177, 90919, 71791, 126726, 169316, 84182, 144151, 197229, 126552]
9235A26552N2356J11069o1640n8644l8967K4173L4232j0054N462k0835k8304J30778
9223B66178j68209N7494j6978J11456j3845K645j9704J04344m7613m6173J8697
9212B48292k9384P3572j01462J08378l1423L7450l0548N6311j83196N9824l1631
9201A76183J13067J4205p876m9692j2798N1906r9579J78900k3183l8301O3108
9190C65940K2362k6760o3263O572Q7546o3692k8339l7403J46284j20992n1674
9179B36581R7275n8184O6217o52L742o8588J40902j08223M7370j2605R9484j36504
9167C06815Q4042r8085J00545q7439O8889K3699o7533J14437n0465O8464r5436
9156C67933q546J2910P0452o6100m2248Q3964m704m3680J10530r3048K6827N0878
$$ y = [126552, 178908, 289977, 228337, 169693, 130726, 154899, 189131, 179077, 184539, 163704, 135400, 266178, 97969, 155463, 138485, 249941, 236096, 238741, 219037, 323381, 275768, 229595, 248292, 218908, 292480, 191018, 299396, 267973, 305423, 274875, 331186, 147990, 207814, 176183, 289250, 303455, 295579, 245887, 233089, 284995, 185416, 364316, 341133, 302832, 365940, 388302, 361542, 298279, 304851, 392397, 328705, 300366, 262963, 409247, 288255, 236581, 333856, 275672, 341889, 341237, 344979, 276391, 417293, 309070, 356440, 343835, 443319, 306815, 390857, 292772, 393317, 305878, 374767, 398466, 330933, 445370, 394905, 463369, 367933, 359387, 372297, 442749, 376649, 334401, 418365, 413661, 369981, 480511, 387463, 414290, 465168]
9144D65168J7877l6252J10127q2884O9088l588R071M6057m1354j439n0270J76498
9132F78099J557n7073J26434q4029J19424j9677j9001M4081l4200L2443J4322
9121H02380J02303n7940J5123o0725R5049M206J66959N4660j25952J83596K3654
9110A203313J13703O0302m8863J36187R876m0161J73855O9335P1306j14930J25843
9099A759766Q5597J23505P1095J11800q2234L35061J04273L00324M51913O03772
9089C864872P19850R50021N51632L74166O37364O56286P73119R98190P08262M55264
9079A0689026Q9772L05116O08900Q56840R82152K36914k74602m94999l47532l04739
9069A2346848j74332k66192o41618q37201o69872q13823m09665n74556m69872
$$ y = [465168, 483045, 446793, 556920, 474036, 543124, 539536, 548607, 594664, 553310, 551871, 501601, 678099, 679656, 622583, 749017, 664988, 784412, 764735, 745734, 789815, 755615, 788058, 802380, 904683, 846743, 861866, 801141, 896190, 900396, 1067355, 1122015, 996063, 1179659, 1203313, 1317016, 1377318, 1328455, 1464642, 1474518, 1434357, 1608212, 1677547, 1748853, 1633923, 1759766, 1845363, 1968868, 2039963, 2151763, 2069529, 2404590, 2508863, 2809187, 3261100, 3864872, 4584722, 5534743, 6086375, 6460541, 7097905, 7754191, 8527310, 9525500, 10233762, 10689026, 10778798, 11083914, 11692814, 12549654, 13531806, 13768720, 13494118, 12999119, 12651587, 12346848, 12172516, 11906324, 11264706, 10427505, 9757633, 8943810, 8534145, 7959589, 7489717]
9060G489717n74853o65632o28230p28885o19218o29592l65561l54237j30139k20018
9050B573352j89737k25469q086p6963l7941r2382m3150m0661k2961J55213j54264
9039A836951l1115j94748J4313M062j79591K7134o6821r2309M9515k8882k7860
9028A310649n3754j8492j22219P0292j1918K3835k597j46631J43233P6379l3362
9017A235415L5089J26736J85059q9902O0048q981q9676j24779n9572o404o9959
9006A193074j59125k563j31572P1531j59995P2307N6207j92169K5096j2653j02050
8995F58088j4665R0091q1101J5345R8819Q3674j7869M1306p5376R6563j64908
8984G29967J40493n7067j77974n0127N9304o2755m6830L342p1265l8245J11912
$$ y = [7489717, 6914864, 6249232, 5621002, 4892117, 4272899, 3643307, 3277746, 2923509, 2793370, 2573352, 2383615, 2158146, 2150060, 2073097, 2035156, 1942774, 1899624, 1858963, 1836002, 1991215, 1836951, 1805836, 1611088, 1625401, 1629463, 1449872, 1477006, 1410185, 1317876, 1367391, 1338509, 1310649, 1256895, 1238403, 1116184, 1186476, 1174558, 1198393, 1195796, 1049165, 1192398, 1268777, 1235415, 1270504, 1397240, 1582299, 1492397, 1552445, 1543464, 1453788, 1329009, 1269437, 1263033, 1193074, 1033949, 1031386, 899814, 971345, 811350, 883657, 939864, 747695, 772791, 760138, 658088, 643423, 733514, 652413, 667758, 766577, 850251, 832382, 873688, 798312, 894875, 729967, 870460, 813393, 635419, 585292, 644596, 581841, 535011, 538353, 467088, 428843, 540755]
8973E40755q1046j16116J60504r4468M4506O917k3202N6675j07891L1909J0795
8962D29338n6338J2858l7207J16270k8137m8335m094J9824j19965J03351o7883
8951C19682o195Q987m8526J08131M6591p9831k73l9354M0303O64q506O1434j1667
8938C91440q2056j7792N8930m5117J3356Q1689n9363o6790O5015l8367m7357O6692
8926C20280K8785k3641l0302M9045k5534K2548O5378p0786R9673j17500L7655
8915C55601n9585m821L053M1302M1569n8348L1030L799q1113R3549L4184q3651
8903C16569j9639N6691j3898l2876J07341J7705n2592o0099J13574k0395j5071
8892C97310o0899J27888j5204l1070J9827k4858o2451J30032l8475l1469n0545
$$ y = [540755, 459709, 343593, 504097, 409629, 454135, 461052, 437850, 494525, 386634, 418543, 429338, 373000, 385858, 348651, 464921, 436784, 388449, 384355, 404179, 284214, 387565, 319682, 313487, 322474, 273948, 382079, 428670, 348839, 348566, 309212, 349515, 350179, 341673, 403107, 391440, 309384, 291592, 350522, 305405, 318761, 400450, 341087, 274297, 339312, 300945, 253588, 320280, 349065, 325424, 295122, 344167, 318633, 341181, 406559, 335773, 435446, 317946, 355601, 296016, 291195, 294248, 335550, 377119, 318771, 349801, 353600, 272487, 366036, 400220, 316569, 296930, 353621, 339723, 306847, 414188, 431893, 379301, 319202, 432776, 412381, 397310, 336411, 464299, 449095, 418025, 437852, 412994, 350543, 480575, 442100, 410631, 360086]
8881C60086J32896m4689K9192m7888N4282J1589m792k83J03559j00948J19646
8870F12650o7568L2137O2400q3089O5613L759n6073J03518M201N6285j0370N1838
8858G75301l0249J18598p9846N9342M9186K4372L4209L5993J9936J73883Q5451
8847A266176J15109J40291M9682J71837J11660J52829J4212K06112q1724J87837
8837B334021j80700K2367K712p3766j3822o9532l7819o2848K408M0850m4267J23216
8825B042820k7413K44253m0399K26880J02670J23829J87843K12234K73942K60242
8815C606901L46629K44486L64012L35827R3112K52552K9482o2859J5554o7019
8805E158677j98804j06405j03231j73985p5087r6352o6496Q6993q1320R7166m6033
$$ y = [360086, 492982, 448293, 477485, 429597, 483879, 495468, 490676, 490393, 593952, 493004, 612650, 545082, 577219, 639619, 556530, 622143, 625902, 569829, 673347, 677548, 733833, 723463, 775301, 745052, 863650, 783804, 843146, 892332, 916704, 950913, 986906, 1006842, 1180725, 1266176, 1381285, 1521576, 1571258, 1743095, 1854755, 2007584, 2021796, 2227908, 2146184, 2334021, 2153321, 2175688, 2178400, 2104634, 2090812, 2021280, 1983461, 1920613, 1923021, 1963871, 1919604, 2042820, 2015407, 2259660, 2219261, 2446141, 2548811, 2672640, 2860483, 3072717, 3346659, 3606901, 3953530, 4198016, 4562028, 4897855, 4990967, 5243519, 5273001, 5210142, 5225696, 5158677, 4959873, 4853468, 4750237, 4576252, 4501165, 4404813, 4338317, 4425310, 4343990, 4441156, 4395123]
8794D395123M2948M1164p2537K14272o7081J68921J36241K01233K39949J86783
8784E487016J78919L84805J85854J16327K72301R6094p7153k74k21542j0153n3583
8773F358611r1423m9020k3478Q7621M9302P9341J4028n3256P2350j54622k5679
8762F263775p5073j67631n0781j6513l1788m4289L0484N7954Q4216J04753j1389
8751F143718P3333l3420j4553j48021j10942j01321j98257j94506o2547j93607
8741E159877J2056j08928P0752j67879N2355p9898j42426j1620k02378j51478
8731D430433j31779j48648j82553j83164j5581j25311o8139q3855j62666o7626
8721C261111j59580n4846p2262m1538m7649j30424j58664j31458j30589L4036
$$ y = [4395123, 4438071, 4479235, 4406698, 4620970, 4553889, 4722810, 4859051, 5060284, 5300233, 5487016, 5665935, 6050740, 6236594, 6352921, 6625222, 6721316, 6644163, 6643889, 6422347, 6412194, 6358611, 6267188, 6218168, 6194690, 6282311, 6331613, 6410954, 6424982, 6371726, 6444076, 6289454, 6263775, 6188702, 6021071, 5970290, 5953777, 5921989, 5877700, 5908184, 5966138, 6050354, 6155107, 6143718, 6217051, 6183631, 6169078, 6021057, 5910115, 5808794, 5610537, 5416031, 5353484, 5159877, 5171933, 5063005, 5133757, 4965878, 5018233, 4938335, 4795909, 4784289, 4581911, 4430433, 4298654, 4150006, 3967453, 3784289, 3768708, 3643397, 3575258, 3491403, 3328737, 3261111, 3101531, 3046685, 2974423, 2932885, 2885236, 2754812, 2596148, 2464690, 2334101, 2368137]
8711B368137j65093j30850j6805n8644k0881k17904k8380N2606n9359P424M9925
8700A780176n7466n2437O6552O7068J6713R5696J00819M3976P2471Q2772J13986
8689B330326K5678P6519J29521j35480L9231j75958L9305q6822m0395j74827J4041
8678B041139O701L3983K8318K5793n1482K7106J56776J1042P0789J03244R8621
8667B552030J52739J55350R0283J86782K87593J57465J88855J49624J68157R5625
8657D184503N8022l7690O9758j26105J13512k67413L1696r5337l659p1757n7637
8646C797893q031N6478p0489j6720k6807j888L0786l6512O1319P7949P1682J15675
8634D051335M9989J94644J39010J16193q3202K9479O5867r0023n8463j33360j63153
$$ y = [2368137, 2203044, 2072194, 2055389, 1996745, 1975864, 1757960, 1729580, 1782186, 1722827, 1730251, 1780176, 1722710, 1670273, 1736825, 1803893, 1820606, 1916302, 2017121, 2061097, 2133568, 2216340, 2330326, 2356004, 2432523, 2562044, 2426564, 2465795, 2289837, 2329142, 2242320, 2201925, 2027098, 2041139, 2047840, 2081823, 2110141, 2135934, 2084452, 2111558, 2268334, 2279376, 2350165, 2453409, 2552030, 2704769, 2860119, 2950402, 3137184, 3424777, 3582242, 3771097, 3920721, 4088878, 4184503, 4242525, 4204835, 4274593, 4148488, 4262000, 3994587, 4026283, 3930946, 3927287, 3855530, 3797893, 3789862, 3846340, 3775851, 3759131, 3732324, 3730436, 3761222, 3724710, 3786029, 3863978, 3935660, 4051335, 4101324, 4295968, 4434978, 4551171, 4467969, 4497448, 4563315, 4473292, 4414829, 4281469, 4118316]
8623D118316p8853o8163r7541o0893M6459M1236j25526K4537p2077N1146l0921
8612C747720j57613j16476P8051j20815j14183j26090R779p7732j44937m1522
8602B936182K190j15257n8925k002j60445N2625n5151p9741l3948m903j46192
8591B334433K1484J1802o5317j0498j62805p2203O2962j39732L990q2886n6463
8580A844767L192o6409q2608P3246j2818k8862k1840K9717L928Q4486M9752K42712
8568B119263J53220K35558L30852N0156J63684J69571K74728K35830L22515M50707
8558D506084K80087J56955O8774n993J64660L89726L40778K95384M1582j67862
8548F070175j57416k54510k60513L3136j3105k30632k02709l70242k74273l64896
$$ y = [4118316, 4039463, 3971300, 3873759, 3812866, 3859325, 3900561, 3775035, 3799572, 3727495, 3778641, 3747720, 3590107, 3473631, 3551682, 3430867, 3316684, 3190594, 3200373, 3122641, 2977704, 2936182, 2938372, 2823115, 2764190, 2762188, 2601743, 2654368, 2599217, 2519476, 2485528, 2480625, 2334433, 2355917, 2367719, 2302402, 2291904, 2129099, 2056896, 2119858, 1980126, 1984116, 1901230, 1844767, 1847959, 1781550, 1698942, 1772188, 1759370, 1730508, 1708668, 1738385, 1742313, 1826799, 1876551, 2119263, 2272483, 2508041, 2838893, 2889049, 3052733, 3222304, 3497032, 3732862, 4055377, 4506084, 4786171, 4943126, 5011900, 5005907, 5170567, 5560293, 5901071, 6196455, 6238037, 6070175, 5912759, 5658249, 5397736, 5430872, 5417767, 5187135, 4984426, 4614184, 4339911, 3975015]
8538C975015k79120j89571k10273k60192j69335k82186k69300k31073l93756o71931
8528A018278J117615m71602k70319p8033j45278j30559j0353j20964K2493l1777
8518H99501q5664J01305r9281r1559J05415o4807M2066j33262K9558q6329n843
8507F11100N1709Q0775j00249m1325P0567j3792o2068j5430m104m8790q0377P7307
8495E25323l0775P8476j49035j1340Q3638k6872N8616n6274l5232L5691m2459
8484D29757k4698n844P1866j01988J05112p9412N1136p2433Q1101j7083l0077
8473D07437l3303m5545J01124j58p2462J14954j44673N2095r595R7425p4528O429
8461C99200o361j1580k1049L4263k794n132O5911r2408R3030J132O3332j05849
$$ y = [3975015, 3695895, 3506324, 3296051, 3035859, 2866524, 2584338, 2315038, 2083965, 1690209, 1018278, 2135893, 1664291, 1393972, 1315939, 1170661, 1040102, 1029749, 908785, 931278, 899501, 813837, 915142, 815861, 724302, 829717, 764910, 806976, 673714, 703272, 616943, 611100, 662809, 743584, 643335, 602010, 672577, 658785, 596717, 581287, 577183, 528393, 448016, 525323, 494548, 573024, 423989, 412649, 496287, 469415, 528031, 471757, 436525, 472216, 429757, 405059, 399215, 471081, 369093, 474205, 394793, 445929, 373496, 454597, 437514, 407437, 374134, 328589, 429713, 429555, 357093, 472047, 327374, 379469, 369874, 467299, 392771, 399200, 392839, 381259, 360210, 394473, 391679, 386547, 452458, 360050, 453080, 454212, 517544, 411695]
8449D11695R445N4755j2500K6703R1413J5785p3000N0343R6339N1899P3081m0459
8437G55499n2156J64402M8166O6678K1061k560R6694J0484L7798l7516J72324
8426A280874k0564O0912J04202j30837Q3395o6164M4705O0224J51333L623R624
8415A581327J30905J11573p9477J37068Q8411Q5730j6476r3922J04568Q0738j50857
8404A979588p9040k4745k9057j39923M129j01281q8194j14863O0400k92933R7151
8393A271232Q7599p2171m8918J52772j48537l9492N0243r5294R7988o8210q6522
8382A100690q2431p383J4276j42606j34372M3038j16067K1311j07945Q6451j11113
8371E63849Q3394n3409k1458j07614L6489k2290j05302O4672m2220m1101M4186
$$ y = [411695, 421140, 475895, 463395, 490098, 581511, 597296, 524296, 574639, 670978, 722877, 795958, 755499, 703343, 867745, 915911, 982589, 1003650, 1001090, 1097784, 1108268, 1146066, 1108550, 1280874, 1260310, 1321222, 1425424, 1294587, 1377982, 1311818, 1356523, 1416747, 1568080, 1571703, 1581327, 1712232, 1823805, 1744328, 1881396, 1969807, 2055537, 2039061, 1945139, 2049707, 2130445, 1979588, 1900548, 1875803, 1846746, 1706823, 1710952, 1609671, 1521477, 1406614, 1467014, 1174081, 1271232, 1358831, 1286660, 1237742, 1390514, 1241977, 1202485, 1252728, 1157434, 1255422, 1187212, 1100690, 1018259, 1010876, 1025152, 882546, 748174, 791212, 675145, 696456, 588511, 674962, 563849, 647243, 593834, 572376, 464762, 501251, 478961, 373659, 438331, 396111, 355010, 399196]
8360C99196k6302k3977q1144P7610l0933l6298k3566o756m9O1131l1852p3538
8348B03522L3145k087m1962O8352j46270Q7685k8322J03297j18530M2376J32378
8337C33584r8744l0208K3153m2914J13812p3238p6986M0453Q7546j77400J28585
8326B27643k8898l6068J6362P010N3733q5475J04498q1405j8984J28562n0352
8315B36626K5247j30388M4381J6095J03849j08265J00162p781k6P058m4410L603
8303B46151j11182Q5039j4965k0475j6689l7624O5443j5890n6510R3R9883l1957
8291A91317k6318Q1924j03687R6990P7938n5901j6117L9800q4922J8106k0205
8280A98925O7158O5384l603p0628o1891L0138J24326k8355j28152J64846n6378
$$ y = [399196, 372894, 348917, 267773, 345383, 314450, 278152, 254586, 247830, 247781, 308912, 277060, 203522, 236667, 234580, 192618, 260970, 114700, 202385, 174063, 277360, 158830, 201206, 333584, 234840, 204632, 227785, 184871, 298683, 225445, 148459, 188912, 276458, 99058, 227643, 198745, 162677, 179039, 186049, 239782, 154307, 258805, 177400, 158416, 286978, 236626, 261873, 131485, 175866, 191961, 295810, 187545, 287707, 279926, 279900, 286958, 242548, 246151, 134969, 220008, 205043, 184568, 167879, 130255, 195698, 179808, 123298, 123391, 223274, 191317, 164999, 246923, 143236, 240226, 318164, 262263, 246146, 285946, 201024, 219130, 198925, 266083, 331467, 327864, 257236, 195345, 225483, 349809, 321454, 193302, 358148, 301770]
8269C01770r1955Q9355k5089J8020L7530o8757p8446K0124O9307j051L3100n2215
8257B51693J33853n4815o4377O6919N0915k5630m966R0655k1089j4227K01169
8246F10100Q036Q8365P3577j23816P9782l0035l4821N9887n7567k6457l5593p2922
8234E38536M3891J50230o4879J895p6310L9279J33375j66679J52826J00932n5370
8223G97726P6514Q4878J24645J13857K14751J07663L1837J80810J3480K23633
8213A969794P0233o8199O1509k11160Q4216j52808j23163p4242o3328j1514p9286
8202A402052l8780j606j13075J72927K8741J9386L3705O9199N4939M60315n07362
8191A580441N83217M41300k25316N12022K26422O2045K50355Q7997m8868K5323
$$ y = [301770, 209815, 299170, 274081, 292101, 329631, 260874, 182428, 202552, 271859, 270808, 303908, 251693, 385546, 330731, 266354, 333273, 384188, 358558, 353592, 444247, 423158, 408931, 610100, 618136, 706501, 780078, 656262, 736044, 706009, 671188, 731075, 673508, 647051, 611458, 538536, 582427, 732657, 667778, 669673, 593363, 632642, 766017, 599338, 752164, 853096, 797726, 874240, 959118, 1083763, 1197620, 1412371, 1520034, 1551871, 1732681, 1746161, 1969794, 2040027, 1971828, 2033337, 1822177, 1906393, 1753585, 1630422, 1556180, 1492852, 1481338, 1402052, 1363272, 1361666, 1248591, 1421518, 1450259, 1469645, 1503350, 1572549, 1627488, 2087803, 1580441, 2163658, 2604958, 2379642, 2891664, 3118086, 3180131, 3430486, 3518483, 3469615, 3494938]
8181C494938j04100j29459k00431j85944j82545j84990k00105j227l2329k18698
8171B055110j0390j4004K8841k0707N4523J22625k7792J49232J30495M9358K34386
8160B751677K47750K42275J41715J69610J04786J25604q5965m7461j73083k27562
8150C249346j50694k19135k14521j16886j33919j95800o2995k01603J15934k21324
8140A848403R4635j21498k3104j7641R5918L0129j30296J55421L2657J48622L4739
8129B147985R2205O2031P4033J04966j26131o7031n8769k9270j81629j07329o4446
8118A846615j13516j96768j56397Q0426k8589j73045J9565j63281M3761N1353
8108A210124j16780j834J05527p8291O120L7975j5902J08163j00778P2434q0157
$$ y = [3494938, 3390838, 3261379, 3060948, 2875004, 2692459, 2507469, 2307364, 2306137, 2273808, 2055110, 2044720, 2030716, 2059557, 2038850, 2093373, 2215998, 2188206, 2337438, 2467933, 2517291, 2751677, 2999427, 3241702, 3383417, 3553027, 3657813, 3783417, 3697452, 3649991, 3476908, 3249346, 3098652, 2879517, 2664996, 2548110, 2414191, 2218391, 2155396, 1953793, 2069727, 1848403, 1943038, 1821540, 1798436, 1780795, 1876713, 1906842, 1776546, 1931967, 1964624, 2113246, 2147985, 2240190, 2302221, 2376254, 2481220, 2355089, 2288058, 2229289, 2200019, 2018390, 1911061, 1846615, 1733099, 1536331, 1379934, 1460360, 1431771, 1258726, 1278291, 1115010, 1158771, 1210124, 1093344, 1091510, 1197037, 1118746, 1124866, 1162841, 1146939, 1255102, 1154324, 1226758, 1146601]
8097A146601p1912n071l3491K1757j66948J56593r2307j10537k1884M9017m6434
8086H25384l1627n532m2736J1063Q9836r5779L7163p7946o4387K23517k08570
8075F60386L4916P8086p2847j23909l8128J08521N143k8466M8202j2602m544N9893
8063G14651o6583L2726P2581M290p0668K9985J10380n263Q643J19530o4323K18961
8051A104910j70702M5899q888q7840P0123p9379O4861k19M5685R7297j78309P522
8039I10960J38996r6872J89564j11167N3736L7960J10613J43873L531R0753R3457
8028A565404J92795M1335m4000M4424P7246j80794P6411J5335j00224J84962k3082
8017A849812j82108K23410L8100L5149N9607J40079J4235J89071J15393Q7269
$$ y = [1146601, 1074689, 1069618, 1036127, 1057884, 890936, 1047529, 955222, 844685, 822801, 871818, 825384, 793757, 788225, 745489, 756552, 846388, 750609, 787772, 709826, 645439, 868956, 660386, 695302, 773388, 700541, 576632, 538504, 647025, 652168, 623702, 671904, 659302, 654758, 714651, 648068, 680794, 753375, 757665, 686997, 716982, 827362, 822099, 830742, 950272, 885949, 1104910, 934208, 980107, 971219, 883379, 953502, 874123, 938984, 938765, 984450, 1081747, 903438, 910960, 1049956, 953084, 1142648, 1031481, 1085217, 1123177, 1233790, 1377663, 1381194, 1471947, 1565404, 1758199, 1799534, 1755534, 1799958, 1877204, 1696410, 1772821, 1788156, 1687932, 1872894, 1849812, 1667704, 1891114, 1929214, 1964363, 2023970, 2164049, 2178284, 2367355, 2482748, 2570017]
8007B570017J44096J62455L07500J75496J94004K71958K20460R7190K97407j25157
7997D315426J00656P4424Q6002j26778K02272R8531K14211J04154Q5016J31252
7987E285166N6993J69813J05641J72159K63185K33183K62489L61618K27619L44956
7977G482822K81473J74781K36100k8218K9416j29831j14685p4323r7739l4777
7967G725019Q166q4866K9563r9310l0287j16636j16430r7199l1305p4218L7303
7956G149800J23831j7423K56669p8321J12125o2882n1713m7962k92777k90961
7946F800386k21315l32952k42952k92763j44910k15014j57026j42372k07912k14450
7936D628720j12136j85187j17007q7994k15300j2148l41542j40959O254K8851
$$ y = [2570017, 2714113, 2876568, 3184068, 3359564, 3553568, 3825526, 4045986, 4143176, 4440583, 4315426, 4416082, 4490506, 4576508, 4449730, 4652002, 4750533, 4964744, 5068898, 5153914, 5285166, 5342159, 5511972, 5617613, 5789772, 6052957, 6286140, 6548629, 6910247, 7137866, 7482822, 7764295, 7939076, 8175176, 8146958, 8176374, 8046543, 7931858, 7857535, 7759796, 7725019, 7733185, 7648319, 7677882, 7578572, 7548285, 7431649, 7315219, 7218020, 7186715, 7112497, 7149800, 7273631, 7256208, 7512877, 7434556, 7546681, 7483799, 7432086, 7384124, 7091347, 6800386, 6579071, 6246119, 6003167, 5710404, 5565494, 5350480, 5193454, 5051082, 4843170, 4628720, 4516584, 4331397, 4214390, 4126396, 3911096, 3898948, 3557406, 3416447, 3422701, 3451552]
7926C451552q1640j77043j76101K0957k12471j69087j04930k07222j03769p2786
7916B167460k42870m1513k8701j00571j30644j77j2998p3955j29928M8835k59704
7905A195234J02904O8360j10899r5497O0776K6421o3092j27901J77369j88344
7895A045331P8476j46302N326n9069o769l0678p0033J7786p8242J31557n3961
7884H33422o2240j02110N0956N8570k9944j11924k793m2126M7619q2748P2507
7873F29189m5573N0931j47336M7032K0174p0065P8143k9202j60113J02199Q0319
7862E55698j66150L8993O281l4282n5901j84216l48237Q07514j29342j354p9902
7851D09102o5525m711j1562p1456R7148Q226m0527l4886n8893Q3531J3435K2659
$$ y = [3451552, 3369912, 3192869, 3016768, 3037725, 2825254, 2656167, 2551237, 2344015, 2240246, 2167460, 1924590, 1883077, 1854376, 1753805, 1623161, 1622984, 1609986, 1536031, 1406103, 1454938, 1195234, 1298138, 1366498, 1255599, 1160102, 1220878, 1247299, 1184207, 1056306, 1233675, 1045331, 1123807, 977505, 982831, 923762, 916993, 886315, 816282, 834068, 755826, 887383, 833422, 771182, 669072, 720028, 778598, 748654, 636730, 633937, 591811, 639430, 556682, 629189, 583616, 634547, 487211, 534243, 554417, 484352, 562495, 533293, 373180, 475379, 555698, 389548, 428541, 434822, 400540, 344639, 160423, -187814, 619700, 490358, 489004, 409102, 343577, 338866, 327304, 255848, 352996, 361222, 320695, 285809, 226916, 310447, 323882, 346541]
7839C46541N66l3613K5215l4459o1040K4687l0380j7278L2520j7379j13682R5777
7827B17475L0920M0610m7064m5632R094O4298J1929p4767M0787l9512j7932o1192
7815A29014J01909j08802K9051O3067q3016L1400L7421l8274L2932l1651r9472
7804F3579J40173n7469m1313M7085o4159O5183M3919M4701l0093m3485N2044p6432
7792A43733J3897n9489P4515j6538p4629O2179N8592p265l0079p4419M1914Q0012
7780B12423j9530k2615m624N8400J9450n4537l7333l5209J15485q9696P7096r5920
7768A23390L8934q723N9587j17778P1673J4376K101K3650O1287j70905J08028
7757B05620R317o8819M3472n4810J02530n5753j9045P571L732M8136k14452R5053
$$ y = [346541, 347107, 313494, 338709, 304250, 243210, 267897, 237517, 220239, 252759, 235380, 121698, 217475, 248395, 289005, 241941, 196309, 205403, 269701, 281630, 206863, 247650, 208138, 190206, 129014, 230923, 122121, 151172, 214239, 131223, 162623, 200044, 161770, 194702, 163051, 63579, 203752, 146283, 104970, 152055, 87896, 153079, 196998, 241699, 211606, 168121, 220165, 143733, 157630, 98141, 172656, 156118, 81489, 143668, 202260, 194995, 164916, 90497, 132411, 212423, 192893, 170278, 165654, 224054, 243504, 188967, 151634, 116425, 231910, 142214, 219310, 123390, 162324, 153601, 213188, 95410, 167083, 181459, 183560, 207210, 268497, 97592, 205620, 214937, 146118, 189590, 134780, 237310, 181557, 162512, 170083, 173815, 221951, 7499, 102552]
7745A02552J08947k3390O5872j84746O4411R2319j02706R7012R6796j25917l0652
7734A60498n714J4092k9186n1831K06071q8940p9522n015L7458R630O312M6416
7722B20269m2094K0140O0432k3002j50684L5900M7999j4032K7318o1945L7434
7711A57735J5306k3334p6475J25537L1463l5163j14603J01927P0768r6597j5668
7700A40896J1611l3082k7414N0640l0529j7970Q1903r4696M6968o2058Q178R2961
7688A67408j3501r6514J31009o9934o114o0284M3725J4099L146P4879n1792K3508
7676A59635K4475j22212O231O1171L619O4598j18383N7354l4554j1096M0062M0500
7664A71400n8661o65R3968m9319r5770J10920j5668P3197j52547N2130l1040M2582
$$ y = [102552, 211499, 188109, 253981, 69235, 133646, 225965, 123259, 220271, 317067, 191150, 160498, 154784, 168876, 139690, 87859, 293930, 204990, 125468, 120453, 157911, 167541, 173853, 220269, 178175, 198315, 258747, 235745, 85061, 120961, 168960, 154928, 182246, 120301, 157735, 173041, 149707, 73232, 198769, 230232, 195069, 80466, 182393, 253161, 156564, 140896, 152507, 119425, 92011, 142651, 112122, 94152, 176055, 81359, 128327, 66269, 74447, 167408, 153907, 57393, 188402, 118468, 112354, 52070, 95795, 109894, 113040, 187919, 136127, 159635, 184110, 61898, 68129, 129300, 132919, 197517, 79134, 136488, 101934, 90838, 130900, 171400, 112739, 112074, 206042, 156723, 60953, 171873, 156205, 229402, 76855, 128985, 97945, 140527]
7652A40527q3900O3195J0364P9055n3438r6111R8304k0298o1239M4520k4462k7732
7640F8785J03858n6842m0820J863j6955J24824k8638j30256O204J17658k5961
7629A23720l4337J7857n2229J39699n9374J6300p3840O2266l1087k3165J0176
7618I5986j314J20741M261o3715Q859K6177r3214M923l8560J15843l7027K4141
7606A67101L026l2672k6274N1551k0024J8417j09645P3946M5547q2719L8600L1734
7594A58588J4797P5188j27081K2201M7501o2740j2920N9402P1552n5698Q2701
7583B73491r6260Q6820q9540m1914J03730N0655j12679J71416K4030n7821K6458
7572C38386o426M8520q0561J45748n8195N33L7780j19641l6466J01154O9732p0780
$$ y = [140527, 56627, 119822, 130186, 209241, 155803, 59692, 157996, 137698, 76459, 120979, 96517, 68785, 172643, 115801, 74981, 76844, 59889, 184713, 156075, 25819, 32023, 149681, 123720, 89383, 107240, 55011, 194710, 135336, 151636, 77796, 140062, 108975, 85810, 95986, 94672, 215413, 219674, 155959, 164818, 190995, 97781, 102704, 64144, 179987, 142960, 167101, 170127, 137455, 111181, 162732, 142708, 161125, 51480, 125426, 170973, 88254, 126854, 158588, 173385, 248573, 121492, 143693, 191194, 128454, 115534, 174936, 246488, 190790, 273491, 177231, 264051, 174511, 132597, 236327, 286982, 174303, 345719, 369749, 311928, 338386, 331960, 380480, 299919, 445667, 387472, 388005, 425785, 306144, 269678, 370832, 440564, 369784]
7560C69784J1460O260k9237l6661L2065O1222l4168P5133L978n5197O2969k252
7548D65356J1242m4602L149M9728J02649J77207r1587R8656K4453O2452L1447
7537H90150p4160j75723J11689m0734L2631n9161j8283M9129K0080n1180J30626
7526H15064J0697Q1825k969m8433P9723Q2642J4388k4333J32406J02095K01353
7515A444458R498J32782P3718O9358M2949j49954J5406k71850M5601r7343k29689
7504A084934j33606p4500m2876r0462l6236n6386K2031j4748j40749m2043N7826
7493E33185L3768r7874N510K4843p4365L9440r4042O7730n2628L7833J5926k1482
7481D17844O9719r3175Q3371m6935j9708K564K2418Q55J6443r6128k697O1383
$$ y = [369784, 381244, 387504, 358267, 321606, 353671, 414893, 380725, 455858, 459836, 404639, 467608, 465356, 476598, 431996, 435145, 484873, 587522, 764729, 673142, 771798, 796251, 858703, 890150, 815990, 640267, 751956, 711222, 743853, 684692, 666409, 715538, 735618, 684438, 815064, 825761, 907586, 904617, 856184, 935907, 1018549, 1032937, 1008604, 1141010, 1243105, 1444458, 1453956, 1586738, 1660456, 1729814, 1772763, 1622809, 1638215, 1366365, 1411966, 1314623, 1084934, 951328, 876828, 833952, 743490, 707254, 650868, 672899, 658151, 517402, 475359, 533185, 566953, 469079, 474589, 499432, 425067, 464507, 370465, 438195, 385567, 423400, 439326, 417844, 487563, 394388, 477759, 430824, 411116, 413680, 436098, 436953, 453396, 357268, 354571, 415954]
7469D15954R498r4686k4814M4933j20436J48157j19730Q3326r1328J2491K0872
7458B84237l1943N1482M6757J8485j7980p4946J6878j6143k5589M5166J08269
7447D04673m9725j26959k3101P9069K3013q2934k3532O1996j19109K19276j45205
7436B17462K8218j36565Q5825o3693R6523m1425J33878l8707m6690l156m4499
7425A87171J1856J6327J2048p1185J25445j04229O3415P2258K6288n5152O4798
7414C49040j26617J0877M2861J8396j4728j6906K4772q8924O4640n2698K5386
7403B36099L210O6438J115Q6201L6448j33001R702k0725J7131J8152k2032k3493
7391B75245m6984J07057N006l7588p4493J0769j70489L24825j68460J24401j36720
$$ y = [415954, 425452, 330766, 305952, 350885, 230449, 378606, 258876, 342202, 250874, 263365, 284237, 252294, 303776, 350533, 369018, 351038, 276092, 292970, 276827, 251238, 296404, 404673, 354948, 227989, 204888, 283957, 306970, 224036, 200504, 262500, 143391, 362667, 217462, 245680, 109115, 194940, 131247, 227770, 186345, 320223, 281516, 234826, 231670, 187171, 199027, 215354, 227402, 156217, 281662, 177433, 240848, 313106, 339394, 284242, 349040, 222423, 233300, 276161, 294557, 279829, 262923, 287695, 198771, 263411, 210713, 236099, 239309, 305747, 306862, 393063, 429511, 296510, 306212, 285487, 302618, 320770, 298738, 275245, 228261, 335318, 340324, 302736, 228243, 239012, 68523, 393348, 224888, 349289, 212569]
7380B12569P1753n6815J34292p079P3197K9928k9336L8900n9128N9105q3895j2299
7368C71192j00437O3525p2484M2118q1557K8709m5640N0636o8848m0306N9365
7357B06273k8981N3025q9930N0305L368M7215o3506o0045j1230J74331j41381
7346A39444J10728k7242j5782O8247p4051J145Q6572j37940K5308r153K4712j29200
7334F2788J39675r6919J2428O9359j301l1227J7230M9773j12651L0507p1055O7829
7322A36436k675l5057M5581p4033N201O7002M774j3026k6639m7135J2706P5113
7310A48248q1952j5185J1019Q3024L447m3560n629k2099J4409m9450J22419o6415
7298I8276o0489n4447M6885R7848j5917j0188k2744L3009o891M5584n6334M2665
$$ y = [212569, 284322, 227507, 361799, 354720, 427917, 457845, 428509, 467409, 408281, 467386, 383491, 371192, 270755, 334280, 261796, 303914, 222357, 251066, 205426, 256062, 187214, 146908, 206273, 177292, 230317, 140387, 190692, 194060, 241275, 177769, 117724, 106494, 280825, 139444, 250172, 222930, 207148, 275395, 201344, 202489, 289061, 151121, 176429, 167276, 191988, 62788, 202463, 105544, 117972, 187331, 186030, 154803, 172033, 221806, 109155, 139662, 68607, 136436, 133761, 98704, 144285, 70252, 75453, 142455, 147229, 134203, 107564, 60429, 73135, 148248, 66296, 51111, 62130, 145154, 148601, 105041, 99412, 77313, 91722, 42272, 164691, 98276, 37787, -16660, 30225, 128073, 112156, 101968, 79224, 112233, 105342, 150926, 94592, 137257]
7286A37257J816m2198m8239L0909N7280n8740O360N6524n3216J06041j42463K3090
7274G4421L6615l0276J2630M1901O9880m8607r3979K9430P6908K9078j30561J1931
7262G9371J39742J4397J4301p3027k1663r233J4132O9842r670p8724J06261Q339
7250B54068P970l9117L5791j6508n700Q081k4226J16930k1005n5149K2515n3350
7238B30300J2016M8867J8485k7329O3057j06068J71022r4317M7088k1049J5166
7227C57238j02364L3211J07337j52865J35241M0146l1407Q704P133J12243r0195
7216D24422N8013J9861j56722m2113J78090l8135j14589k6155K0977J2232J41316
7205D77197j21285l5630K861j70472J89647j6981K750k0923N0406j7575K8871
$$ y = [137257, 139073, 96875, 48636, 79545, 136825, 78085, 84445, 140969, 87753, 193794, 51331, 74421, 111036, 80760, 93390, 135291, 205171, 156564, 62585, 92015, 168923, 198001, 67440, 79371, 219113, 233510, 247811, 174784, 153121, 143888, 158020, 227862, 218192, 139468, 245729, 254068, 262038, 222921, 258712, 242204, 236504, 244585, 220359, 337289, 316284, 261135, 283650, 230300, 242316, 291183, 309668, 282339, 345396, 239328, 410350, 316033, 363121, 342072, 357238, 254874, 288085, 395422, 242557, 377798, 417944, 386537, 395241, 402374, 514617, 424422, 482435, 502296, 345574, 303461, 481551, 443416, 328827, 302672, 323649, 335881, 477197, 355912, 320282, 323143, 152671, 342318, 325337, 328087, 307164, 357570, 339995, 368866]
7194C68866n6173M4031k1315P8189o4291J4677M182r6884n4509L443N5532m10
7182B75338K7323l7010J5943n5967M2698p4290M4266J3955m3223j5552J14919
7171C08400j09868L986n6756M9434M5115n457j57115R3707J56661j39884N4648
7160B42871q1618L0651m5323O1026l4824p5652J16569m9570M1212k07187J06680
7149A04835k5857O252L1298M512n1279k1874O4598j7289o3514K8646n2001P9371
7137H7698k9899N3565l9283q2110L7678k228L105j866J1265K2342K9459j6344
7125G3382n1390R3382m6401j12454L6100R5893o6935O087k376r9170J20324n0913
7113d471m873P2255p3988J12716j03980q638P129L9243K0535j17270R0153m1674
$$ y = [368866, 312693, 356724, 335409, 413598, 349307, 363984, 368166, 271282, 216773, 220216, 275748, 275338, 302661, 265651, 281594, 225627, 268325, 194035, 238301, 252256, 209033, 193481, 308400, 198532, 202518, 145762, 195196, 240311, 234854, 77739, 171446, 328107, 188223, 242871, 161253, 191904, 146581, 207607, 172783, 97131, 213700, 164130, 205342, -1845, 104835, 78978, 85230, 116528, 121040, 69761, 47887, 112485, 95196, 31682, 60328, 8327, 87698, 57799, 111364, 72081, -10029, 27649, 25421, 28526, 26660, 37925, 60267, 89726, 73382, 21992, 115374, 68973, -43481, -7381, 88512, 21577, 27664, 25288, -73882, 46442, -4471, -9344, 62911, -11077, 101639, -2341, -10979, -3850, 35393, 55928, -61342, 28811, -12863]
7101a2863p71K8776o4601N3871q266J0700O2523p9406j073n9009O383J22778j31196
7088g2154N9193L2488r4828R0800j4727J842k0189M4830n5122L1536N7686j33911
7076g2556J02555n3965J5293O2420q6846N3616q519l409k8425n1805K9833m3312
7064h5120J08647o4774P478n4714N5484m8533K4561J05720r3431J9577k4854k7041
7052g7000O168M2854n5314J12853m5429j8103O1054n3996K7776J9498k5778l6783
7040d2200L6658m5443M941K8638oN7126j46801L1948k954l3080J10378k6023J6519
7027a0299J6310p4698R8201K4654Q692j16577O2162j62478Q8133N9161L4329j06757
7015g9167K6823m6488L6531J5805q5361Q8482l1861k2427j7926o34Q956K1173
$$ y = [-12863, -13634, 15142, -49459, 4412, -3854, 6846, 69369, -10037, -11110, -70119, -63736, 59042, -72154, -12961, 19527, -75301, 15499, 772, 2614, -17575, 27255, -27867, 3669, 61355, -72556, 29999, -23966, -8673, 53747, -33099, 20517, 11998, 8589, -19836, -71641, -41808, -85120, 23527, -41247, -33769, -88483, -32999, -81532, -56971, 48749, -44682, -25105, -49959, -77000, -70832, -27978, -83292, 29561, -15868, -33971, 27083, -26913, 863, 20361, -5417, -42200, -5542, -50985, -46044, -17406, -17412, 39714, -107087, -75139, -78093, -111173, -795, -26818, -10299, 6011, -68687, 29514, 54168, 62860, -53717, 8445, -154033, -65900, -6739, 27590, -79167, -52344, -98832, -62301, -46496, -131857, -43375, -75236, -97663, -115589, -116223, -107267, -86094]
7003h6094J9202P5094o8398P872J3098m0747k9117Q7990J7555j7732o9153J26005
6991C5575n0301m7391P9172p3772M8420l8406p3912R6709j09178J01816m0508
6980g1776M5790K03K1259R643j8240J3693k0133o149N1930j13531O0557j05750
6968a32504J00442r296l0697n0155J25513j5723m5187j747J9635K6504n0063n6309
6956a19587J06940k4776l5719M4846m6554Q5868m3343J8423j14632J07657O7855
6945D6978p8047P8108p4311M9017o4672n490O370J3813l5353L9630n5061L5971
6933d3047p3414J36212M133j01683P2945L4252j45598Q6796q155M7274j11682
6922a01967K946Q59O13l7643J18891K1548m9354q496K9333r4943J0741O6061q029
$$ y = [-86094, -66892, 8202, -60196, -52324, -39226, -79973, -109090, -21100, -3545, -21277, -90430, 35575, -14726, -62117, 17055, -56717, -8297, -46703, -120615, -23906, -133084, -31268, -71776, -25986, -25783, -4524, 5119, -13121, 572, -19561, -25710, 26220, -87311, -26754, -132504, -32062, -41358, -72055, -122210, 3303, -12420, -57607, -59354, -39719, -13215, -63278, -119587, -12647, -37423, -73142, -28296, -74850, 11018, -32325, -13902, -128534, -20877, 46978, -31069, 47039, -27272, 21745, -42927, -48417, -42047, -28234, -63587, -23957, -79018, -43047, -116461, 19751, 23884, -77799, -4854, 29398, -116200, -29404, -37559, 9715, -101967, -99021, -98162, -97549, -135192, -16301, 5247, -44107, -52603, -23270, -118213, -107472, -41411, -49440]
6909d9440J1823k5551l1647P317M3812n128j7624Q5362j55820J02772j2319J2574
6897c3869j403o9315Q2728K0376k4658j00595J11785l2952k7480K2954j5380k4448
6885i2257J11223r7042M0396J51008k71334N2866J05785j5523q9290P0965l5085
6874f8288O0213j9623k5532O3849q2278N6395K126O302q3013Q6619o5214K4981
6862d3463n4852M3505m3072O8204R280k3731K0087j05481P3149j4609o677j1793
6850h9453o2846J30494o2275N6920k5931o5364J7630Q2995J11794m0017p2833
6839a8886L7263j60312Q4523k2114K1371o9776M0784l5757J04515q3677L1762
6828g0304J06238k7589q2375n7963N9081O1285q5327R8691m6749m0857J12257
$$ y = [-49440, -37617, -63168, -94815, -87498, -43686, -48814, -66438, 18924, -136896, -34124, -46443, -33869, -35272, -104587, -21859, -1483, -26141, -126736, -14951, -47903, -75383, -52429, -67809, -92257, 18966, -78076, -37680, 113328, -158006, -105140, 645, -14878, -104168, -33203, -68288, -8075, -27698, -53230, 10619, -71659, -15264, -13138, -6836, -89849, -3230, -68444, -43463, -98315, -54810, -97882, -29678, -20398, -44129, -24042, -129523, -56374, -70983, -77660, -89453, -152299, -21805, -84080, -27160, -53091, -118455, -100825, -17830, 93964, 53947, -18886, 18377, -141935, -57412, -79526, -58155, -127931, -87147, -122904, -18389, -102066, -70304, 35934, 8345, -74030, -131993, -72912, -11627, -96954, 1737, -45012, -85869, 26388]
6817B6388r8677R5377o3340n1099j9035k030N5819J03387j10627j5974n7583J96096
6805E8702q124j57591Q9986k0617r6875L3666q124j4205K02305n1915r6463R2345
6793B3090p1281L4205J9030q3433j6803k014P0132l2608P9329k6897n0399R6781
6781C9132n3907l9326m7972J56595n2820q4909P789R011J04828k0348k1350o5468
6769f8745k6830L3543N0756j01569L0184N967j8528Q441J05375j25893J61941
6758E4642m8511o6362m29J34j9416J15157m8032r5871J34318M3779m0046L1444
6746F0807K3833M3420j16681L5241L3677o5791n6486N4176o0519K0659K9497q9571
6734h7738l1583J55627r5499P2458j13789O7908j6690Q7624j46986K37R6685M5178
$$ y = [26388, -72289, 23088, -40252, -91351, -110386, -112416, -56597, 46790, -63837, -79811, -137394, 58702, 50578, -107013, -17027, -37644, -134519, -100853, -108977, -123182, 79123, 27208, -69255, 23090, -48191, -13986, 5044, -78389, -95192, -97206, -27074, -59682, 19647, -7250, -57649, 39132, -14775, -54101, -102073, 54522, 1702, -83207, -75418, -66407, 38421, 18073, -3277, -68745, -95575, -62032, -11276, -112845, -82661, -76694, -95222, -86781, 18594, -107299, 54642, 6131, -60231, -60660, -60526, -79942, 35215, -12817, -108688, 25630, 69409, 29363, 60807, 84640, 128060, 11379, 46620, 80297, 14506, -41980, 12196, -48323, -27664, 1833, -87738, -119321, 36306, -59193, 13265, -100524, -32616, -49306, 38318, -108668, -108431, -11746, 33432]
6722C3432n0965O3143r4612J23390l9189r1816J20890j76564R3829O681k6400
6711c8181J2821L3148n3048M3958l4354k8555J08896n3315r4445L0224Q0354O9773
6699G7276j30545p23N133P5872m230J6945j04810O9423l425k3760k2352M2515
6687b681k9048j7763O5493K953K777J9571k7701N1450n1846J1513n7202n0259
6675h2743N6077P5369l9952n2258P1619R860j11415Q3932J0090r6552J12323j10870
$$ y = [33432, -17533, 45610, -49002, 74388, 35199, -56617, 64273, -112291, -18462, -11781, -38181, -25360, 7788, -45260, -1302, -35656, -64211, 44685, -8630, -103075, -72851, 7503, 77276, -53269, -53992, -48859, 27013, 22783, 39728, -65082, 4341, 916, -22844, -45196, -2681, -31729, -49492, 16001, 18954, 21731, 41302, 13601, 65051, 13205, 24718, -32484, -82743, -26666, 48703, 8751, -43507, 28112, 37972, -73443, 10489, 20579, -75973, 36350, -74520]
$$ [...]
##END NTUPLES=NMR SPECTRUM
##END=
