##TITLE=abcd
##JCAMPDX= 6.0         $$ Bruker NMR JCAMP-DX V2.0
##DATA TYPE= NMR SPECTRUM
##DATA CLASS= NTUPLES
##ORIGIN= UXNMR, Bruker Analytische Messtechnik GmbH
##OWNER= root
$$ XWIN-NMR		Version 3.5
$$ Fri Jul 31 16:49:11 2026 Russian Standard Time (UT+4h)  servis@DPX200
##.OBSERVE FREQUENCY= 200.131235884673
##.OBSERVE NUCLEUS= ^1H
##.ACQUISITION MODE= SIMULTANEOUS
##.ACQUISITION SCHEME= undefined
##.AVERAGES= 32
##.DIGITISER RES= 18
##SPECTROMETER/DATA SYSTEM= spect
##.PULSE SEQUENCE= zg
##.SOLVENT NAME= MeOD
##.SHIFT REFERENCE= (INTERNAL, MeOD, 0, 16.4885)
##AUDIT TRAIL= $$ (NUMBER, WHEN, WHO, WHERE, WHAT)
$$ ##TITLE= Audit trail, XWIN-NMR		Version 3.5
$$ ##JCAMPDX= 5.01
$$ ##ORIGIN= Bruker BioSpin GmbH
$$ ##OWNER= servis
$$ F:\spectra/data/av/nmr/H1/1/pdata/1/auditp.txt
$$ ##AUDIT TRAIL=  $$ (NUMBER, WHEN, WHO, WHERE, WHAT)
(   1,<2026-07-31 16:47:15.09 +0400>,<servis>,<DPX200>,
      <created by zg, POWCHK disabled, PULCHK disabled
       configuration hash MD5:
       00 E9 B6 7A A2 85 ED C7 34 08 36 98 17 FE 4E 26
       data hash MD5: 32K
       EB 47 45 3F 85 67 6A C4 70 A9 7C E9 F2 49 F4 3A>)
(   2,<2026-07-31 16:48:34.09 +0400>,<servis>,<DPX200>,
      <Start of raw data processing
       efp BC_mod = 2 LB = 0.05 FT_mod = 6 PKNL = 1 PHC0 = -414.9518 PHC1 = 3.101563 SI = 16K 
       data hash MD5: 16K
       6F F9 0C 73 BD 04 88 0E 0A 49 5F FC 17 BC 86 0C>)
(   3,<2026-07-31 16:48:48.46 +0400>,<servis>,<DPX200>,
      <pk PHC0 = -2 PHC1 = 0 
       data hash MD5: 16K
       B0 41 10 3D 14 73 AF 6E 10 18 81 F4 19 E2 34 FC>)
$$ ##END=
$$ 
$$ hash MD5
$$ F1 A9 92 0E 99 EF 0F 16 EA 6C 44 80 60 F5 98 81
##$RELAX= 
##$RELAX= 
##$RELAX= 
##$RELAX= 
##$RELAX= 
##$RELAX= 
##$RELAX= 
##$RELAX= 
$$ Bruker specific parameters
$$ --------------------------
##$DU= <F:\spectra>
##$EXPNO= 1
##$NAME= <H1>
##$PROCNO= 1
##$TYPE= <nmr>
##$USER= <av>
##$AMP= (0..31)
100 100 100 100 100 100 100 100 100 100 100 100 100 100 100 100 100 100 
100 100 100 100 100 100 100 100 100 100 100 100 100 100 
##$AQSEQ= 0
##$AQ_mod= 1
##$AUNM= <au_zg>
##$AUTOPOS= <>
##$BF1= 200.13
##$BF2= 200.13
##$BF3= 200.13
##$BF4= 200.13
##$BF5= 500.13
##$BF6= 500.13
##$BF7= 500.13
##$BF8= 500.13
##$BYTORDA= 1
##$CFDGTYP= 0
##$CFRGTYP= 5
##$CHEMSTR= <none>
##$CNST= (0..31)
1 1 145 1 1 1 1 1 1 1 1 1 1 1 1 1 1 1 1 1 1 1 1 1 1 1 1 1 1 1 1 1 
##$CPDPRG= <>
##$CPDPRG1= <>
##$CPDPRG2= <>
##$CPDPRG3= <>
##$CPDPRG4= <mlev>
##$CPDPRG5= <mlev>
##$CPDPRG6= <mlev>
##$CPDPRG7= <mlev>
##$CPDPRG8= <mlev>
##$CPDPRGB= <>
##$CPDPRGT= <>
##$D= (0..31)
0 10 0 0 0 0 0 0 0 0.06 0 0 0 0 0 0 0.0002 0 0 0 0 0 0 0 0 0 0 0 0 0 0 
0 
##$DATE= 1785502034
##$DBL= (0..7)
120 120 120 120 120 120 120 120 
##$DBP= (0..7)
150 150 150 150 150 150 150 150 
##$DBP07= 0
##$DBPNAM0= <>
##$DBPNAM1= <>
##$DBPNAM2= <>
##$DBPNAM3= <>
##$DBPNAM4= <>
##$DBPNAM5= <>
##$DBPNAM6= <>
##$DBPNAM7= <>
##$DBPOAL= (0..7)
0.5 0.5 0.5 0.5 0.5 0.5 0.5 0.5 
##$DBPOFFS= (0..7)
0 0 0 0 0 0 0 0 
##$DE= 6
##$DECBNUC= <off>
##$DECIM= 32
$$ [...]
##$SUBNAM4= <"">
##$SUBNAM5= <"">
##$SUBNAM6= <"">
##$SUBNAM7= <"">
##$SUBNAM8= <"">
##$SUBNAM9= <"">
##$SW= 20.6817932712277
##$SWIBOX= (0..15)
0 0 3 0 0 0 0 0 0 0 0 0 0 0 0 0 
##$SW_h= 4139.07284768212
##$TD= 32768
##$TD0= 1
##$TE= 0
##$TE2= 300
##$TE3= 300
##$TEG= 300
##$TL= (0..7)
0 120 120 120 120 120 120 120 
##$TP= (0..7)
150 150 150 150 150 150 150 150 
##$TP07= 0
##$TPNAME0= <>
##$TPNAME1= <>
##$TPNAME2= <>
##$TPNAME3= <>
##$TPNAME4= <>
##$TPNAME5= <>
##$TPNAME6= <>
##$TPNAME7= <>
##$TPOAL= (0..7)
0.5 0.5 0.5 0.5 0.5 0.5 0.5 0.5 
##$TPOFFS= (0..7)
0 0 0 0 0 0 0 0 
##$TUNHIN= 0
##$TUNHOUT= 0
##$TUNXOUT= 0
##$USERA1= <user>
##$USERA2= <user>
##$USERA3= <user>
##$USERA4= <user>
##$USERA5= <user>
##$V9= 5
##$VALIST= <valist>
##$VCLIST= <CCCCCCCCCCCCCCC>
##$VD= 0
##$VDLIST= <DDDDDDDDDDDDDDD>
##$VPLIST= <PPPPPPPPPPPPPPP>
##$VTLIST= <TTTTTTTTTTTTTTT>
##$WBST= 1024
##$WBSW= 30
##$XGAIN= (0..3)
0 0 0 0 
##$XL= 0
##$YL= 0
##$YMAX_a= 1693922
##$YMIN_a= -2215012
##$ZGOPTNS= <>
##$ZL1= 120
##$ZL2= 120
##$ZL3= 120
##$ZL4= 120
##$ABSF1= 0
##$ABSF2= 0
##$ABSG= 0
##$ABSL= 0
##$ALPHA= 0
##$AQORDER= 0
##$ASSFAC= 0
##$ASSFACI= 0
##$ASSFACX= 0
##$ASSWID= 0
##$AUNMP= <proc_1d>
##$AZFE= 0.1
##$AZFW= 0.1
##$BCFW= 0
##$BC_mod= 2
##$BYTORDP= 0
##$COROFFS= 0
##$CY= 18.4799938201904
##$DATMOD= 1
##$DC= 0
##$DFILT= <>
##$DTYPP= 0
##$F1P= 9.9274215381318
##$F2P= -0.165520771350173
##$FCOR= 1
##$FTSIZE= 16384
##$FT_mod= 6
##$GAMMA= 0
##$GB= 0
##$INTBC= 1
##$INTSCL= 4.127829e-11
##$ISEN= 128
##$LB= 0.05
##$LEV0= 0
##$LPBIN= 0
##$MAXI= 10000
##$MC2= 0
##$MEAN= 0
##$ME_mod= 0
##$MI= 50
##$NCOEF= 0
##$NC_proc= -2
##$NLEV= 6
##$NOISF1= 3.799351
##$NOISF2= 2.8
##$NSP= 0
##$NTH_PI= 0
##$NZP= 0
##$OFFSET= 16.48848
##$PC= 4
##$PHC0= -416.9518
##$PHC1= 3.101563
##$PH_mod= 1
##$PKNL= yes
##$PPARMOD= 0
##$PSCAL= 4
##$PSIGN= 0
##$REVERSE= no
##$SF= 200.130005582386
##$SI= 16384
##$SIGF1= 3
##$SIGF2= 2
##$SINO= 400
##$SIOLD= 16384
##$SREGLST= <1H.CDCl3>
##$SSB= 0
##$STSI= 16384
##$STSR= 0
##$SW_p= 4139.07284768211
##$SYMM= 0
##$S_DEV= 0
##$TDeff= 32768
##$TDoff= 0
##$TI= <>
##$TILT= no
##$TM1= 0
##$TM2= 0
##$TOPLEV= 0
##$USERP1= <user>
##$USERP2= <user>
##$USERP3= <user>
##$USERP4= <user>
##$USERP5= <user>
##$WDW= 1
##$XDIM= 16384
##$YMAX_p= 352545050
##$YMIN_p= -190002
$$ End of Bruker specific parameters
$$ ---------------------------------
##NTUPLES= NMR SPECTRUM
##VAR_NAME=  FREQUENCY,     SPECTRUM/REAL,   SPECTRUM/IMAG
##SYMBOL=    X,             R,               I
##VAR_TYPE=  INDEPENDENT,   DEPENDENT,       DEPENDENT
##VAR_FORM=  AFFN,          ASDF,            ASDF
##VAR_DIM=   16384,         16384,           16384
##UNITS=     HZ,            ARBITRARY UNITS, ARBITRARY UNITS
##FACTOR=    0.252644378177508, 1,           1
##FIRST=     3299.83951724647, 0,            0
##LAST=      -839.233330435636, 0,           0
##MIN=       -839.233330435636, -190002,     0
##MAX=       3299.83951724647, 352545050,    0
$$ Real data points
##PAGE= N=1
##DATA TABLE= (X++(R..R)), XYDATA
$$ [...]
10841i1540J715q257L671K745j4066N981J0135j2173j9203K4355j1976l539o394
$$ -91540 -89825 -98082 -94411 -91666 -105732 -99751 -89616 -101789 -120992 -96637 -108613 -112152 -118546
10828a18546r035L1792k631J2555j2894J3160l562K0728j9988N647j6405m792
$$ -118546 -127581 -95789 -98420 -85865 -98759 -85599 -89161 -68433 -88421 -82774 -99179 -103971
10816a03971J1562n970j6912K1754o959O025L94l510J8790k5464j237J9437k1343
$$ -103971 -92409 -98379 -115291 -93537 -100496 -94471 -94077 -97587 -78797 -104261 -105498 -86061 -107404
10803a07404L734N160o621j253J3191Q538k8846M195J5441m405q838Q82J5038
$$ -107404 -103670 -98510 -105131 -106384 -93193 -84655 -113501 -109306 -93865 -98270 -107108 -106226 -91188
10790i1188J448m923r691R08o098J0246n711k309o9K4584j4992P226r763j861
$$ -91188 -89740 -94663 -104354 -103446 -109544 -99298 -105009 -107318 -107387 -82803 -97795 -90569 -100332 -102193
10776a02193Q568o191J159o339K2714j3804q934O542j1961o22K1496k3j1830J3730
$$ -102193 -93625 -99816 -98657 -104996 -82282 -96086 -105020 -98478 -110439 -111061 -89565 -89588 -101418 -87688
10762h7688N061j9417l851J4657r268O900j7333J7576j6854M34J0514P996j1259
$$ -87688 -82627 -102044 -105895 -91238 -100506 -93606 -110939 -93363 -110217 -109783 -99269 -91273 -102532
10749a02532N083J0793L828k9826J7304J5163j3419k102j8279K2463p423J474
$$ -102532 -97449 -86656 -82828 -112654 -95350 -80187 -93606 -95708 -113987 -91524 -98947 -97473
10737i7473n6k814J5080M753j5143J5150j6936J4451j744q909r145q317J8744
$$ -97473 -97529 -100343 -85263 -80510 -95653 -80503 -97439 -82988 -84732 -93641 -102786 -111103 -92359
10724i2359k4108J7213Q479Q117J806j286m418o006l085P659k5394J6694J884
$$ -92359 -116467 -99254 -90775 -82658 -80852 -82138 -86556 -92562 -95647 -87988 -113382 -96688 -94804
10711i4804j3973J2930j4795n314n335L1128j1059P202q494J4517r864L677r408
$$ -94804 -108777 -95847 -110642 -115956 -121291 -90163 -101222 -94020 -102514 -87997 -97861 -94184 -103592
10698a03592J557R76k184o920q961J1101Q526N37J365L925j5569J4654p719J4710
$$ -103592 -102035 -101059 -103243 -110163 -119124 -108023 -99497 -98960 -97595 -93670 -109239 -94585 -102304 -87594
10684h7594l517R786q363K30j3307N686J3732k6590Q27R074J3413q546l00L443
$$ -87594 -91111 -81325 -89688 -89458 -102765 -97079 -83347 -109937 -109110 -100036 -86623 -95169 -95469 -92026
10670i2026K325q771N970l539O324j20p066J576n173J2953p292j0472J6443j2530
$$ -92026 -89701 -98472 -92502 -96041 -89717 -89837 -96903 -95327 -100500 -87547 -94839 -105311 -88868 -101398
10656a01398L285J4747j3174K29K433r301L866m131q895J3966n471J5697j6496
$$ -101398 -98113 -83366 -96540 -96311 -93878 -103179 -99313 -103444 -112339 -98373 -103844 -88147 -104643
10643a04643P25J5928j3796O530J2061k0582O862K552j4108Q310m055k227J324
$$ -104643 -103918 -87990 -101786 -95256 -83195 -103777 -96915 -94363 -108471 -100161 -104216 -106443 -105119
10630a05119j0663K0090k221p150J7J2832j607K928m889n607k335J5325j2859
$$ -105119 -115782 -95692 -97913 -105063 -105046 -92214 -93821 -90893 -95782 -101389 -103724 -88399 -101258
10617a01258J9369j4993k151J6998q031k308R277k5573N816Q727n884m876R257
$$ -101258 -81889 -96882 -99033 -82035 -90066 -92374 -83097 -108670 -102854 -94127 -100011 -104887 -95630
10604i5630P665p780j0242O836J6489k5071J5554j2247M674M077p781j0156J5854
$$ -95630 -87965 -95745 -105987 -99151 -82662 -107733 -92179 -104426 -99752 -95675 -103456 -113612 -97758
10591i7758k48j843j3365L821K6412j0383j2342Q958P660L139l520j4459J1897
$$ -97758 -98006 -99849 -113214 -109393 -82981 -93364 -105706 -96748 -89088 -85949 -89469 -103928 -92031
10578i2031Q934N09j8226N50m479K1466j4750M000r842J2006J1627j6742j144
$$ -92031 -83097 -82588 -100814 -100264 -104743 -83277 -98027 -94027 -103869 -91863 -80236 -96978 -98122
10565i8122J544R259j2367l716R048j9954L1618k4568J1030J1820j4899k4413
$$ -98122 -96578 -87319 -99686 -103402 -94354 -114308 -82690 -107258 -96228 -84408 -99307 -123720
10553a23720L3433r087N161j0937J4658m044J214j933n471r637N002O958L853
$$ -123720 -90287 -99374 -94213 -105150 -90492 -94536 -93322 -95255 -100726 -110363 -105361 -98403 -94550
10540i4550N449q477o598Q93o101M206J2320o203m136l600J0284j9293K6197j0953
$$ -94550 -89101 -97578 -104176 -103283 -109384 -105178 -92858 -99061 -103197 -106797 -96513 -115806 -89609 -100562
10526a00562J4115p581M307r209K0123k7012M785J1129k0895R561k301J1966j5730
$$ -100562 -86447 -94028 -89721 -98930 -78807 -105819 -101034 -89905 -110800 -101239 -103540 -91574 -107304
10513a07304J3682o552J9879j938k361j4352Q1K1768l949k2873l119J3090J1980
$$ -107304 -93622 -100174 -80295 -82233 -84594 -98946 -98865 -77097 -81046 -103919 -107038 -93948 -81968
10500h1968j8755O475M108M656n026o274J719k510K797n700p388R971o15L128
$$ -81968 -100723 -94248 -90140 -85484 -90510 -96784 -95065 -97575 -94778 -100478 -107866 -97895 -98510 -95382
10486i5382q247l012L355J7041k4359o630L3003j1154K683p721M577L121N377
$$ -95382 -103629 -106641 -103286 -86245 -110604 -117234 -84231 -95385 -92702 -100423 -95846 -92725 -87348
10473h7348p770m346L503J1754j4105j0505K3273j0830M656j832J1978j2014J3106
$$ -87348 -95118 -99464 -95961 -84207 -98312 -108817 -85544 -96374 -91718 -93550 -81572 -93586 -80480
10460h0480j2842N357J818k0251J4205o205J1317j8987L853K876j616P372L203
$$ -80480 -93322 -87965 -86147 -106398 -92193 -98398 -87081 -106068 -102215 -99339 -100955 -93583 -90380
10447i0380m715K268n360R715j217j2124N936K620p895j2151J5766J7781j9429
$$ -90380 -95095 -92827 -98187 -88472 -89689 -101813 -95877 -93257 -101152 -113303 -97537 -79756 -99185
10434i9185J9137l882M858j2151k4507L5143p711j2691Q88J3433l627J1406k2462
$$ -99185 -80048 -83930 -79072 -91223 -115730 -80587 -88298 -100989 -100101 -86668 -90295 -78889 -101351
10421a01351L650j838J8546j5758J4556j2387k148l25j622K74K393l831j0831
$$ -101351 -97701 -99539 -80993 -96751 -82195 -94582 -96730 -97055 -98677 -98403 -96010 -99841 -110672
10408a10672N601J5839L821j3775l157J8123K88o371m645j4046M357J9576j5352
$$ -110672 -105071 -89232 -85411 -99186 -102343 -84220 -83932 -90303 -94948 -108994 -104637 -85061 -100413
10395a00413j5818J0318J1125j3321K137Q498J2489n929j4394K2014r256l167
$$ -100413 -116231 -105913 -94788 -108109 -105972 -97474 -84985 -90914 -105308 -83294 -92550 -95717
10383i5717K798K291r067j230K8164k1476j2623J9057K599j799o709L855J177
$$ -95717 -92919 -90628 -99695 -100925 -72761 -94237 -106860 -87803 -85204 -87003 -93712 -89857 -88680
10370h8680j1114l264L284K2995j9992j946l391J3969j0454M705l300J3698K866
$$ -88680 -99794 -103058 -99774 -76779 -96771 -98717 -102108 -88139 -98593 -93888 -97188 -83490 -80624
10357h0624P938k2051o672N201k424Q321n699m620Q669j1279k897J2522M201P820
$$ -80624 -72686 -94737 -101409 -96208 -98632 -90311 -96010 -100630 -91961 -103240 -106137 -93615 -89414 -81594
10343h1594J0162j0302l2069L3262k6068J5124j5484Q33J1103j4547O750M201
$$ -81594 -71432 -81734 -113803 -80541 -106609 -91485 -106969 -106136 -95033 -109580 -102830 -98629
10331i8629j34p455M585j2886J7852j241p393J2048L653q462J8237j6842l017
$$ -98629 -98763 -106218 -101633 -114519 -96667 -97908 -105301 -93253 -89600 -98062 -79825 -96667 -99684
10318i9684J977K722K476K644q236J5149R920l2130K7914j3819j1484N456J3490
$$ -99684 -97707 -94985 -92509 -89865 -98101 -82952 -73032 -105162 -77248 -91067 -102551 -97095 -83605
10305h3605k1880K2454k1908J7621J3097k2558o583J1012J4822q898j5469J188
$$ -83605 -105485 -83031 -104939 -87318 -74221 -96779 -103362 -92350 -77528 -86426 -101895 -100707
10293a00707R461r696K038m371M82R970k2141J9552N665R577J0729k7744J184
$$ -100707 -91246 -100942 -98904 -103275 -102793 -92823 -114964 -95412 -89747 -80170 -69441 -97185 -96001
10280i6001O996J4451k5711j995J0380J1965k0619J1292p959J2569K456j5073
$$ -96001 -89005 -74554 -100265 -102260 -91880 -79915 -100534 -89242 -97201 -84632 -82176 -97249
10268i7249J1002Q453p406r283J484m1J7472j6129q077Q102J333m903j7832J3639
$$ -97249 -86247 -77794 -85200 -94483 -92999 -93040 -75568 -91697 -99774 -91672 -90339 -95242 -113074 -99435
10254i9435O865l724j0216J1764j2058R164m833J0084l73r678K2794j7951P134
$$ -99435 -92570 -96294 -106510 -94746 -106804 -97640 -102473 -92389 -92762 -102440 -79646 -97597 -90463
10241i0463r420J4315m487n783O958J3827k3075J6822j3771J3413j3697J1643
$$ -90463 -99883 -85568 -90055 -95838 -88880 -75053 -98128 -81306 -95077 -81664 -95361 -83718
10229h3718j0508J5401j7534P260J3019N615j0617k1967K1799k2712O569R05L882
$$ -83718 -94226 -78825 -96359 -89099 -76080 -70465 -81082 -103049 -81250 -103962 -97393 -96488 -92606
10216i2606r263J8091l767j2742N656L779J512l192m882J2269j0477J2927N993
$$ -92606 -101869 -83778 -87545 -100287 -94631 -90852 -89340 -92532 -97414 -85145 -95622 -82695 -76702
10203g6702j4000J4037j9743L996j1338J4703J265o792q61O801k0253K3893k4087
$$ -76702 -90702 -76665 -96408 -92412 -103750 -89047 -87782 -94574 -95435 -88634 -108887 -84994 -109081
10190a09081J5281K697k450q20m830L860K341j5037J8781P803k7841L1400j6162
$$ -109081 -93800 -91103 -93553 -94373 -99203 -95343 -93002 -108039 -89258 -81455 -109296 -77896 -94058
10177i4058r310L607J4459k186p722K305M679L176m229K320P336j7754j539J2042
$$ -94058 -103368 -99761 -85302 -87488 -95210 -92905 -88226 -85050 -89279 -86959 -79623 -97377 -98916 -86874
10163h6874K137j1058p709Q909R08J2397n689k346j1473J1052l208L056k586l478
$$ -86874 -84737 -95795 -103504 -94595 -93687 -81290 -86979 -89325 -100798 -89746 -92954 -89898 -92484 -95962
10149i5962Q856j412o592j7075L9575j6968l279P129j4166J0786Q783o893p289
$$ -95962 -87106 -88518 -95110 -112185 -72610 -89578 -92857 -85728 -99894 -89108 -80325 -87218 -94507
10136i4507j898J5732J539J398j6096k038Q456J0831l0601J1298Q582N941j7354
$$ -94507 -96405 -80673 -79134 -77736 -93832 -95870 -87414 -76583 -107184 -95886 -87304 -81363 -98717
10123i8717o66J9800J952k024j2586L937O825j1958l382o012J0416M380k3222
$$ -98717 -99383 -79583 -77631 -79655 -92241 -88304 -81479 -93437 -96819 -102831 -92415 -88035 -111257
10110a11257Q681R138J605j0484Q338J4268O786l035j2009j804K2640k1961J6622
$$ -111257 -102576 -93438 -91833 -102317 -93979 -79711 -72925 -75960 -87969 -89773 -67133 -89094 -72472
10097g2472j3446K758L955Q359m735r164J3135k1515J7554j1998Q207q901K288
$$ -72472 -85918 -83160 -79205 -70846 -75581 -84745 -71610 -93125 -75571 -87569 -79362 -88263 -85975
10084h5975j1265J3289r46m366Q353R254r702j986j2286K0325j9650R10L778K18
$$ -85975 -97240 -83951 -84897 -89263 -80910 -71656 -81358 -83344 -95630 -75305 -94955 -94045 -90267 -90049
10070i0049n531K5m293J7002r709n74j352K4989j3587j803N248o509j4072R120
$$ -90049 -95580 -95555 -99848 -82846 -92555 -93129 -94481 -69492 -83079 -84882 -79634 -86143 -100215 -91095
10056i1095J129L687j0378J664m933J3634K629N621n838r414J3354M806j6331
$$ -91095 -89966 -86279 -96657 -94993 -99926 -86292 -83663 -78042 -83880 -93294 -79940 -75134 -91465
10043i1465l9P781l579R9j736j9764J4367J8209O436k4706J1429m058q332P933
$$ -91465 -91504 -83723 -87302 -87203 -88939 -108703 -94336 -76127 -69691 -94397 -82968 -87026 -95358 -87425
10029h7425l217J9155k0597j222M795M990k8779J6856K2178k3789R168n432J7173
$$ -87425 -90642 -71487 -92084 -93306 -88511 -83521 -112300 -95444 -73266 -97055 -87887 -93319 -76146
10016g6146p289R806l1387K6847j7334O963J210j0395K5238k680j1752J729J2136
$$ -76146 -83435 -73629 -105016 -78169 -95503 -88540 -87330 -97725 -72487 -75167 -86919 -85190 -73054
10003g3054j8471j0840J1404k0735K6979J4036j0868j4665J7945o708p274o754
$$ -73054 -91525 -102365 -90961 -111696 -84717 -70681 -81549 -96214 -78269 -84977 -92251 -99005
9991i9005J8406n790N025j9375K6618o438q610r985J0966K105m13O580j0576o579
$$ -99005 -80599 -86389 -81364 -100739 -74121 -80559 -89169 -99154 -88188 -86083 -86496 -79916 -90492 -97071
9977i7071P853m664J967M819j4242J5747n000J2053n807P893j3743p648Q718q390
$$ -97071 -89218 -93882 -91915 -87096 -101338 -85591 -90591 -78538 -84345 -76452 -90195 -97843 -89125 -97515
9963i7515R172j070J9322j7850P798m30o294K045m351Q669k204J1042j9791l921
$$ -97515 -88343 -89413 -70091 -87941 -80143 -80573 -86867 -84822 -89173 -80504 -82708 -71666 -91457 -95378
9949i5378Q237O000k9095O407J3597p185J9368o663r71r124J7525k5710J5929
$$ -95378 -87141 -81141 -110236 -103829 -90232 -97417 -78049 -84712 -85683 -94807 -77282 -102992 -87063
9936h7063j0861L969Q137L038p446J261j4947J7735j244J8238j6093P474j5433
$$ -87063 -97924 -93955 -85818 -82780 -90226 -88965 -103912 -86177 -87421 -69183 -85276 -77802 -93235
9923i3235J9016p184k733k2K004k38M159j5387J1414P412q864L996K753Q836l3455
$$ -93235 -74219 -81403 -84136 -84158 -82154 -82392 -78233 -93620 -82206 -74794 -83658 -79662 -76909 -68073 -101528
9908a01528J2497M281P261j925j6342R448M891j0079J3590k2942K8983j3577L318
$$ -101528 -89031 -84750 -77489 -79414 -95756 -86308 -81417 -91496 -77906 -100848 -71865 -85442 -82124
9895h2124j8631J0964J0634j1762R299j2171J635J592l4l697J466P892P7o01J6250
$$ -82124 -100755 -89791 -79157 -90919 -81620 -93791 -92156 -90564 -90598 -94295 -92829 -84937 -84860 -85461 -69211
9880f9211k0153J1029r301k028J8202N96R84j4504P411R149j1422p794j86J6776
$$ -69211 -89364 -78335 -87636 -89664 -71462 -70866 -69882 -84386 -76975 -67826 -79248 -87042 -87228 -70452
9866g0452j5374N28P764K495O79j0340j2106J9635Q147l0318K108J0350J0176
$$ -70452 -85826 -85298 -77534 -75039 -74360 -84700 -96806 -77171 -69024 -99342 -97234 -86884 -76708
9853g6708J988k4818j003J7919J4861k1117Q751J0423n075J606j0986p146K2367
$$ -76708 -74720 -99538 -100541 -82622 -67761 -88878 -80127 -69704 -74779 -73173 -84159 -91305 -68938
9840f8938j0665j0988o466K3276J3353k0432n019J4046p316l055k9591L9073q135
$$ -68938 -79603 -90591 -97057 -73781 -60428 -80860 -85879 -71833 -79149 -82204 -111795 -72722 -80857
9827h0857K091j4730N766M881M705J7668l1493K0125j1504J834j0278J9952j4336
$$ -80857 -78766 -93496 -87730 -82849 -78144 -60476 -91969 -71844 -83348 -81514 -91792 -71840 -86176
9814h6176m695k388K157K2187j2803p906J3029j2556J1690j0005P249J1640k5322
$$ -86176 -90871 -93259 -91102 -68915 -81718 -89624 -76595 -89151 -77461 -87466 -80217 -68577 -93899
9801i3899M038L56j269N870q900J596J0845R501n701l5387J6875J7085R767k0415
$$ -93899 -89861 -89505 -90774 -84904 -93804 -92208 -81363 -71862 -77563 -112950 -96075 -78990 -69223 -89638
9787h9638j0354K4675l273k142j7206J8085J3321j5393L096N570o676l716J8055
$$ -89638 -99992 -75317 -78590 -80732 -97938 -79853 -66532 -81925 -78829 -73259 -79935 -83651 -65596
9774f5596r291j9290Q741J2343m746n980K2817n988j2270K600K2406k1559q755
$$ -65596 -74887 -94177 -85436 -73093 -77839 -83819 -61002 -66990 -79260 -76660 -54254 -75813 -84568
9761h4568N254M190m54L618l772j1527K049Q54K008J0750j4935j3164J7194K6622
$$ -84568 -79314 -75124 -75578 -71960 -75732 -87259 -85210 -84356 -82348 -71598 -86533 -99697 -82503 -55881
9747e5881j8676N477M891j1971K2764M142P01N0923J2112k7378J22j3302J0339
$$ -55881 -74557 -69080 -64189 -76160 -53396 -49254 -48553 2370 14482 -12896 -12774 -26076 -15737
9734a5737j7766j6585j8755N515p251R299j9133q931J1003L079r739m672J6328
$$ -15737 -33503 -50088 -68843 -63328 -70579 -61280 -80413 -89344 -78341 -75262 -85001 -89673 -73345
9721g3345m305N459j2330J0022L162J882j7885K0823l839O557k5562K1843j5118
$$ -73345 -77650 -72191 -84521 -74499 -71337 -69455 -87340 -66517 -70356 -63799 -89361 -67518 -82636
9708h2636M291l514J1990m308k572O939J64J645L533k617j3392m14k642R605j1686
$$ -82636 -78345 -81859 -69869 -74177 -76749 -69810 -69646 -68001 -64468 -67085 -80477 -80891 -83533 -73928 -85614
9693h5614J4319m746p833O127L400m721M319j3019J7526r476n16J0445L148j2888
$$ -85614 -71295 -76041 -83874 -77747 -74347 -79068 -74749 -87768 -70242 -79718 -80234 -69789 -66641 -79529
9679g9529K1214k1201N838o373j1012Q677Q603j0252M701M931M215k845M249p495
$$ -79529 -58315 -79516 -73678 -80051 -91063 -82386 -73783 -84035 -79334 -74403 -70188 -73033 -68784 -76279
9665g6279k771L860n391l732O154R536q359l417J2813k3636J8303J6041j6601
$$ -76279 -79050 -75190 -80581 -84313 -78159 -68623 -76982 -80399 -67586 -91222 -72919 -56878 -73479
9652g3479K96M729k4223R196k88L694m65J9397M872j5848P958j0308K7382l7311
$$ -73479 -73183 -68454 -92677 -83481 -83769 -80075 -80540 -61143 -56271 -72119 -64161 -74469 -47087 -84398
9638h4398J1857k282J3801j4851O335J834r49K456p405J164M303P277j4435J9004
$$ -84398 -72541 -74823 -61022 -75873 -69538 -67704 -68653 -66197 -73602 -72438 -68135 -60858 -75293 -56289
9624e6289j5752J7681j3187j912q53l217L0163k8665Q607N824O548L907k3598
$$ -56289 -72041 -54360 -67547 -69459 -70312 -73529 -43366 -72031 -63424 -57600 -51052 -47145 -70743
9611g0743O902N062J1263k1335J6268p173O621j5435J1108q433J5483m25j1319
$$ -70743 -63841 -58779 -47516 -68851 -52583 -59756 -53135 -68570 -57462 -65895 -50412 -50837 -62156
9598f2156M927L3442j4798K1719k788r166J8404P301K8073P552R3540J46956J31115
$$ -62156 -57229 -23787 -38585 -16866 -19654 -28820 -10416 -3115 24958 32510 126050 273006 404121
9585D04121P7413K5602j3060n0423j04058q8184q0117m1863l3787n7643l3644
$$ 404121 481534 507136 494076 443653 339595 251411 171294 129431 95644 38001 4357
9574D357j3102j0923k1481p538R366j2966K215m842J5432k3080J6183j2906J496
$$ 4357 -8745 -19668 -41149 -48687 -39321 -52287 -50072 -54914 -39482 -62562 -46379 -59285 -57789
9561e7789n307o3R568j0824N739l618j069p073J2990j6041K3592m379p660J6640
$$ -57789 -63096 -63159 -53591 -64415 -58676 -62294 -63363 -70436 -57446 -73487 -49895 -54274 -61934 -45294
9547d5294j4197n176m703o86j2911L0602n18n925j2473K8698j4658j1271R010
$$ -45294 -59491 -64667 -69370 -70056 -82967 -52365 -52883 -58808 -71281 -42583 -57241 -68512 -59502
9534e9502N7j2224q92J8128j1669m796J0045o550j0472j5J647k203P988j4553
$$ -59502 -59445 -71669 -72561 -54433 -66102 -70898 -60853 -67403 -77875 -77890 -76243 -78446 -70458 -85011
9520h5011J1005J1387j2736j069Q144O923p275j5749K3903j1500m655J3995j077
$$ -85011 -74006 -62619 -75355 -76424 -68280 -61357 -68632 -84381 -60478 -71978 -76633 -62638 -63715
9507f3715r167N948O759j9266P609J5057n947K980r480L46r761K242N914j509
$$ -63715 -72882 -66934 -60175 -79441 -71832 -56775 -62722 -59742 -69222 -68876 -78637 -76395 -70481 -71990
9493g1990o724R13q20L6876l3752J5490k8877K0793j612L815p187l284l223J4808
$$ -71990 -78714 -77801 -78621 -41745 -75497 -60007 -88884 -68091 -69703 -65888 -73075 -76359 -79582 -64774
9479f4774l928P656n140k0429J9367k2629K2098J217J095n01M901n049n483J4413
$$ -64774 -68702 -61046 -66186 -86615 -67248 -89877 -67779 -66562 -65467 -65968 -61067 -66116 -71599 -57186
9465e7186j2991R562m604J3195l532l439j871J2323j3831j2426J3921R470j3719
$$ -57186 -70177 -60615 -65219 -52024 -55556 -58995 -60866 -48543 -62374 -74800 -60879 -51409 -65128
9452f5128l396m906R551M482o186K261m787q01L121j530K378L698m290j2447K3294
$$ -65128 -68524 -73430 -63879 -59397 -65583 -63322 -68109 -68910 -65789 -67319 -64941 -61243 -65533 -77980 -54686
9437e4686j8102L5220j2535l9938L4942l40R71j1156M976R483J8676k4848k724
$$ -54686 -72788 -37568 -50103 -90041 -55099 -55439 -54468 -65624 -60648 -51165 -32489 -57337 -60061
9424f0061O228p551j268j7057K0384O660N705l0839R787r602J2954j1140J7719
$$ -60061 -53833 -61384 -62652 -79709 -59325 -52665 -46960 -77799 -68012 -77614 -64660 -75800 -58081
9411e8081j4844K738J1281j0754J2008j8167J6858p282Q271K1687j6858k7143
$$ -58081 -72925 -70187 -58906 -69660 -57652 -75819 -58961 -66243 -57972 -36285 -53143 -80286
9399h0286K6017k5778J7230j0112k455J7274o42p520j233j1389K6456j6893p997
$$ -80286 -54269 -80047 -62817 -72929 -75384 -58110 -58752 -66272 -67505 -78894 -52438 -69331 -77328
9386g7328J4897J122j0699q300K899J2074q244j212j3614K3224J8974j9582M096
$$ -77328 -62431 -61309 -72008 -80308 -77409 -65335 -73579 -74791 -88405 -65181 -46207 -65789 -61693
9373f1693M54K2005l2843J8331k1761N239j195J0922q160K36K2541j2230n276
$$ -61693 -61239 -39234 -72077 -53746 -75507 -70268 -71463 -60541 -68701 -68465 -45924 -58154 -63430
9360f3430N157O100j2607J1589k0122R897K331j1834O716J440Q884p998k567k807
$$ -63430 -58273 -52173 -64780 -53191 -73313 -63416 -61085 -72919 -66203 -64763 -55879 -63877 -66444 -69251
9346f9251R713l0287K8478J2928j9089M941J806j7646n041J3256j5480J9497j733
$$ -69251 -59538 -89825 -61347 -48419 -67508 -62567 -60761 -78407 -83448 -70192 -85672 -66175 -67908
9333f7908O070j5035P485O009P06j3184L887J7896M560k7459J3011l576K1711
$$ -67908 -61838 -76873 -69388 -63379 -62673 -75857 -71970 -54074 -49514 -76973 -63962 -67538 -45827
9320d5827j5320n728m649J0222o660k758k409K1023q186R032j8023M548j274j1778
$$ -45827 -61147 -66875 -71524 -61302 -67962 -70720 -73129 -52106 -60292 -51260 -69283 -64735 -66009 -77787
9306g7787j521k708J9342k6593J1493J759J0536l204n612Q599J3635j7543j2883
$$ -77787 -79308 -82016 -62674 -89267 -77774 -76015 -65479 -68683 -74295 -65696 -52061 -69604 -82487
9293h2487J5366J9959l0194R973K02P960j0863L36q559N226J1312R171j5039P229
$$ -82487 -67121 -47162 -77356 -67383 -67181 -59221 -70084 -69748 -78307 -73081 -61769 -52598 -67637 -60408
9279f0408N426O280k1944j4141K5812J464r088n22J218M878j1477Q866o77k4480
$$ -60408 -54982 -48702 -70646 -84787 -58975 -57511 -66599 -67121 -65903 -61025 -72502 -63636 -64313 -88793
9265h8793K6342k44o729N542r966J4668n893j7602R336K0P058J2984n344j2570
$$ -88793 -62451 -62695 -69424 -63882 -73848 -59180 -65073 -82675 -73339 -73319 -66261 -53277 -58621 -71191
9251g1191J4799J4089j6490o362o125J1880o767k92P617j8708J8091j739J8393
$$ -71191 -56392 -42303 -58793 -65155 -71280 -59400 -66167 -66459 -58842 -77550 -59459 -61198 -42805
9238d2805k3446k970J0240j2643O648j373l990K2047k6254J9347k954K115j8888
$$ -42805 -66251 -69221 -58981 -71624 -64976 -66349 -70339 -48292 -74546 -55199 -58153 -56038 -74926
9225g4926J4961k308n523J1061r116K3330l9173J4940O254J1348k9556K1322p595
$$ -74926 -59965 -62273 -67796 -56735 -65851 -42521 -81694 -66754 -60500 -49152 -78708 -57386 -64981
9212f4981Q409n435J0166l690J2116j4980J7057j4805O386K115l71p351R507J7912
$$ -64981 -56572 -62007 -51841 -55531 -43415 -58395 -41338 -56143 -49757 -47642 -48013 -55364 -45857 -27945
9198b7945j5700K287q772J4407j0174j774J0133o275q407K1389j4646k0700J9214
$$ -27945 -43645 -41358 -50130 -35723 -45897 -47671 -37538 -43813 -52220 -30831 -45477 -66177 -46963
9185d6963O382j0925j4500K6968j961r791k977L939j1090j0164Q044J5738j6080
$$ -46963 -40581 -51506 -66006 -39038 -40999 -50790 -53767 -49828 -60918 -71082 -63038 -47300 -63380
9172f3380J3798j2623K8789n821j1770J3692j1520M328N276J3663k0316L356l077
$$ -63380 -49582 -62205 -33416 -39237 -51007 -37315 -48835 -44507 -39231 -25568 -45884 -42528 -45605
9159d5605R064p43J000L097r161l759O445M495l630n310K38J2408j6298R054k080
$$ -45605 -36541 -37284 -36284 -33187 -42348 -46107 -39662 -35167 -38797 -44107 -43869 -31461 -47759 -38705 -40785
9144d0785J167m39O730o071j600O801n145j531L681P989l67p07J3468J61J2062
$$ -40785 -39618 -40057 -33327 -39398 -40998 -34197 -39342 -40873 -37192 -29203 -29570 -30277 -16809 -16648 -4586
9129d586k6868K2343j8197P957L060o312Q725N855j6710jl030m632M276m855j5734
$$ -4586 -31454 -9111 -27308 -19351 -16291 -22603 -13878 -8023 -24733 -24734 -27764 -32396 -28120 -32975 -48709
9114d8709J1282J340l893k605k778J03j0637P16J2545l270O01n351Q657J4490
$$ -48709 -37427 -36087 -39980 -42585 -45363 -45260 -55897 -55181 -42636 -45906 -45305 -50656 -41999 -27509
9100b7509l9263O628Q150O386j6588J4628n508J5113j0578K7352k6022J5088k424
$$ -27509 -66772 -60144 -51994 -45608 -62196 -47568 -53076 -37963 -48541 -21189 -47211 -32123 -34547
9087c4547j2678j245K500j426r159N072j4778J9201r756J746M641k075m803J3350
$$ -34547 -47225 -48470 -45970 -47396 -56555 -51483 -66261 -47060 -56816 -55070 -50429 -52504 -57307 -43957
9073d3957n534j1730N218Q695j4512K898Q055Q942j3512j2951N500J6329p637
$$ -43957 -49491 -61221 -56003 -47308 -61820 -58922 -50867 -41925 -55437 -68388 -62888 -46559 -54196
9060e4196P317q915K741J0149j3480n832L795P284l649J9370k7311L0180j6950
$$ -54196 -46879 -55794 -53053 -42904 -56384 -62216 -58421 -51137 -54786 -35416 -62727 -32547 -49497
9047d9497J957ML334K966j4939p681Q491Q166k9241K9073j4476J9883k1277K4533
$$ -49497 -47540 -47536 -44202 -41236 -56175 -63856 -55365 -47199 -76440 -47367 -61843 -41960 -63237 -38704
9033c8704k3897J5673r225O238J905r609L767n782K690n242J7158k5953J078J2472
$$ -38704 -62601 -46928 -56153 -49915 -48010 -57619 -53852 -59634 -56944 -62186 -45028 -70981 -69903 -57431
9019e7431K929K1738k8644J6648j0006n947L406L531k2488K9433r47p378J4652
$$ -57431 -54502 -32764 -61408 -44760 -54766 -60713 -57307 -53776 -76264 -46831 -47778 -55156 -40504
9006d0504k5117J3240l113p836m441K5681j4340M128J8198j5799J379j5409J3837
$$ -40504 -65621 -52381 -55494 -63330 -67771 -42090 -56430 -52302 -34104 -49903 -48524 -63933 -50096
8993e0096j2068J7157k1877K8139k9699L5585j9229r966O124J1211J043k7547
$$ -50096 -62164 -45007 -66884 -38745 -68444 -32859 -52088 -62054 -55930 -44719 -43676 -71223
8981g1223K1094j7935K2064r999O592j7350K5877j7930n685J0533L727m319J2962
$$ -71223 -50129 -68064 -46000 -55999 -49407 -66757 -40880 -58810 -64495 -53962 -50235 -54554 -41592
8968d1592j3642N762j5958J3667o543j452j264K0290j3616Q579j1494J7914k3105
$$ -41592 -55234 -49472 -65430 -51763 -58306 -59758 -61022 -40732 -54348 -45769 -57263 -39349 -62454
8955f2454J0718L133k474K080L037l689n790Q137j8648L074q729J1269P078M395
$$ -62454 -51736 -48603 -51077 -48997 -45960 -49649 -55439 -47302 -65950 -62876 -71605 -60336 -53258 -48863
8941d8863p601N210j25n334j125P651k3763J4306N771O979o832q588K5571j1060
$$ -48863 -56464 -51254 -51379 -56713 -57838 -50187 -73950 -59644 -53873 -46894 -53726 -62314 -36743 -47803
8927d7803J078j0837k158R72J3496j2989K510K920o5k850k2135J8185Q150J946
$$ -47803 -46725 -57562 -59720 -58748 -45252 -58241 -55731 -52811 -52876 -55726 -77861 -59676 -51526 -49580
8913d9580j0782J6935O599j5261J0795l910J549j6402P506p649M544l719K0775
$$ -49580 -60362 -43427 -36828 -52089 -41294 -45204 -43655 -60057 -52551 -60200 -55656 -59375 -38600
8900c8600j3255j783O779J5200j2222j7781n614K4626p951m968M322N384j3379
$$ -38600 -51855 -53638 -46859 -31659 -43881 -61662 -67276 -42650 -50601 -55569 -51247 -45863 -59242
8887e9242L880q184K0184k2230Q481J515P054p57l7930M5560j1521m319M669p475
$$ -59242 -55362 -63546 -43362 -65592 -57111 -55596 -48542 -49299 -87229 -41669 -53190 -57509 -52840 -60315
8873f0315M282J0021M086j4126l358J9472K164k683l11j056j2282r770J6242k3563
$$ -60315 -56033 -46012 -41926 -56052 -59410 -39938 -37774 -40457 -40768 -41824 -54106 -63876 -47634 -71197
8859g1197L930K5237O569j2647r813K3069m548q611M574J10r223l826l136J6198
$$ -71197 -67267 -42030 -35461 -48108 -57921 -34852 -39400 -48011 -43437 -43327 -52550 -56376 -59512 -43314
8845d3314k1963J784l579o602J0897L989l859J778K1438J096P55k4302P698J1877
$$ -43314 -65277 -63493 -67072 -73674 -62777 -58788 -62647 -60869 -39431 -38335 -37580 -61882 -54184 -42307
8831d2307p879m744J8186r259O929j606L15k27J2307j9468L515L745J467q647
$$ -42307 -50186 -54930 -36744 -46003 -39074 -40680 -40365 -40592 -28285 -47753 -44238 -40493 -39026 -47673
8817d7673k327q18J9904m904j4927j209J1162l795o192O042j6371K3281j3582
$$ -47673 -50000 -50818 -30914 -35818 -50745 -51954 -40792 -44587 -50779 -44737 -61108 -37827 -51409
8804e1409n980K646O429q633K120M669k2119K2168o397r757P623O753J0048m5
$$ -51409 -57389 -54743 -48314 -56947 -54827 -50158 -72277 -50109 -56506 -66263 -58640 -51887 -41839 -41884
8790d1884j479J904J821k2455J5758J1321k53l4187J8735N644q80j4449K0529
$$ -41884 -43363 -41459 -39638 -62093 -46335 -35014 -35267 -69454 -50719 -45075 -45955 -60404 -39875
8777c9875m293j7389O174J8075l17k832K161K54j9725Q759j3605J5049j3966K9744
$$ -39875 -44168 -61557 -55383 -37308 -37625 -40457 -38296 -38042 -57767 -49008 -62613 -47564 -61530 -31786
8763c1786K962l6633K0506Q200j4454N305M529K136j5649J45J1224K638M099m462
$$ -31786 -28824 -65457 -44951 -36751 -51205 -45900 -41371 -39235 -54884 -54739 -43515 -40877 -36778 -41240
8749d1240P658j5292J392O470o460j798Q030L845k2338p871J9520P486j4966J70
$$ -41240 -33582 -48874 -47482 -41012 -47472 -49270 -41240 -37395 -59733 -67604 -48084 -40598 -55564 -55394
8735e5394J0143J5600j5156o545k167J5104r715m586L92J3305N62k3131K6550
$$ -55394 -45251 -29651 -44807 -51352 -53519 -38415 -48130 -52716 -52324 -39019 -38457 -61588 -35038
8722c5038j7761J443J370R641j4485K1930K765j3348J7133j6918J9171k6613M257
$$ -35038 -52799 -51356 -49986 -40345 -54830 -32900 -30135 -43483 -26350 -43268 -24097 -50710 -46453
8709d6453J8871p830j9356O652J2015j4319R42K3230p002k299n509L214K576j619
$$ -46453 -27582 -35412 -54768 -48116 -36101 -50420 -49478 -26248 -33250 -35549 -41058 -37844 -35268 -36887
8695c6887J0274j6825J6475J0080l1815L786J5982q690K6410k2569R199p92R62
$$ -36887 -26613 -43438 -26963 -16883 -48698 -44912 -28930 -37620 -11210 -33779 -24580 -25372 -24410
8682b4410N002p867l333J3701j661j6754J5349p348k571L920m648L674J0040K239
$$ -24410 -19408 -27275 -30608 -16907 -18568 -35322 -19973 -27321 -29892 -25972 -30620 -26946 -16906 -14667
8668a4667j834P057m801j0560J3769p052J155o870o313O720L0222k8615J2719
$$ -14667 -16501 -9444 -14245 -24805 -11036 -18088 -16933 -23803 -30116 -23396 6826 -21789 -9070
8655i070J27P018N58p393O061P887n319J7589Q052n376o294J587n887K606J929
$$ -9070 -8943 -1925 -1367 -8760 -2699 5188 -131 17458 25510 20134 13840 15427 9540 12146 14075
8640A4075k75M713J8259m483J5414k8401J7751j85o69J7648j5201J2256j2168
$$ 14075 13800 18513 36772 32289 47703 19302 37053 36868 36199 53847 38646 50902 38734
8627C8734J5253P551j067N291p588O126q410Q187k922L430j575L831J4217p488
$$ 38734 53987 61538 60471 65762 58174 64300 55890 64077 61155 64585 63010 66841 81058 73570
8613G3570k0215K2065J0702j3034L882J223j1022P882M792k1120K0434M62k2203
$$ 73570 53355 75420 86122 73088 76970 78193 67171 75053 79845 58725 79159 79621 57418
8600E7418P336j083K440K477l611r263K457J265M552j9614R778J4077l2414R666
$$ 57418 64754 63671 66111 68588 64977 55714 58171 59436 63988 44374 54152 68229 35815 45481
8586D5481J4251k2021Q830k7291K4345n136L274j5896J484O553r831l664k457
$$ 45481 59732 37711 46541 19250 43595 38459 41733 25837 27321 33874 24043 20379 17922
8573A7922N852r203j139P557j9836K082j586K4333k3981N102O058j2793q835J2745
$$ 17922 23774 14571 13432 20989 1153 3235 1649 25982 2001 7103 13161 368 -8467 4278
8559D278j1935m84O685r354R890j4638J0657k747n864N512p432k287K3124k5783
$$ 4278 -7657 -8141 -1456 -10810 -920 -15558 -4901 -7648 -13512 -8000 -15432 -17719 5405 -20378
8545b0378K539N975P786n864j5279O859J2855j4697j2247Q594K1348r456k300
$$ -20378 -17839 -11864 -4078 -9942 -25221 -18362 -5507 -20204 -32451 -23857 -2509 -11965 -14265
8532a4265l446k1697L2017P392l2120J6871J508J2486j4295o575K961N541k0587
$$ -14265 -17711 -39408 -7391 1 -32119 -15248 -13740 -1254 -15549 -22124 -19163 -13622 -34209
8519c4209J2222r584k56J6328j3774p333N164o326L073K643j9139K1834J601k1496
$$ -34209 -21987 -31571 -31827 -15499 -29273 -36606 -31442 -37768 -34695 -32052 -51191 -29357 -27756 -49252
8505d9252K9349j2460J0710j7826Q842m635J8527r674j2053J0935j6282J8036
$$ -49252 -19903 -32363 -21653 -39479 -30637 -35272 -16745 -26419 -38472 -27537 -43819 -25783
8493b5783R24j1750j1633K9116r684J129j4604K8996j0763j4028K464K9524k1845
$$ -25783 -24859 -36609 -48242 -19126 -28810 -27681 -42285 -13289 -24052 -38080 -35616 -6092 -27937
8480b7937j4759J1137R582j2756q47r684J7468k1689K4898K843m986J369n399
$$ -27937 -42696 -31559 -21977 -34733 -35580 -45264 -27796 -49485 -24587 -21744 -26730 -25361 -30760
8467c0760O960p120P01k165J0578j7605J651O564K304j0010o91K902j202P514
$$ -30760 -23800 -30920 -30219 -32384 -21806 -39411 -37760 -31196 -28892 -38902 -39593 -36691 -37893 -30379
8453c0379K842K23L945M966j0660R183m865m792o501Q837J0356p467O327p306
$$ -30379 -27537 -27314 -23369 -18403 -29063 -19880 -24745 -29537 -36038 -27201 -16845 -24312 -17985 -25291
8439b5291m30R217o896K205K2100j2194j6907N625N15k25O038j0547J280J8328
$$ -25291 -25721 -16504 -23400 -21195 905 -11289 -28196 -22571 -22056 -22281 -16243 -26790 -25510 -7182
8425g182j180j6931J2798m934M845j4428p615J8711k91L520m080n419Q719J7588
$$ -7182 -8362 -25293 -12495 -17429 -12584 -27012 -34627 -15916 -16207 -12687 -16767 -22186 -13467 4121
8411D121k7007Q612K0321O740j8065L073J836J8591l2586J6983j5216k907P757
$$ 4121 -22886 -14274 6047 12787 -5278 -2205 -369 18222 -14364 2619 -12597 -15504 -7747
8398g747J1057j2970k0169K6731O12j1938J0660R400j5419J3546j3902q060R13
$$ -7747 3310 -9660 -29829 -3098 -2486 -14424 -3764 5636 -9783 3763 -10139 -18199 -17286
8385a7286p385J0867J5613k1742m490N928J5802m0k5329J5905N515j3027Q368
$$ -17286 -24671 -13804 1809 -19933 -24423 -18495 -2693 -2733 -28062 -12157 -6642 -19669 -11301
8372a1301j6340K5165j860l3791K676J3791P956l001j3200N405K9018j5688J201
$$ -11301 -27641 -2476 -4336 -38127 -35451 -21660 -13704 -16705 -29905 -24500 4518 -11170 -9969
8359i969k6324K9917j060j4989j5370K5778J001k0362k0364L4973M54r929K29
$$ -9969 -36293 -6376 -7436 -22425 -37795 -12017 -11016 -31378 -51742 -16769 -16315 -26244 -26015
8346b6015P321k0611J1725M56j2478n201K5204m587l7893K0080J6665J020j5215
$$ -26015 -18694 -39305 -27580 -27124 -39602 -44803 -19599 -24186 -62079 -41999 -25334 -24314 -39529
8333c9529m715J0384J9186l0648K2566J3137j5121j0810J0446J0145o314O88k305
$$ -39529 -44244 -33860 -14674 -45322 -22756 -9619 -24740 -35550 -25104 -14959 -21273 -20585 -22890
8320b2890r5p428K3098q277m669n234L748J6670k4793J6294O046j5618L807o077
$$ -22890 -22985 -30413 -7315 -15592 -20261 -25495 -21747 -5077 -29870 -13576 -7530 -23148 -19341 -25418
8306b5418Q572L646r886Q400j2809Q221j7143K0537j8900O371N169P436k1942
$$ -25418 -16846 -13200 -23086 -14686 -27495 -19274 -36417 -15880 -34780 -28409 -23240 -15804 -37746
8293c7746L488K749R750j8193Q101L166Q881j1342K0653K829k1899J5320n080
$$ -37746 -34258 -31509 -21759 -39952 -31851 -28685 -19804 -31146 -10493 -7664 -29563 -14243 -19323
8280a9323j588j7546J3673j850p520K760J7591J526j1660R499k429p876M018J3045
$$ -19323 -20911 -38457 -24784 -26634 -34154 -31394 -13803 -12277 -23937 -14438 -16867 -24743 -20725 -7680
8266g680j6555r514Q053J4262k4596J7201j83j0011J3035k0160J855R250O524
$$ -7680 -24235 -33749 -25696 -11434 -36030 -18829 -19012 -29023 -15988 -36148 -34293 -25043 -18519
8253a8519j4110J4851P215q818j384Q916j2927Q923k051Q168l87j2953J4777J001
$$ -18519 -32629 -17778 -10563 -19381 -20765 -11849 -24776 -15853 -17904 -9736 -10123 -23076 -8299 -7298
8239g298k6419J5947J3888J458j3287j1451K1638j98n957L24j0353j0684L7013
$$ -7298 -33717 -17770 -3882 -2424 -15711 -27162 -5524 -5722 -11679 -11355 -21708 -32392 4621
8226D621j9327k616p898J6716j5029R916j4758K1944j5938J2811m637k359R091
$$ 4621 -14706 -17322 -25220 -8504 -23533 -13617 -28375 -6431 -22369 -9558 -14195 -16554 -7463
8213g463P075j5084r946K3940m676j0137J8340m346J855M415k5304p381K2308
$$ -7463 -388 -15472 -25418 -1478 -6154 -16291 2049 -2297 -442 3973 -21331 -28712 -6404
8200f404k259R56l011K3796k6817k450M428j7244l531O3563l7340N714J5800o014
$$ -6404 -8663 -7707 -10718 13078 -13739 -16189 -11761 -29005 -32536 31027 -6313 -599 15201 9187
8186I187r961J3273j0580j02K6988k2653P729m759K791q317J7246j4541k913j72
$$ 9187 -774 12499 1919 1817 28805 6152 13881 9122 11913 3596 20842 6301 3388 3216
8172C216J8724J568r223Q285O56L620m588k970k4374J8091n474k842J0219J0564
$$ 3216 21940 23508 14285 22570 23226 26846 22258 19288 -5086 13005 7531 4689 14908 25472
8158B5472j2252K1410m0573J5874Q283M721k8192K8269k5343J6582j5925J4229
$$ 25472 13220 34630 -5943 9931 18214 22935 -5257 23012 -2331 14251 -1674 12555
8146A2555n081o289L1943j1030J470M15P903j2857L0412j0803j4541M504j1882
$$ 12555 7474 1185 33128 22098 23568 23983 31886 19029 49441 38638 24097 28601 16719
8133A6719K25R493J0741j3588N143L559N194q856M525p184K795o2M257j078k81
$$ 16719 16944 26437 37178 23590 28733 32292 37486 28630 33155 25971 28766 28704 32961 31883 31602
8118C1602K70q77J0285Q98j6244K54j529K711Q120j0487R934R237j0022J4107
$$ 31602 31872 30995 41280 42178 25934 26188 24659 27370 35490 25003 34937 44174 34152 48259
8104D8259Q45k301r679J2563j1689K5549j017k0073J8011M607k655Q044k2013
$$ 48259 49104 46803 37124 49687 37998 63547 62530 42457 60468 65075 62420 70464 48451
8091D8451K0714p562K405o642P752q472j276o260J6220k562j0055M621J2564m988
$$ 48451 69165 61603 64008 57366 65118 56646 55370 49110 65330 62768 52713 57334 69898 64910
8077F4910p20j1410J4830J2377k0373J2533k4589K4981J889p211L520K325N451
$$ 64910 64190 52780 67610 79987 59614 72147 47558 72539 74428 67217 70737 73062 78513
8064G8513N535l187k4776L9184k2367j0302J4469K3802k4204j031J1234J3189
$$ 78513 84048 80861 56085 95269 72902 62600 77069 100871 76667 75636 86870 100059
8052A00059K88j7710P032j253l827J1401N052r554P33j08m680P962p783p431Q577
$$ 100059 100347 82637 89669 88416 84589 95990 101042 91488 92221 92113 87433 95395 87612 80181 88758
8037H8758Q794j2103K0090j2265K2653l151j9186k183K922R890q4j7485L2299
$$ 88758 97552 85449 105539 93274 115927 112776 93590 91407 94329 104219 104135 86650 118949
8024A18949k8491J9748L217j374k640O269o840l314J1851j3881M026M323j2021
$$ 118949 90458 110206 113423 112049 109409 115678 108838 105524 117375 103494 107520 111843 99822
8011I9822n071P091j17L005M330O162o860o732J4257j8149M903M019J2542j5117
$$ 99822 94751 101842 101725 104730 109060 115222 108362 101630 115887 97738 102641 106660 119202 104085
7997A04085j0512R047j595M22j3477l402N469J1983k0044L9481k4483Q929J986
$$ 104085 93573 102620 101025 101447 87970 84568 90037 102020 81976 121457 96974 105903 107889
7984A07889k006j383P009j8957J7301l1340J2249N346j634o068J6735N093j7981
$$ 107889 105883 104500 111509 92552 109853 78513 90762 96108 94474 88406 105141 110234 92253
7971I2253J9102n30k6788J3685q504P500N937L813j6338j0004r226K1380M026
$$ 92253 111355 110825 84037 97722 89218 96718 102655 106468 90130 80126 70900 92280 96306
7958I6306j6433O712k452J2066j110J239j2021Q37M814J4121k6300J4245P080
$$ 96306 79873 86585 84133 96199 95089 96328 84307 85144 89958 104079 77779 92024 99104
7945I9104k0776J0499j3451R104k252Q609J144o260J2471M658k2077k984J7333
$$ 99104 78328 88827 75376 84480 82228 90837 91981 85721 98192 102850 80773 77789 95122
7932I5122q042O000j7385N819l383N528J2098j4360j998r318J5757k049n035j052
$$ 95122 87080 93080 75695 81514 78131 83659 95757 81397 79399 70081 85838 83789 78754 77702
7918G7702J842j3865P738L537N829l8808K0610O142O696k1316P954J8415j8919
$$ 77702 79544 65679 73417 76954 82783 43975 64585 70727 77423 56107 64061 82476 63557
7905F3557M952P441k0886Q112l063J7807j5430j9306M1425k6512J8137n39O49
$$ 63557 68509 75950 55064 63176 60113 77920 62490 43184 84609 58097 76234 75695 76344
7892G6344K471j0069K6412k3411K601n601j5422K2480J173j4824K2281j6700l066
$$ 76344 78815 68746 95158 71747 74348 68747 53325 75805 76978 62154 84435 67735 64669
7879F4669J1730q282l772R449n420J0799p966r589K1266l435k3497J5787j1798
$$ 64669 76399 68117 64345 73794 68374 79173 71207 61618 82884 79449 55952 71739 59941
7866E9941N067J7667l094j8347J453L7247j6795m198j6052L8001j7504j260r00
$$ 59941 65008 82675 79581 61234 62687 99934 83139 78941 62889 100890 83386 82126 81226
7853H1226J2451j751K1145m5269j8907M1650r275l324J1008m211r841J7916l7596
$$ 81226 93677 91926 113071 67802 48895 90545 81270 77946 88954 84743 74902 92818 55222
7840E5222K5214p287q851n801j617J181J7787j3838P107J0800l748Q280o328j325
$$ 55222 80436 73149 64298 58497 56880 58061 75848 62010 69117 79917 76169 84449 78121 76796
7826G6796m631o613L666K0528k2335J0432k043N616J3530j7557J2589L81J5719
$$ 76796 72165 65552 69218 89746 67411 77843 75800 81416 94946 77389 89978 90359 106078
7813A06078l162J4064j7606J474R968j3124P795k61K999k1314J3523K19o860q505
$$ 106078 102916 116980 99374 100848 110816 97692 105487 105226 108225 86911 100434 100653 93793 85288
7799H5288J1252K0026l1934J6064r468O851k0611L7525l4168K1125l775J9089
$$ 85288 96540 116566 84632 100696 91228 98079 77468 114993 80825 101950 98175 117264
7787A17264r230j9577K2479M23j2803P017R621j4327N286j4540J9467J5481j3171
$$ 117264 108034 88457 110936 111359 98556 105573 115194 100867 106153 91613 111080 126561 113390
7774A13390L59j823L463Q551L449j0602j0244J4216o424p93J4440j519p986N216
$$ 113390 113749 111926 115389 123940 127389 116787 106543 120759 114335 113542 127982 126463 118477 123693
7760A23693N058j3684k259R461j2319K2629j7457K4406k3796J4257o820j0761
$$ 123693 128751 115067 112808 122269 109950 132579 115122 139528 115732 129989 123169 112408
7748A12408J4318j6928M142O138J2481l682r057l431J4929r782J6659R281j1117
$$ 112408 126726 109798 113940 120078 132559 128877 119820 116389 131318 121536 138195 147476 136359
7735A36359j855Q676Q357j9216K7636k5966L9109k0774Q929R832j4805L727l51
$$ 136359 134504 143180 151537 132321 159957 133991 173100 152326 161255 171087 156282 160009 159658
7722A59658K210q703J2751q888J3333n177l197k756Q655p180J0072p297j3209
$$ 159658 161868 153165 165916 157028 170361 165184 161987 159231 167886 160706 170778 163481 150272
7709A50272J8326R99m553q711N343n312J1474p181k444O549n409R255n276r61
$$ 150272 168598 169597 165044 156333 161676 156364 167838 160657 158213 164762 159353 168608 163332 162371
7695A62371J3007O198L379M694j279J4291K849k4326K6635r809Q226j611O007
$$ 162371 175378 181576 184955 189649 188370 202661 205510 181184 207819 198010 206236 204625 210632
7682B10632J4162k045k5712J4395K934Q121O425k0484M480m591N175L722R647
$$ 210632 224794 222749 197037 211432 214366 222487 228912 208428 212908 208317 213492 217214 226861
7669B26861K451J085K020M20K174l381j3193L502J7253l923O074k5589K2179l957
$$ 226861 229312 230397 232417 232837 235011 231630 218437 221939 239192 235269 241343 215754 237933 233976
7655B33976J6897K709J1876L691o433L29p901K0903o30r824j41O024Q802q138
$$ 233976 250873 253582 265458 269149 262716 263045 255144 276047 275417 265593 265452 271476 280278 272140
7641B72140M75J5034J2466o589M097O518j2130K239Q614j8841J6252r598j2848
$$ 272140 272615 287649 300115 293526 297623 304141 292011 294250 302864 284023 300275 290677 277829
7628B77829M608L3479j7206k882L721N727M570K3388j5933J003M493N690j8815
$$ 277829 282437 315916 298710 295828 299549 305276 309846 333234 317301 318304 322797 328487 309672
7615C09672J7470l829R199o771J3478J5731r984J1591J6500j989K1368k5365l883
$$ 309672 327142 323313 332512 325741 339219 354950 344966 356557 373057 371068 392436 367071 363188
7602C63188Q139Q529k188j4539K3861J0891r387J5304m496l621J6955l024J2539
$$ 363188 371327 379856 377668 363129 386990 397881 388494 403798 399302 395681 412636 409612 422151
7589D22151J4646n263j4089J0532j722Q213J1663j8550J0104J2957J4272j2946
$$ 422151 436797 431534 417445 427977 426255 434468 446131 427581 437685 450642 464914 451968
7577D51968K2780R581q847J4668j8723K9175J187M093j1144J5008P399J4912j8119
$$ 451968 474748 484329 475482 490150 471427 500602 501789 505882 494738 509746 517145 532057 513938
7564E13938J0286J4750o672Q199N912M153J9278o114O94J4755q598J0666r263
$$ 513938 524224 538974 532302 540501 546413 550566 569844 563730 564424 579179 570581 581247 571984
7551E71984L4561r815R140o348J9758p354M841N717O754J5112j9458J0814K7105
$$ 571984 606545 596730 605870 599522 619280 611926 616767 622484 629238 644350 624892 635706 662811
7538F62811k4332J1909J5243Q719R920J3179r495K3575R810N178N783L395K0786
$$ 662811 638479 650388 665631 674350 684270 697449 687954 711529 721339 726517 732300 735695 756481
7525G56481J556k667J0986K4746p050P265l069K7592K709P786K3162L217J0342
$$ 756481 758037 755370 766356 791102 784052 791317 788248 815840 818549 826335 849497 852714 863056
7512H63056j662K9245j0513N718K3812j3254K0990J4362j556M163Q066J3806K0381
$$ 863056 861394 890639 880126 885844 909656 896402 917392 931754 930198 934361 942427 956233 976614
7499I76614O304N271R996J8973J917K6757J101J3680N367n390K1005J7861R676
$$ 976614 982918 988189 998185 1017158 1019075 1045832 1046933 1060613 1065980 1060590 1081595 1099456 1109132
7486A109132J537O877J8038K0927n314j0053J3914L2126l568L711K0473L2940
$$ 1109132 1110669 1117546 1135584 1156511 1151197 1141144 1155058 1187184 1183616 1187327 1207800 1240740
7474A240740M707J0775Q170K496J7154p131L0973R361K1122k307m27N1863j1288
$$ 1240740 1245447 1256222 1264392 1266888 1284042 1276911 1307884 1317245 1338367 1336060 1335633 1387496 1376208
7461A376208K7236J2393J8217K0065K0111J293K2003K1272L2849j3436J0848M6604
$$ 1376208 1403444 1415837 1434054 1454119 1474230 1475523 1497526 1518798 1551647 1538211 1549059 1595663
7449A595663R984K4472q485K9754K1126K4971l98K6170K4289P135M4030r489L1878
$$ 1595663 1605647 1630119 1621634 1651388 1672514 1697485 1697087 1723257 1747546 1754681 1798711 1789222 1821100
7436A821100K9789L0908J6700J2480M4550K2412J1295L0313N4201L1767J6698
$$ 1821100 1850889 1881797 1898497 1910977 1955527 1977939 1989234 2019547 2073748 2105515 2122213
7425B122213K8317L8172M2642K9167K0063L6869L6015M2032L4096L0885K0556
$$ 2122213 2150530 2188702 2231344 2260511 2280574 2317443 2353458 2395490 2429586 2460471 2481027
7414B481027L6573N6345J9376N1819L6820L2856M4909J9211M7355K5634K9320
$$ 2481027 2517600 2573945 2593321 2645140 2681960 2714816 2759725 2778936 2826291 2851925 2881245
7403B881245M4366L8777M4407K1584L9089M0179L1196N1489M8773L5935N1069
$$ 2881245 2925611 2964388 3008795 3030379 3069468 3109647 3140843 3192332 3241105 3277040 3328109
7392C328109M5976M0440M8868O1793L4293N7545M3448N1414N4254L5815O0276
$$ 3328109 3374085 3414525 3463393 3525186 3559479 3617024 3660472 3711886 3766140 3801955 3862231
7381C862231P1766N0246N3617P1888N7329N2682P3221P0897P6914Q7924N2444
$$ 3862231 3933997 3984243 4037860 4109748 4167077 4219759 4292980 4363877 4440791 4528715 4581159
7370D581159Q2724Q7868P3699P7336P3274Q1785R6472Q0346P9505R6652R3079
$$ 4581159 4663883 4751751 4825450 4902786 4976060 5057845 5154317 5234663 5314168 5410820 5503899
7359E503899P7035J07960O7803J19841J03655J02178P9146J18356R9405J09533
$$ 5503899 5580934 5688894 5756697 5876538 5980193 6082371 6161517 6279873 6379278 6488811
7349F488811R4112J11251J15346J07418R1341J32551J34366J12576J14822J28485
$$ 6488811 6582923 6694174 6809520 6916938 7008279 7140830 7275196 7387772 7502594 7631079
7339G631079J43602J30785J36410J43158J57029J59062J53017J49898J68262J68363
$$ 7631079 7774681 7905466 8041876 8185034 8342063 8501125 8654142 8804040 8972302 9140665
7329I140665J86851J51604J84164K00516K01233J81472K13322K02163K29145J96174
$$ 9140665 9327516 9479120 9663284 9863800 10065033 10246505 10459827 10661990 10891135 11087309
7319A1087309K31266K51809K40594K69078K48707K91978K78445K75472K98140
$$ 11087309 11318575 11570384 11810978 12080056 12328763 12620741 12899186 13174658 13472798
7310A3472798L15649L09029L35412L25763L46181L84575L73560L63178L94314
$$ 13472798 13788447 14097476 14432888 14758651 15104832 15489407 15862967 16226145 16620459
7301A6620459M38384M05439M52661M36129M99302N04321M87079N39863N45479
$$ 16620459 17058843 17464282 17916943 18353072 18852374 19356695 19843774 20383637 20929116
7292B0929116N77575O04760O30140O48543P11760P28715P68092Q20351Q52550
$$ 20929116 21506691 22111451 22741591 23390134 24101894 24830609 25598701 26419052 27271602
7283B7271602Q87632R56557R59279J054224J115417J157130J232951J309607J396919
$$ 27271602 28159234 29115791 30075070 31129294 32244711 33401841 34634792 35944399 37341318
7274C7341318J471794J575444J681381J814637J928611K076276K245650K426584
$$ 37341318 38813112 40388556 42069937 43884574 45813185 47889461 50135111 52561695
7266E2561695K620219K838528L085308L362103L685406M031611M444795M911937
$$ 52561695 55181914 58020442 61105750 64467853 68153259 72184870 76629665 81541602
7258H1541602N424887O034400O684210P445307Q286396R232830J0285937J1451000
$$ 81541602 86966489 93000889 99685099 107130406 115416802 124649632 134935569 146386569
7250A46386569J2729297J4143062J5595275J7102611J8529328J9713454K0454724
$$ 146386569 159115866 173258928 188854203 205956814 224486142 244199596 264654320
7243B64654320K0526743J9645627J7656202J4488975J0275386N297797k4985n262500
$$ 264654320 285181063 304826690 322482892 336971867 347247253 352545050 352520065 347257565
7235C47257565r986720j3883215j6781122j8680351j9652217j9764165j9253223
$$ 347257565 337270845 323387630 306606508 287926157 268273940 248509775 229256552
7228B29256552j8311084j7094641j5711308j4274862j2891327j1579218j0385548
$$ 229256552 210945468 193850827 178139519 163864657 150973330 139394112 129008564
7221A29008564r286208q308441p460124o697457o042234n443942m947378m508279
$$ 129008564 119722356 111413915 103953791 97256334 91214100 85770158 80822780 76314501
7213G6314501m114362l749839l444478l188006k925760k746132k507788k349327
$$ 76314501 72200139 68450300 65005822 61817816 58892056 56145924 53638136 51288809
7205E1288809k179028k055288j898268j796511j686755j602127j466887j405285
$$ 51288809 49109781 47054493 45156225 43359714 41672959 40070832 38603945 37198660
7197C7198660j344785j269809j188823j137980j085355j007301r89255r42828
$$ 37198660 35853875 34584066 33395243 32257263 31171908 30164607 29175352 28232524
7189B8232524q76112q44287q10561p92990p40766p15028o77761o76296o27022
$$ 28232524 27356412 26512125 25701564 24908574 24167808 23452780 22775019 22098723 21471701
7180B1471701o32493n89606n45254n65004n36602m98427m77611m80549m47929
$$ 21471701 20839208 20249602 19704348 19139344 18602742 18104315 17626704 17146155 16698226
7171A6698226m52526l79914m16449l97108l56569l53534l39768l15928l37428
$$ 16698226 16245700 15865786 15449337 15052229 14695660 14342126 14002358 13686430 13349002
7162A3349002l04998k93330k74850k92905k60378k43522k50368k41591k48046
$$ 13349002 13044004 12750674 12475824 12182919 11922541 11679019 11428651 11187060 10939014
7153A0939014k21978k09580k24568k23194j79602k14351j79062k12038j57037
$$ 10939014 10717036 10507456 10282888 10059694 9880092 9665741 9486679 9274641 9117604
7144I117604j86357j74012j62276j83708j64383j50063j57424j59309j48724j49104
$$ 9117604 8931247 8757235 8594959 8411251 8246868 8096805 7939381 7780072 7631348 7482244
7134G482244j30515j52255j59948j20181j15283j41140j23763j05237j29123j04463
$$ 7482244 7351729 7199474 7039526 6919345 6804062 6662922 6539159 6433922 6304799 6200336
7124F200336j44679j00215j13207j46191q3170j06867j17564r4027r4409j04093
$$ 6200336 6055657 5955442 5842235 5696044 5612874 5506007 5388443 5294416 5200007 5095914
7114E095914q3822q6440q9547q8139q9890q8457p2042q7062r3847n3672q4975
$$ 5095914 5012092 4925652 4836105 4747966 4658076 4569619 4497577 4410515 4316668 4262996 4178021
7103D178021p9535r0781p5224p6142o3978p8593m8369o5876o7358n6385p3853
$$ 4178021 4098486 4007705 3932481 3856339 3792361 3713768 3665399 3599523 3532165 3475780 3401927
7092C401927n1902p2255m7986o9445m6165o4329m4164p5168l6066m2009o8158
$$ 3401927 3350025 3277770 3229784 3160339 3114174 3049845 3005681 2930513 2894447 2852438 2784280
7081B784280k6175n8966m6762l9557m9313n2157j9363n2480m6582m8603j0878
$$ 2784280 2758105 2699139 2652377 2612820 2563507 2511350 2491987 2439507 2392925 2344322 2333444
7070B333444o6201l7304l4370k6336l3543l7763k7094n9358j5657j4105n9829
$$ 2333444 2267243 2229939 2195569 2169233 2135690 2097927 2070833 2011475 1995818 1981713 1921884
7059A921884p515l9226j418m4520o914l2240O558n1359j5362j5447j8842j2430
$$ 1921884 1914369 1875143 1873725 1829205 1822291 1790051 1796609 1745250 1729888 1714441 1695599 1683169
7047A683169j7478j3682l2607J441n6139k314j6554j0870m3289j3373j0763k1881
$$ 1683169 1665691 1652009 1619402 1620843 1564704 1562390 1545836 1534966 1491677 1478304 1467541 1445660
7035A445660j6098j7363l4581j6913j2594j1499k4882r007k3318k0115r70k8869
$$ 1445660 1429562 1412199 1377618 1360705 1348111 1336612 1311730 1302723 1279405 1259290 1258320 1229451
7023A229451j4483j9695l989q587j3874K2447R817K8640K4907K3880n4553J163
$$ 1229451 1214968 1195273 1191284 1182697 1168823 1191270 1201087 1229727 1254634 1278514 1223961 1225124
7011A225124k5442l6023l8760m2850o7k4348j8796j2758j0884j7735J1875N658
$$ 1225124 1199682 1163659 1124899 1082049 1081982 1057634 1038838 1026080 1015196 997461 1009336 1014994
6999A014994o419r042P025j5417J7651L328M794J8097J9218K1756K1006J9792
$$ 1014994 1008575 999533 1006558 991141 1008792 1012120 1016914 1035011 1054229 1075985 1096991 1116783
6987A116783K1762M8522P7174P7808J49298J69336K49013K09330J52275R0636
$$ 1116783 1138545 1187067 1264241 1342049 1491347 1660683 1909696 2119026 2271301 2361937
6977B361937R629n0815j10499j27101j48028j04336q4079p7115n6603j4002J2063
$$ 2361937 2371566 2320751 2210252 2083151 1935123 1830787 1746708 1669593 1612990 1598988 1611051
6966A611051L4732P3303J68750K43330L27861L71484L26475K93353J93600L6439
$$ 1611051 1645783 1719086 1887836 2131166 2459027 2830511 3156986 3450339 3643939 3680378
6956C680378r4423k26924k63337k90450k98795k83187k16098j88406j07881j00087
$$ 3680378 3585955 3359031 3095694 2805244 2506449 2223262 2007164 1818758 1710877 1610790
6946A610790k7635j2806K5419P5415J10201J74826K04533J54939J40229K1032
$$ 1610790 1583155 1570349 1595768 1671183 1781384 1956210 2160743 2315682 2455911 2476943
6936B476943m2793j46073j91167k03450j86205j80253j48417j16436o5485m2452
$$ 2476943 2434150 2288077 2096910 1893460 1707255 1527002 1378585 1262149 1196664 1154212
6926A154212k7685J8037J9984q018m5080m6728o1988l6061q1149l1580o2529j4175
$$ 1154212 1126527 1144564 1164548 1156530 1111450 1064722 1002734 966673 885524 853944 791415 777240
6914G77240m0444j8163k4122K294j0467J0437K0472N0147Q3775Q6904O5662N2005
$$ 777240 736796 718633 694511 696805 686338 696775 717247 767394 851169 938073 1003735 1055740
6902A055740M4908M804l7791r5772o5098p4412n7821o9166o7004m5930K319l9439
$$ 1055740 1100648 1105452 1067661 971889 906791 832379 774558 705392 638388 592458 594777 555338
6890E55338n409k4757J0692J1496J2209L9289N2147M1829K4015k1821J5802l9962
$$ 555338 549929 525172 535864 547360 559569 598858 651005 692834 716849 695028 710830 670868
6878F70868m1895m3411p3185k7212n1370l4716l1103K821j9266l2202j8315J4356
$$ 670868 628973 585562 512377 485165 433795 399079 367976 370797 351531 319329 301014 315370
6866C15370k6029J1393q327l137J3753l540J1884L922l899l621j2184q494O408
$$ 315370 289341 300734 292407 289270 303023 299483 311367 315289 311390 307769 295585 287091 293499
6853B93499j1063m828j3698m133l549L972k0285L199r046j1401L784K173j587
$$ 293499 282436 277608 263910 259777 256228 260200 239915 243114 234068 222667 226451 228624 227037
6840B27037j1324J1165l2418J4563q685P200j9732J2456q931K114J715J2391o013
$$ 227037 215713 226878 194460 209023 200338 207538 187806 200262 191331 193445 195160 207551 201538
6827B01538m396L906o187p852j9294m874L1107k3576l798j7285P296P565o897
$$ 201538 197142 201048 194861 187009 167715 162841 193948 170372 166574 149289 156585 164150 157253
6814A57253n244j5713K4690q670J458M664j1427J4837J658j5246Q53o051j554
$$ 157253 152009 136296 160986 152316 153774 158438 147011 161848 163506 148260 149113 143062 141508
6801A41508j2211k194K0054l3647l596j1653J5221j305r24r105J443J2055N57
$$ 141508 129297 127103 147157 113510 109914 98261 113482 112177 111253 102148 103591 115646 116203
6788A16203j3596M050N075R068j1604m832L0885K774j4777q937O401J66Q0k4751
$$ 116203 102607 106657 111732 120800 109196 104364 135249 138023 123246 114309 120710 120876 120956 96205
6774I6205J0359J6192J599l2705K9499j1989J6331k0904J2881m915j2861K0733
$$ 96205 106564 122756 124355 91650 121149 109160 125491 104587 117468 112553 99692 120425
6762A20425j5332r26K7583k0118k754m860J3938J0761j0532K4373m010L961l0678
$$ 120425 105093 104167 131750 111632 108878 104018 117956 128717 118185 142558 138548 142509 111831
6749A11831P348q608n549j6696q695N010j0668p44J0691m412J394N288l6608K2742
$$ 111831 119179 110571 105022 88326 79631 84641 73973 73229 83920 79508 80902 86190 49582 72324
6735G2324R419J3818k4383K0713J517p347p924j5450J8723l981Q384p849P494
$$ 72324 81743 95561 71178 91891 93408 86061 78137 62687 81410 77429 85813 77964 85458
6722H5458k1527m676P320j8013J3506k2431J0801Q707R24P138k123k2267j343
$$ 85458 63931 59255 66575 48562 62068 39637 50438 59145 60069 67207 65084 42817 41474
6709D1474k316K2221k3986J1143N990N173O744j5278J6311M659k1493K2611j699
$$ 41474 39158 61379 37393 48536 54526 59699 66443 51165 67476 72135 50642 73253 71554
6696G1554P519j2766k111k0041J7642J737k0948K480O326P33O74j5712L2659j0156
$$ 71554 79073 66307 64196 44155 61797 63534 42586 45066 51392 52125 52799 37087 69746 59590
6682E9590R443j8959K7264J9121n557N34j7285R947k840n894l200j0113K4060
$$ 59590 69033 50074 77338 96459 90902 91436 74151 84098 81258 75364 72164 62051 86111
6669H6111k3790l655L501Q346k3762J0328p347k447J3184p331P592j3987K2192
$$ 86111 62321 58666 62167 70513 46751 57079 49732 47285 60469 53138 60730 46743 68935
6656F8935J3183K3269J0676L6840J700J3450J0639l5926j765k4201j8992k3411
$$ 68935 82118 105387 116063 152903 154603 168053 178692 142766 141001 116800 97808 74397
6644G4397O646j8685J142k1787R162L920o001N179J2055k1423J4108K755p84P597
$$ 74397 81043 62358 63500 41713 50875 54795 48794 53973 66028 44605 58713 61468 60684 68281
6630F8281L055l87K1574K534K8464L8178L0255k7948L536j5988L354k6418k1645
$$ 68281 71336 70949 92523 95057 123521 161699 191954 164006 167542 151554 154908 128490 106845
6617A06845j3671o651j0869k2396k500k2664N248J6824k3872J5329j6134J2370
$$ 106845 93174 86523 75654 53258 50758 28094 33342 50166 26294 41623 25489 37859
6605C7859k2036J7811P42R586o664J8651K822J07J5534j2558p49K0716j1369l532
$$ 37859 15823 33634 34376 43962 37298 55949 58771 58878 74412 61854 61105 81821 70452 66920
6591F6920M092n869k854m3782J8662j8390O924j2746r12K918R347r782j4106n537
$$ 66920 71012 65143 62289 18507 37169 18779 25703 12957 12045 14963 24310 14528 422 -5115
6577e115J1596M893j0223J037k572J7540j0026k359j2008kJ92q842K539J3329
$$ -5115 6481 11374 1151 2188 -384 17156 7130 4771 -7237 -7239 -7047 -15889 -13350 -21
6563b1J902j0182J1254L001j1160R636M85P783j9629K3951k8994J9595j8124J4997
$$ -21 1881 -8301 2953 5954 -5206 4430 4915 12698 -6931 17020 -11974 7621 -10503 4494
6549D494J2025j5264n468o311J1101l150l85l004l262K9123k5907j0205l929K0134
$$ 4494 16519 1255 -4213 -10524 577 -2573 -2958 -5962 -9224 19899 -6008 -16213 -20142 -8
6535hr815o043m245J1900k604J2190o825k0737K6607k2350Q082J3103n027k1416
$$ -8 -9823 -15866 -20111 -8211 -10815 1375 -5450 -26187 420 -21930 -13848 -745 -5772 -27188
6521b7188J3143k069Q310M190j7658N219Q602M865n402o244m883J939k528J1462
$$ -27188 -14045 -16114 -7804 -3614 -21272 -16053 -7451 -2586 -7988 -14232 -19115 -17176 -19704 -8242
6507h242m387r892R349m460l032J5742l3910K1074j7249K4333j305p585q190K501
$$ -8242 -12629 -22521 -13172 -17632 -20664 -4922 -38832 -17758 -35007 -10674 -11979 -19564 -27754 -25253
6493b5253O430P856q45n376O525M813j0766j2289J5424k062L372n708N200M072
$$ -25253 -18823 -10967 -11812 -17188 -10663 -5850 -16616 -28905 -13481 -15543 -12171 -17879 -12679 -8607
6479h607j0019J6429j6460M581J0095O304k8679J4158j0477N239q289Q718R767
$$ -8607 -18626 -2197 -18657 -14076 -3981 2323 -26356 -12198 -22675 -17436 -25725 -17007 -7240
6466g240j025j7514N526K6337j7152q488J0740M609j0538J6697j5984J0396j3671
$$ -7240 -8265 -25779 -20253 6084 -11068 -19556 -8816 -4207 -14745 1952 -14032 -3636 -17307
6453a7307K7687k3231L361j322q59K676j2086J8984m191K2680m0468L0075j198
$$ -17307 10380 -12851 -9490 -10812 -11671 -8995 -21081 -2097 -6288 16392 -24076 5999 4801
6440D801j3010j4239J1044K733L833l522J6605n919j3910J2364N44q292J0129
$$ 4801 -8209 -22448 -11404 -8671 -4838 -8360 8245 2326 -11584 780 1324 -6968 3161
6427C161n258m418J5541j9293p290m745J1826j877n030R534j2441O294J2390N628
$$ 3161 -2097 -6515 9026 -10267 -17557 -22302 -10476 -12353 -17383 -7849 -20290 -13996 -1606 4022
6413D022j7197J7245l638n273j2763N099J2324q703J453J262j5071K4052j4670
$$ 4022 -13175 4070 432 -4841 -17604 -12505 -181 -8884 -7431 -6169 -21240 2812 -11858
6400a1858K62L786J3017j3940j1763L1380p572q843J8162O029j5762l51l470K6981
$$ -11858 -11596 -7810 5207 -8733 -20496 10884 3312 -5531 12631 18660 2898 2547 -923 26058
6386B6058k3470K0754j9545o95N67J9577j7832J448O211j2400J0613l942J2377
$$ 26058 2588 23342 3797 3102 3669 23246 5414 6862 13073 673 11286 7344 19721
6373A9721j0284j259j0036K3195j3806Q795j5409k27J4621K935q907o75q442N717
$$ 19721 9437 8178 -1858 21337 7531 16326 917 690 15311 18246 9339 8664 222 5939
6359E939o049j666R727k76J6384k2061L638J2459J5206r485M976K761j1035J2137
$$ 5939 -110 -1776 7951 7675 24059 1998 5636 18095 33301 23816 28792 31553 20518 32655
6345C2655r966J3942J5007j0520M313J8994J3513j0652L6499k3055o009J4663
$$ 32655 22689 36631 51638 41118 45431 64425 77938 67286 103785 80730 74721 89384
6333H9384j1574l250J5840j5843J7662r791P480M619l694n471K7622l859J0855
$$ 89384 77810 74560 90400 74557 92219 82428 89908 94527 90833 85362 112984 109125 119980
6320A19980j7071j1094M065J6445j7290o580J7332J465J3444J19J5626K4822J7870
$$ 119980 102909 91815 95880 112325 95035 88455 105787 107252 120696 120815 136441 161263 179133
6307A79133N524J5508K2440J5868J260L955N786Q795M941k653J5885k4788j0700
$$ 179133 184657 200165 222605 238473 239733 243688 249474 258269 263210 260557 276442 251654 240954
6294B40954o422l0621N789m039m4216N93j3202j4435o17k5444j626O400k058P825
$$ 240954 234532 203911 209700 205661 161445 162038 148836 134401 133784 108340 106714 113114 111056 118881
6280A18881l612K1098M097R175L4004J6107K0453K6036K939J1758R882k731j5490
$$ 118881 115269 136367 140464 149639 183643 199750 220203 246239 249178 260936 270818 268087 252597
6267B52597j7770j0292o886n771k7430n690M613j7144O23n804O083k459k1470
$$ 252597 234827 224535 217649 211878 184448 178758 183371 166227 166850 161046 167129 164670 143200
6254A43200j2813L412K989r413j0285P219j695K3850j9350J1146J4676M422j1237
$$ 143200 130387 133799 136788 127375 117090 124309 122614 146464 127114 138260 152936 157358 146121
6241A46121R734j7660L1656p697j2087M2106N434j7279K4728k0934K9903P319
$$ 146121 155855 138195 169851 162154 150067 192173 197607 180328 205056 184122 214025 221344
6229B21344K665J0460l825O611O913k1836P383L143R096k7336k0513K4075Q81
$$ 221344 224009 234469 230644 237255 244168 222332 229715 232858 241954 214618 194105 218180 219061
6216B19061M414p746J7282j799o185K906L191q588k5964L8623j9146J3053O737
$$ 219061 223475 215729 233011 231212 225027 227933 231124 222536 196572 235195 216049 229102 235839
6203B35839P23P772j3991R158J2385k6267j0077J1113M340J0490R298K3241j1694
$$ 235839 236562 244334 230343 239501 251886 225619 215542 226655 230995 241485 250783 274024 262330
6190B62330N695J2357Q095J2091J9592L1984J9604J7528M3738K1900N4071L4985
$$ 262330 268025 280382 288477 300568 320160 352144 371748 389276 433014 454914 508985 543970
6178E43970J7635L5296M5199J7432R681J243K041J3866J6817J2460K9323K4537
$$ 543970 561605 596901 642100 659532 669213 670456 672497 686363 703180 715640 744963 769500
6166G69500L7942N2457P8834J34507J29758J51735J88986J68230J20442J11491
$$ 769500 807442 859899 938733 1073240 1202998 1354733 1543719 1711949 1832391 1943882
6156A943882L9291j7625n7763p4928n7557p5633p7365l7728j4450l3722M5681
$$ 1943882 1983173 1965548 1907785 1832857 1775300 1699667 1622302 1584574 1570124 1536402 1582083
6145A582083N7111Q3477J15385J89374J81517K39641K05331J93827Q4184K8532
$$ 1582083 1639194 1722671 1838056 2027430 2208947 2448588 2653919 2847746 2931930 2960462
6135B960462n0241j39063j85277k09983k12945k17758j65524j82747r1513q4047
$$ 2960462 2910221 2771158 2585881 2375898 2162953 1945195 1779671 1596924 1505411 1421364
6125A421364o1016o668M1612L1882N2081Q4443Q4732R9764M0947K6732l6184q8206
$$ 1421364 1360348 1353680 1395292 1427174 1479255 1563698 1648430 1748194 1789141 1815873 1779689 1691483
6113A691483o7438r6132r4096q9553j06797j04137r3526r1350r7361o3596p9580
$$ 1691483 1624045 1527913 1433817 1344264 1237467 1133330 1039804 948454 851093 787497 707917
6102G07917m4279n1297l1323j2401l3687k8345K7580o840J4258K3034L5828K5046
$$ 707917 663638 612341 581018 568617 534930 506585 534165 527325 541583 564617 600445 625491
6090F25491L0758J476K3291N010k3684R679K9802K4456K5348r582j0400l2289
$$ 625491 656249 657725 681016 686026 662342 672021 701823 726279 751627 742045 731645 699356
6078F99356l2935l6572k6237j1787L724J6293M2204K5608N8658K3689L1033k2427
$$ 699356 666421 629849 603612 591825 595549 611842 654046 679654 738312 762001 793034 770607
6066G70607M50j7815l8652k4858l5120k9311k8170l3582l2648r273o0J0856j6396
$$ 770607 771057 753242 714590 689732 654612 625301 597131 563549 530901 521628 521568 532424 516028
6053E16028J5193J3562K228M2542j5421K5091j0438q74l4100j1445k9198r541
$$ 516028 531221 544783 547011 589553 574132 599223 588785 587911 553811 542366 513168 503627
6041E03627l4358L294k1749k8059j2749M329o905j2605k259n632J442J1744R714
$$ 503627 469269 472563 450814 422755 410006 414335 407430 394825 392566 386934 388376 400120 409834
6028D09834j5441k50J1755K001P131n793J182Q552R363P615O964J4125K59q074
$$ 409834 394393 394143 405898 407899 415030 409237 410419 418971 428334 435949 442913 457038 457297 449223
6014D49223J3037M14K2868J9243r910J9005J9317J6008R260j3679J4804K0795
$$ 449223 462260 462674 485542 504785 494875 513880 533197 549205 558465 544786 559590 580385
6002E80385J4447K2470r38K9245J62J0724K4579J4904K6400K1475L4025r88L1610
$$ 580385 594832 617302 616364 645609 645771 656495 681074 695978 722378 743853 777878 776890 808500
5989H08500K8765L2122M1049R184P5171M3687M4593N0686M0463Q0174M2420P3558
$$ 808500 837265 869387 910436 919620 994791 1038478 1083071 1133757 1174220 1254394 1296814 1370372
5977A370372J01983J31937J28696J33137J30901J78281K03367L31289N83809J126092
$$ 1370372 1472355 1604292 1732988 1866125 1997026 2175307 2378674 2709963 3293772 4419864
5967D419864J297587J015607N56315M35734N67384Q33065J829040J569773Q15126
$$ 4419864 5717451 6733058 7289373 7725107 8292491 9125556 10954596 12524369 13339495
5958A3339495L72008J14726J78443J283890K032203J353634J40515m03447o19263
$$ 13339495 13711503 13826229 14004672 15288562 17320765 18674399 18814914 18411467 17792204
5949A7792204j214500n8522r4573m80476p94008j179634j321826j175994o59117
$$ 17792204 16577704 16519182 16424609 15944133 15150125 13970491 12648665 11472671 10813554
5940A0813554n96374p89518q52438r90920j226298j070839r03949o54675n17161
$$ 10813554 10217180 9427662 8575224 7584304 6358006 5287167 4383218 3728543 3211382
5931C211382m65962l89675k38614j94973j46834j17422r7202p3541o7659n1423
$$ 3211382 2745420 2355745 2117131 1922158 1775324 1657902 1560700 1487159 1419500 1368077
5921A368077q2500l1136m7294l8678n0160o811m0182k9277l0503j8618n1744l9117
$$ 1368077 1285577 1254441 1207147 1168469 1118309 1111498 1071316 1042039 1011536 992918 941174 902057
5909I02057j9490l9942k3504K81l7350l6006j7676J519m5042q659j7817k5600
$$ 902057 882567 842625 819121 819402 782052 746046 728370 729889 684847 676188 658371 632771
5897F32771k9119J2010m2347k0423p84k6949P057q638j7574m099k1793r939N536
$$ 632771 603652 615662 573315 552892 552108 525159 532216 523578 506004 501905 480112 470173 475709
5884D75709k9189k161k3712l10j0076L699l3126L767l558k4288J1728j7025P895
$$ 475709 446520 444359 420647 420337 410261 413960 380834 384601 381043 356755 368483 351458 359353
5871C59353p660o427p210K649O669k960j9402r090R487o62k8731J1704Q2j6840
$$ 359353 351693 345266 338056 340705 347374 344414 325012 315922 325409 324747 296016 307720 307802 290962
5857B90962k86L998k5624P998j3709r562m697J2673k6579J6858k163k8904J0889
$$ 290962 290676 294674 269050 277048 263339 253777 249080 261753 235174 252032 249869 220965 231854
5844B31854k7616J9052p324J229j1759J8481j5727o13R156K276j5429O842O695
$$ 231854 204238 223290 215966 217195 205436 223917 208190 207577 216733 219009 203580 210422 217117
5831B17117r065P339k5441K4893k5934O8p296Q486p347M206k585n335M104J0888
$$ 217117 208052 215391 189950 214843 188909 188977 181681 190167 182820 187026 184441 179106 183210 194098
5817A94098l624k3049p312J0988k289O334k3143J7952N705j9070P874n01O28j4273
$$ 194098 190474 167425 160113 171101 168812 175146 152003 169955 175660 156590 164464 163963 164591 150318
5803A50318J6089l483J0261j5530J3864j2544Q244K238N66k103J4289N455n785
$$ 150318 166407 162924 173185 157655 171519 158975 167219 169457 170023 167920 182209 187664 181879
5790A81879J5770Q418j8454m168k936m138P103m019k1551l7J9503r992K919r682
$$ 181879 197649 206067 187613 183445 180509 176371 183474 179455 157904 157867 177370 167378 170297 160615
5776A60615J852J5847q70J784J3912L178N631M257L663K3057j7880P473J0139
$$ 160615 162467 178314 177444 179228 193140 196318 201949 206206 209869 232926 215046 222519 232658
5763B32658N474K2330N733O521J1561J2272O884M975o762N045M11R85R47L507
$$ 232658 238132 260462 266195 272716 284277 296549 303433 308408 301646 306691 307102 308087 309034 312541
5749C12541J2111j9970J8163n746L1252j2348J7611P680K078K5818J0007k265
$$ 312541 324652 304682 322845 317099 348351 336003 353614 361294 363372 389190 399197 396932
5737C96932K5130J4835n046K7078J5693P310K4789K205K5184R863K473N456Q005
$$ 396932 422062 436897 431851 458929 474622 481932 506721 508926 534110 543973 546446 551902 559907
5724E59907P177J2230k2756j414L8141J580J9041J2177K5619O227K2143K2809
$$ 559907 567084 579314 556558 555144 593285 594865 613906 626083 651702 657929 680072 702881
5712G02881N916J940J4334R315K0557j717O432k87j2628J2511M461j2838P333
$$ 702881 708797 710737 725071 734386 754943 753226 759658 759371 746743 759254 763715 750877 758210
5699G58210J0985O412M286J9291K4652J6787j149K8175L9237L2104L7475L0158
$$ 758210 769195 775607 779893 799184 823836 840623 839474 867649 906886 938990 976465 1006623
5687A006623M2699O3451L1772M3215N5678L2509L8168K3148P6169L1671O3533
$$ 1006623 1049322 1112773 1144545 1187760 1243438 1275947 1314115 1337263 1413432 1445103 1508636
5676A508636O0122O6598Q7367J04602O2755R6234J10868J11797Q2714R7093R8112
$$ 1508636 1568758 1635356 1722723 1827325 1890080 1986314 2097182 2208979 2291693 2388786 2486898
5665B486898R4540P9829N9060O1382N6426K9555j2516j7583L641l1101j2550j0889
$$ 2486898 2581438 2661267 2720327 2781709 2838135 2867690 2855174 2837591 2841232 2810131 2797581 2786692
5653B786692K1197K6378P8602R1771J15454J71973K01001K14904K48691K88614
$$ 2786692 2807889 2834267 2912869 3004640 3120094 3292067 3493068 3707972 3956663 4245277
5643D245277L11341L21899K97051K83605K45369K10647J26550J05596L7960K2944
$$ 4245277 4556618 4878517 5175568 5459173 5704542 5915189 6041739 6147335 6185295 6208239
5633F208239j9950m9811j01541j30482j42744j93955j93994j91158j69830j39695
$$ 6208239 6188289 6138478 6036937 5906455 5763711 5569756 5375762 5184604 5014774 4875079
5623D875079j27320n8194j822L2015J06491J37469J63731K53180K60603L10016
$$ 4875079 4747759 4689565 4687743 4719758 4826249 4963718 5127449 5380629 5641232 5951248
5613E951248L35446L18830L16347K87082K12681J72729J04529m909n0361j04145
$$ 5951248 6286694 6605524 6921871 7208953 7421634 7594363 7698892 7693983 7643622 7539477
5603G539477j19467j56969k08944j67218j62754j50700j05507q8216l7308p139
$$ 7539477 7420010 7263041 7054097 6886879 6724125 6573425 6467918 6379702 6342394 6335255
5593F335255J7482M4049K7548K2552R072l2100j7420k2184k0691k605R12N3186
$$ 6335255 6352737 6396786 6424334 6446886 6455958 6423858 6406438 6384254 6363563 6360958 6361870 6415056
5581F415056P4265O7322R0673L4737J8003r660n0670o8605r2675o8513l7019J7345
$$ 6415056 6489321 6556643 6647316 6682053 6700056 6690396 6639726 6571121 6478446 6409933 6372914 6390259
5569F390259R0778J05946J53178J50485R3663K4540n4684j51522k46697k89652
$$ 6390259 6481037 6586983 6740161 6890646 6984309 7008849 6954165 6802643 6555946 6266294
5559F266294l55286l47637l48053l17292l14394k63614k14036j82431j55349j01080
$$ 6266294 5911008 5563371 5215318 4898026 4583632 4320018 4105982 3923551 3768202 3667122
5549C667122p9148l5359j2361o530J7060J8898N6585M1732O4641R5441J04461
$$ 3667122 3587974 3552615 3540254 3533724 3550784 3569682 3626267 3667999 3732640 3828081 3932542
5538C932542P8402J21811P2989J09223Q5374N4335M2048J4893P739m8500j04522
$$ 3932542 4010944 4132755 4205744 4314967 4400341 4454676 4496724 4511617 4519356 4470856 4366334
5527D366334j16892j32646j50180j87961j78656j39528j34561j09414p1432m5272
$$ 4366334 4249442 4116796 3966616 3778655 3599999 3460471 3325910 3216496 3145064 3099792
5517C099792j1306J1033J7338N7562K5294P3797O6206Q0446J21044J43195J65900
$$ 3099792 3088486 3099519 3116857 3174419 3199713 3273510 3339716 3420162 3541206 3684401 3850301
5506C850301K22169K30731K51397K86308K56831K21870K13554J40492Q3672K147
$$ 3850301 4072470 4303201 4554598 4840906 5097737 5319607 5533161 5673653 5757325 5759472
5496E759472n7766r6067j29813j46511j43572j31238j22288j06246r0377p3531
$$ 5759472 5701706 5605639 5475826 5329315 5185743 5054505 4932217 4825971 4735594 4662063
5486D662063p2417p6714p3798q0474n8129o3201k6700k0388K3062M5787R9589
$$ 4662063 4589646 4512932 4439134 4358660 4300531 4237330 4210630 4190242 4213304 4259091 4358680
5475D358680J23241J51193J67982J33780J02337L7620l9445j09869j55067k42046
$$ 4358680 4481921 4633114 4801096 4934876 5037213 5074833 5035388 4925519 4770452 4528406
5465D528406k48801k34002k55737k21533j95060j74503j46665j31671q8313o3736
$$ 4528406 4279605 4045603 3789866 3568333 3373273 3198770 3052105 2920434 2832121 2768385
5455B768385p2428o2104l2056m4776j6991m1571k1999o9614j1649m5752k5236
$$ 2768385 2695957 2633853 2601797 2557021 2540030 2498459 2476460 2406846 2395197 2349445 2324209
5444B324209p5390m4679m6362m7831m3360j9768l9357k2968n594q930K0561N486
$$ 2324209 2248819 2204140 2157778 2109947 2066587 2046819 2007462 1984494 1978900 1969970 1990531 1996017
5432A996017k510M5012L5979J9639L1359K4242K8398J0554l498O657j4631r650
$$ 1996017 1993507 2038519 2074498 2094137 2125496 2149738 2178136 2188690 2185192 2191849 2177218 2167568
5420B167568l9320o6706l4230l4165m5365l8263l8190n2035J2438K0783N489L3737
$$ 2167568 2128248 2061542 2027312 1993147 1947782 1909519 1871329 1819294 1831732 1852515 1858004 1891741
5408A891741N7139M7759O7572J08364Q2904J31205N9436J05342M7879P2072J2533
$$ 1891741 1948880 1996639 2064211 2172575 2255479 2386684 2446120 2551462 2599341 2671413 2683946
5397B683946j1735n4828l4747q6772j00181r6187q6763j13688q8651p9557o0547
$$ 2683946 2672211 2617383 2582636 2495864 2395683 2299496 2212733 2099045 2010394 1930837 1870290
5386A870290m5353m1799k7753k7263j2174J0191l8696Q972j3443l1567l3489l3861
$$ 1870290 1824937 1783138 1755385 1728122 1715948 1726139 1687443 1696415 1682972 1651405 1617916 1584055
5374A584055n5481n6287p5555p5632n2247r8507r0346n6878p8881l4946q6850
$$ 1584055 1528574 1472287 1396732 1321100 1268853 1170346 1080000 1023122 944241 909295 822445
5363H22445j9902m1367k5995m3138J501k4019j5515j4161k293r870P073j7654
$$ 822445 802543 761176 735181 692043 693544 669525 654010 639849 637556 627686 634759 617105
5351F17105K2551j3680J1015j8340o108j5026O155p192k2053O43j9145J2945j4687
$$ 617105 639656 625976 636991 618651 612543 597517 603672 596480 574427 575070 555925 568870 554183
5338E54183j7640j3816J1805J731K3797j2061j4649L2019n077J7743N03J7718
$$ 554183 536543 522727 534532 536263 560060 547999 533350 565369 560292 578035 578538 596256
5326E96256l644Q483j6967K5945k79j0348l714j8153p073j1060m195j4164r522
$$ 596256 592612 601095 584128 610073 609794 599446 595732 577579 570506 559446 555251 541087 531565
5313E31565n717k953L474j3503K6434l8210J5051J598K3253l853m275K3355k944
$$ 531565 525848 522895 526369 512866 539300 501090 516141 517739 540992 537139 532864 556219 553275
5300E53275J0071J7194k1513O995J636Q981P709K0788m64o15J1015K3673M4423
$$ 553275 563346 580540 559027 566022 567658 576639 584348 605136 604672 604057 615072 638745 683168
5287F83168L7924J9500N8339L7590P0596O7676P3041P6422P6269P4633N1387P0066
$$ 683168 721092 740592 798931 836521 907117 974793 1047834 1124256 1200525 1275158 1326545 1396611
5275A396611O7438L2795N2666L6786N7919K3174J9543M2016J2379J9704M9451
$$ 1396611 1464049 1496844 1549510 1586296 1644215 1667389 1686932 1728948 1741327 1761031 1810482
5264A810482M3975O6003N3216R0421R5334J05771R5352J00103Q7378P7187O1735
$$ 1810482 1854457 1920460 1973676 2064097 2159431 2265202 2360554 2460657 2548035 2625222 2686957
5253B686957L9028K2180k4704l8072p4904q4838j14712j06832j22509j07815r2388
$$ 2686957 2725985 2748165 2723461 2685389 2610485 2525647 2410935 2304103 2181594 2073779 1981391
5242A981391j28213q1430m9966q2863o4159l0570j5979l897j8525J2271m989P45
$$ 1981391 1853178 1771748 1721782 1638919 1574760 1544190 1528211 1524314 1505789 1518060 1513071 1513816
5230A513816R224k7248m0976k0752n8202q1034p3808p1157r3492o8996j12398
$$ 1513816 1523040 1495792 1454816 1434064 1375862 1294828 1221020 1149863 1056371 987375 874977
5219H74977n7611m0784p2812o2963l9819m3615k9989j6897m7754j8288l2637o459
$$ 874977 817366 776582 703770 640807 600988 557373 527384 510487 462733 444445 411808 405349
5207D05349l6797j0043k4388l774k9533M384p207j5572O958j3168o102J6541J600
$$ 405349 368552 358509 334121 330347 300814 305198 297991 282419 289377 276209 270107 286648 288248
5194B88248k3338M981j2976n883k0109N744j1345N42k9651P223k0778J4475j3984
$$ 288248 264910 269891 256915 251032 230923 236667 225322 225864 196213 203436 182658 197133 183149
5181A83149N407q880J1992j5214P746J5859K902o987j4463J1822O966p641k4210
$$ 183149 188556 179676 191668 176454 184200 200059 202961 195974 181511 193333 200299 192658 168448
5168A68448K6963j1138J6555J947j3125J1266P462k8131J1346k883j8107Q776
$$ 168448 195411 184273 200828 202775 189650 200916 208378 180247 191593 188710 170603 179379
5156A79379j7889j1264K4526j5761j4108J0318j2188L022O057j6889J7128M495
$$ 179379 161490 150226 174752 158991 144883 155201 143013 146035 152092 135203 152331 156826
5144A56826p568O620j5318J1533J7920k2131l678J8699K3020k1385k185J1627
$$ 156826 149258 155878 140560 152093 170013 147882 144204 162903 185923 164538 162353 173980
5132A73980L0094k7845Q906l434Q788k8934R137j258M083P991l878J2272j295
$$ 173980 204074 176229 185135 181701 190489 161555 170692 169434 173517 181508 177630 189902 188607
5119A88607P122M480J8876o244k102l479J6884p251R513k1099Q019p212K2570
$$ 188607 195729 200209 219085 212841 210739 207260 224144 216893 226406 205307 213326 206114 228684
5106B28684j1236N608J1867p723L787K8593o730n001J3494m188K6323N371J1302
$$ 228684 217448 223056 234923 227200 230987 259580 252850 247849 261343 257155 283478 288849 300151
5093C00151J6994M386K4408K2198N3846P648M2668J6367N4115M9165L0260Q0950
$$ 300151 317145 321531 345939 368137 421983 429631 472299 488666 542781 591946 622206 703156
5081G03156N0999N1780O0333L1969N3209j9362J3149n3172n2428l9814n1853k4858
$$ 703156 754155 805935 866268 898237 951446 932084 945233 892061 839633 799819 747966 723108
5069G23108j8548k6342J5260j3547K4368M2366R941L5073J3607O4766O5318N8921
$$ 723108 704560 678218 693478 679931 704299 746665 756606 791679 805286 870052 935370 994291
5057I94291R7878J07542J36943J48678J35324J35288J41147J63301J71396J50812
$$ 994291 1092169 1199711 1336654 1485332 1620656 1755944 1897091 2060392 2231788 2382600
5047B382600R8536M9758m6724r4486j38388j59174j47993j30499j09383p8804
$$ 2382600 2481136 2530894 2484170 2389684 2251296 2092122 1944129 1813630 1704247 1625443
5037A625443m3471m6434j3894O630R079O3207K6528R3643Q2507J40524J26065
$$ 1625443 1581972 1535538 1521644 1528274 1537353 1600560 1627088 1720731 1803238 1943762 2069827
5026B069827J79104J74953J77464J97676K06661K15323K30250K03936J61058R4733
$$ 2069827 2248931 2423884 2601348 2799024 3005685 3221008 3451258 3655194 3816252 3910985
5016C910985j5606q7426j69981k29869k48988k48509k21932j70809j31755j17824
$$ 3910985 3895379 3807953 3637972 3408103 3159115 2910606 2688674 2517865 2386110 2268286
5006B268286n7839M293Q400N0288R7651J18761J17623J23551J54072J39274J38019
$$ 2268286 2210447 2214740 2223140 2273428 2371079 2489840 2607463 2731014 2885086 3024360 3162379
4995C162379J32985J42002J10882J18479R8754R0718K4799L4760o4711j05425
$$ 3162379 3295364 3437366 3548248 3666727 3765481 3856199 3880998 3915758 3851047 3745622
4985C745622j79634k19480j97191k31177j82626j99832j16430j04669n6753o9856
$$ 3745622 3565988 3346508 3149317 2918140 2735514 2535682 2419252 2314583 2257830 2187974
4975B187974L826M6810O6083R0597J03087J47588J44902J59480Q9360R6936J8423
$$ 2187974 2191800 2238610 2304693 2395290 2498377 2645965 2790867 2950347 3039707 3136643 3155066
4964C155066Q908q4369m1916p2923r2369j08577j40381j21444j28230j35999j67108
$$ 3155066 3163974 3079605 3037689 2964766 2872397 2763820 2623439 2501995 2373765 2237766 2070658
4953B070658j14024j13140j06551r9234o6866o9722n0449j8028k6169o304M9698
$$ 2070658 1956634 1843494 1736943 1637709 1570843 1501121 1450672 1432644 1406475 1400171 1449869
4942A449869N0104P0494Q8457Q4721J09286P9225M1256j7653m5826o6446j26175
$$ 1449869 1499973 1570467 1658924 1743645 1852931 1932156 1973412 1955759 1909933 1843487 1717312
4931A717312j05818j29360r9492j04517q2975j08678l3052q4441l8647n4274l8738
$$ 1717312 1611494 1482134 1382642 1278125 1195150 1086472 1053420 968979 930332 876058 837320
4920H37320l7326l4365k6853o988k0939q215O940l331n071J0280R886J1071l967
$$ 837320 799994 765629 738776 731788 710849 702634 709574 706243 701172 711452 721338 732409 728442
4907G28442J1648J4293k4013k0115k0929p144k5492l4408l0275k3251k7553N587
$$ 728442 740090 754383 730370 710255 689326 682182 656690 622282 592007 568756 541203 546790
4895E46790l6075r579j654l194j0222k3200J3328R736r745j844R058R775k278
$$ 546790 510715 501136 499482 496288 486066 462866 476194 485930 476185 474341 483399 493174 490896
4882D90896J4199k838J2928L008K3789m052Q553M1876j276p67j0053J8682j5982
$$ 490896 505095 502257 515185 518193 541982 537930 546483 588359 587083 586316 576263 594945 578963
4869E78963P605j1175K4684J7237l137P583J1326K4182J4631N643J0843L1421
$$ 578963 586568 575393 600077 617314 614177 621760 633086 657268 671899 677542 688385 719806
4857G19806L0586K862L6637K1122K6908M2201K3837L9110N5936J9377M0503K6721
$$ 719806 750392 753254 789891 811013 837921 880122 903959 943069 999005 1018382 1058885 1085606
4845A085606O1734M3972M6490O3060O4130M6111Q2367L2482M0617N2063L4270
$$ 1085606 1147340 1191312 1237802 1300862 1364992 1411103 1493470 1525952 1566569 1618632 1652902
4834A652902N1353O2995Q8635P5005N8183M1897L4323M1240M0767M5332O2593
$$ 1652902 1704255 1767250 1855885 1930890 1989073 2030970 2065293 2106533 2147300 2192632 2255225
4823B255225K5838J10602R8618Q7827J30843J05521J58757J31032J39811J33081
$$ 2255225 2281063 2391665 2490283 2578110 2708953 2814474 2973231 3104263 3244074 3377155
4813C377155J62794J72119J91305K03993J79704K05586J86683J89485J71827J79998
$$ 3377155 3539949 3712068 3903373 4107366 4287070 4492656 4679339 4868824 5040651 5220649
4803E220649J92886J77904J64389J72112J78476K00450K37175K63873L25731K98858
$$ 5220649 5413535 5591439 5755828 5927940 6106416 6306866 6544041 6807914 7133645 7432503
4793G432503K54136K03562J41884R2375R3326R6196R1067J53132K23708K47970
$$ 7432503 7686639 7890201 8032085 8124460 8217786 8313982 8405049 8558181 8781889 9029859
4783I029859K79726K83535K69281K09023J70701O8781l1657j28942j82445k37874
$$ 9029859 9309585 9593120 9862401 10071424 10242125 10310906 10279249 10150307 9967862 9729988
4773I729988k57392k74260k08454j22655p5680p7102q6576j17436j78912j81165
$$ 9729988 9472596 9198336 8989882 8867227 8791547 8714445 8627869 8510433 8331521 8150356
4763H150356k27244k13459k12373j76199j86737j46792j17024q2401j00085r2798
$$ 8150356 7923112 7709653 7497280 7321081 7134344 6987552 6870528 6788127 6688042 6595244
4753F595244j18578j47705j89736k72383k68000k95547k91913k94308k60308k34456
$$ 6595244 6476666 6328961 6139225 5866842 5598842 5303295 5011382 4717074 4456766 4222310
4743D222310k12852j98815j76756j35250j11908j09010r8104p6603n4451n7678
$$ 4222310 4009458 3810643 3633887 3498637 3386729 3277719 3179615 3103012 3048561 2990883
4733B990883n4002o6981l9041m1922p9277p6318r6323q2490q5372r1577n9194
$$ 2990883 2936881 2869900 2830859 2788937 2709660 2633342 2537019 2454529 2369157 2277580 2218386
4722B218386r4897o4177o8056q4026p7219p9914p1758o7495p7694n9616m4330
$$ 2218386 2123489 2059312 1991256 1907230 1830011 1750097 1678339 1610844 1533150 1473534 1429204
4711A429204m5533m4539m2214l1814l7079j9436l8634n0981q248l0717l7039l5999
$$ 1429204 1383671 1339132 1296918 1265104 1228025 1208589 1169955 1118974 1110726 1080009 1042970 1006971
4699A006971l0857k1437n1609j6415k7525k6597k0540k3896l9568j1153l6046
$$ 1006971 976114 954677 903068 886653 859128 832531 811991 788095 748527 737374 701328
4688G01328k2372j3524l6544j4533k2625j8054m2812l106p133l2918j7982p09
$$ 701328 678956 665432 628888 614355 591730 573676 530864 527758 520625 487707 469725 469016
4676D69016q451k5916j7435R02j8k3919j2190j72J124j4249j3807j7778K752j1978
$$ 469016 460565 434649 417214 418116 418098 394179 381989 381817 382941 368692 354885 337107 339859 327881
4662C27881j0047k349k6982m812J6735o419j6037j648n245o135j2547Q282p289
$$ 327881 317834 315485 288503 283691 300426 294007 277970 276322 271077 264942 252395 260677 253388
4649B53388l769j3453j5692j384M161O42j2432k0143J4445Q020l114k8801j381
$$ 253388 249619 236166 220474 219090 223251 223893 211461 191318 205763 213783 210669 181868 180487
4636A80487K8234k7112q479M980m448P725l176p573q346o83J1916j2401j6588
$$ 180487 208721 181609 173130 178110 173662 181387 178211 170638 162292 161609 173525 161124 144536
4623A44536N493O805q021l375J1426R160p40m289j3909O209J0394q811l605k891
$$ 144536 150029 156834 148813 145438 156864 166024 165284 160995 147086 153295 163689 154878 151273 148382
4609A48382K327k658n661L676q888K575p311J894J0006m624J1880j8419K0225
$$ 148382 150709 148051 142390 146066 137178 139753 132442 134336 144342 139718 151598 133179 153404
4596A53404j6286K2267k0177P732q831J5035R20l502P63K2016k3945J1350q182
$$ 153404 137118 159385 139208 146940 138109 153144 154064 150562 151325 173341 149396 160746 152564
4583A52564M296j8250j844K2159j6325j0721J7736j2526K842k0697r80P430K660
$$ 152564 156860 138610 136766 158925 142600 131879 149615 137089 139931 119234 118254 125684 128344
4570A28344o980Q725J1816k2691P086p863o374J643J0589L659k555j2626J5706
$$ 128344 121364 130089 141905 119214 126300 118437 112063 113706 124295 127954 125399 112773 128479
4557A28479m668k999J0507J366o874j2237K1842j0579J112J402R019k9111J0513
$$ 128479 123811 120812 131319 132685 125811 113574 135416 124837 125949 127351 136370 107259 117772
4544A17772Q79K983j1512M051Q430j3600J2715k582N399j0164R611o240J802l0271
$$ 117772 118651 121634 110122 114173 122603 109003 121718 119136 124535 114371 123982 117742 119544 89273
4530H9273J5238n304n143l195L663O945j8169R326p789O868r481J7919N181o728
$$ 89273 104511 99207 94064 90869 94532 101477 83308 92634 84845 91713 82232 100151 105332 98604
4516I8604j777j308O580r377o742P960q374J959q622K2156j6614J492o098j5199
$$ 98604 96827 95519 102099 92722 85980 93940 85566 87525 78903 101059 84445 85937 79839 64640
4502F4640J7660m477k1022M218O346j437n988p408k079P158L361o982O532J1174
$$ 64640 82300 77823 56801 61019 67365 65928 59940 52532 50453 57611 60972 53990 60522 71696
4488G1696o917j882N419j2527P565o545q038J0698P848j9684M393L558O443k594
$$ 71696 64779 62897 68316 55789 63354 56809 48771 59469 67317 47633 52026 55584 62027 59433
4474E9433J2176m689l880Q325j0984n889N146J7146j2647Q509j6049M586M44r316
$$ 59433 71609 66920 63040 71365 60381 54492 59638 76784 64137 72646 56597 61183 61627 52311
4460E2311J7946j3448P229O272j1730P910r479j987N511k0072O078K043J4703
$$ 52311 70257 56809 64038 70310 58580 66490 57011 55024 60535 40463 46541 48584 63287
4447F3287J2212j2829J4008k400k328k1875J7868r227R084J8791l665n616L747
$$ 63287 75499 62670 76678 74278 71950 50075 67943 58716 67800 86591 82926 77310 81057
4434H1057J0304M853J8059J56j5254K826J3153k1185K6590j2513j0015K290M8
$$ 81057 91361 96214 114273 114429 99175 102001 115154 93969 120559 108046 98031 100321 100369
4421A00369r738K899L552N644M761o31K6381k6410J3757K891q21J879J2102K0553
$$ 100369 90631 93530 97082 102726 107487 106856 133237 106827 120584 123475 122654 124533 136635 157188
4407A57188q465j0637L4356J4870J5454k809J0711j1128L152r012O287l180K9110
$$ 157188 148723 138086 172442 187312 202766 199957 210668 199540 202692 193680 199967 196787 225897
4394B25897k6443p653K9310K0686J8269L8912J791K6376K0838n311k4389k1669
$$ 225897 199454 191801 221111 241797 260066 298978 300769 327145 347983 342672 318283 296614
4382B96614J9904k5175J188O411p059J6988J8100k3206K9951K2295O415r117j981
$$ 296614 316518 291343 292531 298942 291883 308871 326971 303765 333716 356011 362426 353309 351328
4369C51328K1667K2175Q942n249L6554L8293K7123O7307P2080O5477J1504K1646
$$ 351328 372995 395170 404112 398863 435417 473710 500833 568140 640220 705697 717201 738847
4357G38847J5033l5170J7373k2782j6873K4632N776L5522J5047L6836O1045L8732
$$ 738847 753880 718710 736083 713301 696428 721060 726836 762358 777405 814241 875286 914018
4345I14018M8203R432L8382l2695r427m0416n7784n8408o5002m4647l2373k4715
$$ 914018 962221 971653 1010035 977340 967913 927497 869713 811305 746303 701656 669283 644568
4333F44568j5157m153l9680q441j5672l7761k7084k6573j7480j8107l595k40k7030
$$ 644568 629411 625258 585578 577137 561465 523704 496620 470047 452567 434460 430865 430625 403595
4320D03595m2432R70k0035j8357k0283k3611l944R457p713r705l824j0517J2865
$$ 403595 361163 362133 342098 323741 303458 279847 275903 285360 277647 267942 264118 253601 266466
4307B66466j7762q595J3963J8868L8164p314l636m621K034q025j9983O035N5583
$$ 266466 248704 240109 254072 272940 311104 303790 300154 295533 297567 289542 269559 275594 331177
4294C31177K7907L5791K2624P385K315n1929n305n9293k6626j103k3273l6285
$$ 331177 359084 394875 417499 424884 427199 375270 369965 310672 284046 282943 259670 223385
4282B23385R409k0734o264J3578k1977P616m719J0331K1005K927J6445r662K323
$$ 223385 232794 212060 205796 219374 197397 205013 200294 210625 231630 234557 251002 241340 243663
4269B43663K2778P523R8184J14660P2842M3830J5974j0461m0414p6560o8374l9467
$$ 243663 266441 273964 372148 486808 559650 603480 619454 608993 568579 492019 423645 384178
4257C84178l8016l8854l3969j3259k7560J686j0808o084O257r853K0512R436M841
$$ 384178 346162 307308 273339 260080 232520 234206 223398 217314 223571 213718 234230 243666 248507
4244B48507J0159P608j1522L0747K940O5887N0713N1490p851K0037k0973k3654
$$ 248507 258666 266274 254752 285499 288439 354326 405039 456529 448678 468715 447742 424088
4232D24088k5916n7914k4227j8005n4154n838l3693j4460j5181k122J5657N87
$$ 424088 398172 340258 316031 298026 243872 238034 204341 189881 174700 172578 188235 188822
4220A88822j0718J9176M037m734o989K5012L979o835L0638Q577J9334j3412R542
$$ 188822 178104 197280 201317 196583 189594 214606 218585 211750 242388 250965 270299 256887 266429
4207B66429N457j1849k6037k1329q892k7924l5488O053l0860j8942J6282j9980
$$ 266429 271886 260037 234000 212671 203779 175855 140367 146420 115560 96618 112900 92920
4195I2920J011n732K9382k4603L4313l0211J1382Q638j0449M26K4672k0744J8726
$$ 92920 93931 88199 117581 92978 127291 97080 108462 117100 106651 107077 131749 111005 129731
4182A29731P593p273J434n040M788k4890k4174Q209j6116J1606k6470j2359j1852
$$ 129731 137324 130051 131485 126445 131233 106343 82169 90378 74262 85868 59398 47039 35187
4169C5187J9591k064k1138j9495K4477L598K1971k0754p589P466o632p665J6357
$$ 35187 54778 52714 31576 12081 36558 40156 62127 41373 33784 41250 34618 26953 43310
4156D3310o029k077r518p050o379K9138k9827J0089k5488M256L2796k2712J519
$$ 43310 37281 35204 25686 18636 12257 41395 11568 21657 -3831 425 33221 10509 12028
4143A2028j184M696p18j0248Q039l030k7N198R311J0360j8527J6879l535O849
$$ 12028 10844 15540 14822 4574 12613 9583 9556 14754 24065 34425 15898 32777 29242 36091
4129C6091j3871J8586Q466k3380L610n720J1435j6754P237k0581J1520p76J5701
$$ 36091 22220 40806 49272 25892 29502 23782 35217 18463 25700 5119 16639 15863 31564
4116C1564j8610J0110M883O520m608K263Q010J425l190j066n396J0885Q047L24
$$ 31564 12954 23064 27947 34467 29859 32122 40132 41557 38367 37301 31905 42790 50837 51161
4102E1161J3070M755O825p507J0551j0204J4035J000M138j4229Q539J9346k3412
$$ 51161 64231 68986 75811 68304 78855 68651 82686 83686 87824 73595 82134 101480 78068
4089G8068j9725K4540k4388j57J3358j1238J0703J9443r009J7828M85k4139L2508
$$ 78068 58343 82883 58495 58338 71696 60458 71161 90604 81595 99423 99908 75769 108277
4076A08277n050J2645J179J5566k936J8165p12J3614J5760k1463M6226l1838J5156
$$ 108277 103227 115872 117051 132617 129681 147846 147134 160748 176508 155045 201271 169433 184589
4063A84589j658K3451k1793L615k1641M389J3768j4759j6791J1907L3552o479
$$ 184589 182931 206382 184589 188204 166563 170952 184720 169961 153170 165077 198629 192150
4051A92150Q200k1795K6992q18O016J1963j5481J2272K719K670J9787O874K8426
$$ 192150 200350 178555 205547 204729 210745 222708 207227 219499 222218 224888 244675 251549 279975
4038B79975m620Q001J3845n523l654q480J7381l1141M117N234k8422J2984j6586
$$ 279975 275355 283356 297201 291678 288024 279544 296925 265784 269901 275135 246713 259697 243111
4025B43111j829p845J0442j2760R15o262K2169o026j4887M741p051l305L289J0080
$$ 243111 241282 233437 243879 231119 232034 225772 247941 241915 227028 231769 224718 221413 224702 234782
4011B34782m821k385j884l8934K9511k9855j3361J0023p579J3801k1548n282N199
$$ 234782 229961 227576 225692 186758 216269 186414 173053 183076 175497 189298 167750 162468 167667
3998A67667L339L757j4970j6927M203p611L843k3621q855j495m009M819l8184
$$ 167667 171006 174763 159793 142866 147069 139458 143301 119680 110825 109330 105321 110140 71956
3985G1956J3975q705j0411k1372R658J856Q533k1155M101p839K1293k1279l747
$$ 71956 85931 77226 66815 45443 55101 56957 65490 44335 48436 40597 61890 40611 36864
3972C6864j8808J5702K104k0527K0919m4172J2604j2161P386K422O290j4557J3106
$$ 36864 18056 33758 35862 15335 36254 -7918 4686 -7475 -89 2333 8623 -5934 7172
3959G172l565P584o116J773m569j3608J1819j455N049p691M192n327k914Q094
$$ 7172 3607 11191 5075 6848 2279 -11329 490 -965 4084 -3607 585 -4742 -7656 438
3945D38m640k5592J8507l294q044N503J0865k0519P133l261j0682q511K4299q054
$$ 438 -4202 -29794 -11287 -14581 -22625 -17122 -6257 -26776 -19643 -22904 -33586 -42097 -17798 -25852
3931b5852n455K837j91K147p979K372p155K170P80L918j7853J6194m906N520l705
$$ -25852 -31307 -28470 -28661 -26514 -34493 -32121 -39276 -37106 -36326 -32408 -50261 -34067 -38973 -33453 -37158
3916c7158M268j1791J0282j1923L917n312K709K2367q517j1338M46q668R87K869
$$ -37158 -32890 -44681 -34399 -46322 -42405 -47717 -45008 -22641 -31158 -42496 -42050 -50718 -49731 -46862
$$ [...]
##END NTUPLES=NMR SPECTRUM
##END=
