##TITLE=abcd
##JCAMPDX= 6.0         $$ Bruker NMR JCAMP-DX V2.0
##DATA TYPE= NMR SPECTRUM
##DATA CLASS= NTUPLES
##ORIGIN= UXNMR, Bruker Analytische Messtechnik GmbH
##OWNER= root
$$ XWIN-NMR		Version 3.5
$$ Thu Aug  6 17:26:57 2026 Russian Standard Time (UT+4h)  servis@DPX200
##.OBSERVE FREQUENCY= 200.131235884673
##.OBSERVE NUCLEUS= ^1H
##.ACQUISITION MODE= SIMULTANEOUS
##.ACQUISITION SCHEME= undefined
##.AVERAGES= 32
##.DIGITISER RES= 18
##SPECTROMETER/DATA SYSTEM= spect
##.PULSE SEQUENCE= zg
##.SOLVENT NAME= DMSO
##.SHIFT REFERENCE= (INTERNAL, DMSO, 0, 16.4885)
##AUDIT TRAIL= $$ (NUMBER, WHEN, WHO, WHERE, WHAT)
$$ ##TITLE= Audit trail, XWIN-NMR		Version 3.5
$$ ##JCAMPDX= 5.01
$$ ##ORIGIN= Bruker BioSpin GmbH
$$ ##OWNER= servis
$$ F:\spectra/data/av/nmr/H1/1/pdata/1/auditp.txt
$$ ##AUDIT TRAIL=  $$ (NUMBER, WHEN, WHO, WHERE, WHAT)
(   1,<2026-08-06 17:26:14.68 +0400>,<servis>,<DPX200>,
      <created by zg, POWCHK disabled, PULCHK disabled
       configuration hash MD5:
       00 E9 B6 7A A2 85 ED C7 34 08 36 98 17 FE 4E 26
       data hash MD5: 32K
       47 AB 95 29 EA B8 23 A0 8B D3 48 06 5E 88 60 DB>)
(   2,<2026-08-06 17:26:16.29 +0400>,<servis>,<DPX200>,
      <Start of raw data processing
       efp BC_mod = 2 LB = 0.05 FT_mod = 6 PKNL = 1 PHC0 = -411.9518 PHC1 = 3.101563 SI = 16K 
       data hash MD5: 16K
       26 A1 64 EB 98 77 93 52 05 5F 37 4C 35 E0 32 D5>)
$$ ##END=
$$ 
$$ hash MD5
$$ 12 3D 14 E3 18 1B 5A BA 1D 42 D5 B6 95 92 31 5F
##$RELAX= 
##$RELAX= 
##$RELAX= 
##$RELAX= 
##$RELAX= 
##$RELAX= 
##$RELAX= 
##$RELAX= 
$$ Bruker specific parameters
$$ --------------------------
##$DU= <F:\spectra>
##$EXPNO= 1
##$NAME= <H1>
##$PROCNO= 1
##$TYPE= <nmr>
##$USER= <av>
##$AMP= (0..31)
100 100 100 100 100 100 100 100 100 100 100 100 100 100 100 100 100 100 
100 100 100 100 100 100 100 100 100 100 100 100 100 100 
##$AQSEQ= 0
##$AQ_mod= 1
##$AUNM= <au_zg>
##$AUTOPOS= <>
##$BF1= 200.13
##$BF2= 200.13
##$BF3= 200.13
##$BF4= 200.13
##$BF5= 500.13
##$BF6= 500.13
##$BF7= 500.13
##$BF8= 500.13
##$BYTORDA= 1
##$CFDGTYP= 0
##$CFRGTYP= 5
##$CHEMSTR= <none>
##$CNST= (0..31)
1 1 145 1 1 1 1 1 1 1 1 1 1 1 1 1 1 1 1 1 1 1 1 1 1 1 1 1 1 1 1 1 
##$CPDPRG= <>
##$CPDPRG1= <>
##$CPDPRG2= <>
##$CPDPRG3= <>
##$CPDPRG4= <mlev>
##$CPDPRG5= <mlev>
##$CPDPRG6= <mlev>
##$CPDPRG7= <mlev>
##$CPDPRG8= <mlev>
##$CPDPRGB= <>
##$CPDPRGT= <>
##$D= (0..31)
0 2 0 0 0 0 0 0 0 0.06 0 0 0 0 0 0 0.0002 0 0 0 0 0 0 0 0 0 0 0 0 0 0 
0 
##$DATE= 1786022774
##$DBL= (0..7)
120 120 120 120 120 120 120 120 
##$DBP= (0..7)
150 150 150 150 150 150 150 150 
##$DBP07= 0
##$DBPNAM0= <>
##$DBPNAM1= <>
##$DBPNAM2= <>
##$DBPNAM3= <>
##$DBPNAM4= <>
##$DBPNAM5= <>
##$DBPNAM6= <>
##$DBPNAM7= <>
##$DBPOAL= (0..7)
0.5 0.5 0.5 0.5 0.5 0.5 0.5 0.5 
##$DBPOFFS= (0..7)
0 0 0 0 0 0 0 0 
##$DE= 6
##$DECBNUC= <off>
##$DECIM= 32
##$DECNUC= <off>
##$DECSTAT= 4
##$DIGMOD= 1
##$DIGTYP= 9
##$DL= (0..7)
0 120 120 120 120 120 120 120 
##$DP= (0..7)
150 150 150 150 150 150 150 150 
##$DP07= 0
##$DPNAME0= <>
$$ [...]
##$SUBNAM4= <"">
##$SUBNAM5= <"">
##$SUBNAM6= <"">
##$SUBNAM7= <"">
##$SUBNAM8= <"">
##$SUBNAM9= <"">
##$SW= 20.6817932712277
##$SWIBOX= (0..15)
0 0 3 0 0 0 0 0 0 0 0 0 0 0 0 0 
##$SW_h= 4139.07284768212
##$TD= 32768
##$TD0= 1
##$TE= 0
##$TE2= 300
##$TE3= 300
##$TEG= 300
##$TL= (0..7)
0 120 120 120 120 120 120 120 
##$TP= (0..7)
150 150 150 150 150 150 150 150 
##$TP07= 0
##$TPNAME0= <>
##$TPNAME1= <>
##$TPNAME2= <>
##$TPNAME3= <>
##$TPNAME4= <>
##$TPNAME5= <>
##$TPNAME6= <>
##$TPNAME7= <>
##$TPOAL= (0..7)
0.5 0.5 0.5 0.5 0.5 0.5 0.5 0.5 
##$TPOFFS= (0..7)
0 0 0 0 0 0 0 0 
##$TUNHIN= 0
##$TUNHOUT= 0
##$TUNXOUT= 0
##$USERA1= <user>
##$USERA2= <user>
##$USERA3= <user>
##$USERA4= <user>
##$USERA5= <user>
##$V9= 5
##$VALIST= <valist>
##$VCLIST= <CCCCCCCCCCCCCCC>
##$VD= 0
##$VDLIST= <DDDDDDDDDDDDDDD>
##$VPLIST= <PPPPPPPPPPPPPPP>
##$VTLIST= <TTTTTTTTTTTTTTT>
##$WBST= 1024
##$WBSW= 30
##$XGAIN= (0..3)
0 0 0 0 
##$XL= 0
##$YL= 0
##$YMAX_a= 119920
##$YMIN_a= -236179
##$ZGOPTNS= <>
##$ZL1= 120
##$ZL2= 120
##$ZL3= 120
##$ZL4= 120
##$ABSF1= 0
##$ABSF2= 0
##$ABSG= 0
##$ABSL= 0
##$ALPHA= 0
##$AQORDER= 0
##$ASSFAC= 0
##$ASSFACI= 0
##$ASSFACX= 0
##$ASSWID= 0
##$AUNMP= <proc_1d>
##$AZFE= 0.1
##$AZFW= 0.1
##$BCFW= 0
##$BC_mod= 2
##$BYTORDP= 0
##$COROFFS= 0
##$CY= 18.4799938201904
##$DATMOD= 1
##$DC= 0
##$DFILT= <>
##$DTYPP= 0
##$F1P= 9.9274215381318
##$F2P= -0.165520771350173
##$FCOR= 1
##$FTSIZE= 16384
##$FT_mod= 6
##$GAMMA= 0
##$GB= 0
##$INTBC= 1
##$INTSCL= 4.127829e-11
##$ISEN= 128
##$LB= 0.05
##$LEV0= 0
##$LPBIN= 0
##$MAXI= 10000
##$MC2= 0
##$MEAN= 0
##$ME_mod= 0
##$MI= 50
##$NCOEF= 0
##$NC_proc= -7
##$NLEV= 6
##$NOISF1= 3.799351
##$NOISF2= 2.8
##$NSP= 0
##$NTH_PI= 0
##$NZP= 0
##$OFFSET= 16.48848
##$PC= 4
##$PHC0= -411.9518
##$PHC1= 3.101563
##$PH_mod= 1
##$PKNL= yes
##$PPARMOD= 0
##$PSCAL= 4
##$PSIGN= 0
##$REVERSE= no
##$SF= 200.130005582386
##$SI= 16384
##$SIGF1= 3
##$SIGF2= 2
##$SINO= 400
##$SIOLD= 16384
##$SREGLST= <1H.CDCl3>
##$SSB= 0
##$STSI= 16384
##$STSR= 0
##$SW_p= 4139.07284768211
##$SYMM= 0
##$S_DEV= 0
##$TDeff= 32768
##$TDoff= 0
##$TI= <>
##$TILT= no
##$TM1= 0
##$TM2= 0
##$TOPLEV= 0
##$USERP1= <user>
##$USERP2= <user>
##$USERP3= <user>
##$USERP4= <user>
##$USERP5= <user>
##$WDW= 1
##$XDIM= 16384
##$YMAX_p= 273810571
##$YMIN_p= -1051583
$$ End of Bruker specific parameters
$$ ---------------------------------
##NTUPLES= NMR SPECTRUM
##VAR_NAME=  FREQUENCY,     SPECTRUM/REAL,   SPECTRUM/IMAG
##SYMBOL=    X,             R,               I
##VAR_TYPE=  INDEPENDENT,   DEPENDENT,       DEPENDENT
##VAR_FORM=  AFFN,          ASDF,            ASDF
##VAR_DIM=   16384,         16384,           16384
##UNITS=     HZ,            ARBITRARY UNITS, ARBITRARY UNITS
##FACTOR=    0.252644378177508, 1,           1
##FIRST=     3299.83951724647, 0,            0
##LAST=      -839.233330435636, 0,           0
##MIN=       -839.233330435636, -1051583,    0
##MAX=       3299.83951724647, 273810571,    0
$$ Real data points
##PAGE= N=1
##DATA TABLE= (X++(R..R)), XYDATA
$$ [...]
7294E116285j76443K96776K59500k49570k44458M47803p52850K46800K05029J12991
7284E261863j35200r2982P15994j99080l97508K92504m00987J86701J03980j79092
7274E156193k09995O18275J5839J05032P3157j83115r1173j80187k19358K72496
7264E357164k91760L38134l90633N75617j43403Q9033j82967J13805L0365p1222
7254E424133k2898k87010J79154k8813N9757K01350k99061j03378L11118j94066
7244E240286j06902L32634n16645K80657O9663J36452j4246j34442m5033n595
7234E236829p3200J72080j45220M03576K10532n80926K24252j17380j13159O194
7224E223578K90843j6606J85186j74937m89639O46679p88735M14769q844K02377
$$ plain form
7294 5116285 4939842 5236618 5496118 5246548 5002090 5449893 4697043 4943843 5148872 5261863
7284 5261863 5126663 5033681 5749675 5550595 5153087 5445591 5044604 5231305 5335285 5156193
7274 5156193 4946198 5564473 5580312 5685344 5758501 5575386 5484213 5304026 5084668 5357164
7264 5357164 5065404 5403538 5012905 5588522 5445119 5534152 5351185 5464990 5495355 5424133
7254 5424133 5401235 5114225 5293379 5264566 5324323 5525673 5226612 5123234 5434352 5240286
7244 5240286 5133384 5466018 4949373 5230030 5299693 5436145 5421899 5287457 5242424 5236829
7234 5236829 5163629 5335709 5190489 5594065 5804597 5223671 5447923 5330543 5217384 5223578
7224 5223578 5514421 5497815 5683001 5508064 5018425 5665104 4876369 5291138 5282294 5484671
7214E484671J48007m02400N60506o62043M13988l68414N00671j10718J94831l99773
7204E359326k63221K36494J02408J383o9984k55419J79201L47254l346l3479m7610
7193E553007p77262N69141K39236j27281J49178j69344j26362k30437J26086Q2418
7183E288380L5232N24282p26860M28890m61985j12682M00227K20249j20796l71411
7173E103526M29769j50790p8180j74128l11692N53557K01448k54927K7685O7054
7163E413322K09965J74267m793r5362j26481N1268k26328L84599L0948m05654
7153E405751M30808k87840n40274M88438k16995J74911k78490L86361k42124K59804
7143E580350n74838N78350k33072J28043j62461M61392L2511o05867K45086J52143
$$ plain form
7214 5484671 5632678 5230278 5790784 5128741 5542729 5174315 5674986 5564268 5759099 5359326
7204 5359326 5096105 5332599 5435007 5436390 5366406 5110987 5290188 5637442 5634096 5600617 5553007
7193 5553007 4775745 5344886 5584122 5456841 5606019 5436675 5310313 5079876 5205962 5288380
7183 5288380 5323612 5847894 5121034 5549924 5087939 4975257 5375484 5595733 5474937 5103526
7173 5103526 5533295 5382505 5304325 5130197 4818505 5372062 5573510 5318583 5346268 5413322
7163 5413322 5623287 5797554 5792761 5697399 5570918 5622186 5395858 5780457 5811405 5405751
7153 5405751 5836559 5548719 5008445 5496883 5279888 5454799 5176309 5562670 5320546 5580350
7143 5580350 5005512 5583862 5350790 5478833 5316372 5777764 5810275 5204408 5449494 5601637
7133E601637J37640j18467m19995n4755N27559j3019K00424m87357K67856J883
7123E643406P4594n0151J33842J36869l79706r2411j82041L22426r5627O5591
7113E576792K0520N5821j79906j64579J77825k42301L88315k43021L59135j55905
7103E592696k45387l2061J00366L81312L32102o08086J75203J13075k43789K10419
7093E775850l9644k19566k19319P9879J60676j46183n6956K14387K6573k80002
7083E295695K00517j49238K31938N1648J42650j48344k24664K81164Q8247o4924
7073E704689K8024l8995j74491J99840K1264k59650q1088N39343q9167P5824n35024
7062E390569J82784N3499L27788k39048j94512J15784k100j82900Q9310M06066
$$ plain form
7133 5601637 5739277 5620810 5200815 5146060 5673619 5660600 5861024 5373667 5641523 5643406
7123 5643406 5718000 5667849 5801691 5938560 5558854 5466443 5284402 5606828 5511201 5576792
7113 5576792 5597312 5653133 5473227 5308648 5486473 5244172 5632487 5389466 5748601 5592696
7103 5592696 5347309 5315248 5415614 5796926 6129028 5520942 5696145 5809220 5565431 5775850
7093 5775850 5736206 5516640 5297321 5377200 5537876 5391693 5334737 5549124 5575697 5295695
7083 5295695 5496212 5346974 5578912 5630560 5773210 5624866 5400202 5681366 5769613 5704689
7073 5704689 5732713 5693718 5519227 5719067 5740331 5480681 5399593 5938936 5849769 5925593 5390569
7062 5390569 5573353 5626852 5954640 5715592 5521080 5636864 5634764 5451864 5541174 5947240
7052E947240o32078o6050o5462N96661L908j04802J35447R2754m18436J65712
7042E654894K6307l43721K22488Q9666M5949L47552m90334M90940l09817n9867
7032E674057M03951m05077K00154j34557L38348m49214j59189L05905l56102O0026
7022E478302N01745P2005o50724K87547N3422N0341j81598J54764M4414J03268
7012E913486m8170q870j53837m6634j81920N08905l40647K40025k07412P2487
7002E747413n7790k13831K64758Q9354M1344j81544m79316L18912K59462j0517
6992E778245J37293l66863K86075m40614L65705M0226J24559k71207j01265J09985
6982E662139j80350K43849J09650J86643p7771l63100M59664l31676k61096j33626
$$ plain form
7052 5947240 5315162 5249112 5183650 5780311 5784219 5679417 5814864 5907618 5489182 5654894
7042 5654894 5681201 5337480 5559968 5649634 5695583 6043135 5552801 6043741 5733924 5674057
7032 5674057 6078008 5672931 5873085 5738528 6076876 5627662 5468473 5774378 5418276 5478302
7022 5478302 5980047 6052052 5401328 5688875 5742297 5792638 5611040 5765804 5810218 5913486
7012 5913486 5865316 5856446 5702609 5655975 5474055 5982960 5642313 5882338 5674926 5747413
7002 5747413 5689623 5475792 5740550 5829904 5871248 5689704 5210388 5529300 5788762 5778245
6992 5778245 5915538 5548675 5834750 5394136 5759841 5800067 5924626 5653419 5552154 5662139
6982 5662139 5481789 5725638 5835288 6021931 5944160 5581060 6040724 5709048 5447952 5314326
6972E314326M9948K20221J26380k2412K74327N4383j44542l86113M73884j83526
6962E776876J13103O1714K1705k73235R6154j51247Q7734M41699n96991j06916
6952E470596M25166k12470J34417p2519K27035m3595l70343L72756p9488r8301
6942E753254N7531k16862L70789j77724n3430j32764K00444P728L20815j44098
6932E985683L3543l36139l79754P00341n07410M50656J25375k12686j42208n541
6922E711860K56903k5130J27276m18009L10845j81075r9035Q3757j64980J64523
6912E766935M4537j33891K18823j71592j3371P9108L75463r4862r6650k82982
6902E691518K78244J1820k60422L3034L92062n11926K82611j58313O0993L13531
$$ plain form
6972 5314326 5364274 5584495 5710875 5688463 5962790 6017173 5872631 5486518 5960402 5776876
6962 5776876 5889979 5951693 5973398 5700163 5796317 5645070 5732804 6174503 5577512 5470596
6952 5470596 5895762 5683292 5817709 5745190 5972225 5928630 5558287 5931043 5851555 5753254
6942 5753254 5810785 5593923 5964712 5786988 5733558 5600794 5801238 5808966 6129781 5985683
6932 5985683 6019226 5683087 5303333 6003674 5496264 5946920 6072295 5859609 5717401 5711860
6922 5711860 5968763 5943633 6070909 5652900 5963745 5782670 5683635 5767392 5602412 5766935
6912 5766935 5811472 5677581 5896404 5724812 5711441 5790549 6166012 6071150 5974500 5691518
6902 5691518 5969762 5981582 5721160 5754194 6146256 5634330 5916941 5758628 5819621 6133152
6892F133152k83527J47967m13503K95522N9622M714m32891L33740L0317l0257
6882E844856J95495J5901k50648K5117j18510m3800L06196n398o637j45640K85187
6871F102119r9932k5620K04478l45755J69050p512j139p3587k76939l8886O03413
6860F209690P2476k71498q2599j0223K42646l82216J75383M36935k17135j48642
6850F024817j9002o2204j13077N8310j03300Q6773k353J76155O273m31897N0566
6839E671061L47968J56975J72999l42432l60268J16460j23768L86811j27925J29758
6829F027639k57958L06313M26890l48016k94581J22371R0970j71088J962J3028
6819E917530m8359k96749M23492j3876n7K4590l42338L91697k6174M0206o1731
$$ plain form
6892 6133152 5849625 5997592 5584089 5879611 5939233 5943947 5511056 5844796 5875113 5844856
6882 5844856 6040351 6056252 5805604 5830721 5712211 5668411 5974607 5969209 5962572 5816932 6102119
6871 6102119 6002187 5976567 6181045 5835290 6004340 5996828 5995689 5922102 5645163 5606277 6209690
6860 6209690 6282166 6010668 5928069 5917846 6160492 5778276 5953659 6390594 6173459 6024817
6850 6024817 6005815 5943611 5830534 5888844 5785544 5872317 5869964 6046119 6052392 5620495 5671061
6839 5671061 6019029 6176004 6349003 6006571 5646303 5762763 5638995 6025806 5897881 6027639
6829 6027639 5769681 6075994 6502884 6154868 5860287 5982658 6073628 5902540 5904502 5917530
6819 5917530 5869171 5572422 5995914 5982038 5981981 6006571 5664233 6055930 6029756 6069962 6008231
6808F008231j11926L03567j84453J13936k38722J75464j05983j85241J24339M93930
6798F393142o01362K93694J92708m93748J97901J82940r642O585m1910L74144
6788F494452k75341N1948k11074j81512r7563K37433k36676L03263j8088J45917
6778F212759m69328L62079j3236p7702K29461j07996P38R1306l79958L09765k52356
6767E905532J35581k2614J29365l87893M4406L48741n67860K69051M5094j35313
6757E764090J51573N5684j51567J30639M4696K18440j62755r4287J41663K10166
6747F308342j36065L1718m82223J74537N52535l02952n4080k40581j1572L08144
6737F147803R1405Q2515j95137j85561m0985n16202O35626J51418J49717j09693
$$ plain form
6808 6008231 5896305 6199872 6015419 6129355 5890633 6066097 5960114 5774873 5899212 6393142
6798 6393142 5791780 6085474 6278182 5784434 5982335 6165275 6155633 6162218 6120308 6494452
6788 6494452 6219111 6271059 6059985 5878473 5780910 6018343 5781667 6084930 6066842 6212759
6778 6212759 5743431 6105510 6092274 6014572 6244033 6136037 6136775 6228081 5848123 6157888 5905532
6767 5905532 6041113 6018499 6147864 5759971 5804377 6153118 5585258 5854309 5899403 5764090
6757 5764090 5915663 5971347 5819780 5950419 5995115 6213555 6050800 5956513 6098176 6308342
6747 6308342 6172277 6203995 5721772 5896309 6448844 6145892 6091812 5851231 5839659 6147803
6737 6147803 6239208 6321723 6126586 5941025 5900040 5383838 6019464 6170882 6320599 6210906
6727F210906j76116l65775N61809n9989K35524k48340j83397J64710J11673l00825
6717E950180K25839k82532l04549J42922P26660j27809m59710j06504J11282L0219
6707E905998J76740k4340L29945l98400j7671L99884m6875j02122m87821J66887
6697E902225l71774N44790N1887L04637n40906R0388J19052q4189J27114k98940
6687E844284m0648L45794k95569L17188l5154k40012L05177j31363J83895k44066
6677F009526K11661L0689l46214M06742l62392j09036K81990J70742l77750N00963
6667F416921l40792j38051j01183M72524K11494k42456l71889J84798j93595n074
6657E892697R5508M2524m20144P36892k63384n03633M24734O39785n33862l11354
$$ plain form
6727 6210906 6034790 5669015 6230824 6170835 6406359 6158019 5974622 6139332 6251005 5950180
6717 5950180 6176019 5893487 5588938 5731860 6458520 6330711 5871001 5764497 5875779 5905998
6707 5905998 6082738 6058398 6388343 5989943 5972272 6372156 6325281 6223159 5735338 5902225
6697 5902225 5530451 6075241 6127128 6431765 5890859 5981247 6100299 6016110 6143224 5844284
6687 5844284 5803636 6149430 5853861 6171049 6135895 5895883 6201060 6069697 6253592 6009526
6677 6009526 6221187 6251876 5905662 6312404 5950012 5840976 6122966 6293708 5915958 6416921
6667 6416921 6076129 5938078 5836895 6309419 6520913 6278457 5906568 6091366 5897771 5892697
6657 5892697 5988205 6030729 5610585 6347477 6084093 5580460 6005194 6644979 6111117 5799763
6647E799763J36318J28959K81724Q0498l44527m00453J58156M95890k64609k98489
6637E773230K7917j37094J71730L52046r0295k954K61228k94362P3142k4411K04207
6626F314384k20768Q1710K40685j71952J13615k13559j18374j38564k4050J71242
6616F034369o6844K8783j74921O72626o0498n42534J004348q25819J66197n82057
6606E653650M29085L39600m9276j19601L87519m24815j76044J97054Q0956m9148
6596F268980j83617M46848k93007j75453J3849O36302k16855k24415j00932L62144
6586F533844k78765J61306r9506L13469j2191l09668M53785j78077K2786K7701
6576F634684k04093P0710j3561j33820L50216L4705R962k39062L07543n5719j74126
$$ plain form
6647 5799763 5936081 6065040 6346764 6427262 6082735 5682282 5840438 6336328 6071719 5773230
6637 5773230 5801147 5664053 5835783 6187829 6097534 6094580 6355808 6061446 6134588 6110177 6314384
6626 6314384 6093616 6175326 6416011 6244059 6357674 6144115 6025741 5887177 5863127 6034369
6616 6034369 5967525 5996308 5821387 6494013 6433515 5890981 6895329 6069510 6235707 5653650
6606 5653650 6082735 6422335 6373059 6253458 6640977 6216162 6040118 6237172 6318128 6268980
6596 6268980 6085363 6532211 6239204 6063751 6077600 6713902 6497047 6272632 6171700 6533844
6586 6533844 6255079 6416385 6316879 6630348 6618157 6308489 6762274 6584197 6606983 6634684
6576 6634684 6430591 6501301 6487740 6353920 6704136 6738841 6748803 6509741 6817284 6761565 6587439
6565F587439Q9366R6491l43957M73761n32101n5881K77500m41555L56830J97686
6555F705579m9624o4885K52137j65840L65884R3658o20671K68697O8752p0798
6545F782889m25966K45959P4052m4100j37887k010j19922j71155M14917k47815
6535F368962j18946k27528j89171O87509j36707j76432Q8067r2329j36082M28373
6525F495716k69666r319K65385k12885k23553K1776j18788M65920K5421l52277
6515F087730K5055K38709L79270o99602N58640j1129r09331J68964M13358j8613
6505F233051J66918P8857p4972k44271l69486K3441P85871n53305Q9452l95592
6495E739964Q7346N49761m30981q1708J46726J51225l97064M8886K03498j68870
$$ plain form
6565 6587439 6676805 6773296 6429339 6903100 6370999 6315118 6592618 6151063 6507893 6705579
6555 6705579 6655955 6591070 6843207 6677367 7043251 7136909 6516238 6784935 6853687 6782889
6545 6782889 6356923 6602882 6676934 6632834 6494947 6492937 6373015 6201860 6616777 6368962
6535 6368962 6250016 6022488 5833317 6520826 6384119 6207687 6295754 6203425 6067343 6495716
6525 6495716 6226050 6216731 6482116 6269231 6045678 6067454 5948666 6414586 6440007 6087730
6515 6087730 6112785 6351494 6730764 6031162 6589802 6578673 5669342 5838306 6251664 6233051
6505 6233051 6399969 6478826 6403854 6159583 5790097 5813538 6599409 6046104 6135556 5739964
6495 5739964 5827310 6377071 5946090 5864382 6011108 6162333 5765269 5814155 6017653 5848783
6485E848783J56560K65414j78667M2201k5749O8292r2757L0489N2716J12264M44347
6474F723893m24073j19412N29615k59076L21393l49759P673J46649j18016l04641
6464F154246L53818k75866N36095m47483l84535J20477K05609j59119m736L059
6454F101565j73561L05152r1169J08414j62677l02613N9631L0565J43116n83423
6444E435000K16888J42797N2150j05707n4620J79265k52945M2789K57356n66836
6434E346137M1050N49270k29755l2617k6810O8703j40449m9099K84510n91626
6424E219314L94779M13326q60615Q69520o58296J57809l58801M06650j40326L73741
6414E817101J95593n04372j45289K76219o5180M89434n38388N96501m37092p0146
$$ plain form
6485 5848783 6005343 6270757 6092090 6134291 6108542 6176834 6084077 6114566 6167282 6279546 6723893
6474 6723893 6299820 6180408 6710023 6450947 6772340 6422581 6430254 6576903 6458887 6154246
6464 6154246 6508064 6232198 6768293 6320810 5936275 6056752 6262361 6103242 6098506 6101565
6454 6101565 5928004 6233156 6141987 6250401 6087724 5785111 5844742 5875307 6018423 5435000
6444 5435000 5651888 5794685 5846835 5741128 5686508 5865773 5612828 5655617 5912973 5346137
6434 5346137 5387187 5936457 5706702 5674085 5647275 5715978 5575529 5526430 5810940 5219314
6424 5219314 5614093 6027419 5166804 6036324 5378028 5535837 5177036 5583686 5443360 5817101
6414 5817101 6012694 5508322 5363033 5639252 5574072 6063506 5525118 6121619 5684527 5614381
6404E614381j89362o0277N69100m94661l2597M54223m91447j82563L30012J17486
6394E634295j17840K34676o3578k73790M06703l9680k88879n5583j56662K03597
6384E483259j12178l9863L06549k70649j14513K63680J24922L30610o01589J07187
6374E477415J82668l88361Q971J00883K1944J03956k20141K63541O1087K79620
6364E891583o47558M85484q3042k07587k109r740L73146k79142p4808j44642K7031
6353E328616j94409J41600M30478l73217j58952P80024l63349k16742Q4324N41882
6343F000255o29093r0601K42110J642m37430M03104j04587O3467L78098k60767
6333E566198j30642n2553K28990q015j3144K9711k74704J06116j01757L3k38150
$$ plain form
6404 5614381 5425019 5364742 5933842 5439181 5406584 5860807 5369360 5186797 5516809 5634295
6394 5634295 5516455 5751131 5687553 5413763 5820466 5780786 5491907 5436324 5279662 5483259
6384 5483259 5371081 5331218 5637767 5367118 5252605 5516285 5641207 5971817 5370228 5477415
6374 5477415 5660083 5271722 5280693 5381576 5403520 5507476 5287335 5550876 5611963 5891583
6364 5891583 5244025 5729509 5646467 5438880 5436771 5427031 5800177 5521035 5446227 5301585 5328616
6353 5328616 5134207 5275807 5706285 5333068 5174116 5954140 5590791 5374049 5458373 6000255
6343 6000255 5371162 5280561 5522671 5524313 5086883 5489987 5385400 5448867 5826965 5566198
6333 5566198 5435556 5383003 5611993 5603978 5590834 5620545 5345841 5451957 5350200 5350233 5112083
6322E112083K24708j87723p7045L78395Q766l12065K18108j87355K659l36619
6312D843912O29456n35944M65127j83362l4410K94556m6194j16480j09022P1334
6302E278973J50416l11019j29437J88420J11773K4531l32101M06228l40549P67707
6292E814942n00807K66096l28257K0276K34743k04977M4992K38839J58299k51496
6282E492650l29454J9047J3855j43097K40278J01941k16528j09311k81036R90596
6272E778941p09349k6076L1563N96191k72787l6956k850k5279N6241J44064m63231
6261E070472M17470n74774O69399j91318J93869m71661J13491J90573l12475M24070
6251E529116K94001n14691l27867L83084K89656n44569K66947J94447k36882M45533
$$ plain form
6322 5112083 5336791 5149068 5072023 5450418 5459184 5147119 5365227 5177872 5180531 4843912
6312 4843912 5473368 4937424 5402551 5219189 5184779 5479335 5433141 5316661 5207639 5278973
6302 5278973 5429389 5118370 4988933 5177353 5289126 5313657 4981556 5387784 5047235 5814942
6292 5814942 5314135 5580231 5251974 5272250 5506993 5302016 5347008 5585847 5744146 5492650
6282 5492650 5163196 5182243 5196098 5053001 5293279 5395220 5178692 5069381 4788345 5778941
6272 5778941 5069592 5043516 5075079 5671270 5398483 5361527 5358677 5333398 5389639 5533703 5070472
6261 5070472 5487942 4913168 5582567 5391249 5585118 5113457 5226948 5417521 5105046 5529116
6251 5529116 5823117 5308426 4980559 5363643 5653299 5108730 5375677 5570124 5333242 5778775
6241E778775l31296J23167j13640J81201N71484o10631K43394n1151k10810J78550
6231E759043K29244P4827j49548L64110l59013k20848R13188l30728r8896l62072
6221E819307K56266m69863k46432K88732K50729l82692M53288m95262l66963L91485
6211E498595J52167n46250M9022J51605m4884q0469P1360l86519K88270J34704
6201E287601r0759k59670n4743q0321L40849k69151L77933k86668K18452M67508
6191E651031l87143l55729j03240P17579n76397L34721m43747J63157L48154n46640
6181D801746N1291j55902K95939l2160L1706L9869l6875L97901L4851k69625R0577
6170E249318O597M8670q41421N32634K74663J03448m31435j08617M42212l35599
$$ plain form
6241 5778775 5447479 5570646 5457006 5638207 6209691 5599060 5842454 5791303 5580493 5759043
6231 5759043 5988287 6063114 5913566 6277676 5918663 5697815 6611003 6280275 6181379 5819307
6221 5819307 6075573 5605710 5359278 5648010 5898739 5516047 5969335 5474073 5107110 5498595
6211 5498595 5650762 5104512 5153534 5305139 5260255 5179786 5251146 4864627 5152897 5287601
6201 5287601 5196842 4937172 4882429 4802108 5142957 4873806 5251739 4965071 5183523 5651031
6191 5651031 5263888 4908159 4804919 5522498 4946101 5280822 4837075 5000232 5348386 4801746
6181 4801746 4853037 4697135 4993074 4960914 4992620 5032489 4995614 5393515 5428366 5158741 5249318
6170 5249318 5255915 5304585 4463164 4995798 5270461 5373909 4942474 4833857 5276069 4940470
6160D940470k38249K73226k80315O10588n6653m87503Q2783K8116J36113K3085
6150E031661k55450J07481l02303L42984m50370M06556j86843j56794J30612L65284
6140E032818O0453m55081L38054q0121n06371K84970k71028L76462r5982m9532
6130D634642K9172P7013k89035M60458k19404J37791l88212J64668J51807J63963
6120D922863k83384k19712N95562k25814l48322L77198m61835L66850n14393P53614
6110D962627o08621K2852N82726N0771l25136k3636r8513k1098j31464R9214L72900
6099D882622k52670k02128J52998M17824l46585J8500J4369N82850n94415j56583
6089D516782J1180K3265j8102o4444j21224M84072m66500K9545M32617l83672
$$ plain form
6160 4940470 4702221 4975447 4695132 5305720 5249067 4761564 4844347 4872463 5008576 5031661
6150 5031661 4776211 4883692 4581389 4924373 4474003 4880559 4693716 4536922 4667534 5032818
6140 5032818 5093271 4638190 4976244 4896123 4389752 4674722 4403694 4780156 4684174 4634642
6130 4634642 4663814 4740827 4451792 4912250 4692846 4830637 4442425 4607093 4758900 4922863
6120 4922863 4639479 4419767 5015329 4789515 4441193 4818391 4356556 4723406 4209013 4962627
6110 4962627 4354006 4376858 4959584 5010355 4685219 4661583 4563070 4541972 4410508 4509722 4882622
6099 4882622 4629952 4427824 4580822 4998646 4652061 4670561 4684930 5267780 4673365 4516782
6089 4516782 4527962 4551227 4533125 4468681 4347457 4831529 4365029 4394574 4827191 4443519
6079D443519K2631M97407l42656m40419M70575l76448J14595P0477J58678m15878
6069D202481k7058J53439K63341k15354L33131n4897r5918Q0331M3458n18559
6059D164395L94243o4680K27099Q6854k91674k8193K6402l031l21586K20100K55762
6048D665691J28020o13670J14988M85367k30156J03028m26559J61652L25147k42716
6038D470792q5962j39144K93277k9641L15098l66153o2317J52498q95n03411K48606
6027D292748M948M5121K61270l87149L49121L5187K2685n96649j05213O38228
6017D560297m45485P70391l23540l68259P1437o0030j0315J69634m5983J07157
6007D425304r3585J83106o6723L13873k53136j12098K03813j34890J5107j90759
$$ plain form
6079 4443519 4466150 4963557 4620901 4180482 4651057 4274609 4389204 4459681 4618359 4202481
6069 4202481 4175423 4328862 4592203 4376849 4709980 4655083 4559165 4639496 4682954 4164395
6059 4164395 4558638 4493958 4721057 4807911 4516237 4488044 4514446 4511415 4189829 4409929 4665691
6048 4665691 4793711 4180041 4295029 4780396 4550240 4653268 4226709 4388361 4713508 4470792
6038 4470792 4384830 4245686 4538963 4509322 4824420 4458267 4395950 4548448 4547553 4044142 4292748
6027 4292748 4297696 4342817 4604087 4216938 4566059 4601246 4623931 4027282 3922069 4560297
6017 4560297 4114812 4885203 4561663 4193404 4264841 4204811 4194496 4364130 4318147 4425304
6007 4425304 4331719 4514825 4448102 4761975 4508839 4396741 4600554 4465664 4480771 4290012
5997D290012K64208k49810J64738J24321l70923L61620r3572K13628j66862J42209
5987D679569k60267K18192N18921p68385m6625j46680L22128L15577l82454J13863
5977D563839K860k80075K48271Q9350j14238K12276k81694n7042R9804J55395
5967D638746m5039j08964j1048q7565R0881J8720j31785r6233L77098k73585K34564
5956D605790n12615K33953J65459L47750o3766l81347N39607o15584K10186k96323
5946D233110N4940N8272L24890k78040K90901j77399L9456J50074j12796r640
5936D573768r6110J58508J8608K90867l11124j59399M69233k53546k12803R9006
5926D577008L3734k0307k95054N23110m86496N17777l89691P1671O4427j92271
$$ plain form
5997 4290012 4554220 4304410 4469148 4593469 4222546 4584166 4490594 4704222 4537360 4679569
5987 4679569 4419302 4637494 5156415 4388030 4341405 4194725 4516853 4832430 4449976 4563839
5977 4563839 4566699 4286624 4534895 4624245 4510007 4722283 4440589 4383547 4483351 4638746
5967 4638746 4593707 4484743 4473695 4386130 4477011 4495731 4363946 4267713 4644811 4371226 4605790
5956 4605790 4093175 4327128 4492587 4840337 4776571 4395224 4934831 4319247 4529433 4233110
5946 4233110 4288050 4346322 4671212 4393172 4684073 4506674 4546130 4696204 4583408 4573768
5936 4573768 4477658 4636166 4654774 4945641 4634517 4475118 4944351 4690805 4478002 4577008
5926 4577008 4610742 4590435 4295381 4818491 4331995 4849772 4460081 4531752 4596179 4403908
5916D403908M28927Q8600k09765m43562M92651p905k13560M62208n90507O9208
5906D480203M83537m96882Q11676q25238L41335o8601O9900p4664p7511L40155
5896D983910k83632K46818k88148P49291l05262j59296K06755j94073N36017l4849
5886E457531j66213O94304p06722k165O91426M4918q2846L31022j03860j5338
5876F142057l32930M56804l58270l0508l8318L85874n05029J44856k58279l10193
5866E296064J44226N6269j0010l13062k02599K42813l47260J25404N9774k73353
5856D778266Q8369J07697R844j34935j83158l42526L23812j28979L76579m32615
5846D462354K3095M11314j63471J06661j31007K20912o75289M39803j34914j86212
$$ plain form
5916 4403908 4832835 4921435 4711670 4268108 4760759 4752854 4539294 5001502 4410995 4480203
5906 4480203 4963740 4466858 5278534 4453296 4794631 4726030 4795930 4721266 4643755 4983910
5896 4983910 4700278 4947096 4658948 5408239 5102977 4943681 5150436 4956363 5492380 5457531
5886 5457531 5291318 5985622 5278900 5276735 5968161 6013079 5930233 6261255 6157395 6142057
5876 6142057 5809127 6265931 5907661 5877153 5838835 6224709 5719680 5864536 5606257 5296064
5866 5296064 5440290 5496559 5486549 5173487 4970888 5213701 4866441 4991845 5051619 4778266
5856 4778266 4866635 4974332 4984176 4849241 4666083 4323557 4647369 4518390 4894969 4462354
5846 4462354 4485449 4896763 4733292 4839953 4708946 4929858 4254569 4694372 4559458 4373246
5836D373246L69002k76097K89191q5527p4047J70088l10164q7505J04994p1736
5826D401445m6681J79801K8557L50445K74814l51887J49295m50025K02575L87509
5816E125848k44185m9519l43155j98150P15427o77724J97508K07351j2564J06411
5806D827248k32507k18535L16182J43857L15069j89677m4469j71095J70939k23631
5796D693381L35491K3521l24451k8991J64208j93184j54690K84699J08641n54053
5786D354572J36275O51830n02307K35069m2797o1740k5000K07390j86341J58177
5776D925128l20259M36363r2475l43635L83104n8992K63116j35536l39581k33898
5766D483335M17164K2488L02032k42404o0177K98852n19131K51345K31325k61306
$$ plain form
5836 4373246 4742248 4466151 4755342 4669815 4595768 4765856 4455692 4368187 4473181 4401445
5826 4401445 4354764 4534565 4563122 4913567 5188381 4836494 4985789 4535764 4738339 5125848
5816 5125848 4881663 4832144 4488989 4290839 5006266 4328542 4526050 4733401 4720837 4827248
5806 4827248 4594741 4376206 4692388 4836245 5151314 4961637 4917168 4746073 4917012 4693381
5796 4693381 5028872 5052393 4727942 4698951 4863159 4669975 4515285 4799984 4908625 4354572
5786 4354572 4490847 5142677 4640370 4875439 4832642 4770902 4745902 4953292 4766951 4925128
5776 4925128 4604869 5041232 4948757 4605122 4988226 4929234 5192350 5056814 4717233 4483335
5766 4483335 4900499 4922987 5225019 4982615 4922438 5221290 4702159 4953504 5184829 4923523
5756D923523M2081r5269o8106n9552N41097Q6930m46462j32429M24751K13396
5746E429960m89768J88106J08768n16729M41116j71749Q6041k45039M15399j18947
5736E127158j66502Q0016M10967k84652M65710n4105m86158M05883j36235J76262
5726E538344l10905K26771m4277j5300J10294j45296J46487J88315J21740r4777
5716E721396j15181M77020k52687k4711J54561q5461N54107l63495K12551k48541
5706F029559J80361O3730J07994m4109l08176Q25951m14918L95414J806p7412
5696F760200P45110J32685q76181N05487k86937N35622K23149j56691L9938L27589
5686G949971j32034N13202j48814P3506N5526J88543J61668O30209Q0866L70945
$$ plain form
5756 4923523 4965604 4870335 4802229 4742677 5283774 5370704 4924242 4791813 5216564 5429960
5746 5429960 4940192 5128298 5237066 4720337 5161453 4989704 5075745 4830706 5246105 5127158
5736 5127158 4960656 5040672 5451639 5166987 5632697 5578592 5092434 5498317 5362082 5538344
5726 5538344 5227439 5454210 5409933 5394633 5504927 5359631 5506118 5694433 5816173 5721396
5716 5721396 5606215 6083235 5830548 5805837 5960398 5874937 6429044 6065549 6278100 6029559
5706 6029559 6209920 6273650 6381644 6337535 6029359 6855310 6440392 6835806 6837612 6760200
5696 6760200 7505310 7637995 6761814 7267301 6980364 7515986 7739135 7582444 7622382 7949971
5686 7949971 7817937 8331139 8182325 8255831 8311357 8499900 8661568 9291777 9372643 9743588
5676I743588L17270n3578P43235J71260K63230L26168J52509M39112N52414j1110
5666A2644098R19375L29407K82095L78890L29330L92647J8144P55599L87728L46106
5656A6783419M37228n781O91017J34416O91074J20707M81605R23356M02253P15213
5646B1374507L82396M65885O56951Q27124P27810P10401L38495L50930O10695
5637B6445194N96942r0997J71276M40077J5181j30198J94236J930M6260K13238
5627B7903139j46412K06626O17433l27946P515N04290R7059N62158J95056R56067
5617C0574985L86277j59867P79889j50865N52565M43389l36936R0504L4N05504
5607C2685479p5482l73892k79659j62804M440L45831m00863P12964J97160Q0238
$$ plain form
5676 9743588 10060858 10007280 10750515 10921775 11185005 11511173 11663682 12102794 12655208 12644098
5666 12644098 13563473 13892880 14174975 14553865 14883195 15275842 15293986 16049585 16437313 16783419
5656 16783419 17220647 17214866 17905883 18040299 18731373 18852080 19333685 20257041 20659294 21374507
5646 21374507 21756903 22222788 22879739 23706863 24434673 25145074 25483569 25834499 26445194
5637 26445194 27042136 26951139 27122415 27562492 27577673 27447475 27641711 27643641 27689901 27903139
5627 27903139 27756727 27963353 28580786 28252840 28260355 28764645 28861704 29423862 29618918 30574985
5617 30574985 30961262 30801395 31581284 31430419 31982984 32426373 32089437 32179941 32179975 32685479
5607 32685479 32609997 32236105 31956446 31793642 31798082 32143913 31743050 32456014 32653174 32733412
5597C2733412J92328O63576J65600N9299R74916R51568J36011J19085N40777N36002
5587C7072574M06643O16090J36344K70032n0692L49302L19823l71520O6188l27620
5577C8487164Q26259M7049j50461Q90237L61277K0423Q87293O57448J078609L49410
5567D3454708J380082P78012J502899J001586J020343J998173N81022J159602
5559E2876427J414171J135525Q37130J175249R73842J28724J101021M95896M62542
5550F0600527P95053J59890N51387N78620N60141L10860M06660N04307N42390
5541F5009835J26415O24833N02941P27985N03068P53339L42794R70002R76323
5532G0537535R06955R96541J155390P72411Q61024J457391K027962Q33731J426227
$$ plain form
5597 32733412 32925740 33589316 33754916 33814215 34789131 35740699 35876710 35995795 36536572 37072574
5587 37072574 37479217 38095307 38231651 38501683 38450991 38800293 39120116 38748596 38814784 38487164
5577 38487164 39313423 39360472 39210011 40100248 40461525 40481948 41369241 42026689 43105298 43454708
5567 43454708 44834790 45612802 47115701 48117287 49137630 51135803 51716825 52876427
5559 52876427 54290598 55426123 56263253 57438502 58412344 58541068 59642089 60137985 60600527
5550 60600527 61395580 61555470 62106857 62685477 63245618 63556478 63963138 64467445 65009835
5541 65009835 65136250 65761083 66264024 66992009 67495077 68248416 68591210 69561212 70537535
5532 70537535 71444490 72441031 73596421 74368832 75229856 76687247 78715209 79548940 80975167
5523H0975167J491975J441530J129907J298615K030502J114991L02658J327595
5515I1112940M14497L42341L36147M1479l45520m68243j30765q62221j080140
5506H9360515j026115l53632r16301j491474p90440n06525p63659j28413m28023
5497H2955933p47647J96137k96894J12986k20840L08063j17403J1634Q5327j24659
5487H2162637m86710m05068m40184q93865j065149l74828j480783k165489j196435
5478G3654126j825464j685394j563456k180584j569978j691252j634712j841306
5470E9661980j324025j282338j151366j579848q91911q88158r46617m01494n95182
5461E0601041j017164l92594n70747r7131k25085o21066m49566q85197m18105
$$ plain form
5523 80975167 82467142 83908672 85038579 86337194 88367696 89482687 89785345 91112940
5515 91112940 91527437 91869778 92205925 92247404 91901884 91433641 91302876 90440655 89360515
5506 89360515 88334400 87980768 87064467 85572993 84782553 84276028 83512369 83383956 82955933
5497 82955933 82208286 82404423 82107529 82220515 81999675 82307738 82190335 82201969 82287296 82162637
5487 82162637 81675927 81270859 80830675 79936810 78871661 78496833 77016050 74850561 73654126
5478 73654126 71828662 70143268 68579812 66399228 64829250 63137998 61503286 59661980
5470 59661980 58337955 57055617 55904251 54324403 53432492 52544334 51597717 51196223 50601041
5461 50601041 49583877 49191283 48620536 48523405 48298320 47677254 47227688 46342491 45924386
5452D5924386k43977j178831o28956o15313o02139p24999q24112j003147N4855
5443D0157767o13809n16033o92423p18074l03139m3578m93708j53225o07955k76882
5433C5738941l59083l22212l4770m94198n35035l20482n13580n17711K5619j419801
5423C1247688J07171p30449n79246l90808m81922m20597l80104n51151m81095
5414B7339487k74873j082168m43911l82833p58599O1568n63223n70239p45743
5405B2579466m7415r31117m80050l88607k30970n52122l6824r61074k44165j1516
5395A8695606r10713p2633n27865k19222o68200j76880n05888K30170m24507j02594
5385A5317274k52046n63935j08782r8735j57822l07203Q0864p53151K97514J9789
$$ plain form
5452 45924386 45680409 44501578 43872622 43257309 42655170 41930171 41106059 40102912 40157767
5443 40157767 39543958 39027925 38335502 37617428 37314289 37270711 36777003 36623778 36015823 35738941
5433 35738941 35379858 35057646 35022876 34528678 33993643 33673161 33159581 32641870 32667489 31247688
5423 31247688 31354859 30624410 30045164 29654356 29172434 28751837 28371733 27820582 27339487
5414 27339487 27064614 25982446 25538535 25155702 24397103 24458671 23895448 23325209 22579466
5405 22579466 22532051 21600934 21120884 20732277 20501307 19949185 19912361 18951287 18707122 18695606
5395 18695606 17784893 17712260 17184395 16965173 16296973 16120093 15614205 15844375 15419868 15317274
5385 15317274 15065228 14501293 14392511 14293776 14135954 13828751 13909615 13156464 13453978 13473767
5375A3473767l74682j12801m69145J84750m81217O9824K12114k15832J9102l68283
5365A1937597K00969l30687k74335L33001o98172L37715J46274k35878j3193M5365
5355A1448656j14238K49100n24855M5560P7689K61674j10758m25947j65949M42054
5345A1182986j78435K45432j34300M73307m07426J51709M60108m31811K41210
5336A1602780k4684M48068K51369l6526J99340m8007P96826j85206M24460N56100
5326A3984520M57283L18139M43194M82881Q97269M01356O22901J011248N92226
5317A9211017J539536N81861K010236L91167R04986R63551P24345Q97022J375701
5308B8599422N98993P48447J196356P22222N49584N70145L98708N37762j09686
$$ plain form
5375 13473767 13099085 12986284 12517139 12701889 12220672 12290496 12502610 12286778 12305880 11937597
5365 11937597 12138566 11807879 11533544 11866545 11168373 11506088 11652362 11416484 11403291 11448656
5355 11448656 11334418 11583518 11058663 11104223 11181912 11443586 11332828 10906881 10740932 11182986
5345 11182986 11004551 11249983 11115683 11588990 11181564 11333273 11793381 11361570 11602780
5336 11602780 11578096 12026164 12277533 12241007 12440347 12392340 13189166 13003960 13428420 13984520
5326 13984520 14441803 14759942 15203136 15686017 16583286 16984642 17607543 18618791 19211017
5317 19211017 20750553 21332414 23342650 23733817 24638803 25602354 26326699 27223721 28599422
5308 28599422 29198415 29946862 31143218 31865440 32415024 32985169 33383877 33921639 33811953
5299C3811953j01894J93811l57395m16459l55048m62084j021223o21217q95395
5290B9775049j045356j278504q07852j114373r80029j220052j115807r27700r56078
5281B0329298j116596r18374q24334o09382j278103q65279j30239r84690j97316
5272A3404985k34378q18550m8050j28223p33321m94627J6918p08723j50794J98453
5262A0303690o89554j29746K4310l53393p4362Q5958o06637j15503j72317k21675
5252H050771K51057m63044J93459J41600p61898q9383J25395k08394p613r1321
5242G140629j5581m9294k81017J4237K38996k77440k71299L62675n3951l54102
5232F453853J3332J02351N48144n67766J14521n83824K79793l32094L57087k10528
$$ plain form
5299 33811953 33710059 33903870 33546475 33130016 32774968 32312884 31291661 30670444 29775049
5290 29775049 28729693 27451189 26643337 25528964 24548935 23328883 22213076 21285376 20329298
5281 20329298 19212702 18294328 17469994 16860612 15582509 14717230 14586991 13602301 13404985
5272 13404985 13170607 12352057 12304007 12175784 11442463 10947836 10964754 10256031 10105237 10303690
5262 10303690 9614136 9484390 9508700 9155307 9080945 9166903 8560266 8444763 8272446 8050771
5252 8050771 8301828 7838784 8032243 8173843 7411945 7322562 7447957 7239563 7231950 7140629
5242 7140629 7125048 7075754 6794737 6808974 7047970 6770530 6499231 6861906 6807955 6453853
5232 6453853 6467185 6569536 7117680 6549914 6664435 6080611 6360404 6028310 6385397 6174869
5222F174869n1682O5384q9825j30082l7216k20786K06088L05996j06483p12655
5212E403608R50774n67433r8470L70559r9961Q5336j12199j70862o4915p5146
5202E621291L43158l46589k3603o19121J64782K33602K2733J08451n95503M88686
5192E397887k8769l91532j62488N33975k83750r9547M90066q94515N09251k45332
5182D825246M3948j64833J79422K8809k63550m53971L16627m02216J97990R5917
5172D403389k275l41348K01970l24489K25894k05919N30753j12302m2870r1071
5162D241732K3207K64217l32587l04322j65989J55257M0305k38656L45573r9878
5152C928859J5476n76405L32625o4926Q3724N61433l39915P2496j54973n88635
$$ plain form
5222 6174869 6123187 6188571 6098746 5968664 5931448 5710662 5916750 6222746 6116263 5403608
5212 5403608 6354382 5786949 5688479 6059038 5959077 6044413 5932214 5761352 5696437 5621291
5202 5621291 5964449 5617860 5594257 4975136 5139918 5373520 5396253 5504704 4909201 5397887
5192 5397887 5369118 4977586 4815098 5349073 5065323 4965776 5455842 4561327 5070578 4825246
5182 4825246 4869194 4704361 4883783 4912592 4649042 4195071 4511698 4109482 4307472 4403389
5172 4403389 4401114 4059766 4261736 3937247 4163141 3957222 4487975 4375673 4332803 4241732
5162 4241732 4264939 4529156 4196569 3892247 3726258 3881515 3921820 3683164 4028737 3928859
5152 3928859 3944335 3367930 3700555 3635629 3719353 4280786 3940871 4013367 3858394 3269759
5142C269759N18620l19980k02218M87535l71371L74410m29319O78243l24422j31321
5132C549936J21886J09084N5186n80827K54386J16605k18534K89788K7796n91629
5122C133677K03475L68408j70661R2554k09899J72951m94590M22212j69377n6024
5112C292726K16087l8930l20763K79548Q4842L4165l14448M6433P0195P5874j77712
5101C248017l4400L52098l09990N786O7489L27931k00279m71047j5996N24529
5091C494138j74031n52118M43590j67987m0869j76051L23324k0010k29623K04659
5081C105022L3679k35831J01868R0922l87851L86519R474n15209M92747O6940
5071C148280r0694o5207O71M9511o6121n37318R62566j68216k48728O1850q2373
$$ plain form
5142 3269759 3788379 3468399 3266181 3753716 3382345 3756755 3327436 4005679 3681257 3549936
5132 3549936 3671822 3780906 3836092 3255265 3509651 3626256 3407722 3697510 3725306 3133677
5122 3133677 3337152 3705560 3534899 3627453 3417554 3590505 3095915 3518127 3348750 3292726
5112 3292726 3508813 3469883 3149120 3428668 3513510 3547675 3233227 3279660 3349855 3425729 3248017
5101 3248017 3213617 3565715 3255725 3261511 3329000 3656931 3456652 2985605 2969609 3494138
5091 3494138 3320107 2767989 3211579 3043592 3002723 2826672 3149996 3129986 2900363 3105022
5081 3105022 3138701 2902870 3004738 3095660 2707809 3094328 3103802 2588593 3081340 3148280
5071 3148280 3057586 2992379 2993050 3042561 2976440 2439122 3401688 3233472 2984744 3046594 2964221
5060B964221j64004N07997l19927k14690L37992l5817m09731P81877l56614J60988
5050C252292O5051R0199n83051P8992N05524n36473K66581K05305k80482K55084
5040C319022j97736L5051K25708m68712N76068j41326J08136m6552q2665K19608
5030C546602J07882j24012J56192J97659m46879p0768L270r2075M65366m19545
5020C323692K11328j66902L46674k43510K82745j22734J35696m82114N04217K19047
5010D008139k54885K42770o2146k03377K33212K05727j41991l96385L54424L94283
5000D379771k82427m22852R13514q06355L26359N276j52529K99863K69109J72332
4990D702061j28778L21170Q5108K48620j74842L87313q1865k73782J45894K36244
$$ plain form
5060 2964221 2800217 3308214 2988287 2773597 3111589 3075772 2666041 3447918 3091304 3252292
5050 3252292 3317343 3407542 2824491 2903483 3409007 2872534 3139115 3344420 3063938 3319022
5040 3319022 3121286 3156337 3382045 2913333 3489401 3348075 3456211 3409659 3326994 3546602
5030 3546602 3654484 3530472 3686664 3884323 3437444 3366676 3369946 3277871 3743237 3323692
5020 3323692 3535020 3368118 3714792 3471282 3754027 3631293 3766989 3284875 3789092 4008139
5010 4008139 3753254 3996024 3933878 3730501 3963713 4169440 4027449 3631064 3985488 4379771
5000 4379771 4097344 3674492 4588006 3781651 4108010 4113286 3960757 4260620 4529729 4702061
4990 4702061 4573283 4894453 4979561 5228181 5053339 5440652 5358787 5085005 5230899 5467143
4980E467143J97154o69421O06918L50623J13478L54744j27393M9515L3208K29309
4970F605278k29246M51140K11123j95468N24314j86150L5140N33364k07880L2095
4960G573710K95488J44614p4613M27699l9788K14065M90981k30965K10742L81720
4950I393653K84436L83709m47552Q41631L92881L89164j8587J08551N51780M27453
4940A2307119m7297N94188M1388k12485N35007j96265J89316k5886p62Q843k945
4929A3190221m53506N97630n1774k4119K82729m18403J20009J69380j20325O15587
4919A3907429k57067O82926j40665M31488K00505K52514O1181J05955N42124j77091
4909A5609299J31093N02731l24815L13408m65740J76110N0089n47822l00194K85113
$$ plain form
4980 5467143 5664297 4994876 5601794 5952417 6065895 6420639 6293246 6342761 6375969 6605278
4970 6605278 6376032 6827172 7038295 6842827 7367141 7180991 7216131 7749495 7541615 7573710
4960 7573710 7869198 8013812 7939199 8366898 8327110 8541175 9032156 8801191 9011933 9393653
4950 9393653 9678089 10061798 9614246 10455877 10848758 11237922 11219335 11327886 11879666 12307119
4940 12307119 12259822 12854010 12895398 12682913 13217920 13021655 13210971 13185085 13184323 13193166 13190221
4929 13190221 12736715 13334345 13282571 13258452 13541181 13122778 13242787 13412167 13291842 13907429
4919 13907429 13650362 14333288 14192623 14624111 14824616 15077130 15138311 15244266 15786390 15609299
4909 15609299 15740392 16243123 15918308 16231716 15765976 15942086 15992175 15444353 15144159 15429272
4899A5429272l11613l30094m97451L3245n084m09282k06920n3897m63969J70235
4889A3354442J83294j0521N7022n98350N44821k31823N02857r63245K94911M30222
4879A3563630m99665K27950o92830K50041K236m60365k54909k84328J45990p44282
4869A1253468k25508k07102m4075k22383k72169l60790m5050k54141j207k51800
4859I369243p4447l66590M7001r7539j60482K13022m12145L31811n88388n4632
4849H206854K02958k94862K07449l16313j3982l86668N24989k08507M5874n56659
4839G411133J09618J46778j75385l04081J72638k95640l89971M03094K89661r5414
4829G272431k6588m09123N83427m81091N03193l63210K43615J90424l98978L74665
$$ plain form
4899 15429272 15117659 14787565 14290114 14323359 14318275 13908993 13702073 13648176 13184207 13354442
4889 13354442 13537736 13527215 13584237 12985887 13530708 13298885 13801742 12838497 13133408 13563630
4879 13563630 13063965 13291915 12599085 12849126 12851362 12390997 12136088 11851760 11997750 11253468
4869 11253468 11027960 10820858 10776783 10554400 10282231 9921441 9876391 9622250 9621043 9369243
4859 9369243 9294796 8928206 8975207 8877668 8717186 8930208 8518063 8849874 8261486 8206854
4849 8206854 8409812 8114950 8322399 8006086 7992104 7605436 8130425 7921918 7967792 7411133
4839 7411133 7520751 7667529 7492144 7188063 7360701 7065061 6675090 7078184 7367845 7272431
4829 7272431 7245843 6836720 7420147 6939056 7442249 7079039 7322654 7513078 7114100 7488765
4819G488765k28926P23670l33204K90558l12558M26713R5858p3003N97623o07945
4809H067551O63891N11357n30255P33022j80740K28861L54373J8225L05722o5038
4799A0106969L45109j8515O15807j38669Q22832j59282J81094O33565J2986N01944
4789A2903840O10685K97563Q34194j62095L70082O28589M96683N38962Q10892
4780A7329395N02665L90155J143834O50094R31350K86108J019943M43893J201353
4771B3898790L19061J460959K30446J152253R12361p5286J135044J082645N13578
4762C0629851J169146P06572P93229P79045Q05305L70607N08405N41044J276228
4753C7579432L53642N57679M98324p8659O14181N6475N06903j72749J95456n45549
$$ plain form
4819 7488765 7259839 7983509 7650305 7940863 7628305 8055018 8150876 8077873 8675496 8067551
4809 8067551 8731442 9242799 8712544 9445566 9264826 9493687 9848060 9866285 10172007 10106969
4799 10106969 10452078 10433563 11049370 10910701 11733533 11574251 11755345 12388910 12401896 12903840
4789 12903840 13514525 13812088 14646282 14484187 14854269 15482858 15979541 16518503 17329395
4780 17329395 17832060 18222215 19366049 20016143 20947493 21233601 22253544 22697437 23898790
4771 23898790 24217851 25678810 25909256 27061509 27973870 27898584 29033628 30116273 30629851
4762 30629851 31798997 32505569 33298798 34077843 34883148 35253755 35762160 36303204 37579432
4753 37579432 37933074 38490753 38989077 38910418 39524599 39581074 40087977 39915228 40110684 39565135
4743C9565135M3290q1573j43561o93481m29734l55514q07206o14486m570p85448
4733C5692852m61815r14483q33727m53383j032924r1255q72065n49335j204417
4724B9279448m33608l62473r92196k60259m68734j151279l55365n94953n53460
4715B4107121p89919o15245n53918k16381j022970j66011k28464n81942j48045
4706A9784226l70756j88323o06245l48675j76457l33850L69422m09776j28631
4697A7590935q17750M77349J89092O6073k02158l86570m3047m8333l3780j02572
4687A6689239M66767J14826l79780N58111O0628j51665J95072K92310J66151O90493
4677A8702152j92360K72306Q29741q4679M50643Q3339j31668Q01322N64515K92555
$$ plain form
4743 39565135 39608425 39526852 39383291 38689810 38260076 37904562 37097356 36482870 36478300 35692852
4733 35692852 35231037 34316554 33482827 33029444 31996520 31905265 31033200 30483865 29279448
4724 29279448 28845840 28483367 27491171 27230912 26762178 25610899 25255534 24660581 24107121
4715 24107121 23317202 22701957 22148039 21931658 20908688 20742677 20514213 19932271 19784226
4706 19784226 19413470 19225147 18618902 18270227 18093770 17759920 18129342 17719566 17590935
4697 17590935 16773185 17250534 17439626 17505699 17303541 16916971 16873924 16825591 16791811 16689239
4687 16689239 17156006 17270832 16891052 17449163 17509791 17358126 17553198 17845508 18011659 18702152
4677 18702152 18509792 18782098 19611839 19527160 19977803 20061142 19929474 20730796 21295311 21587866
4667B1587866K28791O55506K15740J56093J70873R25188N77371J48631N94328
4658B5260387M73913K84578J207496j20256Q32710R63964J39634P21323R68304
4649C0732053N00572R50731M45478Q52148N53009N41353P11898Q18011N00929
4640C6606182K47739P21098N35169N01632N55863O71201O89825L30627Q26883
4631D1686219K92390N29869N63006P80834P14964L82421N52311P06115P85057
4622D6993186L60340P33182L12382M67854Q65554L89936J62105M85812L18726
4613E1089077L05725k18805p6886M72249j04735j11658O31639k97685k13449L37197
4603E1812669o03657J8871l24122r6664O90158p41750K8218M20506n97007J16441
$$ plain form
4667 21587866 21816657 22472163 22687903 22843996 23014869 23940057 24517428 24666059 25260387
4658 25260387 25734300 26018878 27226374 27106118 27938828 28902792 29042426 29763749 30732053
4649 30732053 31232625 32183356 32628834 33480982 34033991 34575344 35287242 36105253 36606182
4640 36606182 36853921 37575019 38110188 38611820 39167683 39838884 40528709 40859336 41686219
4631 41686219 41978609 42508478 43071484 43852318 44567282 44949703 45502014 46208129 46993186
4622 46993186 47353526 48086708 48399090 48866944 49732498 50122434 50284539 50770351 51089077
4613 51089077 51394802 51175997 51099111 51571360 51466625 51354967 51986606 51688921 51475472 51812669
4603 51812669 51209012 51227883 50903761 50807097 51497255 50755505 50783723 51204229 50607222 50723663
4593E0723663J37250m00601k07923l15989k24629M1548m19202j47734K1451o10928
4583D8596906p03583n52373p84420m84402m61053p24762o90068p09074j37355
4574D3349816p59124j095634k69901p78331l19091m50594m94834j004289k29532
4565C7948486L7363n76322n63046q70057Q7935q43740j90320o07644m69364o01992
4555C3351299q79200k17707o54758p83589N2696r71191m87574p08437j67197p90539
4545B7743803m36810q35994j1090l33598m74654p67027K68551j47336q46348j65947
4535B3993550o36308N9449k02766L7527k75773l61846O9263j06391n07968j34888
4525B1933849k21368l4200J26702n566p44037j1046N46670n89772K43647m81854
$$ plain form
4593 50723663 50860913 50460312 50252389 49936400 49711771 49753319 49334117 49186383 49207834 48596906
4583 48596906 47893323 47340950 46556530 46072128 45611075 44886313 44196245 43487171 43349816
4574 43349816 42590692 41495058 41225157 40446826 40127735 39677141 39182307 38178018 37948486
4565 37948486 37985849 37409527 36846481 35976424 36064359 35220619 35030299 34422655 33953291 33351299
4555 33351299 32472099 32254392 31599634 30816045 30868741 29897550 29409976 28701539 28534342 27743803
4545 27743803 27306993 26470999 26459909 26126311 25651657 24884630 25153181 25005845 24159497 23993550
4535 23993550 23357242 23416691 23213925 23251452 22975679 22613833 22683096 22576705 22068737 21933849
4525 21933849 21712481 21678281 21804983 21799417 21055380 21044334 21591004 21001232 21244879 20763025
4515B0763025l46001N66989J19680j12313P4497j43318K05966J25634P5103L43647
4505B1672909k26715N86685J96128K71951M83598j6397J0652M40091J69311Q8920
4495B3677133N69111Q7438M92387M57815M0932Q21938L52748N29610M80819L95777
4485B7905708P58196L19042N42793N56421Q11483R32726K33063J022419M92402
4476C3574253J079896N54977J104493J044451Q83006J375445R85539J013506J926563
4467D3542129J001303J331082J292685J271341J813118J511557J539615J887738
4459E5190568J831175K235121J482181K120811K204841K218694K012267K164002
4451G1459660K530974J997761K604406K513460K768047L212776K983222L064894
$$ plain form
4515 20763025 20417024 20984013 21103693 20991380 21065877 20922559 21128525 21254159 21329262 21672909
4505 21672909 21446194 22032879 22229007 22500958 22984556 22968159 22978811 23418902 23588213 23677133
4495 23677133 24246244 24333682 24826069 25283884 25324816 26146754 26499502 27029112 27509931 27905708
4485 27905708 28663904 28982946 29525739 30082160 30893643 31826369 32059432 33081851 33574253
4476 33574253 34654149 35209126 36313619 37358070 38241076 39616521 40602060 41615566 43542129
4467 43542129 44543432 45874514 47167199 48438540 50251658 51763215 53302830 55190568
4459 55190568 57021743 59256864 60739045 62859856 65064697 67283391 69295658 71459660
4451 71459660 73990634 75988395 78592801 81106261 83874308 87087084 90070306 93135200
4443I3135200L654129L390488L973818M459867M646220M396727N099071O088544
4435A28844064N592851O813915P427500P573551Q376744R249189J0022920J0109904
4427A94010638J0512592J1290007J1055573J1441438R401833R284224P717908
4420B64714213N158423L593441L44494j191151m002645n946978p721814q724795
4412B46223188r538817j1055312j0200410j0536814j0106668r551545r183798
4405A76049824q523054q135076o612379o615889n721839n590499n256361l457378
4397A26137349m302882l571984l461416l095576k226665k730455k368533j597791
4389A02782047k520982j759915j152984j251386j097332j101158j235437q96755
$$ plain form
4443 93135200 96789329 100179817 104153635 108613502 113259722 117656449 122755520 128844064
4435 128844064 134436915 141250830 148678330 156251881 164628625 173877814 183900734 194010638
4427 194010638 204523230 215813237 226868810 238310248 247712081 256996305 264714213
4420 264714213 269872636 273466077 273810571 272619420 268616775 262669797 254947983 246223188
4412 246223188 236684371 225629059 215428649 204891835 194785167 185233622 176049824
4405 176049824 167526770 159391694 152779315 146163426 140441587 134851088 129594727 126137349
4397 126137349 121834467 118262483 114801067 111705491 109478826 106748371 104379838 102782047
4389 102782047 100261065 98501150 97348166 96096780 94999448 93898290 92662853 91766098
4381I1766098q93557m54650o03643j220834o19136m9125j769290l86432o34390
4372H5135041j099272p09928j340837m69634j167925j153888o37225j427007j239094
4363G5890231r68490j300438j287675j398781j070473j064998j457379j213451
4355F6128546j151463j416467j037277j102419j021720j813510j126296j089246
4347E6370148j073333j649751j360017q24691o20489j240710q81049q97488j321963
4338D6500657q32794j133730l84764r22535q26312m38367j172277n32698o77732
4329C9579448p65054p59068n64932p63050k49592j037784n73287m44727k44820
4320C4177134o54141q10563q4287j037485j66994K0885m74473l39009m94904m2197
$$ plain form
4381 91766098 90872541 90417891 89814248 88593414 87974278 87925153 86155863 85769431 85135041
4372 85135041 84035769 83325841 81985004 81515370 80347445 79193557 78556332 77129325 75890231
4363 75890231 74921741 73621303 72333628 70934847 69864374 68799376 67341997 66128546
4355 66128546 64977083 63560616 62523339 61420920 60399200 58585690 57459394 56370148
4347 56370148 55296815 53647064 52287047 51462356 50841867 49601157 48720108 47822620 46500657
4338 46500657 45667863 44534133 44149369 43226834 42400522 41962155 40789878 40257180 39579448
4329 39579448 38814394 38055326 37490394 36727344 36477752 35439968 34866681 34421954 34177134
4320 34177134 33522993 32712430 32628143 31590658 31423664 31444549 30970076 30631067 30136163 30093966
4310C0093966j3697m50151n2587O5756m35429J02581p045O0440n5679m0058j66434
4299B9101663j62827M17398k26442n91670l24912J93599l89436l35854p05829
4290B6975690K663q54101m68337q26959n95735m18899m92609p47660p13042o1762
4280B1799249j350500k94194n14582k57539k92844q30155r8057l96527n15185
4271A7249666l51727l5250j21809n39932l38944k69650m0753m54881j63945k37525
4261A4695250l01545m21363J5177K32443l90258n12859l2289j72581o06564J1659
4251A2517070j81443q1677N3512m39227p6395p05255K74448J01802p23328L1729
4241A0771236K2849J7399n07661k75268M08982m47941L20096k12082o7086K41844
$$ plain form
4310 30093966 30080269 29630118 29577531 29643287 29207858 29310439 29303394 29363834 29308155 29268097 29101663
4299 29101663 28938836 29356234 29129792 28538122 28213210 28406809 28017373 27681519 26975690
4290 26975690 26978353 26124252 25655915 24828956 24233221 23814322 23321713 22574053 21861011 21799249
4280 21799249 20448749 20154555 19639973 19382434 19089590 18259435 18161378 17764851 17249666
4271 17249666 16897939 16862689 16740880 16200948 15862004 15592354 15551601 15096720 14932775 14695250
4261 14695250 14393705 13972342 13987519 14219962 13829704 13316845 13284556 13111975 12505411 12517070
4251 12517070 12335627 12253950 12307462 11868235 11791840 11086585 11361033 11462835 10739507 10771236
4241 10771236 10794085 10811484 10303823 10028555 10437537 9989596 10309692 10097610 10030524 10272368
4231A0272368m37788p9395m49629M01749k18622k94658O17692p13668L80960q32507
4221H646502K59509r2038j17806J97437k40757k23270M9820P5775j16883r5812
4211H342477L3645J86954m60653j06631M07896l49026L62939k66173R0585m86185
4201G755828L21113k86961j65603J54601m57905P18116n88804M6611l10249L02530
4191G489277m92441O57054j97048q409k44529J59236L00503k57617n1145o3802
4181G291079K79418j26331l35689M05009k40414l7427k0648L38784j13398K13397
4171G653780q2795K14279j74521o15215K22566L29126o6524K25374j92987P9545
4161G592628m43729O3303J4328m08691L9762q6709J23187j52158J27717m12641
$$ plain form
4231 10272368 9834580 9755185 9305556 9707305 9488683 9194025 9811717 9098049 9479009 8646502
4221 8646502 8906011 8813973 8696167 8893604 8652847 8429577 8479397 8555172 8438289 8342477
4211 8342477 8376122 8563076 8102423 7995792 8403688 8054662 8417601 8151428 8242013 7755828
4201 7755828 8076941 7789980 7624377 7778978 7321073 8039189 7450385 7496996 7186747 7489277
4191 7489277 6996836 7653890 7456842 7448433 7203904 7363140 7663643 7406026 7354881 7291079
4181 7291079 7570497 7444166 7108477 7513486 7273072 7235645 7214997 7553781 7440383 7653780
4171 7653780 7570985 7785264 7610743 6995528 7218094 7547220 7480696 7706070 7513083 7592628
4161 7592628 7148899 7212202 7226530 6817839 6857601 6770892 6894079 6741921 6869638 6456997
4151F456997P2389l51644J17577k19404K86698j89362m70604J10427L71379o14590
4141E569863L56166k3389j07884n7983k01536K8349j01995l48962N21341j64006
4131E469964j07519J14644k56493J83221k13738L27960l35937L04458j98129k57390
4121E031041K27301O5768l6582j80093o8128O58215m88188J04988K85847j01733
4111E498436J24396k24406J41771j75247q0115K98854K05712p7079l3148k19817
4101E459357R4729j93617N8278j74803L23170J8996n03171K38712j06395k8279
4091E186977k63373K57624J1731m53718J52943m09370L82155P370l70224j12395
4081D389720N2415M50337p28715J50836J70020k49994K68653J18489l20232l6951
$$ plain form
4151 6456997 6529386 6177742 6295319 6075915 6362613 6173251 5702647 5813074 6184453 5569863
4141 5569863 5926029 5902640 5794756 5736773 5535237 5563586 5461591 5112629 5633970 5469964
4131 5469964 5362445 5477089 5220596 5403817 5190079 5518039 5182102 5486560 5288431 5031041
4121 5031041 5258342 5324110 5287528 5107435 5039307 5697522 5209334 5314322 5600169 5498436
4111 5498436 5622832 5398426 5540197 5364950 5284835 5583689 5789401 5712322 5679174 5459357
4101 5459357 5554086 5360469 5418747 5243944 5567114 5586110 5082939 5321651 5215256 5186977
4091 5186977 4923604 5181228 5192959 4739241 4892184 4482814 4864969 4872339 4502115 4389720
4081 4389720 4442135 4892472 4163757 4314593 4484613 4234619 4503272 4621761 4301529 4264578
4071D264578R5713r7942m6101M76151k61998n49430O54187o62983Q76512m89317
4061D259370q235M038L44422l94284N84907j64976k3213k02605K75350l74432
4051D300342L65901k2694j79370M63014Q7138k20010N0489j72028L30206l88905
4041D614083K50225m6754M52076q945j43331K44577j60831P0490l57746J52074
4031E065918k08193M0136J32870m07587L48336K50812j20688J54330r0159P4401
4021E240176P6208J47682N45844o16630K16448M66844j50988m7360J52154L88366
4011F418744n57838M47383M9518k71646L69832j54832k85727M23239l78244k4821
4001F035608J13498j35857m2151l40098J06461l42787L06710J9959j8665M9599
$$ plain form
4071 4264578 4360291 4262349 4216248 4692399 4430401 3880971 4535158 3872175 4748687 4259370
4061 4259370 4251135 4255173 4599595 4205311 4790218 4625242 4602029 4399424 4674774 4300342
4051 4300342 4666243 4643549 4464179 4927193 5014331 4794321 4844810 4672782 5002988 4614083
4041 4614083 4864308 4817554 5269630 5260685 5117354 5361931 5201100 5271590 4913844 5065918
4031 5065918 4857725 4897861 5030731 4623144 4971480 5222292 5101604 5255934 5165775 5240176
4021 5240176 5316384 5464066 6009910 5393280 5609728 6076572 5925584 5878224 6030378 6418744
4011 6418744 5860906 6308289 6357807 6086161 6455993 6301161 6015434 6438673 6060429 6035608
4001 6035608 6149106 6013249 5971098 5631000 5737461 5394674 5701384 5721343 5702678 5752277
3991E752277k73605J02891K38987l19919Q9413l59224N77868M2725n42691O24044
3981E932766l13663j66752m53751K60109l28868J60612J52853k69909m02326k83170
3971D287901L76477k74534p8496j04535m4236K59204m11898K07291j03084r537
3961D104553Q8615K3399j63873L89356n57541m35462k16642N13995m6876l92872
3951C306652M21710m9783k13266l84047K24366J53732j06636N0313k12938M43050
3941C633153j30181l23969o1325J51261O1699j753l05735L0484j1887l56233K70335
3930B955849j51513K92573j79598j32071J87016j96890K0110k34515K89168m39964
3920B410165M80199p08283N58456k3797j40692K00991k35253n13448R42998l13827
$$ plain form
3991 5752277 5478672 5581563 5820550 5500631 5590044 5230820 5808688 5851413 5308722 5932766
3981 5932766 5619103 5452351 4998600 5258709 4929841 5090453 5243306 4973397 4571071 4287901
3971 4287901 4664378 4389844 4311348 4206813 4162577 4421781 4009883 4217174 4114090 4104553
3961 4104553 4193168 4216567 4052694 4442050 3884509 3449047 3232405 3746400 3699524 3306652
3951 3306652 3728362 3678579 3465313 3081266 3305632 3459364 3352728 3403041 3190103 3633153
3941 3633153 3502972 3179003 3117678 3268939 3330638 3328885 3023150 3053634 3041747 2685514 2955849
3930 2955849 2804336 3096909 2917311 2785240 2972256 2775366 2795476 2560961 2850129 2410165
3920 2410165 2890364 2182081 2740537 2716740 2576048 2777039 2541786 2028338 2971336 2657509
3910B657509J59655Q766n30914M33242m52562L2612K90700K6208o6288O9967k06561
3899B422334k72497M28876m13525N23267k52616K64754l18195J7155j39420K19090
3889B479223K94028m86214k35283N16428J93957m35213p158K60105j34557L9026
3879B484342K34355l13403K31435m76339L0047P1695J44492K54805n17144J07856
3869B252141j12269Q9920Q9701k3977k13394l1848N52569l08883J30153O9843
3859B493956j43000m4638J05998p6971J4353K72141m18387M17155k63740O11201
3849B968068k8972k98571j8463N1341k50256M45722m98834N75371j15858p8110
3839B751438K19013j06541K84452k98852q0764q0175l2040l89510M24403r3849
$$ plain form
3910 2657509 2817164 2825930 2295016 2728258 2275696 2308308 2599008 2625216 2558928 2628895 2422334
3899 2422334 2149837 2578713 2165188 2688455 2435839 2700593 2382398 2399553 2260133 2479223
3889 2479223 2773251 2287037 2051754 2568182 2762139 2326926 2319768 2579873 2445316 2484342
3879 2484342 2718697 2405294 2636729 2160390 2190437 2262132 2406624 2661429 2144285 2252141
3869 2252141 2139872 2229792 2319493 2295516 2082122 2050274 2602843 2293960 2424113 2493956
3859 2493956 2350956 2306318 2412316 2335345 2349698 2621839 2203452 2620607 2356867 2968068
3849 2968068 2939096 2640525 2622062 2673403 2423147 2868869 2370035 2945406 2829548 2751438
3839 2751438 2970451 2863910 3148362 2849510 2768746 2688571 2656531 2267021 2691424 2597575
3829B597575J23394k14290K37688l13972K67710O5616k05829M7479k80610j98948
3819B125813q6146m12268N10066j14160k07964K28265M8126m123L5079p3569K22364
3808B271483j58960j1011K04710k03807K26290m6063m33704J61180N1886m0714
3798B021290J59169j93949m616N6600n71973R16664l67494l63442n4835K93207
3788A890621m13149L61629k10309J50499M12649l93488L36585l85273l29381P30422
3778B150805j92137k50324J540j04825K47467q5588k6463J54635o0297J5800l75305
3767A475308M8275N24011p61643L49199L5050K47512l9672J17446n78113L65163
3757A782536L8754m08988o4182k01334L57766k06186N87464l98754l09771J80910
$$ plain form
3829 2597575 2720969 2506679 2744367 2430395 2698105 2763721 2557892 2605371 2324761 2125813
3819 2125813 2039667 1627399 2137465 2023305 1815341 2043606 2091732 2087609 2122688 2049119 2271483
3808 2271483 2112523 2101512 2306222 2102415 2328705 2282642 1848938 2010118 2062004 2021290
3798 2021290 2180459 1986510 1981894 2038494 1466521 2383185 2015691 1652249 1597414 1890621
3788 1890621 1477472 1839101 1628792 1779291 2191940 1798452 2135037 1749764 1420383 2150805
3778 2150805 1958668 1708344 1709884 1605059 1852526 1766938 1740475 1895110 1834813 1850613 1475308
3767 1475308 1523583 2047594 1285951 1635150 1670200 1917712 1878040 1995486 1417373 1782536
3757 1782536 1821290 1412302 1348120 1146786 1504552 1298366 1885830 1487076 1177305 1358215
3747A358215M66621n7182n41419M77790k95084M70135n01204J95741K73450q1621
3737A765442q5397j48055Q5170K51116m80700N08224j40318o82194M62648J3464
3727A549400q1625K439J20118K12574k39100l61370J3653M98928j47970r1769
3717A475278l5720K05790n44185K82285q8453J53477K35376m97177l2304L68868
3707A523235k45219K84445J12190J57311n96962L20312p0565K18930m92898J82103
3697A392882j4754M90322m99770M47718k93963N8621k23775j99891P52059o89359
3687A220090M38043j22206J90543k15232k75897j33691J59393L57719r3838J9559
3677A544483k28368M32417p95727M62217K97230m57071k25984J009241l97114
$$ plain form
3747 1358215 1824836 1767654 1226235 1704025 1408941 1879076 1377872 1573613 1847063 1765442
3737 1765442 1680045 1531990 1617160 1868276 1387576 1895800 1755482 1073288 1535936 1549400
3727 1549400 1467775 1470214 1590332 1802906 1563806 1202436 1216089 1715017 1567047 1475278
3717 1475278 1439558 1645348 1101163 1383448 1294995 1448472 1683848 1186671 1154367 1523235
3707 1523235 1278016 1562461 1674651 1831962 1235000 1555312 1484747 1703677 1210779 1392882
3697 1392882 1378128 1868450 1368680 1816398 1522435 1581056 1357281 1157390 1909449 1220090
3687 1220090 1658133 1535927 1726470 1511238 1235341 1101650 1261043 1618762 1524924 1544483
3677 1544483 1316115 1748532 952805 1415022 1712252 1255181 1029197 2038438 1641324
3668A641324o3740J61042n15776j64599K21588n4893J46508p6856L28694j8518
3658A604774k99806l70198L43662K89739l21979L10078m08042L09910j58020k3982
3648A276136L27104n31672K6082M0686J58499M76049m85432n1985K61676k87316
3638A209827P45857k86419k22971J94742l46314Q2423k23884L41720l67488N64673
3628A692166o0517J7471r744n3641l75108M79550j24109J35321l97908R5665j42751
3617A256395L75736j1122m44470L07677j34243o0175k30481K28135j47837j73936
3607I65679R42241p84017M05406l23728M32729l64623J1977P965M32703j73549
3597A552783K34114m23811j22349O82669n07363L7940k36506K64758l5070O8043
$$ plain form
3668 1641324 1577584 1738626 1222850 1058251 1279839 1224946 1371454 1294598 1623292 1604774
3658 1604774 1304968 934770 1278432 1568171 1246192 1556270 1148228 1458138 1300118 1276136
3648 1276136 1603240 1071568 1097650 1138336 1296835 1772884 1287452 1235467 1497143 1209827
3638 1209827 1955684 1669265 1446294 1641036 1294722 1377145 1153261 1494981 1127493 1692166
3628 1692166 1631649 1649120 1639376 1585735 1210627 1690177 1566068 1701389 1303481 1399146 1256395
3617 1256395 1632131 1621009 1176539 1484216 1349973 1289798 1059317 1287452 1139615 965679
3607 965679 1907920 1123903 1529309 1205581 1638310 1273687 1285664 1293629 1726332 1552783
3597 1552783 1786897 1363086 1240737 1923406 1416043 1453983 1217477 1482235 1447165 1515208
3587A515208k43725M29843n38478k8487K75800J27015K58544n82729m225J81971
3577A390737M70280m36650j2919o01209O34993n2022l07511J88573N1137K3190
3567A348599N896l96419M43251M97857l99210J54830k746m96012L76842J13013
3557A645901j3700O1440j87046K57515m7479n96230M77107J50762K51702J49442
3547B149414r54206K87468L18691o96276K08105l8751J92672M2663l50436J71510
3537A330854L30625K69708n76786k25396M01682m35657N72340k01393j47187K14457
3527A533247j56003J39692q7330j23119N80225q90193O10221m37373L45178n6008
3517A458537r1973j6324j65996O01522k95482J65204j99916m4600J59377j89397
$$ plain form
3587 1515208 1271483 1701326 1162848 1134361 1410161 1537176 1795720 1212991 1208766 1390737
3577 1390737 1861017 1424367 1411448 810239 1445232 1393210 1085699 1274272 1325409 1348599
3567 1348599 1354495 958076 1401327 1899184 1499974 1654804 1652058 1156046 1532888 1645901
3557 1645901 1632201 1693641 1506595 1764110 1716631 1120401 1597508 1748270 1999972 2149414
3547 2149414 1195208 1482676 1801367 1105091 1313196 1274445 1467117 1509780 1159344 1330854
3537 1330854 1661479 1931187 1354401 1129005 1530687 1095030 1667370 1465977 1318790 1533247
3527 1533247 1377244 1516936 1429606 1306487 1886712 996519 1606740 1169367 1514545 1458537
3517 1458537 1366564 1350240 1184244 1785766 1490284 1655488 1455572 1410972 1570349 1380952
3507A380952L6228k90543Q2806L62977n80048N33513q4542k92967M47028m38691
3497A156713N66263l12789k52831M91578k02388m06191N40745m55558K7094J40753
3487A293389K86621k35037J04295J30471n18026L37082l15043N37911n06715K39159
3477A354107L26676p3960J53732l16357K79851j3033n12112N19027L701J83667
3467A905299k33008o2823k01980K45246l2101k77221O9511N21936k27724L55663
3457B062798o50505M58712P3790n54109L77761j85043j25972M98521n13653J38798
3447A581098k29567K75475k02027J79072j41355L22728K37665m69299M72196q46070
3437A179916M48677j09489Q2031K99187k32989L73468k15330k49546M6969K73919
$$ plain form
3507 1380952 1417180 1126637 1209443 1572420 992372 1525885 1441343 1148376 1595404 1156713
3497 1156713 1722976 1410187 1157356 1648934 1446546 1040355 1581100 1125542 1152636 1293389
3487 1293389 1580010 1344973 1449268 1579739 1061713 1398795 1083752 1621663 1114948 1354107
3477 1354107 1680783 1606823 1760555 1444198 1724049 1711016 1198904 1717931 1721632 1905299
3467 1905299 1672291 1609468 1407488 1652734 1620633 1343412 1412923 1934859 1707135 2062798
3457 2062798 1412293 1871005 1944795 1390686 1768447 1583404 1457432 1955953 1442300 1581098
3447 1581098 1351531 1627006 1424979 1604051 1462696 1785424 2023089 1553790 2025986 1179916
3437 1179916 1628593 1519104 1601135 1900322 1667333 2040801 1825471 1575925 1622894 1896813
3427A896813l46071N55945m15442K46943k7290K55346k17234J53614k39056K22719
3417B086287Q3628k26045M22306m74649J82308K14025k37647M17694o54374N07131
3407B320664j57149K69949j91883N73956l19915k21649J23517l2822O54408n23283
3397B495793j03104P04144n76853N31896n85281J77277J61610q9330m78724O49547
3387B886975N36305l34219K72123k19843k34912l35383P27880K61417k06364k7131
3377C326848J99019J3611k32219K99554K73242k10850M84085j2657n4237M71429
3367D557825P5577J11432k04557N29512K59999n61287L1648N92967M42556Q4473
3357E920145J32451r1272P69159k82194K28001O33198R7005L07130K06660m41219
$$ plain form
3427 1896813 1550742 2106687 1691245 1938188 1910898 2166244 1949010 2102624 1863568 2086287
3417 2086287 2169915 1943870 2366176 1891527 2073835 2287860 2050213 2467907 1813533 2320664
3407 2320664 2163515 2433464 2241581 2815537 2495622 2273973 2397490 2364668 3019076 2495793
3397 2495793 2392689 3096833 2519980 3051876 2466595 2643872 2805482 2716152 2237428 2886975
3387 2886975 3423280 3089061 3361184 3141341 2906429 2571046 3298926 3560343 3353979 3326848
3377 3326848 3525867 3539478 3307259 3606813 3880055 3669205 4153290 4140633 4086396 4557825
3367 4557825 4633402 4744834 4540277 5069789 5329788 4768501 4800149 5393116 5835672 5920145
3357 5920145 6052596 5961324 6730483 6448289 6676290 7309488 7406493 7713623 7920283 7479064
3347G479064J288322j05418M80545O90079k29940P73362N58556R2523M41055Q04470
3337A2272618N52763J032283K15416J238664J089623R94686J039100J222525J926262
3328B1583940J471988J989281K643091K045539L175387L065644L159873L268255
3320D2402998L656525L985747L387833K693655K159209J344752J05879p04342
3312E9032256j002623j927719k920842k594351l309488l493619l201077l212027
3304C7370510k639330k833192k583692j882614k335922j390043j447658j498995
3296B0759064j467605j509758p51743p61084j121119q12135m85822o70293p79445
3287A2400060q17961j87299k00504l85718m19443m13804l89039o07105o8716l73317
$$ plain form
3347 7479064 8767386 8661968 9142513 9832592 9602652 10376014 10934570 11027093 11468148 12272618
3337 12272618 12825381 13857664 14073080 15311744 16401367 17396053 18435153 19657678 21583940
3328 21583940 23055928 25045209 27688300 29733839 32909226 35974870 39134743 42402998
3320 42402998 46059523 50045270 53433103 56126758 58285967 59630719 59736598 59032256
3312 59032256 58029633 56101914 53181072 50586721 47277233 43783614 40582537 37370510
3304 37370510 34731180 31897988 29314296 27431682 25095760 23705717 22258059 20759064
3296 20759064 19291459 17781701 17029958 16268874 15147755 14335620 13849798 13179505 12400060
3287 12400060 11582099 11394800 11194296 10808578 10389135 9975331 9586292 8979187 8910471 8537154
3277H537154K10406o99364J23314o98161J12685j3962K3445q42975l4885j96810
3267F520847K1502q3900M8533k56117k11189p1087J0723n8875m09409q5487K91989
3256E717530n25714J80012j68386l88793M25714l63443l32050N9282K38710j33574
3246D709288m24475l4446j32429j76356J17207j43410k29657L68480k45013J73019
3236C982208k55059k21829J60535j19728l44545K20092r6854P0679N6565m55245
3226B996819K56185J76633j60564L4370j53777J7982r2979K829j81660J24903
3216C020741j9836l77464j52045M77696k27617L27568k402Q2084n36505j93315
3206B398905M61710m87560K18046k79026P2624j20556J55741k87503j6208L76898
$$ plain form
3277 8537154 8747560 8048196 8171510 7473349 7586034 7572072 7595517 6752542 6717657 6520847
3267 6520847 6542349 6458449 6506982 6250865 6039676 5968589 5979312 5920437 5511028 5425541 5717530
3256 5717530 5191816 5371828 5203442 4814649 5240363 4876920 4544870 4604152 4842862 4709288
3246 4709288 4284813 4250367 4117938 3941582 4058789 3915379 3685722 4054202 3809189 3982208
3236 3982208 3727149 3505320 3665855 3546127 3201582 3421674 3324820 3395499 3452064 2996819
3226 2996819 3253004 3429637 3269073 3303443 3149666 3167648 3074669 3077498 2895838 3020741
3216 3020741 3000905 2623441 2471396 2949092 2721475 3049043 3046641 3128725 2592220 2398905
3206 2398905 2860615 2373055 2591101 2312075 2384699 2264143 2419884 2132381 2116173 2493071
3196B493071n50914J57922K54837j55875j05159J25757n07324M43611n2019M4788
3186B148695j60977k73069L49834j06187K17502k98639K61167n38531J22008L75408
3176B097211l92293r0431K05092J52307J98399n69781Q4192K00846o3180L15485
3166B137847n99377L36080K48390m54297l30934M34047J99926k57065m2319n51506
3156A120792O45225k61869J87883M0703j4773L61617k91605n5724K67403m74348
3146A525304J39877L53944j98311j63106j52219k78650K14974J68517p2209p9725
3136A458396l57289K2952K67675J42917J32417k97411L9775J06179j43083j85789
3126A186739O23528o19286K43952r9399k9554l39354K14559Q156j02558O27096
$$ plain form
3196 2493071 1942157 2100079 2354916 2199041 2093882 2219639 1712315 2155926 2103907 2148695
3186 2148695 1987718 1714649 2064483 1958296 2175798 1877159 2138326 1599795 1721803 2097211
3176 2097211 1704918 1614487 1819579 1971886 2170285 1600504 1684696 1885542 1822362 2137847
3166 2137847 1538470 1874550 2122940 1668643 1337709 1771756 1971682 1714617 1672298 1120792
3156 1120792 1766017 1504148 1692031 1732734 1717961 2079578 1787973 1732249 1999652 1525304
3146 1525304 1665181 2019125 1820814 1657708 1505489 1226839 1441813 1610330 1538121 1458396
3136 1458396 1101107 1124059 1391734 1534651 1667068 1369657 1409432 1515611 1372528 1186739
3126 1186739 1810267 1190981 1434933 1335534 1305980 966626 1181185 1189341 1086783 1713879
3116A713879o93669O56906j31174m06441n768M59694j56991K0704l8545J01407
3106A520002K32275n61033j00462k2778P4119J66609K20577k10782K49183k35964
3096A331746N92983l90230n2853j04707k32886K79882j75257J65369j32429K74421
3086A556039m31494N24505Q6720n36508J10625J31378k04240J43428P0409j13967
3076A336895J36621K22717q4557k73839M2992K34270p23748K14790M27776j59259
3066A374658j52989K44314l59652L23421k37944J1258J38077P505J10487l71353
3056A087782M30904j52879J65922k81536J2089L5542O5855M1733k92589O7121
3046A179944l26737J29512L19004j85000L00073m34568K78258j14693j70426m8345
$$ plain form
3116 1713879 1020210 1677116 1545942 1139501 1133733 1593427 1436436 1457140 1418595 1520002
3106 1520002 1752277 1191244 1090782 1068004 1142123 1308732 1529309 1318527 1567710 1331746
3096 1331746 1924729 1534499 1481646 1376939 1144053 1423935 1248678 1414047 1281618 1556039
3086 1556039 1124545 1649050 1735770 1199262 1309887 1441265 1237025 1380453 1450862 1336895
3076 1336895 1473516 1696233 1611676 1337837 1380829 1615099 891351 1106141 1533917 1374658
3066 1374658 1221669 1465983 1106331 1429752 1191808 1203066 1341143 1348648 1459135 1087782
3056 1087782 1518686 1365807 1531729 1250193 1262282 1297824 1363679 1405412 1112823 1179944
3046 1179944 853207 982719 1301723 1116723 1416796 982228 1260486 1145793 975367 927022
3036I27022P6899J02465l59443j15482L42674M0697q5103N3405L34699m22275
3026H95558k56487L85191n1830J22617j66392R7742j57081k3341J74497j71559
3016H48915L12827k57607L81710k52094L93413o36160N27565k10429j92597Q2693
3006I98236k87151M77006m95925M10996k1620N433k22749l68495R2354L16052
2996I04137L68621m36501K29658J34914m2568m868j55886n02166O54421l76234
2986G73528N14286m18502K55900j02402K390j55097j5796L36872k18299k11337
2976G61543q731k83731Q34515j54369j18069J14838J2308l82097M56006m10027
2966H22186J28491R8478n9614k88773P8031o572J13850J89485k93546K13573j46301
$$ plain form
3036 927022 1003921 1106386 746943 631461 974135 1014832 929729 983134 1317833 895558
3026 895558 639071 1024262 972432 1095049 928657 1026399 869318 845977 1020474 848915
3016 848915 1161742 904135 1285845 1033751 1427164 791004 1318569 1108140 915543 998236
3006 998236 711085 1188091 692166 1103162 1081542 1086975 864226 495731 588085 904137
2996 904137 1272758 836257 1065915 1200829 1158261 1153393 997507 495341 1149762 773528
2986 773528 1287814 869312 1125212 1022810 1025200 870103 854307 1191179 972880 761543
2976 761543 752812 469081 1303596 1149227 1031158 1145996 1158304 776207 1232213 822186
2966 822186 950677 1049155 989541 700768 778799 772227 886077 1075562 782016 995589 849288
2955H49288M43507o84426N40336n19321M50847K38080l07060o1021P7340j65429
2945H62141L9993J99305k10327O1432J45278j22662j63823L6970R9323Q0666m9176
2934I79120r6164k84262O10755k15910j26308Q7821L8068O5720l63923O61563
2924A356480q18847J99513j92325L61041L13238m75959K2099j29016J3944K11298
2914H61466j51402M73979O431n75968j20606J16053L34913m12395K23436J18994
2904H74901j33490K39235m37109J22125P5934J53000J57595j98278K00571l37891
2894G16593K08666r7066K08187j77107m18893K93825j58793K17980j86091K7043
2884F34344j37565N95134m09491J60062j12049K75169k82598r2032J48250j09519
$$ plain form
2955 849288 1292795 608369 1148705 629384 1080231 1318311 1011251 950230 1027570 862141
2945 862141 902134 1101439 891112 952544 1097822 975160 811337 848307 947630 1028296 979120
2934 979120 882956 598694 1209449 993539 867231 955052 993120 1058840 694917 1356480
2924 1356480 537633 737146 544821 905862 1219100 743141 765240 636224 650168 861466
2914 861466 710064 1184043 1190474 614506 493900 609953 944866 532471 755907 874901
2904 874901 741411 980646 543537 665662 741596 894596 1052191 853913 1054484 716593
2894 716593 925259 828193 1036380 859273 440380 734205 575412 793392 607301 634344
2884 634344 496779 1091913 682422 842484 730435 1005604 723006 630974 779224 669705
2874F69705o5178m1879M8805N50081m3159k31050j54960L49917l40859j5390L24941
2863A050974n12690P81654o27581K14911j79999M87776n56378M00628m02847N7779
2853G14227j39998N3704K07085j44398K03186l40930L58290l44126N3676J34791
2843G55507K35737M7730p20522K19545L19374n8820k2154k73003L53603J71520
2833A028517n150l68940o413l7318J50695j77732N40944k41335l01799M645l0045
2822E56069M37030j86338m32656M79692K77004o77082L27332R7317l50985K01771
2812G29154M67028l91749O1587J83833m61409j21774N96385k37867J86606r2276
2802I19518k72013L04594k44939K95471j98401j08142n4797L28027p17403O72040
$$ plain form
2874 669705 604527 562648 611453 1161534 1118375 887325 732365 1082282 741423 726033 1050974
2863 1050974 538284 1319938 692357 907268 727269 1215045 658667 1059295 656448 714227
2853 714227 574229 627933 835018 690620 893806 552876 911166 567040 620716 755507
2843 755507 991244 1038974 318452 537997 857371 798551 776397 503394 856997 1028517
2833 1028517 1023367 654427 648014 610696 761391 583659 1124603 883268 581469 586114 556069
2822 556069 993099 806761 374105 853797 1130801 453719 781051 878368 527383 729154
2812 729154 1196182 804433 866020 1049853 588444 466670 1063055 825188 1011794 919518
2802 919518 647505 952099 707160 1002631 804230 696088 641291 969318 251915 923955
2792I23955N977j54756m21619N21261j09336r6865J98053j91739K44651j08800
2782H10782k14622m7085p4281N55281m72278M41782k64283l01666J54823m03129
2772A85324O37988K13340l02516j62132N54946o02257K52159O0091K95621o9618
2762A062946j92545k6558k57583J49555k609R4349j74165N06798m52887k73824
2752D33477N06610k22290k7493J22551m9528l2322q6839J97124k62019k41776
2742C37495Q26152m36973k24339L75391m2362L42886k34382j30177j51585K6818
2732F88924m548K92395k35736k30593L14295m39953M75562m36306L15103k66164
2722D72979J65554L67232o32210P11349m40865l4635l3977N13189j008361R94895
$$ plain form
2792 923955 929932 775176 353557 874818 765482 668617 866670 674931 919582 810782
2782 810782 596160 549075 474794 1030075 557797 999579 735296 433630 588453 185324
2772 185324 823312 1036652 734136 572004 1126950 524693 776852 836943 1132564 1062946
2762 1062946 870401 843843 586260 735815 733206 827555 653390 1160188 707301 433477
2752 433477 940087 717797 690304 812855 763327 731005 644166 841290 579271 337495
2742 337495 1163647 726674 502335 877726 835364 1178250 943868 813691 662106 688924
2732 688924 684376 976771 741035 510442 824737 384784 860346 424040 739143 472979
2722 472979 638533 1005765 373555 1084904 644039 609404 575427 1088616 80255 1075150
2712A075150k92203m02930K78766m529k3837J41762K30625k70194J03373m02750
2702D33233L64315j73105J26905j73047L93463m1117M0424j48569r6205K37725
2692I64022o9181J8967m76413M48759J4542j61000m39617L08760m4487K35058
2682G99410k58441M7351j19208M72579j42014k21892K03278J05653j81186K96947
2672A002477l73532j27086N0830L91856n14384M76937o1431q9857k23781q8637
2662D43392L48704q7152r1149O4182M835J4283J57867J18833l45619P4056M55426
2651A157658m48101n35057O68834J72353m19150J76017j80465J92825J29940k11078
2641G03776l47479J90279J66533J98329k21791p5380j40881J85950J92125j27963
$$ plain form
2712 1075150 782947 380017 658783 654254 630417 772179 1002804 732610 835983 433233
2702 433233 797548 624443 751348 578301 971764 930647 971071 822502 726297 964022
2692 964022 894841 913808 437395 886154 900696 739696 300079 608839 564352 799410
2682 799410 540969 588320 469112 941691 799677 577785 781063 886716 705530 1002477
2672 1002477 628945 501859 552689 944545 430161 907098 845667 755810 532029 443392
2662 443392 792096 704944 613795 677977 682812 697095 854962 973795 628176 702232 1157658
2651 1157658 709557 174500 843334 1015687 596537 772554 592089 784914 914854 703776
2641 703776 356297 546576 713109 911438 689647 614267 473386 659336 851461 723498
2631G23498k86280J66282k17837N25493O0490j55772j36105L7225m07854K36592
2621E45732j37675j17077P03481m08144j59920P63190r95179L40800J94751K29332
2611I59291l64504j83735K40792O2780j22721J66350k08283k39416N08316J39127
2601I57997k70579k17599r5592R0453M65195k68691j01615J4963L22051M0150
2591I36733l13438j74844K03348P1469L10392n03591P2001k92848N60761k31496
2581F38487K1574o9806J43396R0036k27188J25874J69055m17182L30517J82101
2571I86864k95019j78982M78026J2317n12556p3880K74360m49900M15558K29435
2561H86223m20046L91154j06124k51033J33546j2432r843o76J36113k04373j69655
$$ plain form
2631 723498 437218 603500 385663 911156 971646 815874 679769 716994 309140 545732
2621 545732 408057 290980 994461 586317 426397 1189587 194408 535208 729959 959291
2611 959291 594787 411052 651844 714624 591903 758253 549970 310554 818870 957997
2601 957997 687418 469819 374227 464680 929875 661184 559569 574532 896583 936733
2591 936733 623295 448451 651799 723268 1033660 530069 602070 309222 869983 638487
2581 638487 660061 590255 733651 823687 596499 722373 891428 474246 804763 986864
2571 986864 691845 512863 990889 1003206 490650 416770 691130 241230 656788 886223
2561 886223 466177 857331 751207 500174 633720 621288 611445 610769 746882 542509 372854
2550C72854J43389j17117K38114k17001K5872J19485r5092L56908k1214k39378
2540E66820J62418K01470k13492L1670l58512J53078L33289N1415k05613j76021
2530E46522m1589M51041l09835j71622j50941O74808R252m43198N09006k82378
2520G91066j47127L7836k34266N2835K77237q272l82290K343j39702M39490K037
2509F91187k02259K30482k31364J20528m6631j73002N13721o80805P87799o16824
2499C92832K15761K30509k79002k06202K73815k87715J98293L06263o12965N7768
2489B89357M37456k55532M49945j4124l49057k891L3599L80109l92977J23121
2479F99006j21456J5340M4644K29794k05383K22699O3089m11736M2199j07059
$$ plain form
2550 372854 516243 399126 637240 420239 446111 565596 470504 827412 806198 566820
2540 566820 729238 930708 717216 748886 390374 543452 876741 928156 722543 546522
2530 546522 504933 955974 646139 474517 323576 998384 1007636 564438 1073444 791066
2520 791066 643939 681775 447509 500344 777581 769309 387019 389362 249660 689150 691187
2509 691187 488928 719410 488046 608574 561943 388941 902662 221857 1009656 392832
2499 392832 608593 839102 560100 353898 627713 339998 538291 844554 231589 289357
2489 289357 726813 471281 921226 907102 558045 555154 588753 968862 575885 699006
2479 699006 577550 592890 637534 867328 661945 884644 947733 535997 578196 471137
2469D71137N9894K98638J63338r6080k58946O4111l8928o4956K46332O7257l34340
2458E77457K10256l21085L87327j19373k84831M84462o03065K63455r4135K39179
2448G39647j65084N79637l43411p64189N69440K16516K22072p13891K60196k08766
2438C92167L27919k68377L4729K22008j44200l38545N68662m54991q169K57595
2428E88798j70195K703K69654J74694k50561L56280m95641m43796O72711J63598
2418H68245n11544J1762O13854l71350K925o1929J44715p9951r0368K91123o8497
2407G48985k07364L69241m58308K16655Q6041K6581k70931L27897m86181J66203
2397E18819j02771J60509N05388o51631K98914n7264j51134J68495l0457j93915
$$ plain form
2469 471137 531031 829669 993007 896927 637981 702092 663164 598208 844540 911797 577457
2458 577457 787713 466628 853955 734582 449751 934213 331148 594603 500468 739647
2448 739647 574563 1154200 810789 46600 616040 832556 1054628 340737 600933 392167
2438 392167 720086 451709 486438 708446 564246 225701 794363 339372 331203 588798
2428 588798 418603 421306 690960 865654 615093 971373 475732 31936 704647 868245
2418 868245 356701 368463 982317 610967 613892 551963 696678 616727 526359 817482 748985
2407 748985 541621 910862 452554 669209 755250 781831 510900 838797 352616 518819
2397 518819 416048 576557 1081945 430314 729228 671964 520830 689325 658868 464953
2387D64953J5853o987J70149l76070M54974m65712J6172N03379j8926k15403q4441
2376D57941p9320K7188k99510Q7417K54761j08067K1220J08183J31605K1795N574
2365F28787L9328K57360n53407J1405K51988J08841L4613K1777j30769K55882
2355I25805k94022O60257q69333L0695L70460J1094l12647k42090L70230P7617
2345G28066n2946j92460J6173L12180j77138l56062M56912m66502k4144P87672
2335A031751l86877n34328N44794n8566n04J61111K64673n12259j41374K11270
2325E79691l79315M5307N43009l05870J14410L80212p11574M18789j43904k1160
2315E19595L93594l90741k04553K83842m43282K94742L62867j66798l23118j50425
$$ plain form
2387 464953 480806 473819 643968 267898 722872 257160 273332 776711 757785 542382 457941
2376 457941 378621 405809 106299 193716 448477 340410 361630 469813 601418 623213 628787
2365 628787 668115 925475 372068 383473 635461 744302 778915 800692 669923 925805
2355 925805 631783 1292040 422707 453402 823862 834956 522309 280219 650449 728066
2345 728066 675120 482660 498833 811013 633875 277813 734725 268223 244079 1031751
2335 1031751 644874 110546 655340 596774 596270 757381 1022054 509795 368421 579691
2325 579691 200376 245683 788692 482822 597232 977444 265870 684659 540755 519595
2315 519595 913189 522448 317895 601737 158455 453197 816064 649266 326148 175723
2305A75723P29565j13694J82151p83537K56578O570L72963k27605J16557k43544
2295D71727P9067m5080K42100l53261p1716J67638K09658l85773J59200K87366
2285G60926k14091j30046J85372j22316Q6714l00786K64060J01717M0884j15426
2275E57008o6192J58381n3294m26699M35630K72844J16084l61367n18611O90376
2265H04160p3599j24469J09535N2459n12810J66985j90115N02422l61382K37345
2255F10531J79736l69366o672K11272j88375O1423N9970Q5173L387q6406j4780
2244E45893J67703l72730K46216J74198l47430N60286j84505R6691o04139J27347
2234D09530P3026J42702j77984J48814o34268K91290m7934J99232N8685K59541
$$ plain form
2305 175723 905288 791594 973745 190208 446786 453356 826319 598714 715271 471727
2295 471727 550794 505714 747814 394553 322837 490475 700133 314360 473560 760926
2285 760926 546835 416789 602161 479845 566559 265773 529833 631550 672434 557008
2275 557008 490816 649197 595903 169204 604834 877678 993762 632395 113784 804160
2265 804160 730561 606092 715627 768086 255276 422261 232146 734568 373186 610531
2255 610531 790267 420901 414229 625501 437126 498549 558519 643692 647079 560673 545893
2244 545893 713596 340866 587082 761280 413850 974136 789631 886322 282183 409530
2234 409530 482556 625258 447274 596088 -38180 253110 205176 404408 463093 722634
2224G22634o27930K51335j8705J03911R264N4940O2707R4610m52810o611K95430
2213D88775J72611l25450O6831P6800M89423p15831J52052j1756J82538k58114
2203C17879j45319M48636m06699M17226l13043K88760P0633J62249n29493j31848
2193A78981L45513p6435j69414L98337l06648k9395N31581r5717m58320L13251
2183F31734K3216j4586k4471J02349k93342L52109k08879J35975l31764J26394
2173D98735m6982M74306l65832L13020m79500L94085m46331J10947N805j54599
2163C03654M80417M9598l51469L0738N7217M5936r1669J50954L83821j91515o7398
2152H00284p155J56255k99658r5663j88237N27023p26527J09429j2642L23458
$$ plain form
2224 722634 94704 346039 327334 431245 440509 495449 558156 652766 199956 193345 488775
2213 488775 661386 335936 402767 479567 968990 253159 405211 393455 575993 317879
2203 317879 172560 621196 214497 631723 318680 607440 678073 840322 310829 178981
2193 178981 524494 448059 278645 676982 370334 340939 872520 776803 318483 631734
2183 631734 654950 640364 615893 718242 424900 777009 568130 704105 372341 498735
2173 498735 451753 926059 560227 873247 393747 787832 341501 452448 458253 303654
2163 303654 784071 833669 482200 512938 570155 616091 524422 675376 1059197 867682 800284
2152 800284 793129 949384 649726 554063 365826 892849 166322 275751 263109 586567
2142E86567M7402k71492J32003J29185O2678l32104J70065N09389m19338N5907
2132F70262l69591M78457j58170o58p772j91306K6732r7903O69335n54862P082
2121D71606J0121m4183K26620k06715J60458j01312R1899K98742n29650J74674
2111E52260k86131K95674m04249O26864n87457n7428M67612Q0643k07498l3669
2101D46621M75696o3627n26230J41994J02337k06461J04945j53099K53561k57113
2091C18624K48269J42002K27447n46957q7190l30692M88376R3700l88401O12613
2081G77791N64l13125r2851M11082k53274j70968L13347n6865l1688l71967r3834
2070A18212M97361k02679Q1204l67592M10727K08947l79192L71857k30768l14196
$$ plain form
2142 586567 633969 362477 494480 623665 686343 354239 524304 1033693 614355 670262
2132 670262 300671 779128 620958 620300 612528 421222 447954 350051 1019386 464524 471606
2121 471606 481727 437544 664164 457449 617907 516595 608494 907236 377586 552260
2111 552260 266129 561803 157554 784418 196961 139533 607145 687788 480290 446621
2101 446621 922317 858690 332460 474454 576791 370330 475275 322176 575737 318624
2091 318624 566893 708895 936342 389385 302195 -28497 459879 553579 165178 777791
2081 777791 778355 465230 372379 783461 530187 359219 672566 615701 584013 212046 118212
2070 118212 615573 412894 494098 126506 537233 746180 366988 738845 508077 193881
2060A93881M88197k74652j92974L61649k23564P4779M65913k33427n85394O31350
2050G05758J16607n70513K77736R7580J1910m69979K60120K7148j00835L7222
2040C92754k48428K12262L63635n03808K3524M19295k81318j63399N04963j47847
2030E71633L22369n63449k02958K63363k26180K66039L30862l47509o102r7993
2020C10075K11684l05731K02439J56334r9445q9085k47274J28956M11976M69786
2010A149715k84276j53876j80149m36381L67406O7159k24077q8352O94337o97767
2000B13739M27554k5085j12636o3796k73550K39339K93210J29804m47473K94667
1990F75773j2374N431L9235l01011l66635j79976R77104n03319j82281L45929
$$ plain form
2060 193881 682078 407426 214452 576101 352537 427316 893229 659802 74408 705758
2050 705758 822365 251852 529588 627168 639078 169099 429219 456367 355532 392754
2040 392754 144326 356588 720223 216415 239939 659234 377916 214517 719480 571633
2030 571633 894002 330553 127595 390958 164778 430817 761679 414170 408068 310075
2020 310075 521759 216028 418467 574801 475356 386271 138997 267953 679929 1149715
2010 1149715 865439 711563 531414 95033 462439 529598 305521 217169 911506 213739
2000 213739 641293 616208 503572 439776 166226 405565 698775 828579 381106 675773
1990 675773 663399 668830 708065 407054 40419 -139557 837547 334228 151947 497876
1980D97876k03247L25897k10073N8652m49533O01648R7306l26133K13528j71734
1970D34187P4390n5885N1390l03950N13855k25574j06464M2416L0409j06582o1920
1959B86272N63051k73927k3038k68560N43564m08807J28227k24408O74411k82542
1949G14243j6661k07737J83806j50498J78060l34148J66866L1207j86432m8731
1939C29975K88353m68722K25219K45330k07065j02795J3791K69475L20526n48862
1929C65225k34810M30183r897j28235r1250O27038m68694j55864k74049N55294
1919F14941o5893j34634J61236j29414j10710L02047L6729m60195J01336P8043
1909C93486k83045K41680K65620j73158J09091J42249l92697M2463L91776q2447
$$ plain form
1980 497876 294629 620526 410453 469105 19572 621220 718526 392393 605921 434187
1970 434187 508577 452692 504082 200132 713987 488413 381949 424365 454774 348192 286272
1959 286272 849323 575396 552358 283798 827362 418555 546782 322374 996785 714243
1949 714243 697582 489845 673651 523153 701213 367065 533931 565138 378706 329975
1939 329975 618328 149606 374825 620155 413090 310295 324086 593561 914087 365225
1929 365225 130415 560598 550701 422466 331216 958254 489560 333696 59647 614941
1919 614941 549048 414414 575650 446236 335526 637573 674302 214107 315443 393486
1909 393486 110441 352121 617741 444583 553674 695923 303226 345689 737465 655018
1899F55018j06755P9801K61549l07929R3756j66475k46532J42568O61562n36464
1889E30099n67902N13532j54030M17127j76485R1579k20243j64216N77140k40685
1879F05916k06796j32409K39759m50388J09990K97272k0346m36595M50588k22370
1869B34621K30401k44724K32325J86951n23140J18474K08008K12747O4370j52005
1859E68028j05394j35815L01941k99543j01431L47947j72357J53819J00983O5945
1849G24123j90938o7516M8792K7200j348l49986N66202j12297j47880j17683K63500
1838F42169n84223J37881j98973L05317J31788l58741L53439J15770l21965k62860
1828d0398N90166j41242k46264L35340j08077r455J26288k51506j18789M67286
$$ plain form
1899 655018 548263 628064 889613 581684 675440 508965 262433 405001 1066563 530099
1889 530099 -37803 475729 321699 738826 562341 653920 433677 269461 846601 605916
1879 605916 399120 266711 506470 56082 166072 463344 442998 6403 456991 234621
1869 234621 465022 220298 452623 639574 116434 234908 442916 655663 720033 568028
1859 568028 462634 326819 628760 329217 227786 575733 403376 557195 658178 724123
1849 724123 533185 465669 514461 541661 540313 190327 756529 644232 496352 378669 642169
1838 642169 57946 195827 -3146 302171 433959 75218 428657 544427 222462 -40398
1828 -40398 549768 408526 162262 497602 389525 380070 506358 254852 136063 603349
1818F03349k89157K11045q592N4092m46116L61128N5553n13554L41643L61893
1808G31284k70623l81953K85236K04256k07127k81579l29303O36073J18125p7145
1798D27244N00919j13981j49094k86119J21780l14240O31467n6550m51322L20986
1788F31090n7715L5579J47527j40575l59600m823L26786k06585K66358m68025
1778A70017m3920L66544n7772k06578N28531k30549r4463k14338J34844k69903
1768H2413J352L93246j40693j69930J87375j31396L26608K03817r3441o47604
1758A1747M95324q1173j58177k28138M85209j46075J66276j75249j01231J35532
1748D04045K63894j65293j38717k24817K85406J57088M6558l0526j53925K62135
$$ plain form
1818 603349 314192 525237 516645 570737 124621 485749 541302 27748 369391 731284
1808 731284 460661 78708 363944 568200 361073 79494 -249809 386264 504389 427244
1798 427244 928163 814182 665088 378969 500749 186509 817976 761426 310104 631090
1788 631090 573375 608954 756481 615906 256306 251483 578269 371684 638042 170017
1778 170017 126097 492641 434869 228291 756822 526273 431810 217472 352316 82413
1768 82413 83765 477011 336318 166388 353763 222367 548975 752792 659351 11747
1758 11747 507071 425898 267721 39583 524792 378717 544993 369744 268513 404045
1748 404045 667939 502646 363929 139112 424518 581606 628164 597638 443713 705848
1738G05848r4798o41214M88958n16500O39518j82652L71351J47492j44076j58029
1728F15898J77333m38123j01684M42561o5592n2382j94710k84342L78238K7950
1718E05147K47848n56138N27566q2246k7322l84165p7184L08004j51144J02735
1708D13101N2806l40932l1831L99112n63585N17872J43729l02680j20216J71065
1698C38441J97050J7239L86494o45983K55411R6921j00547j94709M55698l23029
1688D82986J08284n0644n5424K13772j27980l18229K26211L97703o04354L97115
1678F69440k15817R8266L4544j74267L35173m00099J09288l38497p188J11092
1668B21935j14001J21392K2994L25277j96298k10599K81000l4373K3410m8144
$$ plain form
1738 705848 611050 -30164 458794 -57706 581812 399160 770511 918003 773927 615898
1728 615898 793231 355108 253424 695985 630393 578011 383301 98959 477197 505147
1718 505147 752995 196857 724423 642177 614855 230690 153506 461510 310366 413101
1708 413101 465907 124975 93144 492256 -71329 446543 590272 287592 167376 338441
1698 338441 535491 552730 939224 293241 548652 645573 545026 350317 806015 482986
1688 482986 591270 540626 485202 698974 570994 252765 478976 876679 272325 669440
1678 669440 453623 551889 586433 412166 747339 347240 456528 118031 110843 221935
1668 221935 107934 229326 252320 577597 381299 170700 451700 417327 440737 392593
1658C92593L4263j48263m78380N17142k9043K97499k65611K31375j32017p7852
1648C41706l34985J95982M90312k27894K2699p4681m8868K77719n59580P68468
1638H50878j83259Q243P306j41886r5571l47896L70839L63177m96507j99678L26807
1627D62453J35431k8965K42934m59718J75944K41314k39083l49124J05943o1748
1617B25381L22449l78182M48368j07619n15506O02124l15464J22896j28622M69212
1607G45037k11074o47236L05778j42592J54732j87894J03291L68213m3550p90278
1597c45573Q71476l77651L52156k26584L071K88503j00516m5064K46875k40139
1587D26554j82592K97346m7509L0793M1640J93145m80889P9080j60825K28583
$$ plain form
1658 392593 426856 278593 -199787 317355 288312 585811 320200 551575 419558 341706
1648 341706 6721 202703 693015 465121 487820 413139 364271 641990 82410 850878
1638 850878 667619 675862 683168 541282 445711 97815 468654 831831 335324 135646 462453
1627 462453 597884 568919 811853 352135 528079 769393 530310 181186 287129 225381
1617 225381 547830 169648 618016 510397 -5109 597015 281551 404447 275825 745037
1607 745037 533963 -113273 192505 49913 204645 16751 120042 488255 444705 -345573
1597 -345573 525903 148252 500408 273824 276895 565398 464882 419818 666693 426554
1587 426554 243962 541308 493799 524592 566232 759377 278488 357568 196743 425326
1577D25326n0951L9062O2837k2579j31168k63047M17753Q3889J43208o54136p1146
1566b0952M36021J00866o1636o9042R3103R7073k14716L85937J28839n87673q8518
1555A99302j59262L00627j36315K71714l22287M18414l05366J38160k75050j5968
1545A13969J73986J69478Q7947n6873M2722j60170J66069L83770m89743j81991
1535B49164L1010j61630K26452R5278J3042j45537l37762K60789J60367j51210
1525B39963j07402K5149L21124n64851Q15101l74855L10322q6388J57256m3610
1515F91809m50812m5135j4609L89272l9426l07473o1647N35640m00025P353l3119
$$ plain form
1577 425326 374375 413437 476274 453695 322527 59480 477233 561122 704330 50194 -20952
1566 -20952 415069 515935 454299 385257 478360 575433 360717 746654 875493 287820 199302
1555 199302 40040 340667 204352 476066 153779 572193 266827 404987 129937 113969
1545 113969 287955 457433 545380 488507 531229 371059 537128 920898 431155 249164
1535 249164 280174 118544 344996 440274 453316 307779 -29983 230806 391173 239963
1525 239963 132561 157710 478834 -86017 729084 354229 664551 578163 735419 691809
1515 691809 240997 195862 181253 570525 531099 223626 161979 697619 297594 304947 271828
$$ [...]
##END NTUPLES=NMR SPECTRUM
##END=
