##TITLE=abcd
##JCAMPDX= 6.0         $$ Bruker NMR JCAMP-DX V2.0
##DATA TYPE= NMR SPECTRUM
##DATA CLASS= NTUPLES
##ORIGIN= UXNMR, Bruker Analytische Messtechnik GmbH
##OWNER= root
$$ XWIN-NMR		Version 3.5
$$ Tue Aug  4 18:07:21 2026 Russian Standard Time (UT+4h)  servis@DPX200
##.OBSERVE FREQUENCY= 200.131235884673
##.OBSERVE NUCLEUS= ^1H
##.ACQUISITION MODE= SIMULTANEOUS
##.ACQUISITION SCHEME= undefined
##.AVERAGES= 32
##.DIGITISER RES= 18
##SPECTROMETER/DATA SYSTEM= spect
##.PULSE SEQUENCE= zg
##.SOLVENT NAME= D2O
##.SHIFT REFERENCE= (INTERNAL, D2O, 0, 16.4885)
##AUDIT TRAIL= $$ (NUMBER, WHEN, WHO, WHERE, WHAT)
$$ ##TITLE= Audit trail, XWIN-NMR		Version 3.5
$$ ##JCAMPDX= 5.01
$$ ##ORIGIN= Bruker BioSpin GmbH
$$ ##OWNER= servis
$$ F:\spectra/data/av/nmr/H1/1/pdata/1/auditp.txt
$$ ##AUDIT TRAIL=  $$ (NUMBER, WHEN, WHO, WHERE, WHAT)
(   1,<2026-08-04 18:00:52.39 +0400>,<servis>,<DPX200>,
      <created by zg, POWCHK disabled, PULCHK disabled
       configuration hash MD5:
       00 E9 B6 7A A2 85 ED C7 34 08 36 98 17 FE 4E 26
       data hash MD5: 32K
       77 7B C2 D0 7E E0 4D 2C B3 CF E5 AB 45 80 8E 3D>)
(   2,<2026-08-04 18:06:45.51 +0400>,<servis>,<DPX200>,
      <Start of raw data processing
       efp BC_mod = 2 LB = 0.05 FT_mod = 6 PKNL = 1 PHC0 = -412.7518 PHC1 = 3.101563 SI = 16K 
       data hash MD5: 16K
       2D 91 66 93 6C A3 11 6E 0A C6 05 59 38 09 D4 66>)
(   3,<2026-08-04 18:06:58.65 +0400>,<servis>,<DPX200>,
      <pk PHC0 = -5.8 PHC1 = 0 
       data hash MD5: 16K
       42 82 D1 1C D3 ED 2A 17 B8 11 5D D7 F4 7F 20 51>)
$$ ##END=
$$ 
$$ hash MD5
$$ 5D BF A9 67 B3 44 F2 85 FD 71 06 60 B7 86 8F 0A
##$RELAX= 
##$RELAX= 
##$RELAX= 
##$RELAX= 
##$RELAX= 
##$RELAX= 
##$RELAX= 
##$RELAX= 
$$ Bruker specific parameters
$$ --------------------------
##$DU= <F:\spectra>
##$EXPNO= 1
##$NAME= <H1>
##$PROCNO= 1
##$TYPE= <nmr>
##$USER= <av>
##$AMP= (0..31)
100 100 100 100 100 100 100 100 100 100 100 100 100 100 100 100 100 100 
100 100 100 100 100 100 100 100 100 100 100 100 100 100 
##$AQSEQ= 0
##$AQ_mod= 1
##$AUNM= <au_zg>
##$AUTOPOS= <>
##$BF1= 200.13
##$BF2= 200.13
##$BF3= 200.13
##$BF4= 200.13
##$BF5= 500.13
##$BF6= 500.13
##$BF7= 500.13
##$BF8= 500.13
##$BYTORDA= 1
##$CFDGTYP= 0
##$CFRGTYP= 5
##$CHEMSTR= <none>
##$CNST= (0..31)
1 1 145 1 1 1 1 1 1 1 1 1 1 1 1 1 1 1 1 1 1 1 1 1 1 1 1 1 1 1 1 1 
##$CPDPRG= <>
##$CPDPRG1= <>
##$CPDPRG2= <>
##$CPDPRG3= <>
##$CPDPRG4= <mlev>
##$CPDPRG5= <mlev>
##$CPDPRG6= <mlev>
##$CPDPRG7= <mlev>
##$CPDPRG8= <mlev>
##$CPDPRGB= <>
##$CPDPRGT= <>
##$D= (0..31)
0 2 0 0 0 0 0 0 0 0.06 0 0 0 0 0 0 0.0002 0 0 0 0 0 0 0 0 0 0 0 0 0 0 
0 
##$DATE= 1785852052
##$DBL= (0..7)
120 120 120 120 120 120 120 120 
##$DBP= (0..7)
150 150 150 150 150 150 150 150 
##$DBP07= 0
##$DBPNAM0= <>
##$DBPNAM1= <>
##$DBPNAM2= <>
##$DBPNAM3= <>
##$DBPNAM4= <>
##$DBPNAM5= <>
##$DBPNAM6= <>
##$DBPNAM7= <>
##$DBPOAL= (0..7)
0.5 0.5 0.5 0.5 0.5 0.5 0.5 0.5 
##$DBPOFFS= (0..7)
0 0 0 0 0 0 0 0 
##$DE= 6
##$DECBNUC= <off>
##$DECIM= 32
$$ [...]
##$SUBNAM4= <"">
##$SUBNAM5= <"">
##$SUBNAM6= <"">
##$SUBNAM7= <"">
##$SUBNAM8= <"">
##$SUBNAM9= <"">
##$SW= 20.6817932712277
##$SWIBOX= (0..15)
0 0 3 0 0 0 0 0 0 0 0 0 0 0 0 0 
##$SW_h= 4139.07284768212
##$TD= 32768
##$TD0= 1
##$TE= 0
##$TE2= 300
##$TE3= 300
##$TEG= 300
##$TL= (0..7)
0 120 120 120 120 120 120 120 
##$TP= (0..7)
150 150 150 150 150 150 150 150 
##$TP07= 0
##$TPNAME0= <>
##$TPNAME1= <>
##$TPNAME2= <>
##$TPNAME3= <>
##$TPNAME4= <>
##$TPNAME5= <>
##$TPNAME6= <>
##$TPNAME7= <>
##$TPOAL= (0..7)
0.5 0.5 0.5 0.5 0.5 0.5 0.5 0.5 
##$TPOFFS= (0..7)
0 0 0 0 0 0 0 0 
##$TUNHIN= 0
##$TUNHOUT= 0
##$TUNXOUT= 0
##$USERA1= <user>
##$USERA2= <user>
##$USERA3= <user>
##$USERA4= <user>
##$USERA5= <user>
##$V9= 5
##$VALIST= <valist>
##$VCLIST= <CCCCCCCCCCCCCCC>
##$VD= 0
##$VDLIST= <DDDDDDDDDDDDDDD>
##$VPLIST= <PPPPPPPPPPPPPPP>
##$VTLIST= <TTTTTTTTTTTTTTT>
##$WBST= 1024
##$WBSW= 30
##$XGAIN= (0..3)
0 0 0 0 
##$XL= 0
##$YL= 0
##$YMAX_a= 922078
##$YMIN_a= -1074624
##$ZGOPTNS= <>
##$ZL1= 120
##$ZL2= 120
##$ZL3= 120
##$ZL4= 120
##$ABSF1= 0
##$ABSF2= 0
##$ABSG= 0
##$ABSL= 0
##$ALPHA= 0
##$AQORDER= 0
##$ASSFAC= 0
##$ASSFACI= 0
##$ASSFACX= 0
##$ASSWID= 0
##$AUNMP= <proc_1d>
##$AZFE= 0.1
##$AZFW= 0.1
##$BCFW= 0
##$BC_mod= 2
##$BYTORDP= 0
##$COROFFS= 0
##$CY= 18.4799938201904
##$DATMOD= 1
##$DC= 0
##$DFILT= <>
##$DTYPP= 0
##$F1P= 9.9274215381318
##$F2P= -0.165520771350173
##$FCOR= 1
##$FTSIZE= 16384
##$FT_mod= 6
##$GAMMA= 0
##$GB= 0
##$INTBC= 1
##$INTSCL= 4.127829e-11
##$ISEN= 128
##$LB= 0.05
##$LEV0= 0
##$LPBIN= 0
##$MAXI= 10000
##$MC2= 0
##$MEAN= 0
##$ME_mod= 0
##$MI= 50
##$NCOEF= 0
##$NC_proc= -2
##$NLEV= 6
##$NOISF1= 3.799351
##$NOISF2= 2.8
##$NSP= 0
##$NTH_PI= 0
##$NZP= 0
##$OFFSET= 16.48848
##$PC= 4
##$PHC0= -418.5518
##$PHC1= 3.101563
##$PH_mod= 1
##$PKNL= yes
##$PPARMOD= 0
##$PSCAL= 4
##$PSIGN= 0
##$REVERSE= no
##$SF= 200.130005582386
##$SI= 16384
##$SIGF1= 3
##$SIGF2= 2
##$SINO= 400
##$SIOLD= 16384
##$SREGLST= <1H.CDCl3>
##$SSB= 0
##$STSI= 16384
##$STSR= 0
##$SW_p= 4139.07284768211
##$SYMM= 0
##$S_DEV= 0
##$TDeff= 32768
##$TDoff= 0
##$TI= <>
##$TILT= no
##$TM1= 0
##$TM2= 0
##$TOPLEV= 0
##$USERP1= <user>
##$USERP2= <user>
##$USERP3= <user>
##$USERP4= <user>
##$USERP5= <user>
##$WDW= 1
##$XDIM= 16384
##$YMAX_p= 402942568
##$YMIN_p= -150055
$$ End of Bruker specific parameters
$$ ---------------------------------
##NTUPLES= NMR SPECTRUM
##VAR_NAME=  FREQUENCY,     SPECTRUM/REAL,   SPECTRUM/IMAG
##SYMBOL=    X,             R,               I
##VAR_TYPE=  INDEPENDENT,   DEPENDENT,       DEPENDENT
##VAR_FORM=  AFFN,          ASDF,            ASDF
##VAR_DIM=   16384,         16384,           16384
##UNITS=     HZ,            ARBITRARY UNITS, ARBITRARY UNITS
##FACTOR=    0.252644378177508, 1,           1
##FIRST=     3299.83951724647, 0,            0
##LAST=      -839.233330435636, 0,           0
##MIN=       -839.233330435636, -150055,     0
##MAX=       3299.83951724647, 402942568,    0
$$ Real data points
##PAGE= N=1
##DATA TABLE= (X++(R..R)), XYDATA
$$ [...]
$$ plain form
10768 -41244 -53467 -34245 -46883 -38889 -37513 -44178 -48809 -47213 -26163 -37800 -38149 -36601 -35146
10755 -35146 -40532 -58348 -41179 -44179 -52049 -44241 -45098 -43263 -36621 -39017 -51254 -36916 -44134 -36368
10741 -36368 -41520 -40881 -45431 -28567 -51078 -29331 -42441 -38676 -51217 -48427 -49946 -37365 -40389
10728 -40389 -47695 -25428 -56412 -42864 -25567 -52568 -53068 -44231 -34166 -38360 -45742 -37570 -41393
10715 -41393 -25096 -43315 -56112 -31970 -35960 -41672 -39906 -42618 -43946 -52086 -38216 -39915 -41384
10702 -41384 -48876 -42474 -53463 -47159 -24177 -42831 -50096 -43394 -32698 -37875 -37804 -41641 -53218 -43764
10688 -43764 -59190 -45823 -32504 -28540 -47677 -49297 -31369 -44237 -27645 -43120 -38550 -37484
10676 -37484 -37852 -49909 -57876 -43909 -32497 -41483 -44691 -62857 -46043 -39325 -47157 -49825 -49586 -38209
$$ packed form
10768d1244j2223J9222j2638P994J376o665m631J596K1050j1637l49J548J455
10755c5146n386j7816J7169l000p870P808q57J835O642k396j2237J4338p218P766
10741c6368n152O39m550J6864k2511K1747j3110L765j2541K790j519J2581l024
10728d0389p306K2267l0984J3548J7297k7001n00Q837J0065m194p382Q172l823
10715d1393J6297j8219j2797K4142l990n712J766k712j328q140J3870j699j469
10702d1384p492O402j0989O304K2982j8654p265O702J0696n177P1l837j1577R454
10688d3764j5426J3367J3319L964j9137j620J7928j2868J6592j5475M570J066
10676c7484l68j2057p967J3967J1412q986l208j8166J6814O718p832k668K39J1377
$$ plain form
10662 -38209 -52349 -40559 -43268 -30297 -35500 -46248 -41559 -54900 -47709 -26429 -42435 -39383 -34675
10649 -34675 -43172 -33786 -35764 -52587 -36991 -45385 -43235 -42738 -50401 -47591 -43961 -44339 -34398 -39115
10635 -39115 -36863 -44484 -48764 -37784 -25247 -50680 -41209 -36824 -30949 -43022 -40236 -41817 -41209 -40413
10621 -40413 -48472 -46042 -36975 -37400 -37854 -40999 -34222 -45867 -37764 -47644 -30445 -34664 -39236 -40809
10607 -40809 -53549 -37416 -51426 -25304 -32659 -50486 -39260 -36531 -43581 -41297 -51856 -36353
10595 -36353 -49152 -42739 -37044 -39024 -35692 -46179 -44155 -41734 -32441 -34786 -49113 -40929 -47111 -37554
10581 -37554 -45508 -48485 -38897 -53430 -42882 -40050 -59116 -30189 -30082 -33622 -37878 -34280 -42366 -32184
10567 -32184 -34600 -45091 -36798 -46863 -45722 -44480 -43113 -36878 -34169 -43917 -39206 -50656 -50130 -26345
$$ packed form
10662c8209j4140J1790k709J2971n203j0748M689j3341P191K1280j6006L052M708
10649c4675q497R386j978j6823J5596q394K150M97p663K810L630l78R941m717
10635c9115K252p621m280J0980J2537k5433R471M385N875j2073K786j581O08P96
10621d0413q059K430R067m25m54l145O777j1645Q103r880J7199m219m572j573
10607d0809j2740J6133j4010K6122p355j7827J1226K729p050K284j0559J5503
10595c6353j2799O413N695j980L332j0487K024K421R293k345j4327Q184o182R557
10581c7554p954k977R588j4533J0548K832j9066K8927J07l540m256L598q086J0182
10567c2184k416j0491Q293j0065J141J242J367O235K709r748M711j1450N26K3785
$$ plain form
10553 -26345 -46752 -52857 -51039 -41127 -38235 -47052 -39092 -55536 -46608 -45945 -28621 -36148 -42216 -37492
10539 -37492 -48385 -43274 -43287 -49909 -32268 -33822 -43434 -36357 -36956 -38022 -37447 -37428 -37014 -34970 -45765
10524 -45765 -50780 -49292 -50047 -47575 -48475 -41318 -46761 -48964 -39385 -33980 -46560 -38410 -36485 -35322 -52319
10509 -52319 -48752 -31347 -32754 -32997 -50432 -39445 -41692 -41896 -51188 -46893 -51884 -60999 -41240 -43609
10495 -43609 -36645 -48154 -39387 -35650 -52079 -46506 -52264 -46515 -31984 -41629 -47823 -46492 -48627 -48288
10481 -48288 -31199 -33560 -46844 -44121 -42758 -53227 -47876 -35871 -41163 -40385 -44181 -38037 -40206 -38679
10467 -38679 -61416 -36440 -45898 -27282 -39383 -46345 -39391 -47845 -48196 -35453 -33778 -46962 -28279
10454 -28279 -34690 -39827 -42615 -53250 -45286 -38722 -37997 -39321 -49724 -32002 -40265 -41376 -40905 -32195
$$ packed form
10553b6345k0407o105J818R912K892q817P960j6444Q928O63J7324p527o068M724
10539c7492j0893N111j3o622J7641j554r612P077n99j066N75J9M14K044j0795
10524d5765n015J488p55K472r00P157n443k203R579N405j2580Q150J925J163j6997
10509e2319L567J7405j407k43j7435J0987k247k04r292M295m991r115J9759k369
10495d3609O964j1509Q767L737j6429N573n758N749J4531r645o194J331k135L39
10481d8288J7089k361j3284K723J363j0469N351J2005n292P78l796O144k169J527
10467c8679k2737K4976r458J8616j2101o962O954q454l51J2743J675j3184J8683
10454b8279o411n137k788j0635P964O564P25j324j0403J7722q263j111M71Q710
$$ plain form
10440 -32195 -35293 -43614 -51255 -45987 -48149 -41753 -43047 -36229 -44967 -45018 -29329 -38723 -45820 -31691
10426 -31691 -46587 -47334 -31447 -42377 -49844 -38369 -48276 -42191 -44516 -42592 -27510 -47118 -43161
10413 -43161 -40416 -59144 -53545 -38331 -36188 -41391 -37688 -51169 -40968 -36480 -37967 -48544 -34227
10400 -34227 -40349 -46132 -50164 -48921 -50689 -40047 -47089 -43978 -44740 -37181 -45682 -46873 -53812 -38912
10386 -38912 -35287 -47920 -46902 -33011 -37485 -36892 -40672 -30821 -27573 -51385 -41325 -33663 -39663 -50430
10372 -50430 -35634 -42645 -38480 -38546 -32616 -47007 -36495 -63950 -34496 -34194 -44515 -36409 -49221
10359 -49221 -35899 -36378 -32228 -35542 -40503 -38728 -37408 -46674 -40003 -43315 -41293 -42528 -45257 -45140 -58915
10344 -58915 -42291 -39845 -31034 -34306 -40186 -28640 -47144 -46086 -34650 -41761 -35808 -43739 -44143 -37861
$$ packed form
10440c2195l098q321p641N268k162O396j294O818q738n1J5689r394p097J4129
10426c1691j4896p47J5887j0930p467J1475r907O085k325J924J5082j9608L957
10413d3161K745j8728N599J5214K143n203L703j3481J0201M488j487j0577J4317
10400c4227o122n783m032J243j768J0642p042L111p62P559q501j191o939J4900
10386c8912L625j2633J018J3891m474N93l780R851L248k3812J0060P662o000j0767
10372e0430J4796p011M165o6N930j4391J0512k7455K9454L02j0321Q106j2812
10359d9221J3322m79M150l314m961J775J320r266O671l312K022j235k729J17j3775
10344e8915J6624K446Q811l272n880J1546j8504J058J1436p111N953p931m04O282
$$ plain form
10330 -37861 -35308 -49967 -47985 -41468 -45248 -39626 -38271 -51338 -34461 -29941 -54744 -34553 -43577
10317 -43577 -37484 -44939 -51474 -38056 -45525 -41692 -41101 -45838 -49358 -25342 -40418 -65779 -46125
10304 -46125 -52203 -44764 -41252 -38372 -46890 -43578 -43496 -39826 -30365 -33452 -36746 -38526 -31753 -38148 -33175
10289 -33175 -38452 -52109 -32258 -26338 -35079 -38674 -39343 -44003 -50858 -31792 -39821 -46592 -43827 -46793
10275 -46793 -36413 -47326 -40278 -59524 -49970 -32749 -39008 -45327 -43157 -44056 -47675 -35071 -54140
10262 -54140 -54228 -37853 -41637 -43031 -42883 -43920 -50690 -52020 -46849 -30980 -45613 -32188 -39533 -53853
10248 -53853 -41923 -34051 -46167 -39486 -39110 -27777 -39498 -41245 -38493 -39673 -49205 -47618 -33421
10235 -33421 -48373 -35897 -39890 -34392 -30931 -26604 -43032 -38321 -48380 -41590 -30730 -47645 -34747
$$ packed form
10330c7861K553j4659J982O517l780N622J355j3067J6877M520k4803K0191r024
10317d3577O093p455o535J3418p469L833N91m737l520K4016j5076k5361J9654
10304d6125o078P439L512K880q518L312Q2L670R461l087l294j780O773o395M973
10289c3175n277j3657J9851N920q741l595o69m660o855J9066q029o771K765k966
10275d6793J0380j0913P048j9246R554J7221o259o319K170q99l619J2604j9069
10262e4140q8J6375l784j394J48j037o770j330N171J5869j4633J3425p345j4320
10248e3853J1930P872j2116O681L76J1333j1721j747K752j180r532J587J4197
10235c3421j4952J2476l993N498L461M327j6428M711j0059O790J0860j6915J2898
$$ plain form
10222 -34747 -44820 -49505 -30759 -52447 -40508 -30874 -31972 -44008 -41972 -33454 -44285 -55198 -31563
10209 -31563 -27904 -44598 -31139 -38993 -45948 -34987 -28801 -43438 -37151 -53608 -40512 -31166 -46054
10196 -46054 -39209 -46790 -35260 -53682 -51047 -29413 -46291 -39006 -38398 -34031 -47346 -48043 -41709 -49813
10182 -49813 -38056 -39052 -37704 -36598 -41510 -46799 -38718 -41202 -42924 -37157 -38188 -39479 -34400 -33038
10168 -33038 -35367 -38387 -40369 -39747 -26730 -43444 -44098 -33058 -49269 -22269 -56869 -52063 -29596
10155 -29596 -41495 -44561 -28922 -52447 -36313 -35080 -32135 -39389 -28329 -25344 -40022 -38972 -40265
10142 -40265 -22832 -50366 -42337 -40899 -50724 -38025 -44480 -39459 -37852 -39288 -46694 -37453 -34073 -50058
10128 -50058 -46547 -27451 -37926 -43037 -37090 -27110 -39083 -28864 -45895 -45425 -26878 -33060 -37856
$$ packed form
10222c4747j0073m685J8746k1688J1939R634j098j2036K036Q518j0831j0913K3635
10209c1563L659j6694J3459p854o955J0961O186j4637O287j6457J3096R346j4888
10196d6054O845p581J1530j8422K635K1634j6878P285O08M367j3315o97O334q104
10182d9813J1757r96J348J106m912n289Q081k484j722N767j031j291N079J362
10168c3038k329l020j982O22J3017j6714o54J1040j6211K7000l4600M806K2467
10155b9596j1899l066J5639k3525J6134J233K945p254J1060K985j4678J050j293
10142d0265J7433k7534Q029J438r825J2699o455N021J607j436p406R241L380j5985
10128e0058L511J9096j0475n111N947R980j1973J0219j7031M70J8547o182m796
$$ plain form
10115 -37856 -59597 -49761 -50584 -40196 -29925 -27095 -42670 -33630 -41542 -43136 -42304 -51637 -56437 -42211
10101 -42211 -44014 -38633 -33683 -27224 -46593 -36969 -37916 -33148 -27152 -35057 -42497 -33592 -42998 -42621 -42957
10086 -42957 -35406 -18491 -32172 -42526 -33188 -38683 -34196 -43799 -39472 -41412 -33629 -45353 -52200
10073 -52200 -42698 -44454 -36117 -47222 -36578 -28586 -35672 -21750 -44012 -41056 -25772 -31948 -46535
10060 -46535 -37974 -51033 -53091 -39736 -37229 -29088 -31977 -40907 -42369 -49531 -41524 -35163 -46299 -44038
10046 -44038 -48195 -40089 -16463 -39573 -44632 -36888 -31262 -42404 -43180 -32792 -35378 -36946 -56849
10033 -56849 -46083 -34294 -39617 -40161 -34611 -37537 -32708 -46948 -42463 -32888 -44278 -50121 -43573 -42845
10019 -42845 -54140 -45962 -48002 -45511 -37939 -38708 -52816 -40853 -31202 -45858 -36151 -41923 -31049
$$ packed form
10115c7856k1741R836q23J0388J0271K830j5575R040p912j594Q32r333m800J4226
10101d2211j803N381M950O459j9369R624r47M768N996p905p440Q905r406L77l36
10086d2957P551J6915j3681j0354R338n495M487r603M327j940P783j1724o847
10073e2200R502j756Q337j1105J0644P992p086J3922k2262K956J5284o176j4587
10060d6535Q561j3059k058J3355K507Q141k889q930j462p162Q007O361j1136K261
10046d4038m157Q106K3626k3110n059P744N626j1142p76J0388k586j568j9903
10033e6849J0766J1789n323n44N550k926M829j4240M485R575j1390n843O548P28
10019d2845j1295Q178k040K491P572p69j4108J1963R651j4656R707n772J0874
$$ plain form
10006 -31049 -43592 -46358 -39229 -42238 -39166 -34530 -33369 -39834 -31019 -22840 -38018 -37719 -29470 -42280
9992 -42280 -34422 -43110 -38669 -43132 -41635 -30503 -34666 -47743 -49809 -32333 -38244 -37903 -35216 -46897
9978 -46897 -34207 -30522 -37895 -43323 -54362 -40444 -37304 -41767 -45831 -39842 -58741 -33785 -46275
9965 -46275 -30674 -27434 -47730 -35311 -30654 -41153 -39277 -20224 -38707 -38446 -23876 -35973 -32238
9952 -32238 -41216 -59342 -51121 -43917 -34726 -47571 -44844 -44191 -48412 -33082 -51147 -53017 -35703 -44863
9938 -44863 -39135 -34795 -31284 -32384 -28290 -38984 -49345 -55344 -31895 -42643 -45132 -32701 -47264
9925 -47264 -43777 -35260 -36352 -32555 -37157 -38973 -37749 -42067 -29421 -28973 -24528 -27277 -48126 -32638
9911 -32638 -44312 -26038 -44063 -42532 -27546 -34487 -37703 -42575 -37738 -36713 -42680 -47013 -30739
$$ packed form
10006c1049j2543k766P129l009L072M636J161o465Q815Q179j5178K99Q249j2810
9992d2280P858q688M441m463J497J1132m163j3077k066J7476n911L41K687j1681
9978d6897J2690L685p373n428j1039J3918L140m463m064N989j8899K4956j2490
9965d6275J5601L240k0296J2419M657j0499J876J9053j8483K61J4570j2097L735
9952c2238q978j8126Q221P204R191j2845K727O53m221J5330j8065j870J7314r160
9938d4863N728M340L511j100M094j0694j0361n999K3449j0748k489J2431j4563
9925d7264L487Q517j092L797m602j816J224m318J2646M48M445k749k0849J5488
9911c2638j1674J8274j8025J531J4986o941l216m872M837J025n967m333J6274
$$ plain form
9898 -30739 -35131 -45849 -36919 -29012 -29043 -43663 -30796 -37430 -40714 -33292 -41429 -46546 -42008 -38699
9884 -38699 -33584 -45620 -45756 -52733 -32651 -39003 -34073 -37930 -45442 -51965 -45796 -37076 -41163 -42114 -40748
9869 -40748 -45843 -42336 -26060 -44847 -46026 -38920 -40351 -36328 -36360 -29342 -53475 -41924 -38804 -36979
9855 -36979 -49451 -43694 -34155 -52068 -21631 -30347 -42724 -45676 -42246 -41465 -37865 -43314 -57259 -42112
9841 -42112 -40285 -32165 -47731 -47683 -46086 -36331 -42741 -33982 -38519 -41044 -41255 -45819 -30727 -38399 -44786
9826 -44786 -54094 -46043 -33405 -37302 -35657 -52240 -61631 -39581 -39382 -43055 -48659 -36310 -32689 -35881
9812 -35881 -33244 -39427 -44831 -34600 -33712 -42202 -26936 -39485 -53713 -50734 -41504 -29727 -43083
9799 -43083 -37787 -39097 -29018 -33146 -38695 -41878 -49171 -31177 -37983 -38306 -40833 -45440 -39022 -39578 -48196
$$ packed form
9898c0739m392j0718Q930P907l1j4620J2867o634l284P422q137n117M538L309
9884c8699N115j2036j36o977K0082o352M930l857p512o523O169Q720m087r51J366
9869d0748n095L507J6276j8787j179P106j431M023l2P018k4133J1551L120J825
9855c6979j2472N757R539j7913L0437q716j2377k952L430P81L600n449j3945J5147
9841d2112J827Q120j5566M8J597R755o410Q759m537k525k11m564J5092p672o387
9826d4786r308Q051J2638l897J645j6583r391K2050J99l673n604J2349L621l192
9812c5881K637o183n404J0231Q88q490J5266j2549j4228K979R230J1777j3356
9799d3083N296j310J0079m128n549l183p293J7994o806l23k527m607O418n56q618
$$ plain form
9784 -48196 -31214 -48776 -39939 -40136 -42193 -48065 -43378 -37927 -39724 -37201 -22600 -39397 -27518 -35495
9770 -35495 -42441 -31980 -31805 -39811 -30231 -25178 -37107 -45789 -42079 -25954 -39958 -27904 -32848 -41978
9756 -41978 -47107 -41759 -33294 -40883 -29774 -33005 -42118 -25996 -42993 -29449 -40057 -36932 -39766
9743 -39766 -34121 -39982 -38972 -37010 -38753 -49492 -31307 -36671 -33384 -40123 -58669 -41966 -27350
9730 -27350 -33231 -36068 -45096 -34436 -30732 -34580 -42048 -35248 -37683 -47216 -32410 -36070 -31080 -38782
9716 -38782 -33357 -23597 -49163 -38381 -38820 -40830 -38953 -32371 -35336 -32627 -32183 -52632 -30927 -26296
9702 -26296 -39308 -32627 -35829 -33424 -29754 -39967 -32024 -25174 -36974 -34936 -31770 -44744 -20125
9689 -20125 -47000 -37145 -28921 -28151 -35032 -28746 -41330 -32645 -32195 -46313 -44471 -35238 -31000 -38654
$$ packed form
9784d8196J6982j7562Q837j97k057n872M687N451j797K523J4601j6797J1879p977
9770c5495o946J0461J75q006R580N053j1929q682L710J6125j4004J2054m944r130
9756d1978n129N348Q465p589J1109l231r113J6122j6997J3544j0608L125k834
9743c9766N645n861J010J962j743j0739J8185n364L287o739j8546J6703J4616
9730b7350n881k837r028J0660L704l848p468O800k435r533J4806l660M990p702
9716c8782N425R760k5566J0782m39k010J877O582k965K709M44k0449K1705M631
9702b6296j3012O681l202K405L670j0213P943O850j1800K038L166j2974K4619
9689b0125k6875R855Q224P70o881O286j2584Q685M50j4118J842R233M238p654
$$ plain form
9675 -38654 -43760 -24470 -30753 -44257 -33157 -41827 -39136 -39373 -41093 -23102 -31299 -41399 -30526
9662 -30526 -40240 -23096 -40053 -34720 -29933 -31883 -31908 -26099 -13245 -50478 -32956 -27745 -41897 -24040
9648 -24040 -33264 -33089 -37062 -33834 -31310 -57799 -33773 -27807 -39375 -38676 -33255 -39123 -31053 -33248
9634 -33248 -32500 -21803 -24871 -33513 -26340 -32613 -30119 -27728 -38221 -41072 -28269 -36368 -22753 -21298
9620 -21298 -25075 -20495 -30639 -43563 -20740 -28535 -37020 -15926 -39763 -34814 -29524 -33330 -32571 -33728
9606 -33728 -21453 -23045 -25961 -22565 -28145 -44032 -25097 -23542 -44092 -25253 -19725 -19264 -37232
9593 -37232 -28606 -32544 -21592 -27553 -18340 -31022 -29838 -46741 -30279 -27168 -18025 -25886 -19521 -34505
9579 -34505 -19609 -27541 -24945 -13388 -26032 -27286 -10999 -20536 -16281 -21781 -37864 -26549 -18121
$$ packed form
9675c8654n106J9290o283j3504J1100q670K691k37j720J7991q197j0100J0873
9662c0526r714J7144j6957N333M787j950k5N809J2854l7233J7522N211j4152J7857
9648b4040r224J75l973L228K524k6489K4026N966j1568O99N421n868Q070k195
9634c3248P48J0697l068q642P173o273K494K391j0493k851J2803q099J3615J455
9620b1298l777M580j0144j2924K2823p795q485K1094k3837M949N290l806P59j157
9606c3728J2275j592k916L396n580j5887J8935J555k0550J8839N528M61j7968
9593c7232Q626l938J0952n961R213j2682J184j6903J6462L111R143p861O365j4984
9579c4505J4896p932K596J1557j2644j254J6287r537M255n500j6083J1315Q428
$$ plain form
9566 -18121 -17950 -35984 -37264 -16955 -21227 -26381 -30476 -25911 -30952 -32907 -27748 -22240 -31998 -30751
9552 -30751 -15299 -34226 -30161 -18367 -28307 -25522 -15850 -28185 -30660 -37594 -30519 -21481 -28408 -25874
9538 -25874 -27047 -34312 -27758 -29976 -21801 -15972 -20967 -18628 -18811 -17920 -23469 -17717 -19474 -28740 -14776
9523 -14776 -18079 -31397 -28054 -24386 -28190 -21332 -27233 -21829 -13751 -15829 -22752 -21931 -10248 -22027
9509 -22027 -6596 -31713 -17390 -23175 -21881 -17257 -16417 -25681 -23264 -32422 -25484 -16639 -27664 -25530
9495 -25530 -22391 -28705 -14692 -28439 -10696 -22320 -25678 -27249 -9349 -26658 -23734 -22131 -17666
9482 -17666 -24608 -21162 -23511 -18847 -18241 -26959 -18597 -18206 -26342 -12927 -28750 -18873 -28351 -16764
9468 -16764 -13868 -24236 -20304 -11948 -13199 -22192 -16774 -7804 -28367 -19017 -13328 -15382 -28190 -26525
$$ packed form
9566a8121J71j8034j280K0309m272n154m095M565n041j955N159N508r758J247
9552c0751J5452j8927M065J1794r940K785R672j2335k475o934P075R038o927K534
9538b5874j173p265O554k218Q175N829m995K339j83Q91n549N752j757r266J3964
9523a4776l303j3318L343L668l804O858n901N404Q078k078o923Q21J1683j1779
9509b2027J5431k5117J4323n785J294M624Q40r264K417r158O938Q845j1025K134
9495b5530L139o314J4013j3747J7743j1624l358j571J7900j7309K924J603M465
9482a7666o942L446k349M664O06q718Q362L91q136J3415j5823R877r478J1587
9468a6764K896j0368L932Q356j251q993N418Q970k0563R350N689k054j2808J665
$$ plain form
9454 -26525 -13876 -7964 -16610 -25434 -15192 -14110 5 -18939 -24471 -2308 -16147 -20064 -15609
9441 -15609 -14453 -16577 -16624 -17165 -28875 -18699 -11714 -23299 -18839 -13797 -24013 -19560 -17654 -1934
9427 -1934 -21032 -18305 -9733 -25980 -12628 -25826 -25633 -20991 -22430 -18064 -18152 -21334 -11396 -14922 -16511
9412 -16511 -17733 -7866 -14694 -10072 -6464 -7954 -15951 -25309 -7058 -10114 -25723 -11337 705 -22977
9398 -22977 -11728 -13504 -11773 -4842 -18087 -15105 -29485 -20808 -25662 -4683 -19404 -15649 -11772
9385 -11772 -34136 -2256 -4695 -11900 -21180 -17427 -13546 -30222 -20935 -28576 -16910 -8658 -5860 -13366
9371 -13366 -13246 -18805 -24019 -14274 -5043 -17398 -20430 -7732 -22575 -13721 -12928 -22759 -10129 -22794
9357 -22794 -10119 -6485 -19653 -842 -26577 -15909 -8509 -14554 -17372 -23655 -7245 -11312 -12202
$$ packed form
9454b6525J2649N912q646q824J0242J082J4115j8944n532K2163j3839l917M455
9441a5609J156k124m7n41j1710J0176O985j1585M460N042j0216M453J906J5720
9427a934j9098K727Q572j6247J3352j3198J93M642j439M366q8l182R938l526j589
9412a6511j222R867o828M622L608j490p997r358J8251l056j5609J4386J2042k3682
9398b2977J1249j776J731O931j3245K982j4380Q677m854K0979j4721L755L877
9385a1772k2364L1880k439p205r280L753L881j6676R287p641J1666Q252K798p506
9371a3366J20n559n214R745R231j2355l032J2698j4843Q854P93r831J2630j2665
9357b2794J2675L634j3168J8811k5735J0668P400o045k818o283J6410m067q90
$$ plain form
9344 -12202 -7461 -8263 -16882 5569 -3834 -8790 -4873 -15447 -15647 -7672 -13302 -11456 -8315 -28346
9330 -28346 -19033 -8830 -18438 -13938 -25765 -12045 -14808 -16068 -5396 -16858 -21387 -26366 -18392
9317 -18392 -22573 -17233 -21971 -22702 -11891 -16267 -11213 -22160 -18266 -27964 -14862 -22160 -17998 -25080
9303 -25080 -14446 -12532 -20128 -14470 -21580 -26677 -26480 -24552 -25800 -14480 -23971 -25625 -33828 -12880
9289 -12880 -22261 -17803 -18564 -14627 -25703 -21029 -14267 -17670 -20265 -21393 -23984 -20140 -21020 -7400 -9378
9274 -9378 -17484 -17394 -15332 -22275 -21899 -16844 -19483 -25780 -20117 -19270 -23316 -29430 -18620 -19303 -9326 -14085
9258 -14085 -9479 -21321 -25649 -21997 -2790 -27488 -21502 -16171 -21683 -1986 -14225 -35539 -30603
9245 -30603 -23491 -22657 -24552 -21924 -1729 -21879 -15841 -23031 -13629 -4065 -12374 -24256 -9330 -20750
$$ packed form
9344a2202M741q02q619K2451r403m956L917j0574k00P975n630J846L141k0031
9330b8346R313J0203r608M500j1827J3720k763j260J0672j1462m529m979P974
9317a8392m181N340m738p31J0811m376N054j0947L894r698J3102p298M162p082
9303b5080J0634J914p596N658p110n097J97J928j248J1320r491j654q203K0948
9289a2880r381M458p61L937j1076M674O762l403k595j128k591L844q80J3620j978
9274i378q106R0K062o943L76N055k639o297N663Q47m046o114J0810o83R977m759
9258a4085M606j1842m328L652J9207k4698N986N331n512J9697j2239k1314M936
9245c0603P112Q34j895K628K0195k0150O038p190R402R564q309j1882J4926j1420
$$ plain form
9231 -20750 -25538 -17174 -19811 -18253 -14892 -18650 -24773 -12655 -13326 -24422 -13662 -26423 -29025 -16173
9217 -16173 -25012 -20536 -17333 -26238 -18506 -13651 -34006 -17398 -10134 -25707 -24518 -19212 -29832 -18498
9203 -18498 -24902 -29895 -24121 -14341 -34742 -21127 -18487 -19943 -31252 -28058 -22433 -23068 -31257 -22943
9189 -22943 -19840 -29111 -22885 -32693 -26260 -30466 -26176 -34971 -21788 -9731 -25303 -10054 -6839 -34803
9175 -34803 -26015 -17541 -15469 -15004 -9306 -25757 -27900 -34689 -18117 -23465 -38295 -36925 -15298 -29758
9161 -29758 -15772 -27581 -21022 -33941 -18523 -19525 -12930 -29770 -13104 -24261 -19469 -16356 -21072
9148 -21072 -23147 -29002 -11603 -11323 -28862 -24186 -23857 -34193 -31109 -18949 -25318 -32476 -22518 -26610
9134 -26610 -23135 -13136 -24680 -16090 -19023 -8923 -11336 -413 -28656 -33776 -13989 -11531 -21788
$$ packed form
9231b0750m788Q364k637J558L361l758o123J2118o71j1096J0760j2761k602J2852
9217a6173q839M476L203q905P732M855k0355J6608P264j5573J189N306j0620J1334
9203a8498o404m993N774R780k0401J3615K640j456j1309L194N625o35q189Q314
9189b2943L103r271O226r808O433m206M290q795J3183J2057j5572J5249L215k7964
9175c4803Q788Q474K072M65N698j6451k143o789J6572n348j4830J370K1627j4460
9161b9758J3986j1809O559j2919J5418j002O595j6840J6666j1157M792L113m716
9148b1072k075n855J7399K80j7539M676L29j0336L084J2160o369p158R958m092
9134b6610L475R999j1544Q590k933J0100k413J0923k8243n120J9787K458j0257
$$ plain form
9121 -21788 -19926 -22128 -20902 -21721 -21804 -11894 -38495 -22951 -19415 -33128 -12417 -12030 -36432 -18091
9107 -18091 -23805 -31487 -22093 -25914 -28444 -31746 -19001 -23363 -25617 -29775 -25655 -41642 -39148 -19512
9093 -19512 -26152 -27477 -15987 -31022 -31997 -29599 -36335 -25445 -17929 -24385 -34337 -26159 -29822 -33878
9079 -33878 -32344 -26116 -30208 -35146 -28498 -29222 -33657 -29402 -18418 -23238 -29258 -30615 -26235 -34108 -10544
9064 -10544 -30754 -25478 -38557 -40545 -26614 -26982 -25760 -23042 -29202 -24494 -17856 -34659 -28856 -29942
9050 -29942 -33173 -48363 -24891 -32481 -28627 -23184 -24517 -23415 -25543 -37201 -28646 -20261 -33281 -23851
9036 -23851 -22347 -34205 -26147 -13617 -23417 -34791 -24011 -23464 -32655 -30636 -19921 -15561 -28531
9023 -28531 -30341 -39850 -28123 -28016 -29785 -38357 -34777 -21518 -36252 -31102 -29148 -33633 -31471 -30013
$$ packed form
9121b1788J862k202J226q19q3R910k6601J5544L536j3713K0711L87k4402J8341
9107a8091n714p682R394l821k530l302J2745m362k254m158M120j5987K494J9636
9093a9512o640j325J1490j5035r75K398o736J0890P516o456r952Q178l663m056
9079c3878J534O228m092m938O648p24m435M255J0984m820o020j357M380p873K3564
9064a0544k0210N276j3079j988J3931l68J222K718o160M708O638j6803N803j086
9050b9942l231j5190K3472p590L854N443j333J102k128j1658Q555Q385j3020R430
9036b3851J504j1858Q058J2530r800j1374J0780N47r191K019J0715M360j2970
9023b8531j810r509J1727J07j769q572L580J3259j4734N150J954m485K162J458
$$ plain form
9009 -30013 -20510 -16572 -33443 -32766 -38281 -28653 -39403 -27920 -21832 -31134 -44671 -29094 -31334 -21617
8995 -21617 -33225 -35096 -31894 -16009 -30427 -29564 -33495 -28101 -20364 -41295 -27617 -19914 -20392 -37091
8981 -37091 -39605 -28819 -34060 -24155 -31386 -22620 -16514 -25957 -36188 -31125 -30674 -20688 -24638 -30952
8967 -30952 -26204 -22037 -28710 -31151 -27361 -23688 -36367 -24101 -33773 -21243 -36002 -29511 -31521 -29734
8953 -29734 -35195 -30304 -31354 -37463 -21871 -20090 -21765 -26403 -31806 -35754 -25570 -31261 -27247 -16714
8939 -16714 -43323 -32239 -13970 -36689 -25542 -36410 -30291 -22861 -28721 -25774 -35720 -41374 -41240
8926 -41240 -18308 -43514 -31683 -33712 -30761 -41719 -30583 -36773 -39401 -20472 -15118 -27796 -40400
8913 -40400 -19405 -24460 -32973 -27641 -34620 -22938 -28898 -29412 -21128 -31389 -17435 -33899 -22996
$$ packed form
9009c0013R503L938j6871O77n515R628j0750J1483O088r302j3537J5577k240R717
8995b1617j1608j871L202J5885j4418Q63l931N394P737k0931J3678P703m78j6699
8981c7091k514J0786n241R905p231Q766O106r443j0231N063M51R986l950o314
8967c0952M748M167o673k441L790L673j2679J2266r672J2530j4759O491k010J787
8953b9734n461M891j050o109J5592J781j675m638n403l948J0184n691M014J0533
8939a6714k6609J1084J8269k2719J1147j0868O119P430n860K947r946n654J34
8926d1240K2932k5206J1831k029K951j0958J1136o190k628J8929N354j2678j2604
8913d0400K0995n055q513N332o979J1682n960n14Q284j0261J3954j6464J0903
$$ plain form
8900 -22996 -27109 -24110 -21688 -24461 -25358 -22967 -26845 -18704 -29579 -32297 -23331 -33347 -32278 -30756
8886 -30756 -30880 -36913 -28608 -19324 -39958 -34457 -38007 -25873 -21579 -37446 -24039 -16434 -21313 -29182
8872 -29182 -26075 -30363 -23325 -20922 -25500 -28442 -26329 -19230 -33563 -30896 -30013 -28320 -30150 -26495 -20494
8857 -20494 -36645 -21506 3785 -38808 -23545 -23074 -28229 -22403 -21814 -22381 -26895 -15867 -22984 -22347
8843 -22347 -45080 -26337 -18490 -28518 -27280 -24580 -29949 -37979 -19121 -30448 -21552 -24285 -24391 -20901
8829 -20901 -28641 -34586 -25793 -30111 -34944 -18530 -29454 -26453 -25380 -28114 -32498 -22078 -13739 -26137
8815 -26137 -36453 -32237 -35545 -22329 -22612 -13738 -23845 -20713 -6349 -26925 -36323 -21182 -31451
8802 -31451 -20564 -24684 -28595 -29446 -37068 -25387 -25585 -21035 -19876 -25694 -34075 -27637 -34805 -24851 -22868
$$ packed form
8900b2996m113K999K422k773q97K391l878Q141j0875k718Q966j0016J069J522
8886c0756j24o033Q305R284k0634N501l550J2134M294j5867J3407P605m879p869
8872b9182L107m288P038K403m578k942K113P099j4333K667Q83J693j830L655O001
8857b0494j6151J5139K5291m2593J5263M71n155N826N89n67m514J1028p117O37
8843b2347k2733J8743P847j0028J238K700n369q030J8858j1327Q896k733j06L490
8829b0901p740n945Q793m318m833J6414j0924L001J073k734m384J0420Q339j2398
8815b6137j0316M216l308J3216k83Q874j0107L132J4364k0576r398J5141j0269
8802c1451J0887m120l911q51p622J1681j98M550J159n818q381O438p168R954J983
$$ plain form
8787 -22868 -26545 -49479 -19050 -26111 -23348 -11315 -31211 -29490 -24608 -25738 -23764 -18788 -39172
8774 -39172 -21611 -32270 -18979 -15202 -24191 -13979 -18454 -25897 -34417 -28887 -38712 -10696 -23283
8761 -23283 -24178 -19586 -35930 -24740 -25866 -25500 -12826 -29222 -28364 -29349 -17619 -8727 -26495 -24273
8747 -24273 -18080 -20863 -17201 -34502 -30007 -29886 -15504 -21920 -27832 -26524 -21469 -32533 -18480 -18869
8733 -18869 -26714 -16422 -23773 -26550 -22567 -23840 -19504 -26714 -33364 -14594 -24810 -31812 -22183 -18157
8719 -18157 -27705 -10460 -22800 -19075 -34321 -17852 -18847 -30151 -36600 -23194 -22573 -11252 -22124
8706 -22124 -20495 -28493 -30442 -34608 -22159 -19690 -33076 -22791 -32955 -24307 -24169 -25587 -23361 -23061
8692 -23061 -20013 -15400 -13469 -18883 -39572 -20065 -22864 -19036 -35033 -29989 -19940 -19129 -23102 -26065
$$ packed form
8787b2868l677k2934L0429p061K763J2033j9896J721M882j130J974M976k0384
8774c9172J7561j0659J3291L777q989J0212m475p443q520N530r825K8016j2587
8761b3283q95M592j6344J1190j126L66J2674j6396Q58r85J1730Q892j7768K222
8747b4273O193k783L662j7301M495J21J4382o416n912J308N055j1064J4053l89
8733a8869p845J0292p351k777L983j273M336p210o650J8770j0216p002R629M026
8719a8157r548J7245j2340L725j5246J6469r95j1304o449J3406O21J1321j0872
8706b2124J629p998j949m166J2449K469j3386J0285j0164Q648J38j418K226L00
8692b3061L048M613J931n414k0689J9507k799L828j5997N044J0049Q11l973k963
$$ plain form
8678 -26065 -25390 -22966 -14344 -34936 -19752 -37599 -16244 -17652 -20214 -21219 -26239 -25556 -31349 -21668
8664 -21668 -5201 -18910 -24751 -21683 -26766 -13370 -20645 -27824 -15457 -26425 -30164 -15984 -16059 -27371
8650 -27371 -26853 -17402 -33481 -13767 -19364 -17118 -25922 -20353 -20161 -29929 -24238 -36656 -18488 -19845
8636 -19845 -11315 -22962 -35437 -13416 -24879 -27995 -24079 -23710 -28385 -21630 -22988 -28751 -23138 -26149
8622 -26149 -22599 -13027 -26461 -15798 -17835 -17389 -17526 -20330 -7959 -22173 -29492 -18120 -24348 -18120
8608 -18120 -30120 -26151 -22306 -22757 -24263 -30445 -14122 -21856 -7698 -19656 -17337 -19711 -30257 -19264
8594 -19264 -17229 -17329 -27829 -21780 -24060 -19816 -23714 -17599 -21222 -16937 -18443 -25345 -25758 -15787 -9000
8579 -9000 -20599 -18436 -16727 -6954 -17442 -28801 -22070 -20755 -14865 -16496 -33815 -30027 -31161 -2692
$$ packed form
8678b6065O75K424Q622k0592J5184j7847K1355j408k562j005n020O83n793R681
8664b1668J6467j3709n841L068n083J3396p275p179J2367j0968l739J4180p5j1312
8650b7371N18R451j6079J9714n597K246q804N569J92r768N691j2418J8168j357
8636a9845Q530j1647j2475K2021j1463l116L916L69m675O755j358n763N613l011
8622b6149L550R572j3434J0663k037M46j37k804J2371j4214p319J1372o228O228
8608a8120j2000L969L845m51j506o182J6323p734J4158j1958K319k374j0546J0993
8594a9264K035j00j0500O049k280M244l898O115l623M285j506o902m13R971O787
8579i000j1599K163J709R773j0488j1359O731J315N890j631j7319L788j134K8469
$$ plain form
8565 -2692 -15276 -16730 -13858 -22217 -9678 -21351 -16157 -15896 -18814 -18147 -24743 -17215 -14374 -30550
8551 -30550 -26417 -21586 -24558 -22714 -18262 -18454 -24954 -7435 -21109 -37428 -24296 -22940 -20066 -14330
8537 -14330 -26879 -33502 -39856 -38178 -150055 40552 10633 -3548 -15493 347 -6869 -9007
8525 -9007 -21437 -15053 -11706 -10597 -15789 -23560 -15283 -9548 -13130 -19679 -2656 -14698 -24659 -2705
8511 -2705 -8928 -29936 -5594 -18091 -19713 -4983 -28331 -32420 -10114 -12045 -16220 5924 -8963
8498 -8963 -25072 -17439 -18436 -12193 -22822 -19762 1901 -17410 -29241 -10351 -20163 -19233 -20331 -28761
8484 -28761 -24586 -5612 -22572 -29432 -11465 -31835 -19864 2758 -14493 -20564 -17553 -20545 -29854
8471 -29854 -13545 -9417 -18680 -11428 -5735 -8906 -21467 -21666 -25049 -15954 -16804 -22418 -24180 -26672 -9006
$$ packed form
8565b692j2584j454K872q359J2539j1673N194K61k918O67o596P528K841j6176
8551c0550M133M831k972J844M452j92o500J7519j3674j6319J3132J356K874N736
8537a4330j2549o623o354J678j11877J90607k9919j4181j1945J5840p216k138
8525i007j2430O384L347J109n192p771Q277N735l582o549J7023j2042r961K1954
8511b705o223k1008K4342j2497j622J4730k3348m089K2306j931m175K2144j4887
8498h963j6109P633r97O243j0629L060K1663j9311j1831J8890r812R30j098q430
8484b8761M175J8974j6960o860J7967k0370J1971K2622j7251o071L011k992r309
8471b9854J6309M128r263P252N693l171j2561j99l383R095q50n614j762k492J7666
$$ plain form
8456 -9006 -18942 -14588 791 -8359 -17084 -12990 -13235 -10146 -19125 -15508 -13029 -11039 -4030 -18640 -21721
8441 -21721 -19939 -8903 -1523 -3040 -20675 -16027 -14675 3076 -15308 -11347 -16790 -1715 -13136
8428 -13136 -22050 -17314 -2385 -12925 -4850 -13788 -4533 -10431 -11056 -12382 -7096 -14782 762 -9906
8414 -9906 -11990 -5983 -7016 -25661 -19757 -19008 -19476 1298 -11958 -18678 -1411 -17351 -3529 -15802
8400 -15802 -6288 -11726 -12177 -14040 -3660 -10471 -10646 -6401 -12845 1580 -8213 -867 -9391 6967
8386 6967 8364 -1198 5847 -3865 1781 -6231 16940 1339 -6167 2901 20799 4790 12163 13706
8372 13706 4603 -7661 8753 18285 12677 15175 3355 8455 4882 -3600 3557 5904 1030 -7533
8358 -7533 7443 -5939 13726 2406 3257 -5674 -10560 -2403 -3069 -9700 3774 7544 3260 4592
$$ packed form
8456i006r936M354J5379r150q725M094k45L089q979L617K479J990P009j4610l081
8441b1721J782J1036P380j517j7635M648J352J7751j8384L961n443J5075j1421
8428a3136q914M736J4929j0540Q075q938R255n898o25j326N286p686J5544j0668
8414i906k084O007j033j8645N904P49m68K0774j3256o720J7267j5940J3822j2273
8400a5802R514n438m51j863J0380o811j75M245o444J4425r793P346q524J6358
8386F967J397r562P045r712N646q012K3171j5601p506R068J7898j6009P373J543
8372A3706r103j2264J6414R532n608K498j1820N100l573q482P157K347m874q563
8358g533J4976j3382J9665j1320Q51q931m886Q157o66o631J3474L770m284J332
$$ plain form
8344 4592 -6761 -3758 -14073 -4164 -4661 -18497 -10094 -7353 -11654 1113 740 -11279 -11981 8109
8330 8109 -4831 -5433 -4635 -8354 -10161 -1940 -18289 -18591 -13520 -6833 -4044 9591 610 -20290 -9486
8315 -9486 -4612 3851 -8356 -9700 5067 827 -12101 -7411 -10909 -21686 -6590 -4905 -23800
8302 -23800 -13430 -17002 -9975 -9720 -18867 -15852 -7660 -10146 -12968 -14183 -13325 -5787 -16632 -21833 -18136
8287 -18136 -10794 53 -7319 -12239 -4354 -7504 -15404 -9861 -13085 -25279 -6359 -22256 -15072 -8589
8273 -8589 -24440 -16419 -4221 -28418 -6504 -3117 -15589 881 -4971 -8113 -4143 -14362 -22673
8260 -22673 504 -9324 -13296 -9731 -11037 -3811 154 -21106 -10942 -17421 -5769 -11008 -14288 -23710
8246 -23710 -8772 -7315 -17868 -14549 -7500 -25315 -9399 2143 -20082 -12164 -17181 -31081 -11458
$$ packed form
8344D592j1353L003j0315R909m97j3836Q403K741m301J2767l73j2019p02K0090
8330H109j2940o02P98l719j807Q221j6349l02N071O687K789J3635q981k0900J0804
8315i486M874Q463j2207j344J4767m240j2928M690l498j0777J5096J685j8895
8302b3800J0370l572P027K55r147L015Q192k486k822j215Q58P538j0845n201L697
8287a8136P342J0847p372m920P885l150p900N543l224j2194J8920j5897P184O483
8273h589j5851Q021J2198k4197K1914L387j2472J6470n852l142L970j0219q311
8260b2673K3177r828l972L565j306P226L965k1260J0164o479J1652n239l280r422
8246b3710J4938J457j0553L319P049j7815J5916J1542k2225P918n017j3900J9623
$$ plain form
8233 -11458 -22482 -14643 -14580 -11798 -12651 -13554 -14800 -30281 -19327 -11729 -20195 -15017 -2044 -14860
8219 -14860 -5792 -12036 -23257 -12294 -4811 -8902 -19041 -18789 -20769 -1537 -28610 -27488 -238
8206 -238 -25790 -3157 -13938 -10214 -18035 -8612 -17138 -14992 -11269 -22305 -14767 -13064 -20981 -22613
8192 -22613 -654 -11260 -29487 -9289 -21349 -7187 -30450 -7048 6390 -12630 -8153 -2913
8180 -2913 -3468 -14239 -11684 -18592 -12587 -13451 -21456 -24286 -12704 -19398 -17488 -6308 -12176 -6110 -17301
8165 -17301 -15650 -15581 -27405 -12722 -9408 -14772 -8761 -10718 -19425 -17837 -23506 -18789 -15246 -21409 -14197
8150 -14197 -22968 -22450 -8498 -18928 -19837 -23587 -17364 -14700 -3122 -18409 -24557 -9884 -17621 -18298
8136 -18298 -5691 -17270 -23009 -10490 -20614 -2544 -23229 -10957 -12089 -29687 3251 1915
$$ packed form
8233a1458j1024P839O3K782q53r03j246j5481J0954P598q466N178J2973j2816
8219a4860R068o244j1221J0963P483m091j0139K52j980J9232k7073J122K7250
8206b38k5552K2633j0781L724p821R423q526K146L723j1036P538J703p917j632
8192b2613K1959j0606j8227K0198j2060J4162k3263K3402J3438j9020M477N240
8180b913n55j0771K555o908O005q64q005k830J1582o694J910J1180n868O066j1191
8165a7301J651O9j1824J4683L314n364O011j957q707J588n669M717L543o163P212
8150a4197q771N18J3952j0430r09l750O223K664J1578j5287o148J4673p737o77
8136a8298J2607j1579n739J2519j0124J8070k0685J2272j132j7598L2938j336
$$ plain form
8124 1915 -15371 -10967 -7096 -14699 -25298 -8744 -28815 -11928 -9942 -25239 -7575 -22250 -25083
8111 -25083 -4082 -16497 -6032 -14803 -6946 -10656 -20155 -24573 -20983 -36467 -23034 -20878 -18884
8098 -18884 -20775 -1258 3864 -19849 -17788 -30415 -2614 -14688 -19605 -26618 -21612 -23134 -33656
8085 -33656 -27405 -32657 -13544 -15866 -21852 -6617 -13006 -19710 -13275 -9600 -24354 -28655 -11316 -9860
8071 -9860 -9209 -17091 -19022 -15185 -16115 -10615 -18988 -20345 -5799 -4558 -23253 -25203 -20637 -12955 -11312
8056 -11312 -9595 -2730 604 -18036 -8406 -17342 -22125 -15044 -22214 -24541 -13521 -1817 -19060 -12058
8042 -12058 -21654 -13274 -4258 -20110 -1810 -7568 -23072 -12821 -3058 -25895 -16769 -8539 -3744
8029 -3744 1284 -17097 -18698 -12599 -20076 -26957 -15568 -35602 -14803 -17647 -6845 -8415 -18231 -19124
$$ packed form
8124A915j7286M404L871p603j0599J6554k0071J6887J986j5297J7664j4675k833
8111b5083K1001j2415J0465q771P857l710r499m418L590j5484J3433K156J994
8098a8884j891J9517N122k3713K061j2627K7801j2074m917p013N006j522j0522
8085c3656O251n252J9113k322n986J5235o389o704O435L675j4754m301J7339J456
8071i860O51p882j931L837r30N500q373j357J4546J241j8695j950M566P682J643
8056a1312J717O865L334j8640R630q936m783P081p170k327J1020J1704j7243P002
8042a2058r596Q380R016j5852J8300n758j5504J0251R763k2837R126Q230M795
8029c744N028j8381j601O099p477o881J1389k0034K0799k844J0802j570r816q93
$$ plain form
8015 -19124 -9237 -9743 -13578 -3226 -18384 -280 -14570 -21227 -18479 -23569 -15238 -27019 -4571
8002 -4571 -7712 -4438 -34895 -14808 -3569 -19143 -6565 -4580 -28303 -21380 -11158 -19399 -18131
7989 -18131 -32428 -10455 -11247 -12369 -19681 1072 -9436 -14620 -7314 -33717 -15071 -1839 -19404
7976 -19404 -9641 -2016 -17521 -19193 5651 -19350 -19858 -16883 -13506 -713 -15586 -19589 -7739
7963 -7739 -22275 -8121 -20470 -15136 -4664 -11891 -14243 -17648 -13943 -15811 -5213 -15595 -17493
7950 -17493 -11030 -19726 -21070 -7152 -6080 -20317 -12592 -11280 -22004 -14118 -8392 -17512 -10337 -13933
7936 -13933 -10607 -18603 -2067 -12724 -16159 -8626 -5547 -7044 -9242 -24338 -15952 -11695 -17977 -13853
7922 -13853 -2986 -12314 -31433 -34861 -24166 -23774 -7367 -26112 -14362 -2170 -22560 -12091 -17304
$$ packed form
8015a9124R887n06l835J0352j5158J8104j4290o657K748n090Q331j1781K2448
8002d571l141L274l0457K0087J1239j5574J2578J985k3723O923J0222q241J268
7989a8131j4297K1973p92j122p312K0753j0508n184P306k6403J8646J3232j7565
7976a9404R763P625j5505j672K4844k5001n08K975L377J2793j4873m003J1850
7963g739j4536J4154j2349N334J0472p227k352l405L705j868J0598j0382j898
7950a7493O463q696j344J3918J072j4237P725J312j0724P886N726r120P175l596
7936a3933L326p996J6536j0657l435P533L079j497k198j5096Q386M257o282M124
7922a3853J0867r328j9119l428J0695L92J6407j8745J1750J2192k0390J0469n213
$$ plain form
7909 -17304 -1452 -4892 -26361 -12981 -9365 -15577 -14051 -17719 -1580 -20087 -21358 -13032 -20414
7896 -20414 -2928 -13843 -18998 -6647 -14987 -10752 -11730 -14253 545 -269 -3576 -13414 -2714 -19665
7882 -19665 -1889 8947 -5976 -3532 -14361 -5870 -17966 -6707 -27235 -24599 -8548 -3744 -6936
7869 -6936 -13736 -14618 -1005 -19391 -9736 -2108 -14379 -6322 -5585 -8644 -6730 -12474 -22799 -9355
7855 -9355 -17227 -10705 8386 -8008 -14798 -35113 -29350 -11114 -22013 -26109 -9951 -14426 -16341
7842 -16341 -11932 -29124 -19390 -11801 -24927 -25473 -18243 -15314 -19265 -16789 -9602 -26093 -12520 -8294
7828 -8294 -23094 -11093 -12732 -19621 -18991 -20090 -5033 -26265 -22966 -6670 -15029 -10302 -9291 -22417
7814 -22417 -4134 -24352 -18196 -23217 -12361 -11916 -4814 2129 -16329 -10043 -4984 -8334 -9022 -11332
$$ packed form
7909a7304J5852l440k1469J3380L616o212J526l668J6139j8507j271Q326p382
7896b0414J7486j0915n155J2351q340M235r78k523J4798q14l307r838J0700j6951
7882a9665J7776J0836j4923K444j0829Q491j2096J1259k0528K636J6051M804l192
7869f936o800q82J3613j8386R655P628j2271Q057P37l059J914n744j0325J3444
7855i355p872O522J9091j6394o790k0315N763J8236j0899m096J6158m475j915
7842a6341M409j7192R734P589j3126n46P230K929l951K476P187j6491J3573M226
7828h294j4800J2001j639o889O30j099J5057k1232L299J6296q359M727J011j3126
7814b2417J8283k0218O156n021J0856M45P102O943j8458O286N059l350o88k310
$$ plain form
7800 -11332 -4318 -14853 -19746 -7657 -22181 -14717 -8154 -26617 -18794 1221 -4674 -17020 568
7787 568 -21527 -5682 2786 -10232 -10065 -2545 -6956 -8527 -8362 -7486 -10359 -7752 -16774 -14734 -869
7772 -869 -5399 -15714 -20745 -17728 -7881 -27961 -11411 -14017 -22931 -8516 -19872 -23769 -6677 -13855
7758 -13855 -24761 -12452 -11524 -24158 -2816 -7696 -10579 -20800 -15129 -20833 -13349 -6254 -7159 -13156
7744 -13156 3754 -2000 -12274 -487 -15172 -16142 -2834 -5420 -8132 -6657 -6925 -17204 -19557 -11126
7730 -11126 -28184 -3914 -4668 -18842 -14342 -10292 -10712 -5612 -8675 4732 -8629 -9777 -4277 -10525
7716 -10525 -10521 -3128 1277 -5982 2270 -4901 3001 -5296 -15866 -16827 -14736 -23569 -5241 -2814 -7252
7701 -7252 -12079 -8888 -3848 1346 6622 -4937 9397 -15114 -6577 -3074 -11656 -1017 -12508 -25916
$$ packed form
7800a1332P014j0535m893J2089j4524P464O563j8463P823K0015n895j2346J7588
7787E68k2095J5845Q468j3018J67P520m411j571J65Q76k873K607r022K040J3865
7772h69m530j0315n031L017R847k0080J6550k606q914J4415j1356l897J7092p178
7758a3855j0906J2309R28j2634K1342m880k883j0221N671n704P484P095r05n997
7744a3156J6910n754j0274J1787j4685r70J3308k586k712J475k68j0279k353Q431
7730a1126j7058K4270p54j4174M500M050m20N100l063J3407j3361j148N500o248
7716a0525MP393M405p259Q252p171P902q297j0570r61K091q833J8328K427m438
7701g252m827L191N040N194N276j1559J4334k4511Q537L503q582J0639j1491j3408
$$ plain form
7687 -25916 -15967 -3938 -9326 2151 -11094 -7955 -10176 -6285 5565 -5594 -12285 -2124 1854
7674 1854 -16303 -2168 -10546 -19694 -20083 -10004 -19120 598 -20263 -18125 4767 -13596 -11199
7661 -11199 10796 -17283 -9944 -8845 -6742 -6808 -2272 -13831 7079 -152 -7740 -9811 -5530 -7246
7647 -7246 -5033 -7094 -2004 -4405 2674 8199 1261 2611 11122 -3612 1108 16341 3315 14271
7633 14271 8816 -4613 1727 15928 -4404 -4673 14085 7889 5085 3358 4783 12645 -16128 1337
7619 1337 14813 1365 1817 20187 -7883 24456 12305 1642 11589 6815 -1862 6813 -1612
7606 -1612 4808 1922 -2986 8704 -4445 4051 983 2696 9148 -243 -3977 -3876 15055 7988
7592 7988 10551 11835 -4797 7445 -4957 -4061 11694 1202 -7715 -71 4658 13731 -186 22597
$$ packed form
7687b5916R949J2029n388J1477j3245L139k221L891J1850j1159o691J0161L978
7674A854j8157J4135q378r148l89J0079r116J9718k0861K138K2892j8363K397
7661a1199K1995k8079P339J099K103o6M536j1559K0910p231p588k071M281j716
7647g246K213k061N090k401P079N525o938J350Q511j4734M720J5233j3026J0956
7633A4271n455j3429O340J4201k0332k69J8758o196k804j727J425P862k8773J7465
7619A337J3476j3448M52J8370k8070L2339j2151j0663R947m774q677Q675q425
7606a612O420k886m908J1690j3149Q496l068J713O452r391l734J01J8931p067
7592G988K563J284j6632J2242j2402Q96J5755j0492q917P644M729R073j3917K2783
$$ plain form
7578 22597 -694 1399 2615 18353 16588 16498 -1895 12986 6692 12150 18188 -73 16962 9384
7564 9384 11279 -350 -3466 3914 19877 225 -1474 9567 15342 16702 16560 11125 30733 16809
7550 16809 5474 3634 10075 8375 12714 8665 436 1199 -2780 138 14727 2898 8454 8539 11067
7535 11067 2034 12673 1613 13061 9890 10380 14763 4721 16915 -4234 -12066 -1845 5676
7522 5676 -3617 9159 21927 8708 19370 11712 19848 18291 9625 20968 32025 17255 14106
7509 14106 30487 6055 13564 28473 11494 26376 18063 12365 8912 13421 6799 23391 4758
7496 4758 16160 21072 27303 24473 26859 17419 20767 21721 22290 33940 29244 26654 20406 36023 14581
7481 14581 30728 26557 19316 9867 22523 24260 31480 18581 22308 26163 29891 34397 26814 38014
$$ packed form
7578B2597k3291K093J216J5738j765r0j8393J4881o294N458O038j8261J7035p578
7564I384J895j1629l116P380J5963j9652j699J1041N775J360j42n435J9608j3924
7550A6809j1335j840O441j700M339m049q229P63l979K918J4589j1829N556Q5K528
7535A1067r033J0639j1060J1448l171M90M383j0042J2194k1149p832J0221P521
7522E676r293J2776J2768j3219J0662p658Q136j557q666J1343J1057j4770l149
7509A4106J6381k4432P509J4909j6979J4882q313n698l453M509o622J6592j8633
7496D758J1402M912O231k830K386r440L348R54N69J1650m696k590o248J5617k1442
7481A4581J6147m171p241r449J2656J737P220j2899L727L855L728M506p583J1200
$$ plain form
7467 38014 54827 36574 34209 29779 35930 46506 31938 29787 30241 22855 30781 29342 26214 35660
7453 35660 40340 32607 37939 49661 23303 27113 44126 43561 39084 55859 37640 35362 43632 31557
7439 31557 42410 38690 41014 46583 33887 36911 40869 31346 32881 29817 40106 53601 57899 37157
7425 37157 46363 45983 43299 41717 49179 34928 50715 35113 35208 30388 43396 47019 48053 53329
7411 53329 36967 58359 54287 60109 79644 71709 55134 53838 70886 88077 63219 66916 75644
7398 75644 63585 68385 73124 55412 73456 64968 88879 74973 77675 80334 79295 83949 87164
7385 87164 79466 80828 81085 88402 85689 95377 84713 87733 86396 103760 92457 102031 87408 97268
7371 97268 90718 86793 90056 75617 87294 100718 82684 87609 94533 87875 95899 101078 88536
$$ packed form
7467C8014J6813j8253k365m430O151J0576j4568k151M54p386P926j439l128R446
7453C5660M680p733N332J1722k6358L810J7013n65m477J6775j8219k278Q270j2075
7439C1557J0853l720K324N569j2696L024L958r523J535l064J0289J3495M298k0742
7425C7157R206l80k684j582P462j4251J5787j5602R5m820J3008L623J034N276
7411E3329j6362K1392m072N822J9535p935j6575j296J7048J7191k4858L697Q728
7398G5644j2059M800M739j7712J8044q488K3911j3906K702K659j039M654L215
7385H7164p698J362K57P317k713R688j0664L020j337J7364j1303R574j4623R860
7371I7268o550l925L263j4439J1677J3424j8034M925O924o658Q024N179j2542
$$ plain form
7358 88536 110982 98948 94547 103285 102663 102658 98857 96883 103540 115891 97487 117286 119275 116380
7344 116380 123385 118703 124225 115589 118927 104187 107441 85108 78042 54072 39984 24029 1186
7331 1186 -10966 -7241 6574 8904 30789 58806 60706 80393 107169 111965 119226 133787 141844
7318 141844 142439 150097 165448 169887 162767 173263 165793 178514 187085 178703 179269 175480 184515 176853
7304 176853 204854 199489 182441 182990 194533 206965 209941 207896 219637 215644 218501 230566 225473
7291 225473 226191 237606 250369 232826 242892 252028 241377 246552 244382 253609 259098 263594 271152
7278 271152 279643 282278 281612 290402 275319 282473 296443 300526 298989 321547 305148 321058 332892
7265 332892 324484 322555 331046 335390 342192 370777 359303 371571 366529 381377 365842 377680 376474
$$ packed form
7358H8536K2446j2034m401Q738o22nl801j974O657J2351j8404J9799J989k895
7344A16380P005m682N522q636L338j4740L254k2333p066k3970j4088j5955k2843
7331A186j2152L725J3815K330K1885K8017J900J9687K6776M796P261J4561Q057
7318A41844N95P658J5351M439p120J0496p470J2721Q571q382N66l789R035p662
7304A76853K8001n365j7048N49J1543J2432K976k045J1741l993K857J2065n093
7291B25473P18J1415J2763j7543J0066R136j0651N175k170R227N489M496P558
7278B71152Q491K635o66Q790j5083P154J3970M083j537K2558j6399J5910J1834
7265C32892q408j929Q491M344O802K8585j1474J2268n042J4848j5535J1838j206
$$ plain form
7252 376474 377541 383319 380484 381419 414087 407506 398475 422510 427202 425083 440048 437046 438454 445878
7238 445878 458794 459057 468152 486992 496329 509675 495540 495501 507929 515964 531161 530249 536297 548136
7224 548136 544715 558480 566305 566857 581500 592446 609607 603593 646646 647766 652171 663220 679552
7211 679552 680512 688675 708998 717409 731721 741217 753873 774634 788550 784616 796529 792960 797374
7198 797374 809562 799974 816500 829932 841346 875734 879944 892510 923843 938510 934230 937106
7186 937106 955506 958966 972596 987676 1011213 1066318 1077460 1110360 1135447 1174343 1175617 1196390
7174 1196390 1222920 1222874 1240247 1233855 1227294 1242758 1262536 1266292 1280637 1303590 1346821 1345420 1368304
7161 1368304 1410313 1434465 1449184 1506854 1533534 1583219 1626877 1670660 1698659 1768193 1802998
$$ packed form
7252C76474J067N778k835R35L2668o581r031K4035M692k119J4965l002J408P424
7238D45878J2916K63R095J8840R337J3346j4135l9J2428Q035J5197r12O048J1839
7224E48136l421J3765P825N52J4643J0946J7161o014M3053J120M405J1049J6332
7211F79552R60Q163K0323Q411J4312R496J2656K0761J3916l934J1913l569M414
7198G97374J2188r588J6526J3432J1414L4388M210J2566L1333J4667m280K876
7186I37106J8400L460J3630J5080K3537N5105J1142L2900K5087L8896J274K0773
7174A196390K6530m6J7373o392o561J5464J9778L756J4345K2953M3231j401K2884
7161A368304M2009K4152J4719N7670K6680M9685M3658M3783K7999O9534L4805
$$ plain form
7150 1802998 1838913 1898797 1938473 1982072 2042228 2085259 2115331 2167134 2205953 2219879 2288438
7139 2288438 2328426 2370809 2423925 2486994 2522992 2581251 2616167 2664899 2709347 2767154 2807500
7128 2807500 2840668 2866740 2912841 2941959 2949766 2964990 2992470 3004324 3068195 3110942 3163642 3245980
7116 3245980 3328562 3404967 3495130 3576466 3653311 3738546 3823618 3901404 3972905 4065067 4147938
7105 4147938 4224232 4330786 4422402 4523873 4623259 4732216 4845864 4947440 5049426 5169481
7095 5169481 5282320 5407202 5548239 5688667 5840742 6025215 6193935 6376768 6567385 6758882
7085 6758882 6979416 7192867 7414797 7644656 7879495 8131574 8409734 8689365 8964943 9281318
7075 9281318 9593519 9936764 10293419 10692858 11102577 11551362 12044563 12546246 13109544 13703918
$$ packed form
7150A802998L5915N9884L9676M3599O0156M3031L0072N1803L8819J3926O8559
7139B288438L9988M2383N3116O3069L5998N8259L4916M8732M4448N7807M0346
7128B807500L3168K6072M6101K9118P807J5224K7480J1854O3871M2747N2700Q2338
7116C245980Q2582P6405R0163Q1336P6845Q5235Q5072P7786P1501R2162Q2871
7105D147938P6294J06554R1616J01471R9386J08957J13648J01576J01986J20055
7095E169481J12839J24882J41037J40428J52075J84473J68720J82833J90617J91497
7085F758882K20534K13451K21930K29859K34839K52079K78160K79631K75578L16375
7075I281318L12201L43245L56655L99439M09719M48785M93201N01683N63298N94374
$$ plain form
7065 13703918 14346006 15032717 15773444 16583036 17465051 18422015 19479388 20653057 21963211
7056 21963211 23440207 25124714 27050025 29299901 31885274 34883088 38366439 42417545
7048 42417545 47141108 52731541 59443227 67561009 77628641 90336274 106829845 128753394
7040 128753394 158327248 197665426 246484402 299653180 348698644 385297842 402942568
7033 402942568 399474595 376771404 339879906 295618085 250582495 208739144 172064728
7026 172064728 141999563 118712997 100934402 87061808 75965160 66936624 59510781
7019 59510781 53396098 48302165 44044086 40483244 37486473 34938700 32720913 30810378
7011 30810378 29112908 27598586 26229988 24976843 23827865 22771089 21821560 20925447
$$ packed form
7065A3703918O42088O86711P40727Q09592Q82015R56964J057373J173669J310154
7056B1963211J476996J684507J925311K249876K585373K997814L483351M051106
7048D2417545M723563N590433O711686Q117782J0067632J2707633J6493571K1923549
7040A28753394K9573854L9338178M8818976N3168778M9045464L6599198J7644726
7033D02942568l467973k2703191l6891498m4261821m5035590m1843351l6674416
7026A72064728l0065165k3286566j7778595j3872594j1096648r028536p425843
7019E9510781o114683n093933m258079l560842k996771k547773k217787j910535
7011C0810378j697470j514322j368598j253145j148978j056776r49529q96113
$$ plain form
7003 20925447 20111998 19344650 18647185 17972447 17348555 16745441 16147526 15601573 15059729
6994 15059729 14546479 14086474 13625087 13177600 12780144 12374771 11999524 11625744 11282733
6985 11282733 10961049 10624074 10322230 10050646 9787143 9528282 9271737 9025029 8785723
6976 8785723 8543766 8313845 8092875 7858838 7637602 7421872 7230536 7038898 6849916 6663955
6966 6663955 6511816 6353053 6193506 6035677 5900494 5759915 5598325 5479076 5342856 5215818
6956 5215818 5088781 4992698 4882420 4803613 4708509 4630932 4534751 4466335 4378068 4266828 4160887
6945 4160887 4069085 3950141 3837018 3733435 3628370 3526353 3458887 3367780 3292404 3215602
6935 3215602 3146456 3074118 3029494 2965144 2902225 2838241 2801588 2751419 2696654 2638700 2590554
$$ packed form
7003B0925447q13449p67348o97465o74738o23892o03114n97915n45953n41844
6994A5059729n13250m60005m61387m47487l97456m05373l75247l73780l43011
6985A1282733l21684l36975l01844k71584k63503k58861k56545k46708k39306
6976H785723k41957k29921k20970k34037k21236k15730j91336j91638j88982j85961
6966F663955j52139j58763j59547j57829j35183j40579j61590j19249j36220j27038
6956E215818j27037r6083j10278p8807r5104p7577r6181o8416q8267j11240j05941
6945D160887r1802j18944j13123j03583j05065j02017o7466r1107p5376p6802
6935C215602o9146p2338m4624o4350o2919o3984l6653n0169n4765n7954m8146
$$ plain form
6924 2590554 2526091 2470606 2423654 2359884 2330062 2283866 2229402 2201503 2159725 2131958 2094745
6913 2094745 2058563 2036460 2003299 1967435 1935347 1910095 1867916 1840891 1813532 1774613 1748467
6902 1748467 1714609 1678206 1644965 1609630 1557303 1513048 1457960 1412730 1382585 1322431 1296371
6891 1296371 1259555 1226938 1215063 1207015 1206399 1180153 1174858 1154123 1121606 1108131 1085243 1057758
6879 1057758 1047968 1012261 981091 971871 960310 945660 922841 910526 886551 854685 846937 816491
6867 816491 788898 766843 746250 736058 718239 707973 699925 689284 672265 663752 653888 638072
6855 638072 637189 618255 625676 616453 600141 588378 589737 574174 559272 550758 535338 535264 522335
6842 522335 501840 503100 505089 473540 478867 472356 457195 469969 442717 435886 434421 417927 406034
$$ packed form
6924B590554o4463n5485m6952o3770k9822m6196n4464k7899m1778k7767l7213
6913B094745l6182k2103l3161l5864l2088k5252m2179k7025k7359l8919k6146
6902A748467l3858l6403l3241l5335n2327m4255n5088m5230l0145o0154k6060
6891A296371l6816l2617j1875q048o16k6246n295k0735l2517j3475k2888k7485
6879A057758r790l5707l1170r220j1561j4650k2819j2315k3975l1866p748l0446
6867H16491k7593k2055k0593j0192j7819j0266q048j0641j7019q513r864j5816
6855F38072q83j8934P421r223j6312j1763J359j5563j4902q514j5420p4j2929
6842E22335k0495J260J989l1549N327o511j5161J2774k7252o831j465j6494j1893
$$ plain form
6829 406034 417193 395814 396687 381775 387806 380541 367155 352183 346390 345486 330430 340529 327817
6816 327817 306733 321992 292904 289061 291218 278541 277425 253468 255315 253296 244335 224825 231525
6803 231525 227245 215127 213996 213904 208402 212198 215022 207050 197549 187579 199779 200358 195185 181495
6789 181495 185330 195830 177079 178458 162238 173040 168527 169439 155282 142332 159203 148444 140778
6776 140778 160010 157201 147690 150571 150132 158555 150019 148739 143075 142577 145688 147035 144989 134957
6762 134957 135212 128804 108021 137346 115462 105364 121593 113433 113928 119389 127033 102259 110458
6749 110458 123721 117925 121587 127039 118439 155206 154880 160797 189141 206041 231152 228551 229546 229933
6735 229933 207126 183186 171879 139595 124469 126973 109588 94160 91893 73040 73782 77532 65834
$$ packed form
6829D06034J1159k1379Q73j4912O031p265j3386j4972n793r04j5056J0099j2712
6816C27817k1084J5259k9088l843K157j2677j116k3957J847k019q961j9510O700
6803B31525m280j2118j131r2n502L796K824p972r501r970J2200N79n173j3690
6789A81495L835J0500j8751J379j6220J0802m513R12j4157j2950J6871j0759p666
6776A40778J9232k809r511K881m39Q423q536j280n664m98L111J347k046j0032
6762A34957K55o408k0783K9325k1884j0098J6229q160M95N461P644k4774Q199
6749A10458J3263n796L662N452q600L6767l26N917K8344J6900K5111k601R95L87
6735B29933k2807k3940j1307l2284j5126K504j7385j5428k267j8853P42L750j1698
$$ plain form
6722 65834 71686 69484 57519 50237 52977 53986 59887 58171 54270 51707 60220 59280 49277 50006 48905
6707 48905 58404 52112 38895 59475 61587 54420 34518 44710 51125 41259 37499 36063 52075
6694 52075 26018 41883 36237 38965 41231 34371 35717 45123 44634 30003 25104 32626 29502 18309
6680 18309 25376 24007 37441 36790 29469 28072 23981 36895 23920 34450 29412 27345 35781 36457
6666 36457 33661 34702 43216 33033 31852 38550 26505 33215 30818 19798 29136 31422 7373 12841
6652 12841 39803 25287 27670 25286 31393 14747 19873 32755 18467 12591 31449 19558 30098
6639 30098 22664 12513 18832 12855 25560 6688 -986 21659 21154 -3100 16790 25329 6187
6626 6187 19767 18097 21213 13316 -1028 472 25601 11891 -1254 5314 11320 8747 15147 21110
$$ packed form
6722F5834N852k202j1965p282K740J009N901j716l901k563Q513r40j0003P29j101
6707D8905R499o292j3217K0580K112p167j9902J0192O415r866l760j436J6012
6694E2075k6057J5865n646K728K266o860J346R406m89j4631m899P522l124j1193
6680A8309P067j369J3434o51p321j397m091J2914j2975J0530n038k067Q436O76
6666C6457k796J041Q514j0183j181O698j2045O710k397j1020R338K286k4049N468
6652A2841K6962j4516K383k384O107j6646N126J2882j4288n876J8858j1891J0540
6639C0098p434j0151O319n977J2705j8872p674K2645n05k4254J9890Q539j9142
6626F187J3580j670L116p897j4344J500K5129j3710j3145O568O006k573O400N963
$$ plain form
6612 21110 -5804 322 -5255 8637 15371 12422 9199 8532 10740 20516 7802 6764 1852 8807
6598 8807 3287 -5348 9721 -1736 13568 -1652 11407 8663 20603 3070 2675 29603 11211
6585 11211 23351 16651 6567 26498 24853 11103 15437 15749 -1289 4365 13152 5537 -1071 7998
6571 7998 5447 -8234 -6781 5084 -8778 -3000 -10274 8376 7864 -1475 -2238 -7448 -11449 -9908
6557 -9908 -8679 -5193 -10063 -13659 -11131 -13466 -22381 -10330 -23543 -16875 -3133 -11284 -15547 3268
6543 3268 -3614 -13218 -4633 5759 -16621 8952 2858 9987 6965 -2753 2866 -4812 -5538 5275
6529 5275 -11204 -10933 489 -3887 -9247 -4014 -5173 -6633 -4730 -3360 -399 7761 5361 -11611
6515 -11611 11429 16390 -4291 16441 -5643 -20387 -3800 1936 -14604 -5474 -3339 -3317 -4415
$$ packed form
6612B1110k6914O126n577J3892O734k949l223o67K208R776j2714j038m912O955
6598H807n520q635J5069j1457J5304j5220J3059k744J1940j7533l95K6928j8392
6585A1211J2140o700j0084J9931j645j3750M334L12j7038N654Q787p615o608R069
6571G998k551j3681J453J1865j3862N778p274J8650n12r339p63n210m001J541
6557i908J229L486m870l596K528k335q915J2051j3213O668J3742q151m263J8815
6543C268o882r604Q585J0392k2380K5573o094P129l022r718N619p678p26J0813
6529E275j6479K71J1422m376n360N233j159j460J903J370K961Q160k400j6972
6515a1611K3040M961k0681K0732k2084j4744J6587N736j6540R130K135K2j098
$$ plain form
6502 -4415 -5940 -330 -4710 -13086 -8382 -5502 -11739 -7452 -7260 -19540 -10754 -185 -21374 -3975
6488 -3975 -10145 -8876 -8577 -19581 -12168 -4072 -7444 -10842 -17831 -19338 -21226 -19530 -26129 -18356 -10122
6473 -10122 -7971 -6601 -5619 -5544 -6860 -18365 -8733 -20364 -22903 -7736 -12958 -36411 -21625 -29714
6459 -29714 -3828 -636 -6982 12062 -870 -1149 -18018 -2128 -10694 -10388 -8986 -6036 -18665 -14305
6445 -14305 -15865 -18972 -28681 -7901 -3975 -4207 -8341 -5803 -7674 -17280 -9302 -1483 -6199 -9363 -20851
6430 -20851 9577 2526 -8134 3445 -18077 -12812 -11019 -4821 -14002 -2671 -4909 -12079 -12443 -12930
6416 -12930 5321 -13667 -1122 -7076 -14719 -7394 -10269 -11083 -12151 -15433 -8691 8353 -8172 -9860
6402 -9860 -18808 -24166 -11596 -15219 -26372 -11693 -17549 410 -11950 1593 -3629 -19186 -8390
$$ packed form
6502d415j525N610m380q376M704K880o237M287J92j2280Q786J0569k1189J7399
6488c975o170J269K99j1004P413Q096l372l398o989j507j888J696o599P773Q234
6473a0122K151J370R82P5j316j1505R632j1631k539J5167n222k3453J4786q089
6459b9714K5886L192o346J9044j2932k79j6869J5890q566L06J402K950j2629M360
6445a4305j560l107r709K0780L926k32m134K538j871r606P978P819m716l164j1488
6430b0851L0428p051j0660J1579k1522N265J793O198r181J1331k238p170l64m87
6416a2930J8251j8988J2545n954p643P325k875q14j068l282O742J7044j6525j688
6402i860q948n358J2570l623j1153J4679n856J7959j2360J3543n222j5557J0796
$$ plain form
6389 -8390 -20276 -15061 -9228 -9958 -16682 -20891 -5141 -15784 -16680 -17124 -3535 -13043 3097 -12990
6375 -12990 -8980 -10294 -27801 -17133 3560 -18285 -11611 -8647 2172 -1542 -10721 -13500 -2545
6362 -2545 -4362 -7936 -7851 -7700 -8979 -4885 -8566 -15421 10976 -8244 1423 -9295 15563 920
6348 920 -4084 -6167 -1795 5308 -389 1737 13057 -8323 -14728 -1893 -26244 -23450 126 -25175
6334 -25175 3554 -18140 -546 -17947 -22435 -772 -906 -18798 -13147 -288 -9997 -19609 -10777
6321 -10777 -23412 -29184 -30606 -9393 -25470 -17778 -17053 -8968 -4204 -26861 -28795 -17029 -22637 -11150
6307 -11150 -11064 -20753 -34549 -19900 -27001 -11775 -14759 -14314 -19490 -15078 -17521 -14302 -14864 -17658 -3629
6292 -3629 -11802 -9107 -10237 -8504 -12561 -3658 -11648 -23349 -4847 -3724 -8850 5400 2204 -14588
$$ packed form
6389h390j1886N215N833p30o724m209J5750j0643q96m44J3589r508J6140j6087
6375a2990M010j314j7507J0668K0693k1845O674K964J0819l714r179k779J0955
6362b545j817l574Q5J51j279M094l681o855K6397j9220R667j0718K4858j4643
6348I20n004k083M372P103n697K126J1320k1380o405J2835k4351K794K3576k5301
6334b5175K8729k1694J7594j7401m488K1663j34j7892N651J2859r709r612Q832
6321a0777j2635n772j422K1213j6077P692P25Q085M764k2657j934J1766n608J1487
6307a1150Q6r689j3796J4649p101J5226k984M45n176M412k443L219n62k794J4029
6292c629q173K695j130J733m057Q903p990j1701J8502J123n126J4250l196j6792
$$ plain form
6278 -14588 -16950 -12836 -244 -1096 -15371 -7690 -4719 -11279 -4606 -719 -8537 -12396 5051 1441
6264 1441 1390 2080 -12239 -4530 -16681 -10258 -10823 -1333 -9601 -18538 -16442 -9689 -14282 -23890 -16335
6249 -16335 -1005 -7672 -3637 7027 -19554 -10213 -8544 -17960 -14343 -17356 -15896 174 -17412
6236 -17412 -13509 -13552 -22021 -9020 -19838 -7641 -10112 -23835 -10995 -7354 -12781 -14214 -12833 -16718
6222 -16718 -25347 -14953 1129 34 -4073 -9854 -20599 -20696 -5554 -13023 862 -13158 1404
6209 1404 -2024 -14368 -12882 -13154 -4120 -8224 994 12159 -3784 5061 -1834 -10524 -4878 5354
6195 5354 -7513 -10251 -7216 -5520 -19864 -7384 -9305 -378 12712 -10739 -8274 7793 25
6182 25 3112 -151 -6473 -1808 -1217 7610 1505 -5725 -2559 -3651 -3987 1059 -3580 -7718 -845 7770
$$ packed form
6278a4588k362M114J2592q52j4275P681K971o560O673L887p818l859J7447l610
6264A441n1O90j4319P709j2151O423n65R490q268q937K096O753m593r608P555
6249a6335J5330o667M035J0664k6581R341J669r416L617l013J460J6070j7586
6236a7412L903m3q469J3001j0818J2197k471j3723J2840L641n427j433J381l885
6222a6718q629J0394J6082j095m107n781j0745r7J5142p469J3885j4020J4562
6209A404l428j2344J486k72R034m104R218J1165j5943Q845o895q690N646J0232
6195E354j2867k738L035J696j4344J2480j921Q927J3090k3451K465J6067p768
6182B5L087l263o322M665N91Q827o105p230L166j092l36N046m639m138O873Q615
$$ plain form
6166 7770 -9969 -6461 -5230 1891 -2071 -14744 -761 -2558 -12244 -10361 1374 15247 -6773
6153 -6773 -7380 -5770 6948 245 -1621 11159 4377 -779 3675 4699 6968 16925 15177 17351 9242
6138 9242 50830 33298 23716 36221 18605 29078 15596 1882 7020 6389 6836 -5764 6212
6125 6212 6478 -2837 3969 10144 -2052 7289 -1920 1706 15924 22409 -2774 -424 16252 -262
6111 -262 4090 11880 5321 1262 -925 4122 -4362 -744 13006 1821 16586 -338 5497 -490
6097 -490 19653 10992 14867 7970 9110 459 4816 11105 -4922 12650 8687 1517 274 16342
6083 16342 -10480 -18256 -3322 3029 17439 -4231 8083 914 11808 5315 -2893 2628 12568
6070 12568 2180 1446 1978 1713 5888 -6095 4835 2838 5944 5934 -12138 -8793 5663 -7024
$$ packed form
6166G770j7739L508J231P121l962j2673J3983j797r686J883J1735J3873k2020
6153f773o07J610J2718o703j866J2780o782n156M454J024K269R957j748K174q109
6138I242M1588j7532r582J2505j7616J0473j3482j3714N138o31M47j2600J1976
6125F212K66r315O806O175j2196R341r209L626J4218O485k5183K350J6676j6514
6111b62M352P790o559m059k187N047q484L618J3750j1185J4765j6924N835n987
6097d90K0143q661L875o897J140q651M357O289j6027J7572l963p170j243J6068
6083A6342k6822p776J4934O351J4410k1670J2314p169J0894o493q208N521R940
6070A2568j0388p34N32k65M175j1983J0930j997L106j0j8072L345J4456j2687
$$ plain form
6056 -7024 16545 -219 1025 -346 6082 -2214 -87 4168 -9416 -1840 10647 1607 4002 11844
6042 11844 -1989 829 14104 1552 17797 9058 12508 18315 4096 -2903 9000 -2559 2901
6029 2901 -5593 -12967 13149 5938 8214 7183 -3485 -19933 -2358 6405 1796 -464 8700 -2655
6015 -2655 -525 -3102 13355 13997 9022 3633 -5056 5356 -3990 1057 13006 -3480 -467 6188
6001 6188 9801 -4553 -10605 -6464 -8021 2761 11482 9476 -2514 10009 -198 11348 9969
5988 9969 14047 -855 4856 -9761 1983 9042 1378 8376 22895 11604 7904 19125 18911 23603
5974 23603 20570 3199 25821 13807 7644 16454 10568 5277 7562 10667 16222 34541 8475
5961 8475 18395 780 3296 17426 11833 14168 13216 3679 4589 17267 25922 15615 37419 27425
$$ packed form
6056g024K3569j6764J244j371O428q296K127M255j3584P576J2487r040K395P842
6042A1844j3833K818J3275j2552J6245q739L450N807j4219o999J1903j1559N460
6029B901q494p374K6116p211K276j031j0668j6448J7575Q763m609k260R164j1355
6015b655K130k577J6457O42m975n389q689J0412r346N047J1949j6486L013O655
6001F188L613j4354o052M141j557J0782Q721k006j1990J2523j0207J1546j379
5988I969M078j4902N711j4617J1744P059p664O998J4519j1291l700J1221k14M692
5974B3603l033j7371K2622j2014o163Q810n886n291K285L105N555J8319k6066
5961H475R920j7615K516J4130n593K335r52r537R10J2678Q655j0307K1804r994
$$ plain form
5947 27425 27743 27346 23235 27054 35871 16400 12011 14010 30801 16489 17461 21172 4092 12724
5933 12724 20251 9268 13117 14945 5897 12048 -810 5828 1469 -5828 14895 14532 -7763 9737
5919 9737 2124 -2608 18183 11040 6592 21647 27025 30356 30973 21 7314 3839 10280 7736
5905 7736 9096 844 6773 3723 10700 13091 3251 -8795 16974 4004 11664 509 -194 10434
5891 10434 -2918 -3 10142 12040 -1851 8864 12796 4246 9929 11226 9822 -4923 16269
5878 16269 -11474 15862 9885 20810 27642 26602 19961 24055 36469 31755 27862 39542 27397
5865 27397 33324 11358 4357 10799 6796 11406 8915 24976 17183 5263 -4025 11263 13630 441
5851 441 11222 12287 -1276 6106 8396 2862 14142 -9239 11820 -435 9076 5306 3129 -2442
$$ packed form
5947B7425L18l97m111L819Q817j9471m389J999J6791j4312R72L711j7080Q632
5933A2724P527j0983L849J828r048O151j2858O638m359p297K0723l63k2295J7500
5919I737p613m732K0791p143m448J5055N378L331O17l0952P293l475O441k544
5905G736J360q252N929l050O977K391r840j2046K5769j2970P660j1155p03J0628
5891A0434j3352K915J0145J898j3891J0715L932q550N683J297j404j4745K1192
5878A6269k7743K7336n977J0925O832j040o641M094J2414m714l893J1680j2145
5865B7397N927k1966p001O442m003M610k491J6061p793j1920r288J5288K367j3189
5851D41J0781J065j3563P382K290n534J1280k3381K1059j2255R511l770k177n571
$$ plain form
5837 -2442 7983 -3366 15887 10985 -1434 16410 -11218 5711 16972 8508 -10988 17704
5825 17704 24541 10246 8503 5557 2959 6666 7895 11024 11461 5059 18885 10620 11832 10963 504
5810 504 14618 18342 23078 10280 35915 19270 12571 29095 11338 18796 26375 15648 24571
5797 24571 14222 12386 19312 28257 16466 19203 23542 25590 30666 18703 15841 29288 27450 19203
5783 19203 21354 38605 30836 24974 28091 12959 22770 37656 14077 42300 27646 18354 39306
5770 39306 31063 31141 27241 30847 33888 38227 35471 41847 44607 38097 28794 44939 42237 45615 43456
5755 43456 42516 51715 45824 47723 44710 58568 47552 62336 56922 50947 51088 56616 65515 67324
5741 67324 63427 63688 77188 71307 75542 73565 69900 78975 88032 81208 85076 81359 80221 100468
$$ packed form
5837b442J0425j1349J9253m902j2419J7844k7628J6929J1261q464j9496K8692
5825A7704O837j4295j743k946k598L707J229L129M37o402J3826q265J212q69j0459
5810E04J4114L724M736j2798K5635j6645o699J6524j7757P458P579j0727Q923
5797B4571j0349j836O926Q945j1791K737M339K048N076j1963k862J3447j838q247
5783A9203K151J7251p769n862L117j5132R811J4886k3579K8223j4654r292K0952
5770C9306q243P8l900L606L041M339k756O376K760o510r303J6145k702L378k159
5755D3456r40R199n891J899l013J3858j1016J4784n414n975J41N528Q899J809
5741F7324l897K61J3500n881M235j977l665R075R057o824L868l717j138K0247
$$ plain form
5727 100468 111053 98857 98988 121545 122419 121915 133381 134969 142395 150521 168549 157028 171528
5714 171528 186746 208845 221031 243968 274273 294490 324001 382943 417064 479274 560917 658692
5702 658692 794311 988194 1206857 1469767 1770845 2074231 2346727 2594248 2773902 2854125
5692 2854125 2870990 2783710 2605010 2368040 2116340 1871599 1662213 1471681 1320316 1216476
5682 1216476 1151356 1111275 1114458 1156099 1224674 1302142 1432202 1572014 1763629 1963038 2186087
5671 2186087 2454101 2712332 3018491 3321340 3609868 3877588 4109883 4271677 4401245 4436637
5661 4436637 4387617 4289433 4096894 3888506 3673126 3439752 3209440 3015670 2778746 2608000
5651 2608000 2425416 2254718 2081612 1934035 1799016 1664889 1600449 1519191 1492880 1489830
$$ packed form
5727A00468J0585j2196J31K2557Q74n04J1466J588P426Q126J8028j1521J4500
5714A71528J5218K2099J2186K2937L0305K0217K9511N8942L4121O2210Q1643R7775
5702F58692J35619J93883K18663K62910L01078L03386K72496K47521J79654Q0223
5692B854125J6865q7280j78700k36970k51700k44741k09386j90532j51365j03840
5682A216476o5120m0081L183M1641O8575P7468J30060J39812J91615J99409K23049
5671B186087K68014K58231L06159L02849K88528K67720K32295J61794J29568L5392
5661D436637m9020r8184j92539k08388k15380k33374k30312j93770k36924j70746
5651B608000j82584j70698j73106j47577j35019j34127o4440q1258k6311l050
$$ plain form
5641 1489830 1525609 1605437 1757271 1950987 2209846 2513429 2836592 3113762 3378980 3563255
5631 3563255 3683177 3663357 3544881 3311357 3018724 2698453 2373104 2063499 1800523 1586807
5621 1586807 1392215 1231909 1129696 1021865 947812 896438 840013 801121 763601 728728 698343
5610 698343 702615 656323 650159 637975 652627 647112 658629 670028 695650 712469 728631 756703
5598 756703 780577 786130 789742 775949 769296 766605 741889 718365 688268 668250 631043 619562
5586 619562 584623 554700 531430 513634 509018 505800 517999 495141 508803 538632 555615 592715
5574 592715 644547 663818 717772 785867 839793 888354 934824 962798 992727 1011009 998473 1011210
5562 1011210 982964 947391 900974 870375 808275 751348 698147 651405 603976 566297 530209
$$ packed form
5641A489830L5779P9828J51834J93716K58859L03583L23163K77170K65218J84275
5631C563255J19922j9820j18476k33524k92633l20271l25349l09605k62976k13716
5621A586807j94592j60306j02213j07831p4053n1374n6425l8892l7520l4873l0385
5610F98343M272m6292o164j2184J4652n515J1517J1399K5622J6819J6162K8072
5598G56703K3874N553L612j3793o653k691k4716k3524l0097k0018l7207j1481
5586F19562l4939k9923k3270j7796m616l218J2199k2858J3662K9829J6983L7100
5574E92715N1832J9271N3954O8095N3926M8561M6470K7974K9929J8282j2536J2737
5562A011210k8246l5573m6417l0599o2100n6927n3201m6742m7429l7679l6088
$$ plain form
5551 530209 511525 486540 455892 448242 446180 449344 449881 471012 477546 518769 533199 549404 599848
5538 599848 619945 649838 658802 664586 682305 654790 645353 618852 593408 557820 533956 495428
5526 495428 451239 421208 392066 352683 337566 300466 277045 267592 240712 227720 226178 216423
5514 216423 216844 197912 188740 190328 180912 172397 172051 174004 167091 168294 150714 143814 149549 139773
5500 139773 145499 145652 130304 127414 126805 116125 111157 122019 119740 111222 112906 116512 99612 105554
5486 105554 104379 97111 104436 96444 89323 89682 92932 86839 83312 82146 93870 91072 95132 80699
5472 80699 82126 81703 94418 89803 90400 84944 83195 64690 88451 74965 85908 85330 87217 83094
5458 83094 76415 77603 65607 86802 77992 77586 77509 67433 86369 70813 85160 97188 83096
$$ packed form
5551E30209j8684k4985l0648p650k062L164N37K1131O534M1223J4430J6205N0444
5538E99848K0097K9893Q964N784J7719k7515r437k6501k5444l5588k3864l8528
5526D95428m4189l0031k9142l9383j5117l7100k3421r453k6880j2992j542r755
5514B16423M21j8932r172J588r416q515l46J953o913J203j7580o900N735r776
5500A39773N726J53j5348k890o09j0680m968J0862k279q518J684L606j6900N942
5486A05554j175p268P325p992p121L59L250o093l527j166J1724k798M060j4433
5472H0699J427m23J2715m615N97n456j749j8505K3761j3486J0943n78J887m123
5458H3094o679J188j1996K1195q810m06p7j0076J8936j5556J4347J2028j4092
$$ plain form
5445 83096 75607 89244 78369 82064 72709 73679 90071 78270 86516 82213 89641 86028 94853 98601
5431 98601 100094 107195 99779 113859 106511 125208 122382 132790 153272 158628 158552 183519 200739 206269
5417 206269 228333 256135 283661 323754 342430 383019 401840 434966 470445 504532 524455 550278
5405 550278 569414 595011 621679 616113 633649 647247 640232 642394 652712 671869 659219 684249
5393 684249 688610 707449 729736 782535 786065 817411 881527 930233 985788 1047888 1119503 1175734
5381 1175734 1241437 1296319 1344780 1392625 1425661 1449664 1459449 1474953 1464968 1432780 1428081 1399908
5369 1399908 1355825 1319982 1286021 1238168 1198275 1162313 1129516 1091690 1090159 1056504 1052646 1047305
5357 1047305 1031460 1035679 1046502 1032822 1039930 1040651 1047406 1041325 1036987 1020928 991039 957465 930609
$$ packed form
5445H3096p489J3637j0875L695r355R70J6392j1801Q246m303P428l613Q825L748
5431I8601J493P101p416J4080p348J8697k826J0408K0482N356p6K4967J7220N530
5417B06269K2064K7802K7526M0093J8676M0589J8821L3126L5479L4087J9923K5823
5405E50278J9136K5597K6668n566J7536J3598p015K162J0318J9157j2650K5030
5393F84249M361J8839K2287N2799L530L1346O4116M8706N5555O2100P1615N6231
5381A175734O5703N4882M8461M7845L3036K4003R785J5504r985l2188m699k8173
5369A399908m4083l5843l3961m7853l9893l5962l2797l7826j531l3655l858n341
5357A047305j5845M219J0823j3680P108P21O755o081m338j6059k9889l3574k6856
$$ plain form
5344 930609 902569 872812 838389 781297 744129 704548 643948 604659 568977 536810 490680 468623
5332 468623 443422 414768 401099 379611 347281 349542 336933 322175 289559 295237 283894 268946
5320 268946 261908 272297 238588 221987 227329 211526 219190 212838 204706 197620 196205 178361 179603
5307 179603 176672 177561 170748 165152 158638 161953 148151 148543 150072 130773 139148 137435 132703 130305
5293 130305 118046 119359 107535 107579 102979 110038 106828 113820 104781 97257 92096 100820 98132 98083 94790
5278 94790 82958 83514 86824 83573 83777 93658 78568 71051 69174 79596 81792 64668 77978 66357
5264 66357 72998 65026 71235 59983 63788 73157 62644 55703 64452 39423 49170 56042 50999 54782
5250 54782 59253 49068 48837 54841 50084 37162 42494 32359 40944 48584 51450 37367 37357 41423
$$ packed form
5344I30609k8040k9757l4423n7092l7168l9581o0600l9289l5682l2167m6130k2057
5332D68623k5201k8654j3669k1488l2330K261j2609j4758l2616N678j1343j4948
5320B68946p038J0389l3709j6601N342j5803P664o352q132p086j415j7844J242
5307A79603k931Q89o813n596o514L315j3802L92J529j9299Q375j713m732k398
5293A30305j2259J313j1824M4m600P059l210O992r039p524n161Q724k688m9l293
5278I4790j1832N56L310l251K04R881j5090p517j877J0422K196j7124J3310j1621
5264F6357O641p972O209j1252L805R369j0513o941Q749k5029R747O872n043L783
5250E4782M471j0185k31O004m757j2922N332j0135Q585P640K866j4083j0M066
$$ plain form
5236 41423 42439 32789 45531 33470 40862 42393 31803 32331 20203 32762 28839 28230 34805 30644
5222 30644 25683 19355 36039 35789 39129 29827 9328 36627 29205 23951 29523 24760 12974 28129
5208 28129 26978 34296 34486 32616 25625 30533 32705 28687 25734 29109 36395 29493 32801 22911 27741
5193 27741 27117 30350 26844 34689 28739 20935 31487 22963 28995 27293 42407 16565 28826 26793
5179 26793 40955 21060 18191 30282 20183 32351 27712 22778 24392 46012 38847 41501 37922
5166 37922 36582 24927 35925 36192 43457 43095 51016 30551 44748 44849 50487 55950 54183 46676
5152 46676 60235 76446 66025 67553 69107 66447 68495 65415 90730 86292 74414 97801 91394
5139 91394 102113 108394 110977 115269 119585 130317 135632 136562 143541 163682 192364 191694 201250 235223
$$ packed form
5236D1423J016r650J2742j2061P392J531j0590N28j2128J2559l923o09O575m161
5222C0644m961o328J6684k50L340r302k0499K7299p422n254N572m763j1786J5155
5208B8129j151P318J90j870o991M908K172m018k953L375P286o902L308r890M830
5193B7741o24L233l506P845n950p804J0552q524O032j702J5114k5842J2261k033
5179B6793J4162j9895k869J2091j0099J2168m639m934J614K1620p165K654l579
5166C7922j340j1655J0998K67P265l62P921k0465J4197J01N638N463j767p507
5152D6676J3559J6211j0421J528J554k660K048l080K5315m438j1878K3387o407
5139I1394J0719O281K583M292M316J0732N315R30O979K0141K8682o70R556L3973
$$ plain form
5125 235223 240744 254956 279114 280645 294147 319611 331123 351173 357624 377697 384016 405128
5113 405128 424453 441767 460524 489003 505880 513106 528743 550450 580667 586264 611971 621700
5101 621700 630231 653286 671719 669965 684027 706002 691379 696625 688946 702959 705554 685726 680612
5088 680612 684765 668981 658229 633455 624594 627979 597748 593854 579098 562242 545868 534386
5076 534386 527004 518331 506403 498212 480441 472879 464109 459127 428650 407887 425072 389158 391896
5063 391896 358829 349919 336343 333226 321805 292499 288513 278011 254095 246170 232532 215372
5051 215372 213018 214360 209635 202966 186337 184867 182360 181911 165712 175820 161817 153774 161830 157327
5037 157327 136877 142551 132522 139528 126744 146867 129138 122254 129142 127035 127834 127202 119553 124428
$$ packed form
5125B35223N521J4212K4158J531J3502K5464J1512K0050O451K0073O319K1112
5113D05128J9325J7314J8757K8479J6877P226J5637K1707L0217N597K5707R729
5101F21700Q531K3055J8433j754J4062K1975j4623N246p679J4013K595j9828n114
5088F80612M153j5784j0752k4774q861L385l0231l894j4756j6856j6374j1482
5076E34386p382q673j1928q191j7771p562q770m982l0477k0763J7185l5914K738
5063C91896l3067q910j3576l117j1421k9306l986j0502k3916p925j3638j7160
5051B15372k354J342m725o669j6629j470k507m49j6199J0108j4003q043Q056m503
5037A57327k0450N674j0029P006j2784K0123j7729o884O888k107P99o32p649M875
$$ plain form
5023 124428 118259 111779 128317 106927 118272 113253 115590 121066 123990 127467 133752 149637 152571
5010 152571 159922 182725 193748 202980 239060 229125 228279 235311 235838 237228 229081 222480 207670 206336
4996 206336 196951 194250 182993 181512 182465 181349 198333 187724 195052 213297 208413 225528 244121
4983 244121 275756 290993 321330 357824 381287 425856 461070 490593 507709 534123 540826 550901
4971 550901 548342 530989 523312 497360 465734 438478 418565 395789 373391 359546 351607 337302
4959 337302 347713 337091 337235 345062 352679 373488 393731 410681 464911 501184 525720 573519
4947 573519 604992 632144 658497 698591 700205 698968 698697 685973 662659 613784 593587 538371
4935 538371 501709 464898 449046 409636 381207 368523 357212 360373 340613 338744 362879 357892
$$ packed form
5023A24428o169o480J6538k1390J1345n019K337N476K924L477O285J5885K934
5010A52571P351K2803J1023R232L6080r935q46P032N27J390q147o601j4810j334
4996B06336r385k701j1257j481R53j116J6984j0609P328J8245m884J7115J8593
4983B44121L1635J5237L0337L6494K3463M4569L5214K9523J7116K6414O703J0075
4971E50901k559j7353p677k5952l1626k7256j9913k2776k2398j3845p939j4305
4959C37302J0411j0622J44P827P617K0809K0243J6950N4230L6273K4536M7799
4947E73519L1473K7152K6353M0094J614j237k71j2724k3314m8875k0197n5216
4935E38371l6662l6811j5852l9410k8429j2684j1311L161j9760j869K4135m987
$$ plain form
4923 357892 372309 378322 395357 410186 451875 474134 489071 512433 533349 542741 563545 568576
4911 568576 558523 565195 552083 549642 554216 566575 605784 640977 665658 699475 735376 723603
4899 723603 717403 702566 648102 615304 563170 511187 469592 441776 421100 413131 398878 410812
4887 410812 431354 435031 488792 533858 566661 636320 686651 748038 798857 846805 870944 924391
4875 924391 953208 1012814 1065929 1106936 1154787 1218246 1262531 1293657 1308495 1283573 1261995 1217297
4863 1217297 1160664 1120838 1056542 992441 932685 876264 839445 824228 802736 813190 831205
4852 831205 842384 873109 890654 915540 934031 945684 958803 1034641 1105061 1243635 1384542
4841 1384542 1524155 1653134 1769180 1827251 1863574 1836582 1744463 1635193 1500104 1366077
$$ packed form
4923C57892J4417O013J7035J4829M1689K2259J4937K3362K0916R392K0804N031
4911E68576j0053O672j3112k441M574J2359L9209L5193K4681L3817L5901j1773
4899G23603o200j4837n4464l2798n2134n1983m1595k7816k0676p969j4253J1934
4887D10812K0542L677N3761M5066L2803O9659N0331O1387N0819M7948K4139N3447
4875I24391K8817N9606N3115M1007M7851O3459M4285L1126J4838k4922k1578m4698
4863A217297n6633l9826o4296o4101n9756n6421l6819j5217k1492J0454J8015
4852H31205J1179L0725J7545K4886J8491J1653J3119P5838P0420J38574J40907
4841A384542J39613J28979J16046N8071L6323k6992r2119j09270j35089j34027
$$ plain form
4831 1366077 1276894 1170863 1117596 1064979 1012530 972858 927964 895285 840072 806960 802015
4820 802015 808983 824862 835678 877170 881077 900383 937406 964809 991558 1022797 1042884 1094828
4808 1094828 1127598 1144311 1164207 1175029 1158380 1140152 1082980 1053539 981097 934118 863979
4797 863979 783631 729677 645652 582833 523865 486218 460469 426225 384069 373334 361162 357777
4785 357777 352944 363898 362484 395816 419915 448677 491361 503529 518091 551335 548075 515587
4773 515587 496277 467187 418448 378319 338435 304413 277191 266482 242048 244836 220403 202135
4761 202135 203742 212980 187587 183025 183282 171651 171169 165755 165334 152794 150240 148244 143823 151282
4747 151282 140925 152545 138722 138595 128755 134744 145726 131413 103159 126015 124900 121490 133437
$$ packed form
4831A366077q9183j06031n3267n2617n2449l9672m4894l2679n5213l3112m945
4820H02015O968J5879J0816M1492L907J9306L7023K7403K6749L1239K0087N1944
4808A094828L2770J6713J9896J0822j6649j8228n7172k9441p2442m6979p0139
4797H63979q0348n3954q4025o2819n8968l7647k5749l4244m2156j0735j2172l385
4785C57777m833J0954j414L3332K4099K8762M2684J2168J4562L3244l260l2488
4773E15587j9310k9090m8739m0129l9884l4022k7222j0709k4434K788k4433j8268
4761B02135J607R238k5393m562K57j1631m82n414m21j2540k554j996m421P459
4747A51282j0357J1620j3823j27r840N989J0982j4313k8254K2856j115l410J1947
$$ plain form
4734 133437 116075 120278 142689 124332 112671 113834 116035 118578 113655 118671 114836 107045 113254
4721 113254 109423 108575 121845 115441 125309 123107 131161 117214 117423 127618 112515 136624 142462 152338
4707 152338 141149 154115 161111 149728 166181 167613 163504 177725 180545 171937 192931 195980 190024
4694 190024 200377 205274 209998 216531 223688 231598 229236 233758 229812 236188 250247 250459 257530 280667
4680 280667 301119 314036 324959 347794 358812 394014 431295 468129 498401 532464 575968 603156
4668 603156 643634 675120 703854 744124 771288 788910 824278 877233 899050 954406 1000822 1031816
4656 1031816 1073067 1105153 1140850 1172717 1210158 1227434 1284467 1325021 1362458 1402272 1445784
4645 1445784 1498175 1540913 1558973 1592141 1610207 1610536 1593032 1557475 1521182 1493539 1457506 1414449
$$ packed form
4734A33437j7362M203K2411j8357j1661J163K201K543m923N016l835p791O209
4721A13254l831q48J3270o404R868k202Q054j3947K09J0195j5103K4109N838R876
4707A52338j1189J2966O996j1383J6453J432m109J4221K820q608K0994L049n956
4694A90024J0353M897M724O533P157P910k362M522l946O376J4059K12P071K3137
4680B80667K0452J2917J0923K2835J1018L5202L7281L6834L0272L4063M3504K7188
4668F03156M0478L1486K8734M0270K7164J7622L5368N2955K1817N5356M6416L0994
4656A031816M1251L2086L5697L1867L7441J7276N7033M0554L7437L9814M3512
4645A445784N2391M2738J8060L3168J8066L29j7504l5557l6293k7643l6033m3057
$$ plain form
4633 1414449 1396986 1354712 1317762 1296243 1269177 1236686 1218247 1185486 1140859 1088261 1067931
4622 1067931 1007246 996672 958930 919258 910821 876118 837598 816812 793245 747726 713482 678774
4610 678774 647299 599733 581032 540028 503687 499063 480132 443019 413737 404306 390278 375943
4598 375943 364232 362795 352303 342135 340270 317739 316826 313830 300679 298689 288611 290143 293898
4585 293898 269650 257816 258494 246717 236488 238522 236905 225260 219276 204532 203421 197409 202461
4572 202461 190662 184719 181745 170592 163541 159187 154081 149463 146062 147071 144867 144274 150307 133515
4558 133515 129201 124682 137416 132950 122728 123620 122252 118729 124293 117272 106410 118115 106600
4545 106600 109740 122393 105805 116976 106630 106839 87076 115906 100502 91248 97782 96785 103783
$$ packed form
4633A414449j7463m2274l6950k1519k7066l2491j8439l2761m4627n2598k0330
4622A067931o0685j0574l7742l9672q437l4703l8520k0786k3567m5519l4244l4708
4610F78774l1475m7566j8701m1004l6341m624j8931l7113k9282r431j4028j4335
4598C75943j1711j437j0492j0168j865k2531r13k996j3151j990j0078J532L755
4585B93898k4248j1834O78j1777j0229K034j617j1645n984j4744j111o012N052
4572B02461j1799n943k974j1153p051m354n106m618l401J009k204n93O033j6792
4558A33515m314m519J2734m466j0222Q92j368l523N564p021j0862J1705j1515
4545A06600L140J2653j6588J1171j0346K09j9763K8830j5404r254O534r97O998
$$ plain form
4532 103783 86760 98790 77448 77266 92462 82355 81313 90622 86178 65793 69593 74695 82371
4519 82371 83891 75984 79029 67163 70094 62605 81873 77624 68204 61698 65057 57340 53647 82434
4505 82434 60257 74912 67787 63180 55919 62015 55254 73438 66229 62146 75023 60114 64328
4492 64328 59510 53593 68839 67589 72007 65347 69732 67608 74592 69468 39270 63869 63101 48376
4478 48376 60602 63633 53801 48003 57963 67344 62678 57674 53378 38576 55476 66188 55059
4465 55059 53777 61242 52339 52319 60007 51711 59788 63530 51296 51597 40719 62168 59736 35065
4451 35065 50278 59024 54063 67290 46650 55869 63818 51320 56583 56448 54754 50893 56530 56273
4437 56273 51617 56641 43291 43381 49297 48523 56978 51056 61387 47693 63237 51198 42119 50041
$$ packed form
4532A03783j7023J2030k1342j82J5196j0107j042R309m444k0385L800N102P676
4519H2371J520p907L045j1866K931p489J9268m249r420o506L359p717l693K8787
4505H2434k2177J4655p125m607p261O096o761J8184p209m083J2877j4909M214
4492F4328m818n917J5246j250M418o660M385k124O984n124l0198K4599p68j4725
4478D8376J2226L031r832n798R960R381m666n004m296j4802J6900J0712j1129
4465E5059j282P465q903k0P688q296Q077L742j2234L01j0878K1449k432k4671
4451C5065J5213Q746m961J3227k0640R219P949j2498N263j35j694l861N637k57
4437E6273m656N024j3350R0N916p74Q455n922J0331j3694J5544j2039r079P922
$$ plain form
4423 50041 48629 45111 39601 50272 56340 40102 40293 56762 38290 49122 57983 44006 40822
4410 40822 51997 47213 43962 38129 42180 60207 35742 37403 46497 41321 52802 44107 43444 47487
4396 47487 57691 51109 49179 46005 42507 42766 55983 42843 48381 41225 34116 34197 44979 50377
4382 50377 36400 37711 26995 34501 25387 28872 21175 41646 44001 34809 41832 25924 24052 28847
4368 28847 26455 17631 30285 28504 15381 21636 34247 23280 28115 24594 8716 30464 36936
4355 36936 707 23092 12133 6375 22560 19773 13031 17108 16786 6287 14268 11558 22226
4342 22226 9351 14630 17846 15566 16592 14033 -8124 18018 18265 7096 13632 5469 9584 7066
4328 7066 2710 13890 17640 13820 1537 3703 -4554 12442 2833 -2014 2218 6994 9118 -1594
$$ packed form
4423E0041j412l518n510J0671O068j6238J91J6469j8472J0832Q861j3977l184
4410D0822J1175m784l251n833M051J8027k4465J661R094n176J1481q695o63M043
4396D7487J0204o582j930l174l498K59J3217j3140N538p156p109Q1J0782N398
4382E0377j3977J311j0716P506r114L485p697K0471K355r192P023j5908j872M795
4368B8847k392q824J2654j781j3123O255J2611j0967M835l521j5878K1748O472
4355C6936l6229K2385j0959n758J6185k787o742M077l22j0499P981k710J0668
4342B2226j2875N279L216k280J026k559k2157K6142K47j1169O536q163M115k518
4328G066m356J1180L750l820j2283K166q257J6996r609m847M232M776K124j0712
$$ plain form
4314 -1594 5862 -770 8375 18110 -5729 8172 6216 -4345 8827 5446 381 -725 -4957 689
4300 689 15961 7806 12639 9928 1569 14271 2334 5552 15045 -1496 3885 4643 -1739 15090
4286 15090 12367 12454 13054 16004 11446 15887 24614 20453 6888 10558 11322 11411 5335 13006 9360 8096
4270 8096 -10562 6422 -7176 12243 4630 1027 -2916 -9381 -6396 -911 1632 -7339 13661 -6356
4256 -6356 -3180 10077 -15786 -1014 9823 188 3752 8296 11860 -894 5536 643 -2076 -3082
4242 -3082 6421 10341 -1514 3573 8120 -820 13170 13809 5430 -1428 -6947 -10321 4428 6377
4228 6377 -1087 22836 4534 -2259 -651 291 -9966 -1596 -711 -11505 4678 342 7220 1883
4214 1883 -5218 -1139 -6113 830 8216 8091 -10121 2597 -7619 5162 15868 -5219 22087
$$ packed form
4314a594P456o632R145R735k3839J3901j956j0561J3172l381n065j106m232N646
4300F89J5272q155M833k711q359J2702j1937L218R493j6541N381P58o382J6829
4286A5090k723Q7O00K950m558M441Q727m161j3565L670P64Q9o076P671l646j264
4270H096j8658J6984j3598J9419p613l603l943o465K985N485K543q971K1000k0017
4256f356L176J3257k5863J4772J0837r635L564M544L564j2754O430m893k719j006
4242c082R503L920j1855N087M547q940J3990O39q379o858n519l374J4749J949
4228F377p464K3923j8302o793J608R42j0257Q370Q85j0794J6183m336O878n337
4214A883p101M079m974O943P386j25j8212J2718j0216J2781J0706k1087K7306
$$ plain form
4201 22087 19838 -1973 -2399 -2290 -2116 8985 -3976 -8633 244 -6619 -1804 3829 -8288 1775
4187 1775 -263 -9332 5864 -737 2060 -5796 1476 -4708 -2037 -1784 3228 5502 -6865 -3548 6048
4172 6048 3776 4485 9201 -3473 -7188 -2957 13514 -1882 -11811 3487 10171 -2495 7630 -5810
4158 -5810 -14351 -9348 -11523 -7592 2463 -3752 -16315 -8191 -9094 -5758 -10123 -9659 -13810 -2402 -6346
4143 -6346 -10038 -5759 -11545 -6272 -5832 -6080 -18981 414 -17837 -8083 -2301 -11811 -12343 -8463 -19149
4128 -19149 -14629 -678 -14267 -448 -20163 -2567 4657 875 -20974 2891 -3150 -4410 172
4115 172 -15850 -6441 -13945 -3555 -10923 -7469 -5095 -15148 -8560 -17704 -16545 -14220 -17035 -15625
4101 -15625 -12893 -15622 -2457 -15941 -18320 -1158 -23885 -12867 -6626 -4961 -13294 -411 -8322
$$ packed form
4201B2087k249k1811m26J09J74J1101j2961m657Q877o863M815N633j2117J0063
4187A775k038r069J5196o601K797p856P272o184K671K53N012K274j2367L317R596
4172F048k272P09M716j2674l715M231J6471j5396r929J5298O684j2666J0125j3440
4158e810q541N003k175L931J0055o215j2563Q124r03L336m365M64m151J1408l944
4143f346l692M279n786N273M40k48j2901J9395j8251R754N782r510n32L880j0686
4128a9149M520J3951j3589J3819j9715J7596P224l782k1849K3865o041j260M582
4115A72j6022R409p504J0390p368L454K374j0053O588r144J159K325k815J410
4101a5625K732k729J3165j3484k379J7162k2727J1018O241J665q333J2883p911
$$ plain form
4088 -8322 -9819 -5850 2206 -20588 -19645 -8364 -15703 -8858 -6155 -19518 -15968 -11908 -16729 -15846 -15884
4073 -15884 1391 -26776 -14543 -17137 -9465 -8580 -20316 -10602 -24714 -13131 -25878 -17883 -19930
4060 -19930 -13024 -20282 -22792 -18769 -19057 -8290 -23212 -12677 -20646 -14352 -25131 -6879 -11021 -4522
4046 -4522 -22649 -23398 -25631 -14909 -20907 -21163 -27372 -21534 -13452 -20687 -18493 -24828 -20777 -11533 -15976
4031 -15976 -17884 -27476 -12103 -11866 -17745 -22759 -11569 -23448 -17476 -31163 -31987 -12547 -24319 -20372
4017 -20372 -29971 -12384 -19295 -25096 -19927 -29113 -33539 -1564 -17642 -11874 -10578 -17081 -12687 -19693
4003 -19693 -10683 -21409 -10281 -12155 -21103 -9469 -21240 -28316 -20106 -12109 -18593 -18899 -21706 -15281
3989 -15281 -30428 -28403 -31320 -24456 -18024 -16628 -33429 -18776 -3225 -22786 -32871 -13017 -20877
$$ packed form
4088h322j497L969Q056k2794R43J1281p339O845K703j3363L550M060m821Q83l8
4073a5884J7275k8167J2233k594P672Q85j1736R714j4112J1583j2747P995k047
4060a9930O906p258k510M023k88J0767j4922J0535p969O294j0779J8252m142O499
4046d522j8127p49k233J0722n998k56o209N838Q082p235K194o335M051R244m443
4031a5976j908r592J5373K37n879n014J1190j1879N972j3687q24J9440j1772L947
4017b0372r599J7587o911n801N169r186m426L1975j6078N768J296o503M394p006
4003a9693R010j0726J1128j874q948J1634j1771p076Q210P997o484l06k807O425
3989a5281j5147K025k917O864O432J396j6801J4653J5551j9561j0085J9854p860
$$ plain form
3976 -20877 -29392 -22583 -28156 -24646 -20588 -32547 -29156 -25304 -28726 -35121 -40768 -15814 -24685 -28448
3962 -28448 -23533 -26475 -34321 -27671 -18727 -22519 -19210 -14169 -16090 -28419 -28281 -32279 -26223 -26025 -24541
3947 -24541 -27618 -8131 -28738 -33929 -26398 -6915 -33143 -30681 -35522 -21215 -10628 -24008 -20680
3934 -20680 -28607 -22245 -16874 -34667 -31457 -29887 -21331 -28117 -18785 -23039 -33386 -18358 -26460 -34099
3920 -34099 -5917 -19215 -22526 -23948 -33535 -13904 -10612 -16414 -19205 -19414 -21734 -29983 -18555 -24722
3906 -24722 -22687 -19837 -22046 -12656 -27779 -19862 -27336 -24845 -27763 -29973 -29518 -38266 -27250 -29960
3892 -29960 -33578 -32392 -33535 -33016 -24713 -32418 -37415 -22172 -22155 -27592 -29714 -36922 -36490 -22964 -16876
3877 -16876 -21477 -39590 -20643 -27286 -39190 -32013 -33358 -26578 -21484 -26305 -28326 -17184 -16373 -49617
$$ packed form
3976b0877q515O809n573L510M058j1959L391L852l422o395n647K4954q871l763
3962b8448M915k942p846O650Q944l792L309N041j921j2329J38l998O056J98J484
3947b4541l077J9487k0607n191P531J9483k6228K462m841J4307J0587j3380L328
3934b0680p927O362N371j7793L210J570Q556o786R332m254j0347J5028q102p639
3920c4099K8182j3298l311j422r587J9631L292n802k791k09k320q249J1428o167
3906b4722K035K850k209R390j5123P917p474K491k918k210M55q748J1016k710
3892b9960l618J186j143N19Q303p705m997J5243J7n437k122p208M32J3526O088
3877a6876m601j8113J8947o643j1904P177j345O780N094m821k021J1142Q11l3244
$$ plain form
3863 -49617 -31380 -19150 -19979 -23211 -30971 -20623 -15837 -28133 -29956 -18297 -30866 -21610 -27357
3850 -27357 -30593 -25447 -34159 -29088 -22855 -33288 -36707 -29049 -28023 -39468 -27888 -25275 -26578 -18769
3836 -18769 -19833 -18746 -15678 -30674 -21031 -35561 -32172 -23728 -25122 -31098 -22747 -40278 -25200 -22072
3822 -22072 -21573 -9475 -18595 -22124 -37880 -11635 -32594 -25540 -36344 -33577 -24214 -26826 -28507 -18151
3808 -18151 -14475 -33761 -27760 -26216 -33342 -34518 -29545 -28918 -26697 -34731 -32430 -33291 -36675 -23629 -27496
3793 -27496 -29419 -22011 -33644 -36496 -36002 -37172 -33512 -16645 -17455 -33387 -32091 -29055 -28414 -29548 -40930
3778 -40930 -31846 -25468 -23483 -27859 -25263 -27373 -15361 -30799 -23430 -26467 -27230 -25324 -37165 -25515
3764 -25515 -19203 -24727 -22160 -27704 -35301 -25690 -29282 -30364 -22009 -12233 -36181 -40237 -36854 -36104 -37446
$$ packed form
3863d9617J8237J2230q29l232p760J0348M786j2296j823J1659j2569R256n747
3850b7357l236N146q712N071O233j0433l419P658J026j1445J1580K613j303P809
3836a8769j064J087L068j4996R643j4530L389Q444j394n976Q351j7531J5078L128
3822b2072M99J2098r120l529j5756K6245k0959P054j0804K767R363k612j681J0356
3808a8151L676j9286O001J544p126j176M973O27K221q034K301q61l384J3046l867
3793b7496j923P408j1633k852M94j170L660J6867q10j5932J296L036O41j134j1382
3778d0930R084O378J985m376K596k110J2012j5438P369l037p63J906j1841J1650
3764b5515O312n524K567n544p597R611l592j082Q355R776k3948m056L383P50j342
$$ plain form
3749 -37446 -20122 -22106 -33339 -20292 -38746 -34924 -28126 -21911 -28244 -29913 -29907 -27570 -19652 -25658
3735 -25658 -26261 -23787 -13144 -22552 -39992 -27765 -34008 -33317 -25712 -27371 -34860 -21499 -23897 -30738
3721 -30738 -42157 -36857 -37215 -37848 -20262 -26601 -22375 -39284 -34696 -24915 -26630 -34524 -19122 -19985
3707 -19985 -30507 -32459 -35109 -36009 -31710 -36380 -11459 -36583 -35648 -30592 -31239 -24398 -26346 -21479 -32741
3692 -32741 -28013 -34105 -39729 -19089 -17196 -32922 -38928 -21128 -19598 -31795 -35024 -26223 -36659
3679 -36659 -22581 -30140 -26334 -33864 -25572 -36423 -36298 -26417 -30311 -26739 -28878 -32865 -36165 -19666
3665 -19666 -38997 -24075 -19353 -31160 -30257 -22309 -40584 -26767 -20863 -24167 -30156 -21496 -29905 -25956
3651 -25956 -23075 -27970 -23938 -40169 -22059 -27950 -28091 -35612 -35097 -38098 -14585 -34842 -29460 -34072
$$ packed form
3749c7446J7324j984j1233J3047j8454L822O798O215o333j669OK337P918o006
3735b5658o03K474J0643r408j7440J2227o243O91P605j659p489J3361k398o841
3721c0738j1419N300l58o33J7586o339M226j6909M588R781j715p894J5402q63
3707a9985j0522j952k650r00M299m670K4921k5124R35N056o47O841j948M867j1262
3692c2741M728o092n624K0640J893j5726o006J7800J530j2197l229Q801j0436
3679c6659J4078p559L806p530Q292j0851J25R881l894L572k139l987l300J6499
3665a9666j9331J4922M722j1807R03P948j8275J3817N904l304n989Q660q409L949
3651b5956K881m895M032j6231J8110n891j41p521N15l001K3513k0257N382m612
$$ plain form
3637 -34072 -32114 -35180 -29909 -36576 -34279 -29740 -19223 -36494 -26325 -31079 -40377 -23359 -20909 -33446
3623 -33446 -31585 -35454 -35106 -33826 -21738 -29529 -14278 -32204 -32703 -33073 -28969 -29468 -32960 -27737 -16135
3608 -16135 -28760 -38690 -25126 -33312 -36198 -22976 -18658 -39379 -38776 -29785 -30993 -28614 -29352 -45602
3594 -45602 -29973 -33714 -31128 -18920 -35422 -32405 -24379 -38826 -34162 -26282 -15336 -19857 -31098
3581 -31098 -33052 -27070 -39365 -29604 -40301 -34265 -35949 -24993 -28295 -32263 -33294 -33466 -39048 -18569
3567 -18569 -37636 -36625 -19956 -18376 -31962 -29801 -14325 -39538 -30615 -18198 -29860 -22628 -40575
3554 -40575 -20641 -37352 -33602 -37431 -30369 -24284 -22777 -25673 -32112 -26701 -34851 -29489 -24569 -37138
3540 -37138 -44615 -29247 -40305 -41639 -33265 -29898 -24688 -27679 -35620 -30747 -17921 -28177 -36583 -37374
$$ packed form
3637c4072J958l066N271o667K297M539J0517j7271J0169m754r298J7018K450j2537
3623c3446J861l869L48J280J2088p791J5251j7926m99l70M104m99l492N223J1602
3608a6135j2625r930J3564q186k886J3222M318k0721O03Q991j208K379p38j6250
3594d5602J5629l741K586J2208j6502L017Q026j4447M664P880J0946m521j1241
3581c1098j954N982j2295R761j0697O036j684J0956l302l968j031j72n582K0479
3567a8569j9067J011J6669J580j3586K161J5476k5213Q923J2417j1662P232j7947
3554d0575J9934j6711L750l829P062O085J507k896o439N411q150N362M920j2569
3540c7138p477J5368j1058j334Q374L367N210k991p941M873J2826j0256q406p91
$$ plain form
3526 -37374 -24379 -37761 -40823 -31209 -32024 -31452 -34279 -28871 -29090 -23326 -26774 -23453 -32768 -28185 -33088
3511 -33088 -38810 -23576 -35032 -33559 -31040 -28998 -29161 -33972 -22710 -34583 -25151 -23048 -30112 -37196
3497 -37196 -34044 -31745 -29904 -36874 -29561 -30237 -26082 -38537 -38211 -38046 -21773 -22966 -32444 -31585 -42817
3482 -42817 -34312 -30300 -41923 -35159 -38741 -39268 -26847 -13121 -26033 -34885 -27554 -37147 -24514 -41417
3468 -41417 -27940 -38991 -29397 -27243 -30541 -22566 -25544 -19603 -21311 -22981 -24403 -38674 -32060 -30278
3454 -30278 -39657 -27796 -31448 -38351 -29807 -13590 -29521 -35258 -26755 -29087 -26110 -13107 -31790
3441 -31790 -14688 -23493 -21762 -36115 -27208 -30030 -36493 -32277 -20250 -30465 -30358 -28832 -17559 -31030
3427 -31030 -29268 -22229 -21118 -32110 -23898 -43930 -32606 -29366 -33487 -28668 -29251 -28530 -33069 -32567 -45972
$$ packed form
3526c7374J2995j3382l062R614q15N72k827N408k19N764l448L321r315M583m903
3511c3088n722J5234j1456J473K519K042j63m811J1262j1873R432K103p064p084
3497c7196L152K299J841o970P313o76M155j2455L26J65J6273j193r478Q59j1232
3482d2817Q505M012j1623O764l582n27J2421J3726j2912q852P331r593J2633j6903
3468d1417J3477j1051R594K154l298P975k978N941j708j670j422j4271O614J782
3454c0278r379J1861l652o903Q544J6217j5931n737Q503k332K977J3003j8683
3441c1790J7102q805J731j4353Q907k822o463M216J2027j0215J07J526J1273j3471
3427c1030J762P039J111j0992Q212k0032J1324L240m121M819n83P21m539N02j3405
$$ plain form
3412 -45972 -30342 -27460 -36252 -43578 -35275 -33496 -26144 -30049 -34331 -16266 -40878 -16753 -23727 -20387
$$ packed form
3412d5972J5630K882q792p326Q303J779P352l905m282J8065k4612K4125o974L340
$$ [...]
##END NTUPLES=NMR SPECTRUM
##END=
