##TITLE=abcd
##JCAMPDX= 6.0         $$ Bruker NMR JCAMP-DX V2.0
##DATA TYPE= NMR SPECTRUM
##DATA CLASS= NTUPLES
##ORIGIN= UXNMR, Bruker Analytische Messtechnik GmbH
##OWNER= root
$$ XWIN-NMR		Version 3.5
$$ Tue Aug 18 15:46:57 2026 Russian Standard Time (UT+4h)  servis@DPX200
##.OBSERVE FREQUENCY= 200.131235884673
##.OBSERVE NUCLEUS= ^1H
##.ACQUISITION MODE= SIMULTANEOUS
##.ACQUISITION SCHEME= undefined
##.AVERAGES= 32
##.DIGITISER RES= 18
##SPECTROMETER/DATA SYSTEM= spect
##.PULSE SEQUENCE= zg
##.SOLVENT NAME= CDCl3
##.SHIFT REFERENCE= (INTERNAL, CDCl3, 0, 16.4885)
##AUDIT TRAIL= $$ (NUMBER, WHEN, WHO, WHERE, WHAT)
$$ ##TITLE= Audit trail, XWIN-NMR		Version 3.5
$$ ##JCAMPDX= 5.01
$$ ##ORIGIN= Bruker BioSpin GmbH
$$ ##OWNER= servis
$$ F:\spectra/data/av/nmr/H1/1/pdata/1/auditp.txt
$$ ##AUDIT TRAIL=  $$ (NUMBER, WHEN, WHO, WHERE, WHAT)
(   1,<2026-08-18 15:46:10.48 +0400>,<servis>,<DPX200>,
      <created by zg, POWCHK disabled, PULCHK disabled
       configuration hash MD5:
       00 E9 B6 7A A2 85 ED C7 34 08 36 98 17 FE 4E 26
       data hash MD5: 32K
       76 96 A4 58 52 3D E2 32 D2 12 DF FB 82 79 45 F5>)
(   2,<2026-08-18 15:46:20.23 +0400>,<servis>,<DPX200>,
      <Start of raw data processing
       efp BC_mod = 2 LB = 0.05 FT_mod = 6 PKNL = 1 PHC0 = -417.9518 PHC1 = 3.101563 SI = 16K 
       data hash MD5: 16K
       19 09 AC B8 C4 81 62 5D 2B 79 98 59 85 78 58 CC>)
(   3,<2026-08-18 15:46:34.45 +0400>,<servis>,<DPX200>,
      <pk PHC0 = 2 PHC1 = 0 
       data hash MD5: 16K
       39 61 A9 0E E1 6D A5 9E 5C 54 6C 06 59 A8 AB 72>)
$$ ##END=
$$ 
$$ hash MD5
$$ 8F 72 1A 04 7D B3 E7 20 95 E9 EF 85 7B B9 66 A0
##$RELAX= 
##$RELAX= 
##$RELAX= 
##$RELAX= 
##$RELAX= 
##$RELAX= 
##$RELAX= 
##$RELAX= 
$$ Bruker specific parameters
$$ --------------------------
##$DU= <F:\spectra>
##$EXPNO= 1
##$NAME= <H1>
##$PROCNO= 1
##$TYPE= <nmr>
##$USER= <av>
##$AMP= (0..31)
100 100 100 100 100 100 100 100 100 100 100 100 100 100 100 100 100 100 
100 100 100 100 100 100 100 100 100 100 100 100 100 100 
##$AQSEQ= 0
##$AQ_mod= 1
##$AUNM= <au_zg>
##$AUTOPOS= <>
##$BF1= 200.13
##$BF2= 200.13
##$BF3= 200.13
##$BF4= 200.13
##$BF5= 500.13
##$BF6= 500.13
##$BF7= 500.13
##$BF8= 500.13
##$BYTORDA= 1
##$CFDGTYP= 0
##$CFRGTYP= 5
##$CHEMSTR= <none>
##$CNST= (0..31)
1 1 145 1 1 1 1 1 1 1 1 1 1 1 1 1 1 1 1 1 1 1 1 1 1 1 1 1 1 1 1 1 
##$CPDPRG= <>
##$CPDPRG1= <>
##$CPDPRG2= <>
##$CPDPRG3= <>
##$CPDPRG4= <mlev>
##$CPDPRG5= <mlev>
##$CPDPRG6= <mlev>
##$CPDPRG7= <mlev>
##$CPDPRG8= <mlev>
##$CPDPRGB= <>
##$CPDPRGT= <>
##$D= (0..31)
0 2 0 0 0 0 0 0 0 0.06 0 0 0 0 0 0 0.0002 0 0 0 0 0 0 0 0 0 0 0 0 0 0 
0 
##$DATE= 1787053570
##$DBL= (0..7)
120 120 120 120 120 120 120 120 
##$DBP= (0..7)
150 150 150 150 150 150 150 150 
##$DBP07= 0
##$DBPNAM0= <>
##$DBPNAM1= <>
##$DBPNAM2= <>
##$DBPNAM3= <>
##$DBPNAM4= <>
##$DBPNAM5= <>
##$DBPNAM6= <>
##$DBPNAM7= <>
##$DBPOAL= (0..7)
0.5 0.5 0.5 0.5 0.5 0.5 0.5 0.5 
##$DBPOFFS= (0..7)
0 0 0 0 0 0 0 0 
##$DE= 6
##$DECBNUC= <off>
##$DECIM= 32
$$ [...]
##$SUBNAM4= <"">
##$SUBNAM5= <"">
##$SUBNAM6= <"">
##$SUBNAM7= <"">
##$SUBNAM8= <"">
##$SUBNAM9= <"">
##$SW= 20.6817932712277
##$SWIBOX= (0..15)
0 0 3 0 0 0 0 0 0 0 0 0 0 0 0 0 
##$SW_h= 4139.07284768212
##$TD= 32768
##$TD0= 1
##$TE= 0
##$TE2= 300
##$TE3= 300
##$TEG= 300
##$TL= (0..7)
0 120 120 120 120 120 120 120 
##$TP= (0..7)
150 150 150 150 150 150 150 150 
##$TP07= 0
##$TPNAME0= <>
##$TPNAME1= <>
##$TPNAME2= <>
##$TPNAME3= <>
##$TPNAME4= <>
##$TPNAME5= <>
##$TPNAME6= <>
##$TPNAME7= <>
##$TPOAL= (0..7)
0.5 0.5 0.5 0.5 0.5 0.5 0.5 0.5 
##$TPOFFS= (0..7)
0 0 0 0 0 0 0 0 
##$TUNHIN= 0
##$TUNHOUT= 0
##$TUNXOUT= 0
##$USERA1= <user>
##$USERA2= <user>
##$USERA3= <user>
##$USERA4= <user>
##$USERA5= <user>
##$V9= 5
##$VALIST= <valist>
##$VCLIST= <CCCCCCCCCCCCCCC>
##$VD= 0
##$VDLIST= <DDDDDDDDDDDDDDD>
##$VPLIST= <PPPPPPPPPPPPPPP>
##$VTLIST= <TTTTTTTTTTTTTTT>
##$WBST= 1024
##$WBSW= 30
##$XGAIN= (0..3)
0 0 0 0 
##$XL= 0
##$YL= 0
##$YMAX_a= 608773
##$YMIN_a= -1016164
##$ZGOPTNS= <>
##$ZL1= 120
##$ZL2= 120
##$ZL3= 120
##$ZL4= 120
##$ABSF1= 0
##$ABSF2= 0
##$ABSG= 0
##$ABSL= 0
##$ALPHA= 0
##$AQORDER= 0
##$ASSFAC= 0
##$ASSFACI= 0
##$ASSFACX= 0
##$ASSWID= 0
##$AUNMP= <proc_1d>
##$AZFE= 0.1
##$AZFW= 0.1
##$BCFW= 0
##$BC_mod= 2
##$BYTORDP= 0
##$COROFFS= 0
##$CY= 18.4799938201904
##$DATMOD= 1
##$DC= 0
##$DFILT= <>
##$DTYPP= 0
##$F1P= 9.9274215381318
##$F2P= -0.165520771350173
##$FCOR= 1
##$FTSIZE= 16384
##$FT_mod= 6
##$GAMMA= 0
##$GB= 0
##$INTBC= 1
##$INTSCL= 4.127829e-11
##$ISEN= 128
##$LB= 0.05
##$LEV0= 0
##$LPBIN= 0
##$MAXI= 10000
##$MC2= 0
##$MEAN= 0
##$ME_mod= 0
##$MI= 50
##$NCOEF= 0
##$NC_proc= -5
##$NLEV= 6
##$NOISF1= 3.799351
##$NOISF2= 2.8
##$NSP= 0
##$NTH_PI= 0
##$NZP= 0
##$OFFSET= 16.48848
##$PC= 4
##$PHC0= -415.9518
##$PHC1= 3.101563
##$PH_mod= 1
##$PKNL= yes
##$PPARMOD= 0
##$PSCAL= 4
##$PSIGN= 0
##$REVERSE= no
##$SF= 200.130005582386
##$SI= 16384
##$SIGF1= 3
##$SIGF2= 2
##$SINO= 400
##$SIOLD= 16384
##$SREGLST= <1H.CDCl3>
##$SSB= 0
##$STSI= 16384
##$STSR= 0
##$SW_p= 4139.07284768211
##$SYMM= 0
##$S_DEV= 0
##$TDeff= 32768
##$TDoff= 0
##$TI= <>
##$TILT= no
##$TM1= 0
##$TM2= 0
##$TOPLEV= 0
##$USERP1= <user>
##$USERP2= <user>
##$USERP3= <user>
##$USERP4= <user>
##$USERP5= <user>
##$WDW= 1
##$XDIM= 16384
##$YMAX_p= 374576987
##$YMIN_p= -733826
$$ End of Bruker specific parameters
$$ ---------------------------------
##NTUPLES= NMR SPECTRUM
##VAR_NAME=  FREQUENCY,     SPECTRUM/REAL,   SPECTRUM/IMAG
##SYMBOL=    X,             R,               I
##VAR_TYPE=  INDEPENDENT,   DEPENDENT,       DEPENDENT
##VAR_FORM=  AFFN,          ASDF,            ASDF
##VAR_DIM=   16384,         16384,           16384
##UNITS=     HZ,            ARBITRARY UNITS, ARBITRARY UNITS
##FACTOR=    0.252644378177508, 1,           1
##FIRST=     3299.83951724647, 0,            0
##LAST=      -839.233330435636, 0,           0
##MIN=       -839.233330435636, -733826,     0
##MAX=       3299.83951724647, 374576987,    0
$$ Real data points
##PAGE= N=1
##DATA TABLE= (X++(R..R)), XYDATA
$$ [...]
$$ plain form
7081 2340601 2453722 2320608 2267743 2293190 2206422 2333342 2208368 2137165 2283364 2240119
7071 2240119 2254942 2294660 2246803 2352960 2295522 2386120 2420171 2393177 2487916 2499152 2568745
7060 2568745 2557123 2552858 2629252 2692684 2734933 2699684 2818437 2729951 3042069 3083682 3104433
7049 3104433 3220080 3278957 3327843 3548418 3613619 3672084 3826656 3824727 3987374 4104002 4125273
7038 4125273 4368228 4559916 4716256 4922188 5218201 5569672 6030606 6351905 6995231 7673366
7028 7673366 8476900 9517073 10664522 12271573 14290593 17027831 20326556 24307836
7020 24307836 28368582 32214490 35174236 36778491 37020723 35745582 33439971 30376362
7012 30376362 26930292 23404682 20175770 17178434 14794390 12915310 11280341 10079223
$$ packed form
7081B340601J13121j33114n2865K5447q6768J26920j24974p1203J46199m3245
7071B240119J4823L9718m7857J06157n7438R0598L4051k6994R4739J1236O9593
7060B568745j1622m265P6394O3432M2249l5249J18753q8486L12118M1613K0751
7049C104433J15647N8877M8886K20575O5201N8465J54572j929J62647J16628K1271
7038D125273K42955J91688J56340K05932K96013L51471M60934L21299O43326O78135
7028G673366Q03534J040173J147449J607051K019020K737238L298725L981280
7020B4307836M060746L845908K959746J604255K42232j275141k305611l063609
7012C0376362l446070l525610l228912k997336k384044j879080j634969j201118
$$ plain form
7004 10079223 8927757 8163650 7468963 6823928 6318455 5914201 5582978 5381230 5004474
6995 5004474 4898526 4584531 4555184 4461217 4348813 4291736 4152617 4020504 4018882 4113627 3980890
6984 3980890 3994055 3908673 3960114 3890221 3959908 3963773 3930984 4015436 4122060 4220587 4386404
6973 4386404 4433929 4798251 4962159 5462291 6043872 7111387 8085958 8869991 9358964 9436052
6963 9436052 9200006 8761152 7993915 7403222 6740188 6191178 5889682 5546354 5505982 5339542
6953 5339542 5311149 5361945 5358025 5378180 5542323 5802802 6057636 6429206 6728538 7427660
6943 7427660 8140011 9236116 11376490 14238699 17929138 20822587 22297712 22394871 21716164
6934 21716164 20021431 17931551 15602749 13506297 11727350 10224896 8865322 8088199
$$ packed form
7004A0079223j151466p64107o94687o45035n05473m04254l31223k01748l76756
6995E004474j05948l13995k9347r3967j12404n7077j39119j32113j622R4745j32737
6984C980890J3165q5382N1441o9893O9687L865l2789Q4452J06624R8527J65817
6973D386404M7525L64322J63908N00132N81581J067515R74571P84033M88973P7088
6963I436052k36046m38854p67237n90693o63034n49010l01496l43328m0372j66440
6953E339542k8393N0796l920K0155J64143K60479K54834L71570K99332O99122
6943G427660P12351J096105K140374K862209L690439K893449J475125R7159o78707
6934B1716164j694733k089880k328802k096452j778947j502454j359574p77123
$$ plain form
6926 8088199 7600155 7002839 6923385 6619243 6466847 6392184 6422994 6542376 6697143 6973335
6916 6973335 7411004 8057166 9330474 11229026 13972492 17639969 20790721 22549311 22933227
6907 22933227 22204794 20732469 18590799 16018976 13758281 11736276 9961453 8552846
6899 8552846 7586039 6955324 6426966 5958484 5794488 5445569 5311611 5208060 5233800 5049809
6889 5049809 5111714 5247900 5413884 5703212 6275167 7026503 7976227 9012503 9541683 9585080
6879 9585080 9438265 8968944 8289504 7467682 6686273 6039448 5440288 4963134 4655478 4462372
6869 4462372 4254619 4055802 3980523 4037053 3852684 3734684 3796725 3654137 3546130 3488915
6859 3488915 3475464 3436420 3456387 3551427 3534716 3610907 3595780 3577520 3549786 3459348 3469487
$$ packed form
6926H088199m88044n97316p9454l04142j52396p4663L0810J19382J54767K76192
6916F973335M37669O46162J273308J898552K743466L667477L150752J758590L83916
6907B2933227p28433j472325k141670k571823k260695k022005j774823j408607
6899H552846r66807o30715n28358m68482j63996l48919j33958j03551K5740j83991
6889E049809O1905J36186J65984K89328N71955P51336R49724J036276N29180M3397
6879I585080j46815m69321o79440q21822p81409o46825n99160m77154l07656j93106
6869D462372k07753j98817p5279N6530j84369j18000O2041j42588j08007n7215
6859C488915j3451l9044J9967R5040j6711P6191j5127j8260k7734r0438J0139
$$ plain form
6848 3469487 3419212 3338753 3290090 3256233 3123114 3102524 2963377 2933282 2809587 2796492 2775381
6837 2775381 2764231 2623588 2732311 2606398 2710419 2614613 2456695 2648236 2756332 2523718
6827 2523718 2675681 2666430 2507908 2649279 2614288 2483428 2610164 2473822 2431393 2357411
6817 2357411 2342797 2324473 2306287 2118840 2266741 2171855 2147950 2271385 2198976 2250451 2383450
6806 2383450 2376263 2552150 2734479 2968041 3093001 3295935 3515411 3486896 3272019 3239507
6796 3239507 3151815 2999385 2925406 2798753 2758828 2585406 2493498 2479241 2298215 2175845
6786 2175845 2216555 2160019 2075852 1992362 2026977 1994828 1977683 1952220 1922656 1983344 1978738 2036278
6774 2036278 1898356 1966996 1940127 1961496 1916263 1965236 1982276 1995095 2178824 2142347 2263462
$$ packed form
6848C469487n0275q0459m8663l3857j33119k0590j39147l0095j23695j3095k1111
6837B775381j1150j40643J08723j25913J04021r5806j57918J91541J08096k32614
6827B523718J51963r251j58522J41371l4991j30860J26736j36342m2429p3982
6817B357411j4614j8324j8186j87447J47901r4886k3905J23435p2409N1475J32999
6806B383450p187J75887J82329K33562J24960K02934K19476k8515k14877l2512
6796C239507q7692j52430p3979j26653l9925j73422r1908j4257j81026j22370
6786B175845M0710n6536q4167q3490L4615l2149j7145k5463k9564O0688m606N7540
6774B036278j37922O8640k6869K1369m5233M8973J7040J2819J83729l6477J21115
$$ plain form
6763 2263462 2321825 2333447 2325893 2282392 2133834 2216664 2061656 2094156 1929937 1857565 1971880
6752 1971880 1681871 1750226 1862018 1635484 1676890 1714191 1737835 1668370 1792111 1820962 1833953
6741 1833953 1867882 1831878 1935189 1909308 1812711 2001565 2064975 1965139 2129795 2070309 2194928
6730 2194928 2296167 2293007 2218767 2354006 2153165 2301883 2410768 2421892 2591308 2917596
6720 2917596 2961521 3050739 3014973 2814566 2795653 2658294 2418069 2284745 2111879 2048113
6710 2048113 2063001 1939172 2010368 1898764 1944067 2029564 2076714 2149716 2245881 2217528 2324361
6699 2324361 2495137 2735219 2903928 3237626 3556667 4273282 4969459 5772462 5894200 5961630
6689 5961630 5776061 5197535 4785178 4250436 3744123 3398196 3005967 2717665 2579840 2415557
$$ packed form
6763B263462N8363J1622p554m3501j48558Q2830j55008L2500j64219p2372J14315
6752A971880k90009O8355J11792k26534M1406L7301K3644o9465J23741K8851J2991
6741A833953L3929l6004J03311k5881r6597J88854O3410r9836J64656n9486J24619
6730B194928J01239l160p4240J35239k00841J48718J08885J1124J69416L26288
6720B917596M3925Q9218l5766k00407j8913j37359k40225j33324j72866o3766
6710B048113J4888j23829P1196j11604M5303Q5497M7150P3002R6165k8353J06833
6699B324361J70776K40082J68709L33698L19041P16615O96177Q03003J21738O7430
6689E961630j85569n78526m12357n34742n06313l45927l92229k88302j37825j64283
$$ plain form
6679 2415557 2373458 2258222 2283314 2197244 2247281 2137118 2260484 2284907 2423790 2526320
6669 2526320 2656550 2973039 3251118 4091203 4910915 5620231 5957951 5943928 5832859 5453087
6659 5453087 4880879 4304026 3922709 3552741 3091892 2739505 2723358 2549742 2445134 2372606
6649 2372606 2201349 2200609 2262223 2139691 2215050 2233481 2182374 2291122 2442648 2502477 2724578
6638 2724578 2850529 3186331 3300390 3313652 3486120 3431605 3348064 3154236 3036857 2771338
6628 2771338 2733717 2604419 2490090 2496067 2409991 2485560 2459598 2281031 2322433 2286519 2148178
6617 2148178 2271909 2235408 2173784 2377989 2387829 2496922 2528488 2620912 2592765 2587546 2619058
6606 2619058 2710219 2580634 2700405 2934085 2782680 3026013 3132934 3303456 3744350 3829507
$$ packed form
6679B415557m2099j15236K5092q6070N0037j10163J23366K4423J38883J02530
6669B526320J30230L16489K78079Q40085Q19712P09316L37720j4023j11069l79772
6659E453087n72208n76853l81317l69968m60849l52387j6147j73616j04608p2528
6649B372606j71257p40O1614j22532P5359J8431n1107J08748J51526N9829K22101
6638B724578J25951L35802J14059J3262J72468n4515q3541j93828j17379k65519
6628B771338l7621j29298j14329N977q6076P5569k5962j78567M1402l5914j38341
6617B148178J23731l6501o1624K04205R840J09093L1566R2424k8147n219L1512
6606B619058R1161j29585J19771K33680j51405K43333J06921J70522M40894Q5157
$$ plain form
6596 3829507 4096876 4395032 4422594 4383842 4481573 4400090 4293227 4100359 4057137 3857970
6586 3857970 3798023 3682170 3558651 3654221 3707581 3614529 3585665 3575611 3482883 3487097 3617728
6575 3617728 3437893 3393836 3486386 3413603 3392605 3387825 3456992 3587755 3510823 3570109 3430917
6564 3430917 3385877 3379599 3232880 3236960 3251529 3218166 3156747 3364206 3387045 3691849 4056937
6553 4056937 4671039 5320886 5910212 6159887 6262728 6259003 6002084 5536407 5100138 4607973
6543 4607973 4243507 3929585 3642070 3558714 3353021 3274978 3240160 3121687 3014552 3034578
6533 3034578 2987906 3104252 3001101 2907695 3013706 3014262 2942572 3094282 3016220 3069935 3120911
6522 3120911 3149013 3269235 3195733 3065861 3161367 3151523 3054711 3082265 3110296 3096746 3228362
$$ packed form
6596C829507K67369K98156K7562l8752R7731q1483j06863j92868m3222j99167
6586C857970n9947j15853j23519R5570N3360r3052k8864j0054r2728M214J30631
6575C617728j79835m4057R2550p2783k0998m780O9167J30763p6932N9286j39192
6564C430917m5040o278j46719M080J4569l3363o1419K07459K2839L04804L65088
6553D056937O14102O49847N89326K49675J02841l725k56919m65677m36269m92165
6543D607973l64466l13922k87515q3356k05693p8043l4818j18473j07135K0026
6533C034578m6672J16346j03151r3406J06011N56p1690J51710p8062N3715N0976
6522C120911K8102J20222p3502j29872R5506r844r6812K7554K8031j3550J31616
$$ plain form
6511 3228362 3247982 3401610 3319584 3243882 3388096 3490569 3465640 3604909 3630765 3658400 3818394
6500 3818394 3863352 3894740 4103001 4063639 4244647 4373756 4408519 4684824 4750538 4748669 4976696
6489 4976696 5032650 5029500 5229655 5235371 5293452 5289521 5256877 5222083 5302370 5158727 5291821
6478 5291821 5250536 5206899 5240738 5212878 5280065 5221928 5151894 5231235 5311531 5230986 5231793 5328270
6466 5328270 5367182 5365041 5498707 5435677 5621548 5694089 5699134 5774072 5834831 6008120 6056552
6455 6056552 6297477 6410103 6663580 6705726 7070803 7292593 7519498 7837725 8144795 8479771
6445 8479771 8801725 9389237 9961094 10700060 11610725 12369502 12835099 13018985 12926965 12552420
6435 12552420 12056130 11355247 10989626 10347171 9920030 9654707 9420911 9332478 9266803 9091808
$$ packed form
6511C228362J9620J53628q2026p5702J44214J02473k4929J39269K5856K7635J59994
6500C818394M4958L1388K08261l9362J81008J29109L4763K76305O5714j869K28027
6489D976696N5954l150K00155N716N8081l931l2644l4794Q0287j43643J33094
6478E291821m1285m3637L3839k7860O7187n8137p0034P9341Q0296q0545Q07R6477
6466E328270L8912k141J33666o3030J85871P2541N045P4938O0759J73289M8432
6455F056552K40925J12626K53477M2146L65077K21790K26905L18227L07070L34976
6445H479771L21954N87512N71857P38966R10665P58777M65597J83886r2020l74545
6435A2552420m96290p00883l65621o42455m27141k65323k33796q8433o5675j74995
$$ plain form
6425 9091808 9114249 9113039 9207779 9241697 9196156 9292013 9083086 8958862 8775581 8656435 8339865
6414 8339865 8215029 8108825 8119314 8038842 7798190 7769090 7759033 7653604 7671801 7658274 7566777
6403 7566777 7554128 7657057 7663496 7817521 7946568 8052953 8174460 8366009 8512842 8597179
6393 8597179 8875775 9088942 9269879 9616740 9876936 10054571 10468220 10782180 10932506 11408414
6383 11408414 11445457 11823042 12087918 12280581 12553987 12927453 13290308 13691322 14243182 14799173
6373 14799173 15353120 15866408 16418943 16787830 17050733 17305241 17399124 17293963 17286125 17073624
6363 17073624 16835859 16752193 16502857 16307573 16250046 15997733 15755630 15615377 15457401 15278803
6353 15278803 14989216 14688821 14553461 14210878 13954567 13945021 13687495 13714407 13523609 13449504
$$ packed form
6425I091808K2441j210R4740L3918m5541R5857k08927j24224j83281j19146l16570
6414H339865j24836j06204J0489q0472k40652k9100j0057j05429J8197j3527r1497
6403G566777j2649J02929O439J54025J29047J06385J21507J91549J46833Q4337
6393H597179K78596K13167J80937L46861K60196J77635M13649L13960J50326M75908
6383A1408414L7043L77585K64876J92663K73406L73466L62855M01014N51860N55991
6373A4799173N53947N13288N52535L68887K62903K54508R3883j05161p838k12501
6363A7073624k37765q3666k49336j95284n7527k52313k42103j40253j57976j78598
6353A5278803k89587l00395j35360l42583k56311r546k57526K6912j90798p4105
$$ plain form
6343 13449504 13381116 13303512 13259445 13307390 13252662 13272119 13269449 13273150 13318665 13302537 13366804 13378972
6331 13378972 13313008 13325294 13430516 13342259 13263770 13300331 13326792 13290099 13236818 13171490 13357963
6320 13357963 13214359 13314420 13376957 13398885 13468386 13624749 13608190 13660220 13748595 13778767 13762153
6309 13762153 13817524 13825984 13995485 14400289 14532916 14883192 14918462 14792837 14619227 14262084
6299 14262084 13889007 13622220 13335501 13159765 12950241 12754233 12723486 12497609 12430170 12539293
6289 12539293 12358062 12400315 12280859 12263191 12265682 12287343 12282501 12509412 12690357 13192365 14272550
6278 14272550 15676878 17532365 18849568 19497797 20253976 20686782 20728843 20548292 19863674
6269 19863674 19140319 18281741 17209584 16178031 15330132 14386490 13672957 13104411 12663994
$$ packed form
6343A3449504o8388p7604m4067M7945n4728J9457k670L701M5515j6128O4267J2168
6331A3378972o5964J2286J05222q8257p8489L6561K6461l6693n3281o5328J86473
6320A3357963j43604J00061O2537K1928O9501J56363j6559N2030Q8375L0172j6614
6309A3762153N5371Q460J69501M04804J32627L50276L5270j25625j73610l57143
6299A4262084l73077k66787k86719j75736k09524j96008l0747k25877o7439J09123
6289A2539293j81231M2253j19456j7668K491K1661m842K26911J80945N02008J080185
6278A4272550J404328J855487J317203O48229P56179M32806M2061j80551o84618
6269A9863674p23355q58578j072157j031553q47899r43642p13533n68546m40417
$$ plain form
6260 12663994 12270118 12209313 12125944 12213149 12343219 12627954 12975784 13614433 14523908 16147539
6250 16147539 18235708 20691522 22795932 24754497 26719556 28706404 30199560 31129430
6242 31129430 31467582 31161993 30267874 28671925 27057193 24947152 22702574 20950126 19038525
6233 19038525 17317441 16021440 14777830 13975284 13317937 12765748 12546747 12417347 12322132
6224 12322132 12619448 13000429 13767824 14594264 15355237 16236976 17433262 18541601 19493739
6215 19493739 20031641 20156658 19816956 18899647 17894434 16605997 15256634 14202348 13019953
6206 13019953 12075565 11506070 10871145 10515552 10321980 10050846 9876239 9659915 9555378
6197 9555378 9431334 9299362 9104309 9053252 8847532 8863772 8665701 8672550 8727217 8813744 8687249
$$ packed form
6260A2663994l93876o0805q3369Q7205J30070K84735L47830O38649R09475J623631
6250A6147539K088169K455814K104410J958565J965059J986848J493156R29870
6242C1129430L38152l05589q94119j595949j614732k110041k244578j752448j911601
6233A9038525j721084j296001j243610q02546o57347n52189k19001j29400r5215
6224A2322132K97316L80981P67395Q26440P60973Q81739J196286J108339R52138
6215A9493739N37902J25017l39702r17309j005213j288437j349363j054286j182395
6206A3019953r44388n69495o34925l55593j93572k71134j74607k16324j04537
6197I555378j24044j31972j95053n1057k05720J6240j98071O849N4667Q6527j26495
$$ plain form
6186 8687249 8613009 8635269 8560683 8335860 8314484 7916128 7787237 7542048 7388057 7235195
6176 7235195 7265462 7091597 6967850 6880966 6883588 6957064 6871671 6929675 6950838 6999188 7062139
6165 7062139 7113664 7281845 7460123 7585411 7719111 8127850 8415352 8737684 8976273 9035859
6155 9035859 8858340 8771533 8588657 8300322 7983464 7880303 7703977 7536075 7365561 7216941
6145 7216941 7147097 6921431 6863317 6815540 6563325 6464548 6574379 6530207 6468809 6490401 6467111
6134 6467111 6332503 6393525 6198929 6192421 6210006 6159509 6284511 6035132 6209689 6186289 6177639
6123 6177639 6277194 6338621 6234804 6441720 6711414 7247567 7592703 7505091 7519791 7614179
6113 7614179 7222109 7183232 6781405 6538245 6447614 6250361 6129471 5945094 6011631 5904582
$$ packed form
6186H687249p4240K2260p4586k24823k1376l98356j28891k45189j53991j52862
6176G235195L0267j73865j23747q6884K622P3476q5393N8004K1163M8350O2951
6165G062139N1525J68181J78278J25288J33700M08739K87502L22332K38589N9586
6155I035859j77519q6807j82876k88335l16858j03161j76326j67902j70514j48620
6145G216941o9844k25666n8114m7777k52215r8777J09831m4172o1398K1592k3290
6134F467111j34608O1022j94596o508J7585n0497J25002k49379J74557k3400q650
6123F177639R9555O1427j03817K06916K69694N36153L45136q7612J4700R4388
6113G614179l92070l8877m01827k43160r0631j97253j20890j84377O6537j07049
$$ plain form
6103 5904582 5868988 5817800 5860560 5778730 5834006 5991740 5944850 6071336 6155416 6255657 6650528
6092 6650528 7523313 8571044 9888018 10547395 10648974 10637795 10290913 9610700 8857706
6083 8857706 8307790 7698703 7129596 6811043 6471530 6435276 6223430 6104836 6262464 6165101
6073 6165101 6011967 6075630 6148659 6124094 6149307 6076883 6237833 6398056 6803827 7833489
6063 7833489 9074623 10292740 10808283 10750542 10584161 10276636 9396643 8605404 8029967
6054 8029967 7357651 6979605 6737813 6397389 6439472 6320745 6155580 6052753 5907853 5908318
6044 5908318 5835179 5854328 5823679 5683624 5724233 5759935 5833057 5844463 6087622 6563914 6716675
6033 6716675 6920665 6843773 6776957 6463334 6247113 5815790 5626626 5306609 5101606 5153964
$$ packed form
6103E904582l5594n1188M2760q1830N5276J57734m6890J26486Q4080J00241L94871
6092F650528Q72785J047731J316974O59377J01579j1179l46882o80213p52994
6083H857706n49916o09087n69107l18553l39513l6254k11846j18594J57628r7363
6073F165101j53134O3663P3029k4565K5213p2424J60950J60223M05771J029662
6063G833489J241134J218117N15543n7741j66381l07525q79993p91239n75437
6054H029967o72316l78046k41792l40424M2083j18727j65165j02827j44900M65
6044E908318p3139J9149l0649j40055M0609L5702P3122J1406K43159M76292J52761
6033F716675K03990p6892o6816l13623k16221m31323j89164l20017k05003N2358
$$ plain form
6023 5153964 4879240 5004119 5062197 4807817 4846506 4868787 4732742 4839108 4707149 4882819
6013 4882819 4876513 4924362 5020583 5010334 4948211 4931339 4777849 4837505 4852422 4773493 4650992
6002 4650992 4817583 4758407 4768217 4818477 4959128 4902581 4975537 4818541 4949956 4880379 4888197
5991 4888197 4970498 5028655 5005754 4920624 4942850 5063804 5106984 5059170 5028196 5185718 5261308
5980 5261308 5293350 5443573 5377107 5450823 5455613 5498860 5563530 5658119 5738232 5778043 5739701
5969 5739701 5783825 5972113 5942332 6110572 6175824 6203216 6322830 6450417 6538602 6587834 6676445
5958 6676445 6835083 6959327 7103057 7325102 7335627 7700371 8019626 8049238 8329784 8615192
5948 8615192 8798807 9238451 9590088 9914191 10333365 10893742 11376801 12194913 13158054 14521219
$$ packed form
6023E153964k74724J24879N8078k54380L8689K2281j36045J06366j31959J75670
6013D882819o306M7849R6221j0249o2123j6872j53490N9656J4917p8929j22501
6002D650992J66591n9176R810N0260J40651n6547P2956j56996J31415o9577P818
5991D888197Q2301N8157k2901q5130K2226J20954M3180m7814l0974J57522P5590
5980E261308L2042J50223o6466P3716M790M3247O4670R4589Q0113L9811l8342
5969E739701M4124J88288k9781J68240O5252K7392J19614J27587Q8185M9232Q8611
5958F676445J58638J24244J43730K22045J0525L64744L19255K9612K80546K85408
5948H615192J83615M39644L51637L24103M19174N60377M83059Q18112R63141J363165
$$ plain form
5938 14521219 16066040 17707790 19478822 20955605 22093269 22742345 22933601 22808638 22315528
5929 22315528 21841522 21102112 20653344 20069547 19465012 18971606 18674315 18299819 17984505
5920 17984505 17799086 17768811 17863965 17965257 18324148 18767086 19478279 20524474 22029994
5911 22029994 23953962 26360369 29082439 31855012 33954658 35527600 36423380 36516799 36207303
5902 36207303 35456231 34750056 33920634 32849546 32100077 31537547 30792788 30195600 29473334
5893 29473334 28663727 28007063 27274754 26528543 26013069 25312233 25010922 24992421 24745403 25011949
5883 25011949 25306374 25855894 26780214 27440262 27984392 28690704 28729888 28728503 28552068 27955774
5873 27955774 27599183 27148039 26627205 26488579 26360975 26105106 26167819 25810648 25626537 25384780
$$ packed form
5938A4521219J544821J641750J771032J476783J137664O49076J91256j24963m93110
5929B2315528m74006p39410m48768n83797o04535m93406k97291l74496l15314
5920A7984505j85419l0275R5154J01292L58891M42938P11193J046195J505520
5911B2029994J923968K406407K722070K772573K099646J572942Q95780R3419l09496
5902C6207303p51072p06175q29422j071088p49469n62530p44759n97188p22266
5893B9473334q09607o56664p32309p46211n15474p00836l01311j8501k47018K66546
5883B5011949K94425N49520R24320O60048N44130P06312L9184j385j76435n96294
5873B7955774l56591m51144n20834j38626j27604k55869O2713l57171j84111k41757
$$ plain form
5863 25384780 24998676 24751357 24277071 23884557 23459904 23277013 22787492 22639643 22305681
5854 22305681 22032421 21888588 21721472 21524518 21460247 21336446 21119431 20849095 20683715 20237237
5844 20237237 19947033 19499530 19130739 18923533 18602194 18233534 18132365 17707103 17474579
5835 17474579 17422318 17242448 17147057 17063335 17003184 17031008 16946033 17026151 17053556 17112733 17223062
5824 17223062 17296897 17324529 17544564 17701220 17835992 17975530 18057063 18242942 18388663 18549363
5814 18549363 18691278 18881286 19153830 19483674 19833637 20211147 20550687 21005965 21331754
5805 21331754 21467435 21767281 21737610 21741001 21636274 21576090 21424426 21115698 21027972 20684164
5795 20684164 20575250 20616812 20629111 20748741 21028710 21178196 21594626 21985432 22408809 23015677
$$ packed form
5863B5384780l86104k47319m74286l92514m24653j82891m89521j47849l33962
5854B2305681k73260j43833j67116j96954o4271j23801k17015k70336j65380m46478
5844B0237237k90204m47503l68791k07206l21339l68660j01169m25262k32524
5835A7474579n2261j79870r5391q3722o0151K7824q4975Q0118K7405N9177J10329
5824A7223062P3835K7632K20035J56656J34772J39538Q1533J85879J45721J60700
5814A8549363J41915J90008K72544L29844L49963L77510L39540M55278L25789
5805B1331754J35681K99846k9671L391j04727o0184j51664l08728q7726l43808
5795B0684164j08914M1562J2299J19630K79969J49486M16430L90806M23377O06868
$$ plain form
5785 23015677 23841279 24567147 25570598 26676038 27817229 29245363 30560551 31933268
5777 31933268 33192681 34510508 35458212 36334905 36844385 37206164 37374915 37285345 36865181
5768 36865181 36613500 36108974 35716070 35306589 34922630 34721537 34672492 34612873 34832855 35068830
5758 35068830 35473441 36035318 36625057 37314429 38131483 39101707 40175018 41214370 42211859
5749 42211859 43340429 44105615 45053594 45756382 46168465 46444373 46463635 46287154 45949668
5740 45949668 45458627 44702870 44086322 43609683 42819690 42346587 42127740 41875815 41852091 42046656
5730 42046656 42595628 43319440 44275075 45419410 46859197 48420722 50142656 52049297 53804372
5721 53804372 55537380 57181826 58457574 59532493 60497221 60921796 61238049 60998828 60441778
$$ packed form
5785B3015677Q25602P25868J003451J105440J141191J428134J315188J372717
5777C1933268J259413J317827R47704Q76693N09480L61779J68751q9570m20164
5768C6865181k51681n04526l92904m09481l83959k01093m9045n9619K19982K35975
5758C5068830M04611N61877N89739O89372Q17054R70224J073311J039352R97489
5749D2211859J128570P65186R47979P02788M12083K75908J9262j76481l37486
5740D5949668m91041p55757o16548m76639p89993m73103k18847k51925k3724J94565
5730D2046656N48972P23812R55635J144335J439787J561525J721934J906641J755075
5721E3804372J733008J644446J275748J074919R64728M24575L16253k39221n57050
$$ plain form
5712 60441778 59855922 58777965 57449845 56219473 54831110 53302681 52033569 50710344
5704 50710344 49809466 49133762 48827535 49049209 49692685 50799504 52397337 54647096 57352827
5695 57352827 60487837 63925385 67495799 71700967 75809900 79571140 83078039 85791976
5687 85791976 87702664 88489044 88180878 86846431 84729445 81703559 78127371 74262333
5679 74262333 70191656 66239323 62437741 58871572 55732117 52892312 50632187 49081119
5671 49081119 47864423 47205256 47019554 47269420 48054628 49324086 50623644 52075342 53882248
5662 53882248 55939571 58063590 59849934 61600524 62934234 64051986 64514293 64408221
5654 64408221 63783317 62476994 60863755 58908001 56750012 54458091 52037747 49716067
$$ packed form
5712F0441778n85856j077957j328120j230372j388363j528429j269112j323225
5704E0710344r00878o75704l06227K21674O43476J106819J597833K249759K705731
5695E7352827L135010L437548L570414M205168M108933L761240L506899K713937
5687H5791976J910688P86380l08166j334447k116986l025886l576188l865038
5679G4262333m070677l952333l801582l566169l139455k839805k260125j551068
5671D9081119j216696o59167j85702K49866P85208J269458J299558J451698J806906
5662E3882248K057323K124019J786344J750590J333710J117752M62307j06072
5654F4408221o24904j306323j613239j955754k157989k291921k420344k321680
$$ plain form
5646 49716067 47464844 45180746 43338007 41518743 39897321 38654548 37622650 36734548
5638 36734548 36186493 35679203 35528254 35383428 35505143 35673802 35845435 36321621 37088888
5629 37088888 37841035 38970687 40155323 41458123 43142083 44982924 46680995 48617895
5621 48617895 50404498 51857401 53371012 54412904 55221799 55794426 55860588 55851507 55580463
5612 55580463 55128125 54785278 54290660 53759844 53491990 53145915 53034759 53128745 53248018 53560589
5602 53560589 53970090 54411841 55022688 55457153 55850328 56212210 56487507 56637533 56710048 56634522
5592 56634522 56536631 56590158 56432806 56155091 55923846 55564929 55148275 54699287 53922748 53172868
5582 53172868 52414860 51400642 50523034 49431320 48279175 47074684 45796902 44616962
$$ packed form
5646D9716067k251223k284098j842739j819264j621422j242773j031898q88102
5638C6734548n48055n07290j50949j44826J21715J68659J71633M76186P67267
5629C7088888P52147J129652J184636J302800J683960J840841J698071J936900
5621D8617895J786603J452903J513611J041892Q08895N72627O6162r081k71044
5612E5580463m52338l42847m94618n30816k67854l46075j11156R3986J19273L12571
5602E3560589M09501M41751O10847M34465L93175L61882K75297J50026P2515p5526
5592E6634522r7891N3527j57352k77715k31245l58917m16654m48988p76539p49880
5582E3172868p58008j014218q77608j091714j152145j204491j277782j179940
$$ plain form
5574 44616962 43302930 42013809 40694782 39556563 38420660 37191195 36129027 35150287
5566 35150287 34132401 33336810 32386162 31749730 31119728 30590583 30440192 30237610 30135324
5557 30135324 30268255 30149611 30247813 30192158 30168166 29972124 29610624 29164874 28842289 28011208
5547 28011208 27517703 26789219 25949524 25398026 24847081 24205011 23749703 23299528 22984089
5538 22984089 22789586 22473789 22226449 22001042 21839756 21673298 21759490 21697448 21568078 21776226
5528 21776226 21827635 21838733 22011379 22217572 22514976 22772699 23347288 23856789 24306020 25041137
5518 25041137 25596581 26179856 26794651 27226210 27555008 27990177 28284334 28437933 28645127
5509 28645127 28722884 28844964 28973443 29126110 29381332 29698581 30004071 30605968 31374092 32138144
$$ packed form
5574D4616962j314032j289121j319027j138219j135903j229465j062168r78740
5566C5150287j017886p95591r50648o36432o30002n29145j50391k02582j02286
5557C0135324J32931j18644R8202n5655k3992j96042l61500m45750l22585q31081
5547B8011208m93505p28484q39695n51498n50945o42070m55308m50175l15439
5538B2984089j94503l15797k47340k25407j61286j66458Q6192o2042j29370K08148
5528B1776226N1409J1098J72646K06193K97404K57723N74589N09501M49231P35117
5518B5041137N55444N83275O14795M31559L28798M35169K94157J53599K07194
5509B8645127P7757J22080J28479J52667K55222L17249L05490O01897P68124P64052
$$ plain form
5499 32138144 32908876 34029208 35193195 36387914 37748784 39162480 40682405 41934253
5491 41934253 43197296 44322937 45307096 45761355 46013540 46016708 45708318 45373919 44615826
5482 44615826 43998486 43088530 42256231 41589934 40900786 40365352 39995150 39592505 39588576 39512143
5472 39512143 39440485 39554802 39733788 39727007 39918411 40022697 39904517 39888418 39528561 39228117
5462 39228117 38762829 37905719 37193882 36286198 35152481 33897788 32642199 31493145 30339244
5453 30339244 29139875 28104555 27128228 26223612 25386570 24626728 24138689 23666853 23194662
5444 23194662 22838518 22435910 22016459 21792404 21359401 20933818 20501838 19977641 19433124
5435 19433124 18851163 18275047 17705783 17086007 16422182 15817957 15125949 14655184 14099748
$$ packed form
5499C2138144P70732J120332J163987J194719J360870J413696J519925J251848
5491D1934253J263043J125641R84159M54259K52185L168l08390l34399p58093
5482D4615826o17340r09956q32299o66297o89148n35434l70202m02645l929p6433
5472C9512143p1658J14317J78986o781J91404J04286j18180j6099l59857l00444
5462C9228117m65288q57110p11837r07684j133717j254693j255589j149054j153901
5453C0339244j199369j035320r76327r04616q37042p59842m88039m71836m72191
5444B3194662l56144m02608m19451k24055m33003m25583m31980n24197n44517
5435A9433124n81961n76116n69264o19776o63825o04225o92008m70765n55436
$$ plain form
5426 14099748 13649326 13246739 12825663 12463887 12148361 11829201 11514450 11146842 10932141
5417 10932141 10771125 10440702 10352429 10168340 9990320 9940822 9661939 9475627 9453872 9216347
5407 9216347 9159850 9088465 9054029 8920502 8768301 8783675 8551989 8639147 8448637 8388039 8363786
5396 8363786 8357040 8354674 8348293 8206873 8183140 8118033 8158704 8083775 8098956 8151940 8171429 8241794
5384 8241794 8327586 8414638 8546657 8520811 8830839 9045041 9256775 9677477 9929531 10303734
5374 10303734 10717852 10950520 11189671 11422805 11602023 11950670 11922264 12136579 12152697 12035758
5364 12035758 12052050 12023803 11922430 11975748 11874861 11932614 12327450 12360906 12670438 13124249
5354 13124249 13485405 14051197 14605964 15095282 15816187 16406320 16949013 17376257 17838855
$$ packed form
5426A4099748m50422m02587m21076l61776l15526l19160l14751l67608k14701
5417A0932141j61016l30423q8273j84089j78020m9498k78883j86312k1755k37525
5407I216347n6497p1385l4436j33527j52201J5374k31686Q7158j90510o0598k4253
5396H363786o746k366o381j41420k3733o5107M0671p4929J5181N2984J9489P0365
5384H241794Q5792Q7052J32019k5846L10028K14202K11734M20702K52054L74203
5374A0303734M14118K32668K39151K33134J79218L48647k8406K14315J6118j16939
5364A2035758J6292k8247j01373N3318j00887N7753L94836L3456L09532M53811
5354A3124249L61156N65792N54767M89318P20905N90133N42693M27244M62598
$$ plain form
5345 17838855 17959160 18075075 17778540 17615505 17162512 16610884 16228927 15603420 15112423
5336 15112423 14701522 14232505 13861172 13493939 13061982 12966191 12688789 12589717 12680424 12328195
5326 12328195 12364648 12293277 12096032 11955952 11727580 11331151 11032745 10694814 10202269 9827521
5316 9827521 9242997 8772838 8404460 7932977 7487054 7309363 6844929 6638186 6352434 6058375
5306 6058375 5932603 5710461 5572770 5483650 5315569 5246163 5138020 4989654 4864760 4802163
5296 4802163 4724997 4671127 4610910 4521654 4412300 4373548 4349098 4303055 4236321 4129391 4099312
5285 4099312 4069498 4020060 4076260 3925334 3913792 3856578 3863048 3815288 3815056 3857915 3795417 3797069
5273 3797069 3749621 3721060 3629598 3677403 3572633 3500287 3422954 3435060 3347206 3352100 3334075
$$ packed form
5345A7838855J20305J15915k96535j63035m52993n51628l81957o25507m90997
5336A5112423m10901m69017l71333l67233m31957r5791k77402r9072R0707l52229
5326A2328195L6453p1371j97245j40080k28372l96429k98406l37931m92545l74748
5316I827521n84524m70159l68378m71483m45923j77691m64434k06743k85752k94059
5306F058375j25772k22142j37691q9120j68081o9406j08143j48366j24894o2597
5296D802163p7166n3870o0217q9256j09354l8752k4450m6043o6734j06930l0079
5285D099312k9814m9438N6200j50926j1542n7214O470m7760k32M2859o2498J652
5273C797069m7448k8561r1462M7805j04770p2346p7333J2106q7854M894j8025
$$ plain form
5262 3334075 3283504 3238229 3345625 3192237 3186873 3187283 3137301 3268703 3102953 2970015 3184236
5251 3184236 2989660 3035289 3040419 2892500 2984517 2998280 2806794 3024070 2881565 2889796 2984628
5240 2984628 2904107 2890921 2773518 2783457 2781011 2722140 2763625 2826930 2754601 2700269 2727302 2727244
5228 2727244 2643327 2773030 2622416 2620185 2726518 2749707 2694140 2669969 2592804 2583618 2752800
5217 2752800 2575338 2675577 2689603 2647724 2719712 2735234 2666722 2862844 2875742 2714111 2757269
5206 2757269 2721627 2748074 2691025 2796593 2846854 2810086 2739033 2809988 2892366 2815250 3014617
5195 3014617 2988141 3022478 3072729 3153875 3251059 3182452 3320059 3514676 3633052 3785520 3939600
5184 3939600 4167442 4277905 4432636 4528108 4553260 4554950 4549032 4535411 4632055 4621860 4619426
$$ packed form
5262C334075n0571m5275J07396j53388n364M10m9982J31402j65750j32938K14221
5251C184236j94576M5629N130j47919R2017J3763j91486K17276j42505Q231R4832
5240B984628q0521j3186j17403R939k446n8871M1485O3305p2329n4332K7033n8
5228B727244q3917J29703j50614k231J06333K3189n5567k4171p7165r186J69182
5217B752800j77462J00239J4026m1879P1988J5522o8512J96122J2898j61631M3158
5206B757269l5642K6447n7049J05568N0261l6768p1053P0955Q2378p7116J99367
5195C014617k6476L4337N0251Q1146R7184o8607J37607J94617J18376J52468J54080
5184C939600K27842J10463J54731R5472K5152J690n918j3621R6644j0195k434
$$ plain form
5173 4619426 4723831 4685043 4683516 4707494 4523732 4638318 4682068 4581494 4598308 4527344 4636712
5162 4636712 4712843 4561341 4657259 4670823 4577167 4711293 4711885 4777322 4739425 4921612 4904704
5151 4904704 4936156 5033340 5061410 5205091 5329747 5350463 5483949 5693419 5834280 5922941
5141 5922941 6097097 6276534 6552440 6654104 6780698 6966813 7226679 7277422 7379104 7576731
5131 7576731 7852725 8027293 8336358 8556809 8777341 8876638 9257773 9303385 9557783 9683963
5121 9683963 9585406 9560801 9635393 9525730 9545588 9545384 9603687 9586349 9632152 9727923 9671442 9827419
5109 9827419 10040337 10113967 10295448 10738767 10792524 11085225 11498669 11858767 12327654 12914206
5099 12914206 13378880 14082949 14636138 15139911 15770987 16183519 16595908 16837607 16898124 16987937
$$ packed form
5173D619426J04405l8788j527K3978j83762J14586M3750j00574J6814p0964J09368
5162D636712P6131j51502R5918J3564r3656J34126N92O5437l7897J82187j6908
5151D904704L1452R7184K8070J43681J24656K0716J33486K09470J40861Q8661
5141E922941J74156J79437K75906J01664J26594J86115K59866N0743J01682J97627
5131G576731K75994J74568L09065K20451K20532R9297L81135M5612K54398J26180
5121I683963r8557k4605P4592j09663J9858k04N8303j7338M5803R5771n6481J55977
5109I827419K12918P3630J81481M43319N3757K92701M13444L60098M68887N86552
5099A2914206M64674P04069N53189N03773O31076M12532M12389K41699O0517Q9813
$$ plain form
5089 16987937 16825830 16736270 16562789 16413597 16291041 16428828 16319251 16516814 16944087 17521383
5079 17521383 18369124 19515152 20444974 21656105 22578469 23364912 23799657 24038274 24180779
5070 24180779 24180941 24338155 24349582 24558219 24818977 25008020 25322239 25315524 25322582 25046811 24818772
5059 24818772 24240006 23846551 23472920 23289313 23298510 23358686 23814396 24669240 26244157 27870878
5049 27870878 30150352 32551166 35216371 38135590 40478103 42008128 42477158 42057685
5041 42057685 41088609 39440025 37738059 35875150 34452958 33069061 31692934 30602896
5033 30602896 29613466 28649210 27743663 26923205 26290052 25609513 25062950 24848724 24731749
5024 24731749 25072463 26057702 27222076 28931058 30893797 33578069 36699170 40182780
$$ packed form
5089A6987937j62107q9560j73481j49192j22556J37787j09577J97563M27273N77296
5079A7521383Q47741J146028R29822J211131R22364P86443M34745K38617J42505
5070B4180779J62J57214J1427K08637K60758J89043L14219o715P058k75771k28039
5059B4818772n78766l93455l73631j83607R197O0176M55710Q54844J574917J626721
5049B7870878K279474K400814K665205K919219K342513J530025M69030m19473
5041D2057685r69076j648584j701966j862909j422192j383897j376127j090038
5033C0602896r89430r64256r05547q20458o33153o80539n46563k14226j16975
5024B4731749L40714R85239J164374J708982J962739K684272L121101L483610
$$ plain form
5016 40182780 43438052 46028702 47521586 47693091 46667462 44496543 41673433 38672345
5008 38672345 35521400 32498532 29773126 27485421 25661394 24090292 22829935 21938952
5000 21938952 21026079 20345181 19844585 19323841 18973517 18721229 18578179 18770343 19116813
4991 19116813 19934924 21152389 23076515 25318771 27618171 29620764 30861222 31296331
4983 31296331 30827801 29581480 27573661 25489937 23287034 21147353 19176886 17381605
4975 17381605 15843502 14699542 13721413 12873662 12349017 11843915 11308528 10910070 10617355
4966 10617355 10400004 10195939 9821833 9795988 9692674 9772223 10037903 10424548 10961572 11640989
4956 11640989 12114430 12417013 12574126 12271793 11933647 11235607 10506966 9782606 9032943
$$ packed form
5016D0182780L255272K590650J492884J71505j025629k170919k823110l001088
5008C8672345l150945l022868k725406k287705j824027j571102j260357q90983
5000B1938952r12873o80898n00596n20744l50324k52288j43050J92164L46470
4991A9116813Q18111J217465J924126K242256K299400K002593J240458M35109
4983C1296331m68530j246321k007819k083724k202903k139681j970467j795281
4975A7381605j538103j143960r78129q47751n24645n05102n35387l98458k92715
4966A0617355k17351k04065l74106k5845j03314P9549K65680L86645N37024O79417
4956A1640989M73441L02583J57113l02333l38146o98040p28641p24360p49663
$$ plain form
4947 9032943 8416852 7998437 7565903 7386758 7620038 7897281 8166120 8196487 8109922 7914402
4937 7914402 7551748 7028333 6800060 6182870 5848073 5586323 5252271 5200320 5173714 4871266
4927 4871266 4904629 4797172 4655587 4733257 4578121 4522507 4484928 4518015 4384663 4411577 4415298
4916 4415298 4390240 4292748 4296741 4354867 4266587 4270947 4218703 4245644 4266419 4198272 4259698 4190340
4904 4190340 4198364 4212829 4247147 4213429 4383792 4350664 4226116 4348880 4326198 4333648 4480079
4893 4480079 4367848 4315661 4295713 4454767 4332078 4423702 4435185 4525140 4607610 4522383 4688174
4882 4688174 4583458 4635005 4706684 4737564 4975485 4854467 4926881 5034359 5034636 5025399 5128662
4871 5128662 5204114 5249176 5358489 5503093 5630850 5584806 5736508 5776026 5927877 5966649
$$ packed form
4947I032943o16091m18415m32534j79145K33280K77243K68839L0367q6565j95520
4937G914402l62654n23415k28273o17190l34797k61750l34052n1951k6606l02448
4927D871266L3363j07457j41585P7670j55136n5614l7579L3087j33352K6914L721
4916D415298k5058r7492L993N8126q8280M360n2244K6941K0775o8147O1426o9358
4904D190340Q024J4465L4318l3718J70363l3128j24548J22764k2682P450J46431
4893D480079j12231n2187j9948J59054j22689R1624J1483Q9955Q2470q5227J65791
4882D688174j04716N1547P1679L0880K37921j21018P2414J07478K77r237J03263
4871E128662P5452M5062J09313J44604J27757m6044J51702L9518J51851L8772
$$ plain form
4861 5966649 6039043 6247390 6366045 6458158 6594456 6733327 6914925 7103254 7307948 7415749
4851 7415749 7679088 7961760 8142707 8476091 8615673 9174499 9380238 9776274 10165837 10415869
4841 10415869 10982642 11433191 11801249 12338469 12816133 13235700 13705464 14067146 14585670
4832 14585670 15114309 15652374 16373799 16989953 17503795 18145920 18767173 19329250 19929000
4823 19929000 20473970 21243032 21999043 22529620 23293103 23913480 24617644 25427798 26055801
4814 26055801 26852744 27746800 28621254 29649451 30884631 32198922 33731200 35401313 36977616
4805 36977616 38752194 40651278 42558252 44648566 47009283 49361450 51772845 54217219
4797 54217219 56453953 58568191 60362745 62024195 63373278 64706932 66056711 67421803
$$ packed form
4861E966649P2394K08347J18655R2113J36298J38871J81598J88329K04694J07801
4851G415749K63339K82672J80947L33384J39582N58826K05739L96036L89563K50032
4841A0415869N66773M50549L68058N37220M77664M19567M69764L61682N18524
4832A4585670N28639N38065P21425O16154N13842O42125O21253N62077N99750
4823A9929000N44970P69062P56011N30577P63483O20377P04164Q10154O28003
4814B6055801P96943Q94056Q74454J028197J235180J314291J532278J670113J576303
4805C6977616J774578J899084J906974K090314K360717K352167K411395K444374
4797E4217219K236734K114238J794554J661450J349083J333654J349779J365092
$$ plain form
4789 67421803 69143199 71390898 74405799 78423659 82900863 87106806 90458631 92987038
4781 92987038 94815009 96189594 97444933 98452167 99471409 101029591 102935522 105225650
4773 105225650 107659539 110092701 112282602 113477081 113913878 113249139 111546485 109448007
4765 109448007 106665623 103953714 101047218 98830504 97188082 96594298 96818213 97251357
4757 97251357 97103086 95978484 94231035 91921941 89137233 85850526 82704393 79429534
4749 79429534 76171888 73450801 70772555 68458703 66493768 64456040 62296919 60117487
4741 60117487 57914801 55648382 53419244 51382491 49292263 47392783 45613168 44150524
4733 44150524 42560199 41074913 39738843 38523589 37313385 36131859 35086665 34024383
$$ packed form
4789F7421803J721396K247699L014901M017860M477204M205943L351825K528407
4781I2987038J827971J374585J255339J007234J019242J558182J905931K290128
4773A05225650K433889K433162K189901J194479M36797o64739j702654k098478
4765A09448007k782384k711909k906496k216714j642422n93784K23915M33144
4757I7251357j48271j124602j747449k309094k784708l286707l146133l274859
4749G9429534l257646k721087k678246k313852j964935k037728k159121k179432
4741F0117487k202686k266419k229138k036753k090228j899480j779615j462644
4733D4150524j590325j485286j336070j215254j210204j181526j045194j062282
$$ plain form
4725 34024383 32999768 32258895 31372413 30575124 29827218 28951916 28141767 27279428 26460881
4716 26460881 25622708 24889077 24230724 23738997 22940392 22416629 21829764 21074084 20452125
4707 20452125 19940675 19368113 18878966 18399563 17875698 17577912 16923867 16480489 16057894
4698 16057894 15422960 15001048 14642703 14139128 13853056 13417701 13049415 12757515 12265721
4689 12265721 11888937 11712852 11227371 11051217 10705476 10370521 10120046 9962304 9564907
4680 9564907 9362608 9011283 8777272 8695222 8379916 8298561 8136476 7980104 7911073 7664138
4670 7664138 7458525 7505551 7212893 7136980 7074524 6888693 6875078 6845901 6529494 6577600 6462652
4659 6462652 6199743 6185998 5981817 6002208 5911292 5762632 5756832 5674997 5394923 5434475 5412316
$$ packed form
4725C4024383j024615p40873q86482p97289p47906q75302q10149q62339q18547
4716B6460881q38173p33631o58353m91727p98605n23763n86865p55680o21959
4707B0452125n11450n72562m89147m79403n23865k97786o54045m43378m22595
4698A6057894o34934m21912l58345n03575k86072m35355l68286k91900m91794
4689A2265721l76784j76085m85481j76154l45741l34955k50475j57742l97397
4680I564907k02299l51325k34011q2050l15306q1355j62085j56372o9031k46935
4670G664138k05613M7026k92658p5913o2456j85831j3615k9177l16407M8106j14948
4659F462652k62909j3745k04181K0391r0916j48660n800q1835k80074L9552k2159
$$ plain form
4648 5412316 5258392 5316643 5149949 5175975 5203558 5149532 5230820 5055677 5036826 4993902 4875147
4637 4875147 4909268 4794705 4658203 4635220 4577355 4443949 4367403 4214314 4285476 4167854
4627 4167854 4212205 4292968 4303408 4370005 4552267 4583351 4762679 4884057 4859116 4768930 4799438
4616 4799438 4686674 4579007 4498463 4401857 4492955 4469063 4385838 4369937 4464219 4486259 4480812
4605 4480812 4596299 4674031 4701121 4618099 4693857 4645704 4764785 4743263 4736547 4818229 4754779
4594 4754779 4633954 4544798 4382362 4217024 4115260 3975280 3946918 3769529 3789817 3700218
4584 3700218 3596173 3517378 3595131 3441961 3414978 3337149 3355796 3305774 3319103 3203534 3223241
4573 3223241 3096398 3204799 3283323 3249665 3173844 3349494 3190982 3266340 3135837 3207793
$$ packed form
4648E412316j53924N8251j66694K6026K7583n4026Q1288j75143j8851m2924j18755
4637D875147L4121j14563j36502k2983n7865j33406p6546j53089P1162j17622
4627D167854M4351Q0763J0440O6597J82262L1084J79328J21378k4941r0186L0508
4616D799438j12764j07667q0544r6606R1098k3892q3225j5901R4282K2040n447
4605D480812J15487P7732K7090q3022P5758m8153J19081k1522o716Q1682o3450
4594D754779j20825q9156j62436j65338j01764j39980k8362j77389K0288q9599
4584C700218j04045p8795P7753j53170k6983p7829J8647n0022J3329j15569J9707
4573C223241j26843J08401P8524l3658p5821J75650j58512P5358j30503P1956
$$ plain form
4563 3207793 3237714 3208059 3089939 3285385 3256813 3366200 3456842 3398825 3522770 3562032 3505941
4552 3505941 3601089 3624029 3542263 3552529 3618458 3563024 3606114 3636276 3624100 3604911 3636815
4541 3636815 3551337 3656781 3579710 3608355 3770868 3719051 3603640 3818335 3782092 3823711 3878436
4530 3878436 3938250 4022150 4007517 4132983 4224053 4103336 4098522 4367932 4236852 4417718 4587752
4519 4587752 4522973 4608411 4638905 4709764 4707445 4740773 4779168 4826183 4860517 4885343 4855546 4931386
4507 4931386 4951802 5025071 5084157 5058477 5227512 5265654 5376141 5477244 5442473 5539408 5627869
4496 5627869 5654667 5797619 5835217 6009450 6241103 6235048 6474154 6638424 6627957 6658402 6837405
4485 6837405 6735136 6933900 6810050 7002923 7237431 7294623 7421160 7562943 7618206 7821053
$$ packed form
4563C207793K9921k9655j18120J95446k8572J09387R0642n8017J23945L9262n6091
4552C505941R5148K2940q1766J0266O5929n5434M3090L0162j2176j9189L1904
4541C636815q5478J05444p7071K8645J62513n1817j15411K14695l6243M1619N4725
4530C878436N9814Q3900j4633J25466R1070j20717m814K69410j31080J80866J70034
4519D587752o4779Q5438L0494P0859k319L3328L8395M7015L4334K4826k9797P5840
4507D931386K0416P3269N9086k5680J69035L8142J10487J01103l4771R6935Q8461
4496E627869K6798J42952L7598J74233K31653o055K39106J64270j0467L0445J79003
4485F837405j02269J98764j23850J92873K34508N7192J26537J41783N5263K02847
$$ plain form
4475 7821053 7926928 7963851 8157053 8455212 8613433 8781156 8961768 9253775 9534732 9843642
4465 9843642 10569198 11694146 13728057 15564676 16630673 16866399 16752176 16365326 15480320
4456 15480320 14490632 13727822 13266676 12723463 12420415 12284275 12262231 12438007 12569237 12709946
4446 12709946 12926545 13058108 13445846 13746090 14077020 14362377 14786926 15222838 15828722
4437 15828722 16512481 17291100 18221355 19257517 20322038 21682987 23569497 25861404 27772012
4428 27772012 29647962 31495504 33799208 35883558 37699839 39421786 40942014 42583158
4420 42583158 45087385 48923307 53681559 58518190 62623285 66627978 70938029 74537431
4412 74537431 76001359 74850057 71965017 68268909 64131600 59561337 55824996 52925535
$$ packed form
4475G821053J05875L6923J93202K98159J58221J67723J80612K92007K80957L08910
4465I843642P25556J124948K033911J836619J065997K35726j14223l86850q85006
4456A5480320r89688p62810m61146n43213l03048j36140k2044J75776J31230J40709
4446A2709946K16599J31563L87738L00244L30930K85357M24549M35912O05884
4437A5828722O83759P78619R30255J036162J064521J360949J886510K291907J910608
4428B7772012J875950J847542K303704K084350J816281J721947J520228J641144
4420D2583158K504227L835922M758252M836631M105095M004693M310051L599402
4412G4537431J463928j151302k885040l696108m137309m570263l736341k899461
$$ plain form
4404 52925535 51174779 50583819 50785468 51470049 52900862 54990933 57864306 62647647 70437688
4395 70437688 79972202 87426348 91662155 94811928 99085715 103699927 107127390 108074867
4387 108074867 107242993 105170340 102266291 99231918 96883520 95337423 95142149 96236565
4379 96236565 99442190 106726031 120773841 149114534 195769731 248346312 285907501
4372 285907501 301785981 303367997 297419596 280253453 256648008 233880432 217097535
4365 217097535 207717185 206050302 211969075 224561177 243338954 267981380 292348484
4358 292348484 308707748 316723489 320757475 324426206 328624089 335222268 343664827 354765841
4350 354765841 366978951 374576987 368233155 348619158 322905451 293285641 259676328
$$ packed form
4404E2925535j750756n90960K01649O84581J430813K090071K873373M783341P790041
4395G0437688R534514P454146M235807L149773M273787M614212L427463R47477
4387A08074867q31874k072653k904049l034373k348398j546097j95274J094416
4379I6236565L205625P283841J4047810K8340693M6655197N2576581L7561189
4372B85907501J5878480J582016n948401j7166143k3605445k2767576j6782897
4365B17097535r380350j666883N918773J2592102J8777777K4642426K4367104
4358B92348484J6359264Q015741M033986L668731M197883O598179Q442559J1101014
4350C54765841J2213110P598036o343832j9613997k5713707k9619810l3609313
$$ plain form
4343 259676328 226779251 197906224 174367479 154734502 138649969 126202178 116926571
4336 116926571 109311690 102850676 97365342 92821446 88941578 85206247 81913105 79477695
4328 79477695 77530284 76287667 75957829 75580077 75014222 73765806 72378253 71359459 70012511
4319 70012511 69171461 69060124 69222923 69897937 71237362 73352663 76890225 81956059 88321452
4310 88321452 94983774 100552115 103561218 103530719 100754758 96724929 91649740 85385831
4302 85385831 79076779 73241676 68710795 65658942 63776030 62268284 60191042 57455649
4294 57455649 54490652 51288969 47658543 44518052 41523513 39202251 37161428 35561881
4286 35561881 34457285 33754799 32830209 32124038 31663577 31131017 31087721 31278957 32687450
$$ packed form
4343B59676328l2897077k8873027k3538745j9632977j6084533j2447791r275607
4336A16926571p614881o461014n485334m543896l879868l735331l293142k435410
4328G9477695j947411j242617l29838l77752n65855j248416j387553j018794j346948
4319G0012511q41050j11337J62799O75014J339425K115301L537562N065834O365393
4310H8321452O662322N568341L009103l0499k775961m029829n075189o263909
4302H5385831o309052n835103m530881l051853j882912j507746k077242k735393
4294E7455649k964997l201683l630426l140491k994539k321262k040823j599547
4286C5561881j104596p02486r24590p06171m60461n32560m3296J91236J408493
$$ plain form
4277 32687450 35299242 38417859 40097368 40657116 40664256 40536403 39652455 38560634 37144845
4268 37144845 35195241 32998025 30538506 28196621 26054536 24054544 22143647 20708778
4260 20708778 19244584 18245149 17423907 16798365 16277782 15692745 15347330 15199542 15125250
4251 15125250 15106868 15694929 16848612 17817048 18153237 17893632 17357704 16640115 15492694
4242 15492694 14337087 13506957 12408999 11653701 10941899 10431976 10082856 9796304 9577324
4233 9577324 9271711 9034239 8820975 8712862 8561156 8469819 8414237 8076003 8050804 7943914
4223 7943914 7745565 7563190 7372494 7133496 6960734 6753086 6724440 6447793 6311808 6284331
4213 6284331 6127757 5991614 5932565 5782008 5729374 5782399 5634879 5532327 5487832 5331462
$$ packed form
4277C2687450K611792L118617J679509N59748P140j27853q83948j091821j415789
4268C7144845j949604k197216k459519k341885k142085j999992j910897j434869
4260B0708778j464194r99435q21242o25542n20583n85037l45415j47788p4292
4251A5125250j8382N88061J153683R68436L36189k59605n35928p17589j147421
4242A5492694j155607q30130j097958p55298p11802n09923l49120k86552k18980
4233I577324l05613k37472k13264j08113j51706r1337n5582l38234k5199j06890
4223G943914j98349j82375j90696k38998j72762k07648k8646k76647j35985k7477
4213F284331j56574j36143n9049j50557n2634N3025j47520j02552m4495j56370
$$ plain form
4203 5331462 5430842 5315710 5163449 5092076 5099318 4894532 4841294 4624765 4515452 4498837 4465065
4192 4465065 4288786 4163846 4161902 4004794 3984495 3909972 3823255 3810213 3736365 3724684 3604559
4181 3604559 3655614 3657673 3400859 3428313 3370454 3367778 3301324 3298737 3117808 3236154 3218067
4170 3218067 3226953 3229043 3032792 3040468 3102350 3058922 2968357 2905585 2921834 3086688 2892777
4159 2892777 2851068 2834642 2775435 2719988 2747739 2623564 2730118 2606056 2482781 2493006 2441172
4148 2441172 2576951 2446429 2594077 2514497 2574334 2520138 2466293 2565401 2508882 2575501 2473001
4137 2473001 2474170 2456757 2507096 2492310 2574267 2535985 2479167 2407594 2495266 2570125 2591751 2683165
4125 2683165 2831101 2919837 3137881 3166903 3149194 3149941 3141756 2986675 3007114 2953977 2938946
$$ packed form
4203E331462R9380j15132j52261p1373P242k04786n3238k16529j09313j6615l3772
4192D465065j76279j24940j944j57108k0299p4523q6717j3042p3848j1681j20125
4181C604559N1055K059k56814K7454n7859k676o6454k587j80929J18346j8087
4170C218067Q886K090j96251P676O1882m3428r0565o2772J6249J64854j93911
4159B892777m1709j6426n9207n5447K7751j24175J06554j24062j23275J0225n1834
4148B441172J35779j30522J47648p9580N9837n4196n3845R9108n6519O6619j02500
4137B473001J169j7413N0339j4786Q1957l8282n6818p1573Q7672P4859K1626R1414
4125B683165J47936Q8736K18044K9022j7709P47q185j55081K0439n3137j5031
$$ plain form
4114 2938946 2860429 2887156 2879663 3078951 3088268 3181989 3200461 3437064 3331510 3370645 3578186
4103 3578186 3466895 3432539 3527940 3567131 3624761 3580963 3460184 3424381 3375684 3162120 2996540
4092 2996540 2737839 2674157 2499184 2445622 2343907 2358694 2136527 2293387 2295862 2212981 2286545
4081 2286545 2144519 2242852 2372949 2221240 2266364 2219010 2214523 2205891 2243914 2155854 2254582
4070 2254582 2237260 2212093 2092500 2116059 2042090 1978444 1923389 2110615 2102202 2195830 2160454
4059 2160454 2235452 2186370 2283820 2314940 2205072 2371878 2399560 2312745 2413578 2380040 2565551
4048 2565551 2618693 2524396 2538203 2631300 2544110 2776678 2960189 3012748 3107640 3092251 3071930
4037 3071930 2965101 2913683 2855300 2886184 2678807 2730567 2616879 2546508 2667190 2604954 2675891
$$ packed form
4114B938946p8517K6727p493J99288R317R3721J8472K36603j05554L9135K07541
4103C578186j11291l4356R5401L9191N7630m3798j20779l5803m8697k13564j65580
4092B996540k58701o3682j74973n3562j01715J4787k22167J56860K475q2881P3564
4081B286545j42026R8333J30097j51709M5124m7354m487q632L8023q8060R8728
4070B254582j7322k5167j19593K3559p3969o3646n5055J87226q413R3628l5376
4059B160454P4998m9082R7450L1120j09868J66806K7682q6815J00833l3538J85511
4048B565551N3142r4297J3807R3097q7190K32568J83511N2559R4892j5389k0321
4037C071930j06829n1418n8383L0884k07377N1760j13688p0371J20682o2236P0937
$$ plain form
4026 2675891 2796348 2850563 2869489 3039618 2949353 2989533 3082433 3120183 3178046 3263830 3337812
4015 3337812 3440341 3601972 3633325 3472450 3477821 3450277 3189122 3014780 2804463 2797174 2684907
4004 2684907 2584295 2580855 2607961 2673906 2672044 2796623 2853018 2893822 2969011 2959589 3080904
3993 3080904 3055791 3018934 3024245 3134332 3039078 3172692 3070962 2988071 2864259 2779773 2654047
3982 2654047 2635995 2551388 2428694 2405864 2250157 2227549 2450969 2361556 2509011 2657863
3972 2657863 2689376 2859382 2792484 2754469 2714248 2584916 2405220 2345149 2157652 1982471
3962 1982471 1918307 1741466 1613275 1454402 1469467 1475063 1267816 1368082 1215332 1203068
3952 1203068 1195476 1143499 1070596 1110973 1027481 982929 946352 945279 995636 887669 868400 908250
$$ packed form
4026B675891J20457N4215J8926J70129r0265M0180R2900L7750N7863Q5784P3982
4015C337812J02529J61631L1353j60875N371k7544k61155j74342k10317p289j12267
4004B684907j00612l440K7106O5945j862J24579N6395M0804P5189r422J21315
3993C080904k5113l6857N311J10087r5254J33614j01730q2891j23812q4486j25726
3982B654047j8052q4607j22694k2830j55707k2608K23420q9413J47455J48852
3972B657863L1513J70006o6898l8015m0221j29332j79696o0071j87497j75181
3962A982471o4164j76841j28191j58873J5065N596k07247J00266j52750j2264
3952A203068p592n1977p2903M0377q3492m4552l6577j073N0357j07967j9269L9850
$$ plain form
3940 908250 836910 833647 790228 777474 702354 716081 644601 729180 654002 581050 659848 568951
3928 568951 603749 569834 581603 591530 438290 563724 406093 480039 363343 416725 514743
3917 514743 404207 297534 376881 347146 486314 477612 385853 404216 333794 335596 366559
3906 366559 357835 347303 422057 319092 276734 291002 184735 263938 261815 133092 223683
3895 223683 156776 111676 247680 214128 219806 217823 68386 164799 174747 68351 160259 212357
3883 212357 149983 216455 243382 179976 186289 100369 216697 144156 117574 123149 142119 27739
3871 27739 23927 44328 -58841 126700 -53996 -3750 17261 -61603 -9886 60262 3409
3860 3409 118435 -5167 1652 81692 -21130 6394 34089 -33770 21274 35990 -52966 83168
$$ packed form
3940I08250p1340l263m3419j2754p5120J3727p1480Q4579p5178p2952P8798r0897
3928E68951L4798l3915J1769R927j53240J25434j57631P3946j16696N3382R8018
3917E14743j10536j06673P9347k9735J39168q702r1759J8363p0422J802L0963
3906C66559q724j0532P4754j02965m2358J4268j06267P9203k123j28723R0591
3895B23683o6907m5100J36004l3552N678j983j49437R6413R948j06396R1908N2098
3883B12357o2374O6472K6927o3406O313q5920J16328p2541k6582N575J8970j14380
3871B7739l812K0401j03169J85541j80696N0246K1011p8864N1717P0148n6853
3860C409J15026j23602O819Q0040j02822K7524K7695o7859N5044J4716q8956J36134
$$ plain form
3848 83168 -20839 -54025 -38716 -23 -77007 -94752 -94156 -64501 52440 -92635 -12403 -128246
3836 -128246 -75225 -112915 -238615 -100511 -53184 -77075 -84640 -67493 -113379 -127346 -228687
3825 -228687 -73604 -196898 -139859 -148015 -142520 -124544 -202038 -185008 -171797 -230369 -123512
3814 -123512 -191692 -140589 -15073 -202099 -219110 -64476 -181265 -110025 -135264 -287483 -136192
3803 -136192 -190737 -119309 -234470 -104598 -136277 -87077 -95399 -170412 -219509 -156560 -209781
3792 -209781 -242055 -156235 -210998 -266036 -131487 -133996 -152245 -212373 -171979 -148675 -148697 -150397
3780 -150397 -108937 -222185 -145563 -185519 -200318 -163717 -44023 -131522 -138851 -174540 -256166
3769 -256166 -78577 -220292 -176401 -95241 -230142 -210226 -173893 -225103 -61720 -225281 -132111
$$ packed form
3848H3168j04007l3186J5309L8693p6984j7745N96K9655J16941j45075Q0232j15843
3836a28246N3021l7690j25700J38104M7327k3891p565J7147m5886j3967j01341
3825b28687J55083j23294N7039q156N495J7976p7494J7030J3211n8572J06857
3814a23512o8180N1103J25516j87026j7011J54634j16789P1240k5239j52219J51291
3803a36192n4545P1428j15161J29872l1679M9200q322p5013m9097O2949n3221
3792b09781l2274Q5820n4763n5038J34549k509j8249o0128M0394K3304k2j700
3780a50397M1460j13248P6622l9956j4799L6601J19694q7499p329l5689q1626
3769b56166J77589j41715M3891Q1160j34901J9916L6333n1210J63383j63561R3170
$$ plain form
3758 -132111 -199630 -166000 -188954 -78467 -149278 -241482 -160042 -222994 -217955 -222363 -228304 -97331
3746 -97331 -134708 -170960 -92295 -170101 -240779 -227722 -185832 -209506 -135818 -194795 -231657 -156242
3734 -156242 -193147 -200351 -236333 -178539 -142934 -146750 -134300 -228405 -206034 -146055 -179440 -169639
3722 -169639 -139889 -90362 -167411 -22080 -90104 -161714 -159360 -143955 -67927 -203024 -216401
3711 -216401 -163706 -275032 -301848 -169603 -286683 -160020 -272625 -264911 -163373 -232152 -167740
3700 -167740 -192117 -215175 -158553 -142310 -288423 -148189 -205814 -149978 -40542 -282267 -189590
3689 -189590 -152502 -259343 -136909 -64793 -267716 -154899 -265903 -227458 -261693 -272231 -181548
3678 -181548 -277062 -231798 -216499 -142130 -227325 -257343 -231801 -282215 -215942 -200380 -285861 -202992
$$ packed form
3758a32111o7519L3630k2954J10487p0811r2204Q1440o2952N039m408n941J30973
3746i7331l7377l6252P8665p7806p0678J3057M1890k3674P3688n8977l6862P5415
3734a56242l6905p204l5982N7794L5605l816J2450r4105K2371N9979l3385R801
3722a69639K9750M9527p7049J45331o8024p1610K354J5405P6028j35097j3377
3711b16401N2695j11326k6816J32245j17080J26663j12605P714J01538o8779O4412
3700a67740k4377k3058N6622J6243j46113J40234n7625N5836J09436k41725R2677
3689a89590L7088j06841J22434P2116k02923J12817j11004L8445l4235j0538R0683
3678a81548r5514M5264J5299P4369q5195l0018K5542n0414O6273J5562q5481Q2869
$$ plain form
3666 -202992 -197198 -279528 -137420 -184666 -192444 -289041 -234484 -191126 -199663 -347913 -236069 -259576
3654 -259576 -262845 -195195 -309335 -228243 -90105 -346345 -87978 -138469 -258322 -159178 -156863
3643 -156863 -310687 -239573 -175630 -272945 -153931 -146529 -157183 -86790 -326886 -219121 -272521
3632 -272521 -320570 -199494 -235465 -309727 -254634 -301961 -212874 -206564 -180344 -181776 -263221 -252404
3620 -252404 -140112 -212903 -198047 -137404 -221081 -287066 -205329 -179661 -218802 -199605 -125086
3609 -125086 -273636 -194076 -174748 -219966 -173228 -220786 -274351 -230333 -324082 -234554 -241470 -200265
3597 -200265 -191566 -101887 -166335 -230071 -227011 -178763 -229576 -265312 -265343 -153037 -239450 -153560
3585 -153560 -210520 -285675 -137846 -220352 -151437 -326827 -277154 -239618 -206227 -254838 -239680
$$ packed form
3666b02992N794q2330J42108m7246p778r6597N4557M3358q537j48250J11844k3507
3654b59576l269O7650j14140Q1092J38138k56240K58367n0491j19853R9144K315
3643a56863j53824P1114O3943r7315J19014P402j0654P0393k40096J07765n3400
3632b72521m8049J21076l5971p4262N5093m7327Q9087O310K6220j432q1445J0817
3620b52404J12292p2791J4856O0643q3677o5985Q1737K5668l9141J9197P4519
3609a25086j48550P9560J9328m5218M6738m7558n3565M4018r3749Q9528o916M1205
3597b00265Q699Q9679o4448o3736L060M8248n0813l5736l1J12306q6413Q5890
3585a53560n6960p5155J47829q2506O8915j75390M9673L7536L3391m8611J5158
$$ plain form
3574 -239680 -281759 -269922 -172700 -173428 -300020 -212148 -159077 -225202 -255521 -222893 -174690 -325733
3562 -325733 -279148 -167810 -243646 -176764 -252066 -213271 -186252 -265804 -226189 -215950 -231411
3551 -231411 -124260 -152299 -101430 -120295 -155961 -156289 -176470 -229954 -121524 -266445 -233533
3540 -233533 -165373 -232831 -112562 -215975 -192503 -88439 -197552 -243493 -189990 -229230 -285645
3529 -285645 -158172 -185316 -297376 -206371 -252870 -240075 -281225 -114780 -163893 -363229 -216204
3518 -216204 -153296 -308393 -274819 -239152 -338722 -200151 -241690 -192354 -199459 -274866 -181546
3507 -181546 -225653 -241554 -199507 -237700 -169863 -209848 -154306 -211831 -278125 -188076 -172389 -135813
3495 -135813 -163382 -121614 -193534 -260402 -134552 -169413 -130115 -276983 -299376 -229984 -274733
$$ packed form
3574b39680m2079J1837R7222p28j26592Q7872N3071o6125l0319L2628M8203j51043
3562c25733M6585J11338p5836O6882p5302L8795K7019p9552L9615J0239j5461
3551b31411J07151k8039N0869j8865l5666l28k0181n3484J08430j44921L2912
3540b33533O8160o7458J20269j03413K3472J04064j09113m5941N3503l9240n6415
3529b85645J27473k7144j12060R1005m6499J2795m1150J66445m9113j99336J47025
3518b16204O2908j55097L3574L5667r9570J38571m1539M9336p105p5407R3320
3507a81546m4107j5901M2047l8193O7837l9985N5542n7525o6294R0049J5687L6576
3495a35813k7569M1768p1920o6868J25850l4861L9298j46868k2393O9392m4749
$$ plain form
3484 -274733 -155296 -96446 -192781 -192584 -115524 -163922 -71614 -225916 -223762 -154135 -183389 -72210
3472 -72210 -89313 -287761 -269694 -92969 -230503 -120603 -168079 -107251 -78914 -143895 -159459
3461 -159459 -93774 -203750 -122148 -174161 -178639 -105255 -155482 -212167 47905 -99188 -168798
3450 -168798 -138806 -280438 -118005 -27305 -112196 -43822 -48628 -117390 -63156 -86899 -130109
3439 -130109 -94205 -180934 12748 14282 -49027 44004 -24751 -57617 19224 -124449 -120594 -45524
3427 -45524 22746 -54292 -14631 -1974 -75355 39394 -49352 -29404 -51766 -85547 2127 13753
3415 13753 -49057 192090 136868 59943 66003 -4436 62334 933 -34751 149076 121028 92852
3403 92852 160161 105948 131206 177402 127438 303453 285081 379254 450958 508642 516352 593816
$$ packed form
3484b74733J19437N8850r6335J97P7060m8398R2308j54302K154O9627k9254J11179
3472g2210j7103j98448J8067J76725j37534J09900m7476O0828K8337o4981j5564
3461a59459O5685j09976Q1602n2013m478P3384n0227n6685K60072j47093o9610
3450a68798K9992j41632J62433R0700q4891O8374m806o8762N4234k3743m3210
3439a30109L5904q6729J93682J534o3309R3031o8755l2866P6841j43673L855P5070
3427d5524O8270p7038L9661J2657p3381J14749q8746J9948k2362l3781Q7674J1626
3415A3753o2810K41147n5222p6925O060p0439O6770o1401l5684J83827k8048k8176
3403I2852O7309n4213K5258M6196m9964J76015j8372R4173P1704N7684P710P7464
$$ plain form
3391 593816 603440 726957 694136 870397 908781 996986 1054192 1249336 1229290 1585932 2176516
3380 2176516 3133196 4734725 6658661 7659077 8158827 7895177 7438252 6543042 5338419
3371 5338419 4213690 3375447 2629571 2087433 1586324 1371567 1167473 1119144 1002970 815621
3361 815621 834120 840615 790427 644108 701576 696909 525923 599466 513150 481050 454234 507087
3349 507087 377333 510579 570696 497695 579111 495073 562941 483755 441443 570693 569055
3338 569055 576128 752755 594463 709572 794963 825770 1017442 1076688 1211015 1466529 1478270
3327 1478270 1509434 1649100 1872797 2052248 2337642 2802729 3806992 5931312 10016581
3318 10016581 14202106 15955812 16101239 15601014 14558179 12230813 9922980 7605894
$$ packed form
3391E93816R624J23517l2821J76261L8384Q8205N7206J95144k0046L56642N90584
3380B176516R56680J601529J923936J000416M99750k63650m56925q95210j204623
3371E338419j124729q38243p45876n42138n01109k14757k04094m8329j16174j87349
3361H15621J8499O495n0188j46319N7468m667j70986P3543q6316l2100k6816N2853
3349E07087j29754J33246O0117p3001Q1416q4038O7868p9186m2312J29250j638
3338E69055P073J76627j58292J15109Q5391L0807J91672N9246J34327K55514J1741
3327A478270L1164J39666K23697J79451K85394M65087J004263K124320M085269
3318A0016581M185525J753706J45427n00225j042835k327366k307833k317086
$$ plain form
3310 7605894 6022841 4424794 3277598 2569588 2206592 2017157 1777803 1538241 1419262
3301 1419262 1238074 1157203 1097860 938711 881919 775664 649594 615978 508347 533728
3291 533728 460243 470181 408526 382069 391006 389056 294281 394011 260665 233272 292850 256204
3279 256204 429977 332845 236190 296365 60120 184059 220718 112809 182690 137386 72726
3268 72726 199720 83178 103964 10483 -10031 64598 149983 111856 19168 -20065 58393
3257 58393 608 -32132 17112 19722 -22583 -30561 -15862 68566 67421 60825 -55150 -41674
3245 -41674 -84962 19335 -161915 -60717 -106164 -137364 -36237 2337 -103703 4373 -93455
3234 -93455 -105144 -56585 -84639 37109 22913 -83352 -149424 -149027 -162894 -167844 -72835 -97500
$$ packed form
3310G605894j583053j598047j147196p08010l62996j89435k39354k39562j18979
3301A419262j81188q0871n9343j59149n6792j06255j26070l3616j07631K5381
3291E33728p3485R938o1655k6457Q937j950r4775R9730j33346k7393N9578l6646
3279B56204J73773r7132r6655O0175k36245J23939L6659j07909O9881m5304o4660
3268G2726J26994j16542K0786r3481k0514P4629Q5385l8127r2688l9233P8458
3257E8393n7785l2740M9244K610m2305p978J4699Q4428j145o596j15975J3476
3245d1674m3288J04297j81250J01198m5447l1200J01127L8574j06040J08076r7828
3234i3455j1689M8559k8054J21748j4196j06265o6072L97j3867m950R5009k4665
$$ plain form
3222 -97500 -127784 -32967 -76577 -211917 -133807 -68701 -234872 -134185 -117429 -208908 -115773
3211 -115773 -246729 -140350 -119859 -175420 -169242 -278948 -266820 -180301 -333685 -98357 -190741
3200 -190741 -263692 -156834 -161811 -144150 -206803 -222447 -185631 -160811 -144352 -218443 -250124 -284111
3188 -284111 -216576 -169914 -231456 -292606 -193773 -116611 -294961 -208440 -236787 -284618 -266351
3177 -266351 -163019 -371183 -158819 -209157 -242888 -210632 -257495 -228315 -232277 -325745 -238924
3166 -238924 -286263 -205236 -210494 -228829 -225885 -233390 -320166 -209225 -252090 -247864 -196407 -321575
3154 -321575 -251082 -111071 -206566 -212328 -237849 -203955 -267937 -222546 -279121 -300901 -268849 -151202
3142 -151202 -195707 -146452 -215740 -149559 -137237 -187472 -184611 -153589 -296478 -54939 -276476
$$ packed form
3222i7500l0284R4817m3610j35340P8110O5106j66171J00687J6756r1479R3135
3211a15773j30956J06379K0491n5561O178j09706J2128Q6519j53384K35328r2384
3200a90741p2951J06858m977J7661o2653j5644L6816K4820J6459p4091l1681l3987
3188b84111O7535M6662o1542o1150R8833P7162j78350Q6521k8347m7831J8267
3177b66351J03332k08164K12364n0338l3731L2256m6863K9180l962r3468Q6821
3166b38924m7339Q1027n258j8335K944p505q6776J10941m2865M226N1457j25168
3154c21575P0493J40011r5495n762k5521L3894o3982M5391n6575k1780L2052J17647
3142a51202m4505M9255o9288O6181J2322n0235K861L1022j42889K41539k21537
$$ plain form
3131 -276476 -247610 -202352 -212815 -274041 -263755 -304686 -229615 -242800 -214077 -223670 -192381 -317907
3119 -317907 -258446 -110920 -162280 -227008 -273607 -199849 -279846 -257005 -196238 -183427 -304172
3108 -304172 -299668 -271881 -259132 -235814 -190256 -118407 -344485 -282847 -251214 -347924 -157406
3097 -157406 -222955 -267301 -241218 -178295 -273704 -176732 -335472 -217397 -246440 -283370 -232866
3086 -232866 -227687 -315304 -176546 -162822 -191902 -167775 -162837 -184675 -175684 -236386 -244916 -199496
3074 -199496 -289645 -235289 -199245 -280922 -241065 -332904 -277488 -263380 -223793 -256483 -244684 -292328
3062 -292328 -212210 -244778 -230339 -213770 -217817 -253660 -240609 -259010 -141131 -244467 -220383
3051 -220383 -232968 -169181 -197565 -132322 -293001 -269249 -384868 -451000 -291605 -316666 -321748
$$ packed form
3131b76476K8866M5258j0463o1226J0286m0931P5071j3185K8723r593L1289j25526
3119c17907N9461J47526n1360o4728m6599P3758p9997K2841O0767J2811j20745
3108c04172M504K7787J2749K3318M5558P1849k26078O1638L1633r6710J90518
3097a57406o5549m4346K6083O2923r5409R6972j58740J18075k9043l6930N0504
3086b32866N179q7617J38758J3724k9080K4127M938k1838Q991o0702q530M5420
3074a99496r0149N4356L6044q1677L9857r1839N5416J4108L9587l2690J1799m7644
3062b92328Q0118l2568J4439J6569m047l5843J3051j8401J17879j03336K4084
3051b20383j2585O3787k8384O5243j60679K3752j15619o6132J59395k5061n082
$$ plain form
3040 -321748 -335758 -248421 -392472 -211357 -226120 -246593 -161783 -236443 -276275 -262134 -140752
3029 -140752 -124316 -268005 -214750 -205625 -255449 -323980 -89265 -205737 -217468 -199991 -228664
3018 -228664 -160640 -335122 -242986 -391774 -328323 -263654 -239221 -324399 -242698 -296333 -365804
3007 -365804 -297699 -264920 -377505 -284995 -312767 -290957 -193622 -244308 -280247 -198061 -211823
2996 -211823 -178870 -316355 -390889 -159537 -102059 -233550 -240331 -223315 -258775 -253844 -412881
2985 -412881 -243395 -382243 -287699 -268931 -285409 -333244 -312510 -354873 -284089 -220961 -330660
2974 -330660 -249621 -308120 -254132 -282009 -290369 -241432 -318196 -317407 -300978 -287021 -372029 -319004
2962 -319004 -324794 -260309 -264982 -250684 -197804 -359099 -322299 -216537 -159251 -208978 -226591 -295121
$$ packed form
3040c21748j4010Q7337j44051J81115j4763k0473Q4810p4660l9832J4141J21382
3029a40752J6436j43689N3255R125m9824o8531K34715j16472j1731J7477k8673
3018b28664O8024j74482R2136j48788O3451O4669K4433q5178Q1701n3635o9471
3007c65804O8105L2779j12585R2510k7772K1810R7335n0686l5939Q2186j3762
2996b11823L2953j37485p4534K31352N7478j31491o781J7016l5460M931j59037
2985d12881J69486j38848R4544J8768j6478m7835K0734m2363P0784O3128j09699
2974c30660Q1039n8499N3988k7877q360M8937p6764P89J6429J3957q5008N3025
2962c19004n790O4485m673J4298N2880j61295L6800J05762N7286m9727j7613o8530
$$ plain form
2950 -295121 -332516 -267740 -254915 -343726 -265911 -338676 -333857 -304583 -237454 -140656 -222679 -274824
2938 -274824 -345797 -342012 -371818 -315233 -189810 -260590 -253678 -240512 -308483 -199622 -261475 -290624
2926 -290624 -321884 -258932 -331954 -305596 -265366 -199491 -295018 -283034 -203349 -250690 -359722
2915 -359722 -288023 -256226 -179438 -250902 -268837 -229006 -205782 -356799 -294253 -280094 -361997
2904 -361997 -248912 -341345 -257690 -261535 -351099 -203737 -291828 -425833 -296802 -272802 -320114
2893 -320114 -280777 -280439 -238776 -200838 -212343 -222086 -343916 -347229 -308994 -310571 -282332 -294141
2881 -294141 -388159 -267222 -330534 -286160 -293804 -312726 -236420 -259580 -353966 -370950 -355473 -300669
2869 -300669 -162184 -268693 -283984 -296459 -315813 -261090 -267919 -235271 -230474 -234115 -327448 -186997
$$ packed form
2950b95121l7395O4776J2825q8811P7815p2765M819K9274O7129R6798q2023n2145
2938b74824p0973L785k9806N6585J25423p0780O912J3166o7971J08861o1853k9149
2926b90624l1260O2952p3022K6358M0230O5875r5527J1984P9685m7341j09032
2915c59722P1699L1797P6788p1464j7935L9831K3224j51017O2546J4159q1903
2904c61997J13085r2433Q3655l845q9564J47362q8091j34005J29031K4000m7312
2893c20114L9337L38M1663L7938j1505r743j21830l313L8235j577K8239j1809
2881b94141r4018J20937o3312M4374p644j8922P6306k3160r4386j6984J5477N4804
2869c00669J38485j06509j5291j2475j9354N4723o829L2648M797l641r3333J40451
$$ plain form
2857 -186997 -270888 -347529 -215048 -320096 -281026 -298461 -289735 -208345 -221750 -350964 -266117
2846 -266117 -235448 -330507 -261153 -269878 -359975 -210640 -362707 -315851 -213580 -330837 -262873
2835 -262873 -134105 -235639 -248238 -281435 -275284 -188070 -319008 -235970 -256423 -379265 -208406
2824 -208406 -312808 -342520 -212991 -267419 -353138 -343053 -272822 -263336 -251636 -312411 -327564
2813 -327564 -178200 -382359 -280039 -350129 -270150 -218762 -322425 -269078 -343227 -290565 -300477
2802 -300477 -269671 -298312 -205261 -276169 -341918 -159549 -293893 -322017 -339801 -342187 -358658
2791 -358658 -244081 -327776 -240226 -155467 -384654 -266323 -204963 -316245 -293416 -313188 -233191
2780 -233191 -269854 -224342 -346738 -280634 -211269 -289722 -238913 -305479 -368750 -179440 -303766
$$ packed form
2857a86997q3891p6641J32481j05048L9070j7435Q726Q1390j3405j29214Q4847
2846b66117L0669r5059O9354q725r0097J49335j52067M6856J02271j17257O7964
2835b62873J28768j01534j2599l3197O151Q7214j30938Q3038k0453j22842J70859
2824b08406j04402k9712J29529n4428q5719J0085P0231R486J1700o0775j5153
2813c27564J49364k04159J02320p0090P9979N1388j03663N3347p4149N2662r912
2802c00477L0806k8641R3051p0908o5749J82369j34344k8124j7784k386j6471
2791c58658J14577q3695Q7550Q4759k29187J18331O1360j11282K2829j9772P9997
2780b33191l6663M5512j22396O6104O9365p8453N0809o6566o3271J89310j24326
$$ plain form
2769 -303766 -349499 -139400 -328780 -304507 -279998 -401099 -356136 -298961 -285616 -270347 -265198
2758 -265198 -308455 -196619 -320254 -242945 -342129 -329432 -221272 -262887 -340416 -204944 -160215
2747 -160215 -281616 -189069 -345625 -296640 -240419 -299042 -333944 -214027 -318217 -352775 -267142
2736 -267142 -357963 -253289 -272165 -399026 -362055 -332294 -270438 -272994 -207499 -256724 -285413
2725 -285413 -352404 -328575 -341699 -355204 -214447 -323876 -326944 -307216 -343926 -296893 -232289
2714 -232289 -277554 -285552 -247551 -201181 -276922 -260956 -325597 -239182 -224430 -389435 -225880
2703 -225880 -256356 -330255 -269626 -309009 -339546 -238263 -343347 -238197 -404272 -419438 -443507
2692 -443507 -213734 -338223 -314524 -327430 -359014 -221642 -213385 -239205 -263059 -439101 -368771
$$ packed form
2769c03766m5733K10099j89380K4273K4509j21101M4963N7175J3345J5269N149
2758b65198m3257J11836j23635P7309r9184J2697J08160m1615p7529J35472M4729
2747a60215j21401R2547j56556M8985N6221n8623l4902J19917j04190l4558Q5633
2736b67142r0821J04674j8876j26861L6971K9761O1856k556O5495m9225k8689
2725b85413o6991K3829j3124j3505J40757j09429l068J9728l6710M7033O4604
2714b32289m5265p998L8001M6370p5741J5966o4641Q6415J4752j65005J63555
2703b25880l0476p3899O0629l9383l0537J01283j05084J05150j66075j5166k4069
2692d43507K29773j24489K3699j2906l1584J37372Q257k5820k3854j76042P0330
$$ plain form
2681 -368771 -384473 -334781 -276704 -197359 -313559 -171212 -286553 -345620 -278444 -290869 -261030
2670 -261030 -253704 -272801 -236548 -233985 -239094 -259252 -286876 -302030 -311129 -330008 -278525 -253258
2658 -253258 -303638 -292892 -321865 -222444 -248939 -256028 -230702 -352201 -290355 -297314 -259775 -281937
2646 -281937 -340604 -235261 -219041 -307213 -340770 -417354 -339462 -235631 -313329 -341224 -203521
2635 -203521 -288158 -276070 -395720 -308227 -322233 -353702 -293374 -212816 -324987 -247880 -192974
2624 -192974 -263205 -276834 -366103 -231914 -256630 -308823 -180924 -247704 -386264 -224318 -343495
2613 -343495 -209591 -245052 -269369 -280215 -252502 -203867 -247506 -292742 -192311 -279982 -391511
2602 -391511 -299485 -310675 -366785 -229234 -230056 -263042 -307654 -219007 -302794 -244832 -361704 -225167
$$ packed form
2681c68771j5702M9692N8077P9345j16200J42347j15341n9067O7176j2425K9839
2670b61030P326j9097L6253K563n109k0158k7624j5154r099j8879N1483K5267
2658b53258n0380J0746k8973R9421k6495p089K5326j21499O1846o959L7539k2162
2646b81937n8667J05343J6220q8172l3557p6584P7892J03831p7698k7895J37703
2635b03521q4637J2088j19650Q7493j4006l1469O0328Q0558j12171P7107N4906
2624a92974p0231j3629q9269J34189k4716n2193J27899o6780j38560J61946j19177
2613c43495J33904l5461k4317j0846K7713M8635m3639m5236J00431q7671j11529
2602c91511R2026j1190n6110J37551q22l2986m4612Q8647q3787N7962j16872J36537
$$ plain form
2590 -225167 -322945 -338941 -405774 -333291 -263892 -322348 -294473 -207751 -331317 -244685 -311610
2579 -311610 -295859 -266368 -161989 -239091 -241356 -305146 -252928 -251702 -239973 -218264 -351517 -345248
2567 -345248 -227320 -341997 -278933 -448747 -270156 -396878 -291263 -277677 -415369 -331239
2557 -331239 -313470 -254549 -395942 -250879 -284121 -236097 -179081 -331785 -346231 -244463 -264572
2546 -264572 -202580 -174018 -251990 -263406 -227246 -300906 -326032 -286463 -308183 -398605 -332478 -383603
2534 -383603 -324630 -280598 -344999 -311959 -339935 -374912 -175673 -297139 -231288 -344294 -266291
2523 -266291 -298855 -265388 -258247 -377209 -313195 -313911 -217362 -225619 -355879 -180706 -271418 -307816
2511 -307816 -259913 -316810 -359194 -200613 -310448 -348033 -291306 -296496 -257700 -387095 -228611
$$ packed form
2590b25167r7778j5996o6833P2483O9399n8456K7875Q6722j23566Q6632o6925
2579c11610J5751K9491J04379p7102k265o3790N2218J226J1729K1709j33253O269
2567c45248J17928j14677O3064j69814J78591j26722J05615J3586j37692Q4130
2557c31239J7769N8921j41393J45063l3242M8024N7016j52704j4446J01768k0109
2546b64572O1992K8562p7972j1416L6160p3660k5126L9569k1720r0422O6127n1125
2534c83603N8973M4032o4401L3040k7976l4977J99239j21466O5851j13006P8003
2523b66291l2564L3467P141j18962O4014p16R6549q257j30260J75173r0712l6398
2511c07816M7903n6897m2384J58581j09835l7585N6727n190L8796j29395J58484
$$ plain form
2500 -228611 -291740 -381191 -389032 -297745 -325923 -197775 -263540 -320191 -247413 -250426 -204959 -286458
2488 -286458 -260540 -230908 -301828 -301578 -277220 -276791 -277687 -313939 -347922 -381752 -242293 -353924
2476 -353924 -231205 -309587 -186132 -208545 -253369 -242784 -351236 -218797 -259104 -249304 -184613
2465 -184613 -239280 -320152 -237276 -227001 -266124 -279557 -408264 -368845 -245377 -331706 -275465
2454 -275465 -353921 -253612 -354630 -249771 -342793 -345011 -284203 -290150 -299043 -390598 -206779
2443 -206779 -197525 -180923 -281922 -250293 -288875 -329938 -224265 -309600 -317889 -254334 -179813 -373193
2431 -373193 -329772 -288417 -264903 -349801 -316669 -338142 -228919 -219270 -285177 -308418 -181715
2420 -181715 -306365 -338659 -376118 -281188 -324582 -285535 -309575 -194577 -265341 -357569 -367757
$$ packed form
2500b28611o3129q9451p841R1287k8178J28148o5765n6651P2778l013M5467q1499
2488b86458K5918K9632p0920K50K4358M29q96l6252l3983l3830J39459j11631
2476c53924J22719p8382J23455k2413m4824J0585j08452J32439m0307R800O4691
2465a84613n4667q0872Q2876J0275l9123j3433j28707L9419J23468q6329N6241
2454b75465p8456J00309j01018J04859r3022k218O0808n947q893r1555J83819
2443b06779R254J6602j00999L1629l8582m1063J05673q5335q289O3555P4521j93380
2431c73193M3421M1355K3514q4898L3132k1473J09223R649o5907k3241J26703
2420a81715j24650l2294l7459R4930m3394L9047k4040J14998p0764r2228j0188
$$ plain form
2409 -367757 -335061 -314957 -207108 -294951 -408354 -288820 -247231 -202866 -205368 -274104 -325645
2398 -325645 -340300 -293225 -245657 -217813 -286572 -191226 -359021 -288219 -268711 -381281 -314920
2387 -314920 -362256 -271948 -174510 -225672 -266499 -236868 -264501 -334831 -387928 -307823 -280231 -317551
2375 -317551 -317521 -314746 -292587 -292156 -297863 -369422 -402257 -302636 -364710 -344880 -234765 -312818 -206466
2362 -206466 -178088 -379976 -304597 -276938 -399607 -252053 -387268 -434383 -281717 -296224 -371848
2351 -371848 -263635 -373743 -284774 -361846 -232411 -382947 -299158 -238676 -198233 -348193 -276739
2340 -276739 -296954 -231901 -361713 -293567 -325831 -294827 -270594 -331602 -243040 -382424 -355418
2329 -355418 -268253 -354930 -287652 -354853 -271501 -298551 -259372 -320405 -302425 -376525 -267120
$$ packed form
2409c67757L2696K0104J07849q7843j13403J19534M1589M4365k502o8736n1541
2398c25645j4655M7075M7568K7844o8759R5346j67795P0802J9508j12570O6361
2387c14920m7336R0308R7438n1162m0827K9631k7633p0330n3097Q0105K7592l7320
2375c17551L0K775K2159M31n707p1559l2835R9621o2074J9830J10115p8053J06352
2362b06466K8378k01888P5379K7659j22669J47554j35215m7115J52666j4507p5624
2351c71848J08213j10108Q8969p7072J29435j50536Q3789O0482M0443j49960P1454
2340b76739k0215O5053j29812O8146l2264L1004K4233o1008Q8562j39384K7006
2329c55418Q7165q6677O7278o7201Q3352k7050L9179o1033J7980p4100J09405
$$ plain form
2318 -267120 -294464 -316241 -344396 -373224 -232070 -268664 -255074 -349757 -264501 -231434 -251474
2307 -251474 -310118 -302909 -260769 -384491 -266094 -293656 -229511 -243337 -328360 -328180 -319458 -268558
2295 -268558 -310250 -222827 -226859 -210864 -176795 -263606 -379602 -308554 -281379 -318652 -253796 -310059
2283 -310059 -247326 -240936 -249327 -275485 -326409 -213581 -314907 -282356 -239294 -351840 -322783
2272 -322783 -295151 -300769 -269811 -206573 -377312 -255847 -270693 -312335 -210619 -293016 -153450
2261 -153450 -344181 -402138 -269369 -226335 -327238 -345898 -311080 -312296 -259150 -354764 -297193
2250 -297193 -359376 -511667 -330894 -295925 -385329 -231788 -319042 -344116 -137932 -248036 -258303
2239 -258303 -313629 -302872 -403130 -363700 -273482 -135901 -268319 -278073 -362108 -413533 -245932
$$ packed form
2318b67120k7344k1777k8155k8828J41154l6594J3590r4683Q5256L3067k0040
2307b51474n8644P209M2140j23722J18397k7562O4145j3826q5023J80Q722N0900
2295b68558m1692Q7423m032J5995L4069q6811j15996P1048K7175l7273O4856n6263
2283c10059O2733O390q391k6158n0924J12828j01326L2551M3062j12546K9057
2272c22783K7632n618L0958O3238j70739J21465j4846m1642J01716q2397J39566
2261a53450j90731n7957J32769M3034j00903j8660L4818j216N3146r5614N7571
2250b97193o2183j52291J80773L4969q9404J53541q7254k5074K06184j10104j0267
2239b58303n5326J0757j00258L9430R0218J37581j32418r754q4035n1425J67601
$$ plain form
2228 -245932 -328267 -351668 -287441 -341281 -303617 -214536 -245837 -270284 -269375 -313731 -380919 -233530
2216 -233530 -136885 -395910 -295359 -327411 -287444 -290264 -304353 -418821 -317988 -259741 -246226
2205 -246226 -218123 -309437 -231600 -180031 -324713 -265365 -278647 -252053 -347804 -304735 -271211
2194 -271211 -415694 -238870 -280008 -258803 -429393 -247953 -241411 -417148 -233808 -210212 -259354
2183 -259354 -250207 -304154 -316115 -286771 -291732 -350074 -268183 -306544 -304385 -307124 -255800 -334765
2171 -334765 -326072 -261046 -276137 -338515 -302797 -278808 -286470 -273526 -310188 -399147 -409206 -230038
2159 -230038 -323701 -317407 -280549 -381298 -262177 -252268 -288950 -342975 -183613 -344223 -257222
2148 -257222 -376203 -273724 -250453 -343417 -264138 -353413 -240819 -246797 -234755 -230544 -295657
$$ packed form
2228b45932q2335k3401O4227n3840L7664Q9081l1301k4447R09m4356o7188J47389
2216b33530R6645k59025J00551l2052L9967k820j4089j14468J00833N8247J3515
2205b46226K8103r1314P7837N1569j44682N9348j3282K6594r5751M3069L3524
2194b71211j44483J76824m1138K1205j70590J81440O542j75737J83340K3596m9142
2183b59354R147n3947j1961K9344m961n8342Q1891l8361K159k739N1324p8965
2171c34765Q693O5026j5091o2378L5718K3989p662J2944l6662q8959j0059J79168
2159b30038r3663O294L6858j00749J19121R909l6682n4025J59362j60610Q7001
2148b57222j18981J02479K3271r2964P9279q9275J12594n978J2042M211o5113
$$ plain form
2137 -295657 -278232 -363348 -329443 -284716 -215033 -265946 -301686 -290153 -276649 -286452 -301013 -297041
2125 -297041 -337203 -266448 -368280 -308241 -324812 -310245 -300453 -265350 -285575 -345454 -395981 -277823
2113 -277823 -263285 -265898 -328764 -324918 -268199 -256077 -222424 -344650 -308203 -221366 -315204 -300463
2101 -300463 -308166 -372050 -144672 -251215 -312445 -328836 -346513 -406984 -365421 -323881 -382396
2090 -382396 -220277 -302273 -220637 -252252 -385555 -333860 -411494 -300387 -314284 -172267 -234729
2079 -234729 -288901 -310567 -310124 -282808 -309378 -343310 -343253 -317528 -354108 -271183 -358610 -419881 -259956
2066 -259956 -206959 -297181 -341823 -282702 -283932 -319207 -376470 -227343 -246810 -367900 -247518
2055 -247518 -308236 -409980 -239409 -378297 -252501 -215030 -281868 -266685 -384517 -380948 -375171
$$ packed form
2137b95657J7425q5116L3905M4727O9683n0913l5740J1533J3504r803j4561L972
2125b97041m0162P0755j01832O0039j6571J4567R792L5103k0225n9879n0527J18158
2113b77823J4538k613o2866L846N6719J2122L3653j22226L6447Q6837r3838J4741
2101c00463p703o3884K27378j06543o1230j6391j7677o0471M1563M1540n8515
2090c82396J62119q1996Q1636l1615j33303N1695p7634J11107j3897J42017o2462
2079b34729n4172k1666M43K7316k6570l3932N7K5725l6580Q2925q7427o1271J59925
2066b59956N2997r0222m4642N9121j230l5275n7263J49127j9467j21090J20382
2055b47518o0718j01744J70571j38888J25796L7471o6838J5183j17832L569N777
$$ plain form
2044 -375171 -415232 -376902 -181273 -198866 -238281 -344771 -360190 -305853 -369815 -432763 -269018
2033 -269018 -287518 -339327 -236431 -268311 -313903 -222138 -264386 -324770 -319795 -376733 -186351
2022 -186351 -189644 -235624 -165104 -185359 -230736 -301487 -375198 -403292 -253039 -459259 -372579
2011 -372579 -295845 -264721 -224258 -424024 -268697 -175665 -326983 -420629 -376175 -245107 -288943
2000 -288943 -306138 -266709 -354807 -291748 -356724 -319727 -383049 -285517 -286773 -294543 -248046 -240724
1988 -240724 -339726 -238458 -337308 -361927 -278835 -324926 -261798 -313433 -304196 -348632 -273140 -359858
1976 -359858 -339706 -191338 -429140 -334097 -224496 -277918 -305132 -296054 -274741 -269256 -339551
1965 -339551 -268299 -219980 -312228 -266547 -279310 -345179 -255401 -342377 -353350 -256209 -323335 -197839
$$ packed form
2044c75171m0061L8330J95629j7593l9415j06490j5419N4337o3962o2948J63745
2033b69018j8500n1809J02896l1880m5592R1765m2248o0384M975n6938J90382
2022a86351l293m5980P0520k0255m5377p0751p3711k8094J50253k06220Q6680
2011c72579P6734L1124M0463j99766J55327R3032j51318r3646M4454J31068m3836
2000b88943j7195L9429q8098O3059o4976L6997o3322R7532j256p770M6497P322
1988b40724r9002J01268r8850k4619Q3092m6091O3128n1635R237m4436P5492q6718
1976c59858K0152J48368k37802R5043J09601n3422k7214R078K1313N485p0295
1965c39551P1252M8319r2248M5681j2763o5869Q9778q6976j0973R7141o7126J25496
$$ plain form
1953 -197839 -255700 -293452 -298105 -262792 -303505 -245856 -334561 -312289 -303832 -330470 -329725 -226086
1941 -226086 -285576 -355427 -287064 -253731 -250545 -125844 -313079 -267689 -338823 -288114 -383853
1930 -383853 -438171 -251361 -310294 -277148 -245229 -236704 -353078 -337802 -235729 -309958 -147884
1919 -147884 -251732 -236550 -338270 -387363 -313412 -282096 -330091 -414275 -304162 -341528 -361908
1908 -361908 -347478 -233180 -323060 -313347 -250222 -246819 -324414 -344503 -279161 -196832 -217213 -201774
1896 -201774 -274793 -235512 -198789 -386365 -392173 -361453 -243128 -221773 -260332 -294771 -369683
1885 -369683 -287960 -411833 -349260 -242114 -258219 -241980 -197099 -377188 -325007 -201014 -363503
1874 -363503 -286775 -326919 -257545 -297212 -266978 -138855 -394907 -260162 -249604 -339440 -299178
$$ packed form
1953a97839n7861l7752m653L5313m0713N7649q8705K2272Q457k6638P45J03639
1941b26086n9490o9851O8363L3333L186J24701j87235M5390p1134N0709r5739
1930c83853n4318J86810n8933L3146L1919Q525j16374J5276J02073p4229J62074
1919a47884j03848J5182j01720m9093P3951L1316m7995q4184J10113l7366k0380
1908c61908J4430J14298q9880R713O3125L403p7595k0089O5342Q2329k0381J5439
1896b01774p3019L9281L6723j87576n808L0720J18325K1355l8559l4439p4912
1885c69683Q1723j23873O2573J07146j6105J6239M4881j80089N2181J23993j62489
1874c63503P6728m0144O9374l9667L0234J28123k56052J34745J0558q9836M0262
$$ plain form
1863 -299178 -343387 -385492 -265652 -242974 -340147 -194076 -270623 -314627 -251819 -418888 -383179
1852 -383179 -391614 -277734 -358300 -243589 -323155 -286279 -382899 -312550 -249211 -346973 -225263
1841 -225263 -210345 -381853 -327453 -175836 -283510 -367896 -218873 -278861 -319062 -311587 -357886
1830 -357886 -294132 -290676 -331737 -276892 -320099 -341672 -319342 -266611 -319413 -302720 -312903 -252709
1818 -252709 -314377 -179862 -263394 -385680 -201417 -197078 -359156 -276069 -297073 -398777 -393759
1807 -393759 -259109 -383767 -278254 -273555 -197615 -278553 -355955 -270606 -342678 -218558 -321654
1796 -321654 -263565 -240268 -259357 -343667 -253514 -326999 -310870 -223768 -323350 -220011 -374900
1785 -374900 -372317 -326693 -345179 -259112 -335925 -322387 -295955 -270241 -370129 -226279 -230169 -389127
$$ packed form
1863b99178m4209m2105J19840K2678r7173J46071p6547m4004O2808j67069L5709
1852c83179q435J13880q0566J14711p9566L6876r6620P0349O3339r7762J21710
1841b25263J4918j71508N4400J51617j07674q4386J49023n9988m0201P475m6299
1830c57886O3754L456m1061N4845m3207k1573K2330N2731n2802J6693j0183O0194
1818b52709o1668J34515q3532j22286J84263M339j62078Q3087k1004j01704N018
1807c93759J34650j24658J05513M699P5940q0938p7402Q5349p2072J24120j03096
1796c21654N8089K3297j9089q4310R0153p3485J6129Q7102r9582J03339j54889
1785c74900K583M5624j8486Q6067p6813J3538K6432K5714r9888J43850l890j58958
$$ plain form
1773 -389127 -220476 -283261 -390356 -245940 -325979 -348949 -284666 -267155 -417609 -273637 -355103
1762 -355103 -328884 -280171 -287939 -284281 -277689 -319890 -238786 -134459 -334391 -160834 -337215
1751 -337215 -297974 -231256 -268819 -264554 -281719 -334215 -176856 -308459 -266726 -340016 -417086
1740 -417086 -506500 -158811 -383578 -255723 -234076 -236608 -239717 -317251 -361614 -302206 -415498
1729 -415498 -369169 -328276 -357910 -367503 -212124 -257386 -357442 -399171 -408047 -262257 -240221
1718 -240221 -177358 -248383 -364611 -291615 -308412 -367822 -410507 -265578 -390184 -359862 -254052
1707 -254052 -334893 -346501 -316762 -191652 -309986 -268378 -325125 -318681 -331936 -257704 -224564
1696 -224564 -265769 -207077 -299846 -230962 -316298 -381585 -295677 -352710 -239392 -380925 -230988
$$ packed form
1773c89127J68651o2785j07095J44416q0039k2970O4283J7511j50454J43972q1466
1762c55103K6219M8713p768L658O592m2201Q1104J04327j99932J73557j76381
1751c37215L9241O6718l7563M265j7165n2496J57359j31603M1733p3290p7070
1740d17086q9414L47689k24767J27855K1647k532l109p7534m4363N9408j13292
1729d15498M6329M0893k9634r593J55379m5262j00056m1729q876J45790K2036
1718b40221O2863p1025j16228P2996j6797n9410m2685J44929j24606L0322J05810
1707b54052q0841j1608K9739J25110j18334M1608n6747O444j3255P4232L3140
1696b24564m1205N8692r2769O8884q5336o5287Q5908n7033J13318j41533J49937
$$ plain form
1685 -230988 -316273 -308132 -313347 -318691 -312048 -352165 -180588 -369542 -291151 -247212 -297029 -322428
1673 -322428 -351736 -263143 -324431 -265665 -220236 -259224 -249758 -289413 -224462 -405482 -294102
1662 -294102 -283240 -353416 -273610 -282885 -241666 -210146 -373779 -309675 -386136 -443996 -294319
1651 -294319 -363520 -378419 -234686 -350734 -266564 -382990 -276166 -327340 -218786 -130877 -313919
1640 -313919 -279983 -296191 -126654 -282801 -249281 -260460 -248975 -332471 -271382 -236124 -278033
1629 -278033 -365425 -250862 -311724 -301250 -351290 -302018 -274258 -311773 -280452 -265756 -329854
1618 -329854 -329397 -248977 -341402 -294414 -205088 -296956 -299308 -233095 -302866 -331831 -298953 -353806
1606 -353806 -304457 -318614 -283201 -225334 -383160 -331060 -281603 -331136 -358524 -335541 -285373
$$ packed form
1685b30988q5285Q141n215n344O643m0117J71577j88954P8391M3939m9817k5399
1673c22428k9308Q8593o1288N8766M5429l8988R466l9655O4951j81020J11380
1662b94102J0862p0176P9806r275M1219L1520j63633O4104p6461n7860J49677
1651b94319o9201j4899J43733j16048Q4170j16426J06824n1174J08554Q7909j83042
1640c13919L3936j6208J69537j56147L3520j1179J1485q3496O1089L5258m1909
1629b78033q7392J14563o0862J0474n0040M9272K7760l7515L1321J4696o4098
1618c29854M57Q0420r2425M6988Q9326r1868k352O6213o9771k8965L2878n4853
1606c53806M9349j4157L5413N7867j57826N2100M9457m9533k7388K2983N0168
$$ plain form
1595 -285373 -382234 -311736 -326633 -248145 -144345 -242605 -341631 -336816 -362354 -323422 -234650 -384795
1583 -384795 -210674 -302135 -226068 -212817 -421155 -421661 -284665 -380935 -238542 -363342 -142479
1572 -142479 -333065 -356821 -278030 -258790 -401419 -337600 -206642 -249543 -298587 -374171 -338707
1561 -338707 -276234 -255525 -240020 -207828 -309783 -258752 -245523 -220001 -256439 -251315 -247651 -368522
1549 -368522 -242566 -306026 -308952 -318524 -301113 -333973 -247465 -278171 -308056 -371908 -413423 -278281
1537 -278281 -227830 -384876 -257262 -324624 -305022 -212356 -355930 -270265 -314341 -324466 -383023
1526 -383023 -308366 -164142 -293240 -313388 -206877 -343607 -369358 -358353 -285856 -201873 -282990
1515 -282990 -185026 -226558 -319032 -358827 -375408 -363820 -201352 -333868 -355412 -231617 -321224
$$ packed form
1595b85373r6861P0498j4897P8488J03800r8260r9026M815k5538L8932Q8772j50145
1583c84795J74121r1461P6067J3251k08338n06J36996r6270J42393j24800K20863
1572a42479j90586k3756P8791J9240j42629O3819J30958m2901m9044p5584L5464
1561c38707O2473K0709J5505L2192j01955N1031J3229K5522l6438N124L664j20871
1549c68522J25956o3460k926r572J7411l2860Q6508l0706k9885o3852m1515J35142
1537b78281N0451j57046J27614o7362J9602R2666j43574Q5665m4076j0125n8557
1526c83023P4657J44224j29098k0148J06511j36730k5751J1005P2497Q3983q1117
1515b82990R7964m1532r2474l9795j6581J1588J62468j32516k1544J23795q9607
$$ plain form
1504 -321224 -282827 -248563 -412963 -300515 -334885 -453944 -136225 -326629 -384405 -243102
1494 -243102 -240730 -360125 -253019 -414909 -271266 -282000 -350682 -252167 -205225 -294426 -320113
1483 -320113 -324774 -277040 -146164 -289043 -238394 -247797 -280657 -276551 -357650 -321410 -258611 -179414
1471 -179414 -307173 -372428 -282012 -351975 -292677 -261181 -243372 -274673 -366649 -311430 -271686
1460 -271686 -249720 -289812 -182669 -333685 -177463 -234285 -358660 -266746 -243294 -413150 -424554
1449 -424554 -238354 -314415 -338914 -159661 -343664 -401880 -386467 -304150 -368604 -357232 -336872
1438 -336872 -238329 -372010 -280710 -286599 -400221 -217012 -236790 -380015 -170348 -232461 -330400
1427 -330400 -345184 -383798 -307508 -248948 -395788 -345420 -273225 -367695 -276978 -278054 -387904
$$ packed form
1504c21224L8397L4264j64400J12448l4370j19059L17719j90404n7776J41303
1494b43102K372j19395J07106j61890J43643j0734o8682R8515M6942q9201k5687
1483c20113m661M7734J30876j42879N0649r403l2860M106q1099L6240O2799P9197
1471a79414j27759o5255R0416o9963N9298L1496J7809l1301r1976N5219L9744
1460b71686K1966m0092J07143j51016J56222n6822j24375R1914K3452j69856j1404
1449d24554J86200p6061k4499J79253j84003n8216J5413Q2317o4454J1372K0360
1438c36872R8543j33681R1300n889j13622J83209j9778j43225K09667o2113r7939
1427c30400j4784l8614P6290N8560j46840N0368P2195r4470R0717j076j09850
$$ plain form
1416 -387904 -285082 -344285 -293818 -179284 -308627 -295342 -241584 -363089 -232394 -368338
1406 -368338 -321252 -364312 -322231 -399170 -324037 -207947 -199599 -209022 -225453 -398019 -290213
1395 -290213 -240419 -273129 -289139 -292301 -259350 -175212 -288681 -302111 -197074 -369614 -290220
1384 -290220 -352146 -305944 -174222 -242139 -260438 -163358 -405478 -295933 -321602 -314463 -247432
1373 -247432 -367594 -219513 -188532 -346146 -201544 -301261 -342964 -400296 -343067 -372543 -199512
1362 -199512 -296139 -276129 -321419 -309014 -418582 -280833 -293497 -342524 -252770 -298310 -245530
1351 -245530 -378789 -253729 -222858 -418113 -350255 -326809 -346181 -197465 -192929 -223586 -357124
1340 -357124 -261502 -327092 -357213 -263708 -298943 -391711 -274971 -350326 -302393 -396091 -318307
$$ packed form
1416c87904J02822n9203N0467J14534j29343J3285N3758j21505J30695j35944
1406c68338M7086m3060M2081p6939P5133J16090Q348r423j6431j72566J07806
1395b90213M9794l2710j6010l162L2951Q4138j13469j3430J05037j72540P9394
1384b90220o1926M6202J31722o7917j8299R7080k42120J09545k5669P139O7031
1373b47432j20162J48081L0981j57614J44602r9717m1703n7332N7229k9476J73031
1362a99512r6627K0010m5290J2405j09568J37749j2664m9027Q9754m5540N2780
1351b45530j33259J25060L0871j95255O7858K3446j9372J48716M536l0657j33538
1340c57124R5622o5590l0121R3505l5235r2768J16740p5355M7933r3698P7784
$$ plain form
1329 -318307 -276528 -314930 -371803 -316464 -345509 -360452 -376351 -288075 -240431 -349689 -303195
1318 -303195 -227921 -395252 -313917 -190924 -414176 -318687 -213366 -362526 -231635 -247023
1308 -247023 -317371 -318253 -347770 -295081 -177257 -370108 -271561 -276407 -422219 -214324 -271407
1297 -271407 -259494 -287028 -274686 -257324 -271716 -228953 -262905 -345823 -270943 -270528 -253777 -349575
1285 -349575 -353691 -336623 -345101 -356687 -244388 -234746 -346020 -266624 -307399 -238696 -200075 -291837
1273 -291837 -316201 -297036 -329076 -269514 -231793 -314800 -326591 -222163 -437469 -270632 -306994
1262 -306994 -442248 -405563 -232080 -232646 -291156 -416560 -270661 -341515 -335814 -272644 -266105 -317148
1250 -317148 -220094 -264115 -367103 -272046 -249619 -321047 -293979 -383548 -282553 -323922 -279453
$$ packed form
1329c18307M1779l8402n6873N5339k9045j4943j5899Q8276M7644j09258M6494
1318c03195P5274j67331Q1335J22993k23252R5489J05321j49160J30891j5388
1308b47023p0348q82k9517N2689J17824j92851R8547m846j45812K07895n7083
1297b71407J1913k7534J2342J7362j4392M2763l3952q2918P4880M15J6751r5798
1285c49575m116J7068q478j1586J12299R642j11274P9396m0775O8703L8621r1762
1273b91837k4364J9165l2040N9562L7721q3007j1791J04428k15306J66837l6362
1262c06994j35254L6685J73483n66n8510j25404J45899p0854N701O3170O539n1043
1250c17148R7054m4021j02988R5057K2427p1428K7068q9569J00995m1369M4469
$$ [...]
##END NTUPLES=NMR SPECTRUM
##END=
