##TITLE=abcd
##JCAMPDX= 6.0         $$ Bruker NMR JCAMP-DX V2.0
##DATA TYPE= NMR SPECTRUM
##DATA CLASS= NTUPLES
##ORIGIN= UXNMR, Bruker Analytische Messtechnik GmbH
##OWNER= root
$$ XWIN-NMR		Version 3.5
$$ Thu Apr 16 19:05:35 2026 Russian Standard Time (UT+4h)  servis@DPX200
##.OBSERVE FREQUENCY= 200.131235884673
##.OBSERVE NUCLEUS= ^1H
##.ACQUISITION MODE= SIMULTANEOUS
##.ACQUISITION SCHEME= undefined
##.AVERAGES= 32
##.DIGITISER RES= 18
##SPECTROMETER/DATA SYSTEM= spect
##.PULSE SEQUENCE= zg
##.SOLVENT NAME= CDCl3
##.SHIFT REFERENCE= (INTERNAL, CDCl3, 0, 16.4885)
##AUDIT TRAIL= $$ (NUMBER, WHEN, WHO, WHERE, WHAT)
$$ ##TITLE= Audit trail, XWIN-NMR		Version 3.5
$$ ##JCAMPDX= 5.01
$$ ##ORIGIN= Bruker BioSpin GmbH
$$ ##OWNER= servis
$$ F:\spectra/data/av/nmr/H1/1/pdata/1/auditp.txt
$$ ##AUDIT TRAIL=  $$ (NUMBER, WHEN, WHO, WHERE, WHAT)
(   1,<2026-04-16 19:03:48.20 +0400>,<servis>,<DPX200>,
      <created by zg, POWCHK disabled, PULCHK disabled
       configuration hash MD5:
       00 E9 B6 7A A2 85 ED C7 34 08 36 98 17 FE 4E 26
       data hash MD5: 32K
       B7 86 50 33 63 E8 E2 61 8E A8 76 2D 99 CF 3D AC>)
(   2,<2026-04-16 19:05:07.37 +0400>,<servis>,<DPX200>,
      <Start of raw data processing
       efp BC_mod = 2 LB = 0.05 FT_mod = 6 PKNL = 1 PHC0 = -262.6274 PHC1 = 3.101563 SI = 16K 
       data hash MD5: 16K
       0C 88 4E B8 D8 B5 EB 80 E9 49 B4 26 E9 77 43 44>)
$$ ##END=
$$ 
$$ hash MD5
$$ 9E 87 44 5E 7E 3E CF 7D BA 42 02 BE DC A2 69 08
##$RELAX= 
##$RELAX= 
##$RELAX= 
##$RELAX= 
##$RELAX= 
##$RELAX= 
##$RELAX= 
##$RELAX= 
$$ Bruker specific parameters
$$ --------------------------
##$DU= <F:\spectra>
##$EXPNO= 1
##$NAME= <H1>
##$PROCNO= 1
##$TYPE= <nmr>
##$USER= <av>
##$AMP= (0..31)
100 100 100 100 100 100 100 100 100 100 100 100 100 100 100 100 100 100 
100 100 100 100 100 100 100 100 100 100 100 100 100 100 
##$AQSEQ= 0
##$AQ_mod= 1
##$AUNM= <au_zg>
##$AUTOPOS= <>
##$BF1= 200.13
##$BF2= 200.13
##$BF3= 200.13
##$BF4= 200.13
##$BF5= 500.13
##$BF6= 500.13
##$BF7= 500.13
##$BF8= 500.13
##$BYTORDA= 1
##$CFDGTYP= 0
##$CFRGTYP= 5
##$CHEMSTR= <none>
##$CNST= (0..31)
1 1 145 1 1 1 1 1 1 1 1 1 1 1 1 1 1 1 1 1 1 1 1 1 1 1 1 1 1 1 1 1 
##$CPDPRG= <>
##$CPDPRG1= <>
##$CPDPRG2= <>
##$CPDPRG3= <>
##$CPDPRG4= <mlev>
##$CPDPRG5= <mlev>
##$CPDPRG6= <mlev>
##$CPDPRG7= <mlev>
##$CPDPRG8= <mlev>
##$CPDPRGB= <>
##$CPDPRGT= <>
##$D= (0..31)
0 2 0 0 0 0 0 0 0 0.06 0 0 0 0 0 0 0.0002 0 0 0 0 0 0 0 0 0 0 0 0 0 0 
0 
##$DATE= 1776351827
##$DBL= (0..7)
120 120 120 120 120 120 120 120 
##$DBP= (0..7)
150 150 150 150 150 150 150 150 
##$DBP07= 0
##$DBPNAM0= <>
##$DBPNAM1= <>
##$DBPNAM2= <>
##$DBPNAM3= <>
##$DBPNAM4= <>
##$DBPNAM5= <>
##$DBPNAM6= <>
##$DBPNAM7= <>
##$DBPOAL= (0..7)
0.5 0.5 0.5 0.5 0.5 0.5 0.5 0.5 
##$DBPOFFS= (0..7)
0 0 0 0 0 0 0 0 
##$DE= 6
##$DECBNUC= <off>
##$DECIM= 32
##$DECNUC= <off>
##$DECSTAT= 4
##$DIGMOD= 1
##$DIGTYP= 9
##$DL= (0..7)
0 120 120 120 120 120 120 120 
##$DP= (0..7)
150 150 150 150 150 150 150 150 
##$DP07= 0
##$DPNAME0= <>
$$ [...]
##$SUBNAM4= <"">
##$SUBNAM5= <"">
##$SUBNAM6= <"">
##$SUBNAM7= <"">
##$SUBNAM8= <"">
##$SUBNAM9= <"">
##$SW= 20.6817932712277
##$SWIBOX= (0..15)
0 0 3 0 0 0 0 0 0 0 0 0 0 0 0 0 
##$SW_h= 4139.07284768212
##$TD= 32768
##$TD0= 1
##$TE= 0
##$TE2= 300
##$TE3= 300
##$TEG= 300
##$TL= (0..7)
0 120 120 120 120 120 120 120 
##$TP= (0..7)
150 150 150 150 150 150 150 150 
##$TP07= 0
##$TPNAME0= <>
##$TPNAME1= <>
##$TPNAME2= <>
##$TPNAME3= <>
##$TPNAME4= <>
##$TPNAME5= <>
##$TPNAME6= <>
##$TPNAME7= <>
##$TPOAL= (0..7)
0.5 0.5 0.5 0.5 0.5 0.5 0.5 0.5 
##$TPOFFS= (0..7)
0 0 0 0 0 0 0 0 
##$TUNHIN= 0
##$TUNHOUT= 0
##$TUNXOUT= 0
##$USERA1= <user>
##$USERA2= <user>
##$USERA3= <user>
##$USERA4= <user>
##$USERA5= <user>
##$V9= 5
##$VALIST= <valist>
##$VCLIST= <CCCCCCCCCCCCCCC>
##$VD= 0
##$VDLIST= <DDDDDDDDDDDDDDD>
##$VPLIST= <PPPPPPPPPPPPPPP>
##$VTLIST= <TTTTTTTTTTTTTTT>
##$WBST= 1024
##$WBSW= 30
##$XGAIN= (0..3)
0 0 0 0 
##$XL= 0
##$YL= 0
##$YMAX_a= 667369
##$YMIN_a= -447830
##$ZGOPTNS= <>
##$ZL1= 120
##$ZL2= 120
##$ZL3= 120
##$ZL4= 120
##$ABSF1= 0
##$ABSF2= 0
##$ABSG= 0
##$ABSL= 0
##$ALPHA= 0
##$AQORDER= 0
##$ASSFAC= 0
##$ASSFACI= 0
##$ASSFACX= 0
##$ASSWID= 0
##$AUNMP= <proc_1d>
##$AZFE= 0.1
##$AZFW= 0.1
##$BCFW= 0
##$BC_mod= 2
##$BYTORDP= 0
##$COROFFS= 0
##$CY= 18.4799938201904
##$DATMOD= 1
##$DC= 0
##$DFILT= <>
##$DTYPP= 0
##$F1P= 9.9274215381318
##$F2P= -0.165520771350173
##$FCOR= 1
##$FTSIZE= 16384
##$FT_mod= 6
##$GAMMA= 0
##$GB= 0
##$INTBC= 1
##$INTSCL= 4.127829e-11
##$ISEN= 128
##$LB= 0.05
##$LEV0= 0
##$LPBIN= 0
##$MAXI= 10000
##$MC2= 0
##$MEAN= 0
##$ME_mod= 0
##$MI= 50
##$NCOEF= 0
##$NC_proc= -6
##$NLEV= 6
##$NOISF1= 3.799351
##$NOISF2= 2.8
##$NSP= 0
##$NTH_PI= 0
##$NZP= 0
##$OFFSET= 16.48848
##$PC= 4
##$PHC0= -262.6274
##$PHC1= 3.101563
##$PH_mod= 1
##$PKNL= yes
##$PPARMOD= 0
##$PSCAL= 4
##$PSIGN= 0
##$REVERSE= no
##$SF= 200.130005582386
##$SI= 16384
##$SIGF1= 3
##$SIGF2= 2
##$SINO= 400
##$SIOLD= 16384
##$SREGLST= <1H.CDCl3>
##$SSB= 0
##$STSI= 16384
##$STSR= 0
##$SW_p= 4139.07284768211
##$SYMM= 0
##$S_DEV= 0
##$TDeff= 32768
##$TDoff= 0
##$TI= <>
##$TILT= no
##$TM1= 0
##$TM2= 0
##$TOPLEV= 0
##$USERP1= <user>
##$USERP2= <user>
##$USERP3= <user>
##$USERP4= <user>
##$USERP5= <user>
##$WDW= 1
##$XDIM= 16384
##$YMAX_p= 383387987
##$YMIN_p= -2360375
$$ End of Bruker specific parameters
$$ ---------------------------------
##NTUPLES= NMR SPECTRUM
##VAR_NAME=  FREQUENCY,     SPECTRUM/REAL,   SPECTRUM/IMAG
##SYMBOL=    X,             R,               I
##VAR_TYPE=  INDEPENDENT,   DEPENDENT,       DEPENDENT
##VAR_FORM=  AFFN,          ASDF,            ASDF
##VAR_DIM=   16384,         16384,           16384
##UNITS=     HZ,            ARBITRARY UNITS, ARBITRARY UNITS
##FACTOR=    0.252644378177508, 1,           1
##FIRST=     3299.83951724647, 0,            0
##LAST=      -839.233330435636, 0,           0
##MIN=       -839.233330435636, -2360375,    0
##MAX=       3299.83951724647, 383387987,    0
$$ Real data points
##PAGE= N=1
##DATA TABLE= (X++(R..R)), XYDATA
$$ [...]
11927i5773O73845n43212Q4139j53707j197938J888513m40818m01819L30195j071181
$$ -95773 578072 34860 118999 -34708 -1232646 655867 215049 -186770 143425 -927756
11917i27756J27069Q77236l35628m09763K20058P04501J98387m20610p80834J30056
$$ -927756 -800687 76549 -259079 -668842 -448784 255717 454104 33494 -747340 -617284
11907f17284J145219j09398j6825k87499j73741j52563j078308K43534J604777
$$ -617284 527935 418537 401712 114213 -59528 -212091 -1290399 -1046865 557912
11898E57912r50474N67961K14277k22749n82976N58860o05446M25254r64437N88511
$$ 557912 -392562 175399 389676 166927 -416049 142811 -462635 -37381 -1001818 -413307
11888d13307J78441K84416l06579m46083r6495n3634R34473r27380Q62347j077771
$$ -413307 -234866 49550 -257029 -703112 -799607 -853241 81232 -846148 16199 -1061572
11878a061572J93875K252461j338597j73065o11L29331j5370m03467j97576m32222
$$ -1061572 -867697 1384764 46167 -126898 -127509 201822 186452 -217015 -414591 -846813
11868h46813K66553N72842j46714l03895k86971R70874R1577j237694K25224J82541
$$ -846813 -580260 -7418 -154132 -458027 -744998 225876 317453 -920241 -695017 -512476
11858e12476p835p55609J302333m77282R31460j431713P49576k21247j07909K97493
$$ -512476 -520311 -1275920 26413 -450869 480591 -951122 -201546 -422793 -530702 -233209
11848b33209J159735j453015O54668R7692l17649m26062J88876K63319j76892
$$ -233209 926526 -526489 128179 225871 -91778 -517840 -328964 -65645 -242537
11839b42537L07615n06048l14722J349868m47158o30430K06970J68850K02928
$$ -242537 65078 -440970 -755692 594176 147018 -483412 -276442 -107592 95336
11830I5336l82951k56231O68403m2983n80926L45293j21886k79857p1886O54902
$$ 95336 -287615 -543846 124557 81574 -499352 -154059 -275945 -555802 -627688 27214
11820B7214J37124o01131R80826j794516J197661p56357p8373R50756J54251j170123
$$ 27214 164338 -436793 544033 -1250483 -52822 -809179 -887552 63204 217455 -952668
11810i52668M41145k25598n9624K39610j76561J292281n06310J06624J000094
$$ -952668 -511523 -737121 -796745 -557135 -733696 558585 52275 158899 1158993
11801A158993j458215n20090M69309J451349j461885R9891M26273j34473J29154
$$ 1158993 -299222 -819312 -350003 1101346 -360539 -260648 165625 31152 160306
11792A60306l34315N91608j063550K04228n51537J94241K36404M49371N8805Q20588
$$ 160306 -174009 417599 -645951 -441723 -993260 -799019 -562615 -113244 -54439 766149
11782G66149j137584N04874K56615P7818j611407R70214k76254L92172P43081
$$ 766149 -371435 133439 390054 467872 -1143535 -173321 -449575 -57403 685678
11773F85678L69506j161879m97980l55752J106575M60961j367262N38061p6160
$$ 685678 1055184 -106695 -604675 -960427 146148 607109 -760153 -222092 -298252
11764b98252M16083j4525j41129K92209K49184p66278R33354m94103r15695K2845
$$ -298252 117831 103306 -37823 254386 503570 -262708 670646 176543 -739152 -716307
11754g16307Q33140k77735K25169j279175J484603j033017R26100l1123l39367
$$ -716307 116833 -160902 64267 -1214908 269695 -763322 162778 131655 -207712
11745b07712R96592n26716P6310M1206k02158m65327M01678L61017j052374J302395
$$ -207712 788880 262164 338474 379680 177522 -287805 113873 474890 -577484 724911
11735G24911l95101j282121P00927J21759R4171p79475M42661N99255k28841K07005
$$ 724911 329810 -952311 -251384 -129625 -35454 -814929 -372268 226987 -1854 205151
11725B05151m23777K8553L57846j43037M34832J3687j610486J769163j338438
$$ 205151 -218626 -190073 167773 24736 459568 473255 -1137231 631932 -706506
11716g06506N50806j33261o8208O45822J78088k17419l91639M79657j165708R4681
$$ -706506 -155700 -288961 -357169 288653 466741 249322 -142317 337340 -828368 -733687
11706g33687K91521m4298O58869n23022M5701L43113j29059l38445N47239m39377
$$ -733687 -442166 -486464 172405 -350617 -304916 38197 -90862 -429307 117932 -321445
11696c21445L45348L32906o04947k91129J86233K03244P92320m63912l85909l18483
$$ -321445 23903 356809 -248138 -539267 -353034 -149790 642530 178618 -207291 -525774
11686e25774M06147k48230N53684l25292N18408p74813L20612m82635j66520N45875
$$ -525774 -119627 -367857 185827 -139465 378943 -395870 -75258 -557893 -724413 -178538
11676a78538M37663n47978Q05479j152287J74443J780980j737461r13014Q70749
$$ -178538 259125 -288853 516626 -635661 -461218 1319762 -417699 -1330713 -459964
11667d59964j06433O46650j93398J894625k298615L86712L19286j302886R70554
$$ -459964 -566397 80253 -113145 1781480 -517135 -130423 188863 -1114023 -143469
11658a43469j56877p0925N72673o10965n07140M63354K40928j210559O36862J522750
$$ -143469 -300346 -371271 201402 -409563 -916703 -453349 -212421 -1422980 -786118 736632
11648G36632q36748L50060p17601n6005l66555N50452J33321L91647l96125M88390
$$ 736632 -100116 249944 -467657 -523662 -890217 -339765 -206444 185203 -210922 277468
11638B77468Q197m60686j266085J246200N86686o98073O10252r79717K42305R38392
$$ 277468 285665 -175021 -1441106 -194906 391780 -306293 303959 -675758 -433453 504939
11628E04939p08475o26889R21535K91465l6430m03429r60730L87888J62512O34322
$$ 504939 -203536 -830425 91110 382575 346145 -57284 -1018014 -630126 -467614 166708
11618A66708K14571j070836P62864m13683n701N30092m69677M7298n73791M13166
$$ 166708 381279 -689557 73307 -340376 -346077 184015 -285662 -238364 -812155 -398989
11608c98989N76340p86284P44475r66296O57775J78209O96896k28734k25763n23624
$$ -398989 177351 -608933 135542 -830754 -172979 5230 702126 473392 247629 -275995
11598b75995M35142n91196N50949m12579N07219N6872J76587p93912L00290P3698
$$ -275995 159147 -432049 118900 -293679 213540 270412 446999 -346913 -46623 27075
11588B7075L51506n84232J62242j34510m55675J068493k4625k77736l13599M40737
$$ 27075 378581 -205651 -43409 -177919 -633594 434899 410274 132538 -181061 259676
11578B59676j63740l19037M86735q8285k43680J13462k69722Q70630L48010r73501
$$ 259676 95936 -223101 263634 175349 -68331 45131 -224591 646039 994049 20548
11568B0548l46711O20171n85452k71104Q96043L70421n40230M14201n48001n1677
$$ 20548 -326163 294008 -291444 -562548 333495 703916 163686 577887 29886 -21791
11558b1791P21434r09163o1631M69156k74960L75139j57644N49168j94673K13064
$$ -21791 699643 -209520 -271151 198005 -76955 298184 140540 689708 495035 708099
11548G08099r59438n15672O05845P65790m77403p39653k73859P54982j00090O35147
$$ 708099 -251339 -767011 -161166 604624 127221 -612432 -886291 -131309 -231399 403748
11538D03748N09766j324955J60851J400876j154665l38977p6096J031316p7931
$$ 403748 913514 -411441 -250590 1150286 -4379 -343356 -419452 611864 533933
11529E33933m74437K8031m46422N93665l12261p99144N47145r14377J110722J93414
$$ 533933 59496 87527 -358895 234770 -77491 -876635 -329490 -1243867 -133145 60269
11519F0269M67807j206679R667J27613j9822O168Q95106m79772J89309j54798
$$ 60269 528076 -678603 -668936 -541323 -561145 -554977 340129 -139643 49666 -105132
11509a05132J32197k9011Q56755j708584J586251j266599R65902j01924k92597
$$ -105132 27065 -1946 854809 -853775 732476 -534123 431779 329855 37258
11500C7258K02162n36151N78903l41759o69931j83238Q37031J106661j039422
$$ 37258 239420 -296731 282172 -59587 -729518 -912756 -75725 1030936 -8486
11491h486L16787R2274O19244j075179N09863m32365o014J48663q40767Q69526
$$ -8486 308301 400575 1019819 -55360 454503 22138 16124 164787 -675980 193546
11481A93546n03618n09282Q34476k35163J44289J59074q66363J66144n55990L09761
$$ 193546 -310072 -819354 15122 -220041 -75752 83322 -783041 -616897 -1172887 -863126
11471h63126J020397q31909R72092k43263j76946K49906r81278N65666J77788
$$ -863126 157271 -674638 297454 54191 -122755 127151 -854127 -288461 -110673
11462a10673l79655N52248O8853J95046n29735k12667M81613q60071l20064J414955
$$ -110673 -490328 61920 130773 325819 -203916 -416583 65030 -795041 -1115105 299850
11452B99850M83669k025774R84877J343959j103232n2191O45641o7311k18858
$$ 299850 783519 -1242255 -257378 1086581 -16651 -68842 576799 509488 290630
11443B90630o48646n56932J456670k18234o27959J125837n76989p38606Q12906
$$ 290630 -358016 -914948 541722 323488 -304471 821366 244377 -494229 318677
11434C18677j27658p85040R33141q86479O01093O53182j12072J25826m24414N54242
$$ 318677 191019 -594021 339120 -547359 53734 706916 594844 720670 296256 850498
11424H50498o68918j54720J68565k80033k72777j04958M91273Q33822l54271R83958
$$ 850498 181580 26860 195425 -84608 -357385 -462343 28930 862752 508481 1492439
11414A492439n46262l04741k60364L75754j197930J288150l01872o92775o04990
$$ 1492439 946177 641436 381072 756826 -441104 847046 545174 -147601 -752591
11405g52591O57237P3643O05867o0532o23420N46003p17718o19374L95800P68978
$$ -752591 -95354 -21711 584156 523624 -99796 446207 -271511 -890885 -495085 273893
11395B73893k13833o3148k24649L48209n33471r6534M07040n01402P23782L81415
$$ 273893 60060 -3088 -227737 120472 -412999 -509533 -102493 -603895 119887 501302
11385E01302j335101N62720n9924P02329o80356j47553N50620l48949K07623l0355
$$ 501302 -833799 -271079 -331003 371326 -309030 -456583 94037 -254912 -47289 -77644
11375g7644O56099o82161k18051J042921p42585o6341n30515M35609J34714Q11181
$$ -77644 578455 -103706 -321757 721164 -21421 -87762 -618277 -182668 -47954 763227
11365G63227j090688P09789Q1418L38995r70850J123777j224318k94767K34138
$$ 763227 -327461 382328 463746 802741 -168109 955668 -268650 -563417 -329279
11356c29279O4977J23316o37037P10430Q24277l96424m6058l26726k66148J5369
$$ -329279 -264302 -140986 -778023 -67593 756684 360260 314202 -12524 -278672 -263303
11346b63303j69844P03721M74469o46321O16253j186202M46476m7868l94273O22164
$$ -263303 -433147 270574 745043 98722 714975 -471227 -24751 -72619 -466892 155272
11336A55272J84988r48516M85589K64678k02278j29106N68775L65025q25343K02237
$$ 155272 340260 -608256 -122667 142011 -60267 -189373 379402 744427 -80916 121321
11326A21321Q34862j464967J536085j143426n45250R07770j026199J265630n93545
$$ 121321 956183 -508784 1027301 -116125 -661375 246395 -779804 485826 -107719
11317a07719k22908N92198q22476J246959n122q32963L70738p47444Q64813o02954
$$ -107719 -330627 261571 -560905 686054 680932 -152031 218707 -528737 336076 -266878
11307b66878K09506J29765N75036l33531J7897o10084O63577k62084j096227J483966
$$ -266878 -57372 72393 647429 313898 331795 -278289 385288 123204 -973023 510943
11297E10943n26357l05125Q34115k94432m34382R18412n00120m39027J87913R97428
$$ 510943 -15414 -320539 513576 219144 -215238 703174 203054 -235973 -48060 949368
11287I49368o10597m42503K73230O49664r508p05349j35409K89776R1366K27127
$$ 949368 338771 -103732 169498 819162 809654 104305 -31104 258672 350038 577165
11277E77165K20329o11816M46469p31140P96310j90739p22055J078134m78261
$$ 577165 797494 185678 632147 -98993 697317 506578 -215477 862657 384396
11268C84396q45106J461245N08715j817876J098640j24355K40909k87192p06377
$$ 384396 -460710 1000535 1509250 -308626 790014 665659 906568 619376 -87001
11259h7001R10146l83969K40674l97180k70332J29982l11195Q35640n55603J299820
$$ -87001 823145 439176 679850 282670 12338 142320 -168875 666765 111162 1410982
11249A410982r24133j54127R47787o93275j030260R37641L45444j723680J977935
$$ 1410982 486849 332722 1280509 587234 -443026 494615 840059 -883621 1094314
11240A094314m70294J46114o6917p60678Q57885n11602M50814j00772N64422q26878
$$ 1094314 624020 770134 703217 -57461 800424 288822 739636 638864 1203286 376408
11230C76408L18446N85754n56897k78280j98413k72442O53478M05140J01883R89241
$$ 376408 694854 1280608 723711 445431 247018 -25424 628054 1033194 1135077 2124318
11220B124318K82919J70273K308266m47164j381122N04634o36269j382718j53928
$$ 2124318 2407237 2577510 4885776 4438612 3057490 3562124 2925855 1543137 1389209
11211A389209P69624j165917J53858J61683o57541p40965M40210j314417J660767
$$ 1389209 2158833 992916 1146774 1308457 650916 -90049 350161 -964256 696511
11202F96511q05086j01414K85067N40576J3468r73215O96695K38953l83823K31051
$$ 696511 -108575 -209989 75078 615654 629122 -344093 352602 591555 207732 438783
11192D38783l9636k99070P2675K22860O86947m61775l58135L31615L9139M5462
$$ 438783 399147 100077 172752 395612 1082559 620784 262649 594264 633403 678865
11182F78865l34283K56792N3073n50988L56301M65368j092933O1179M12656m68061
$$ 678865 344582 601374 654447 103459 459760 925128 -167805 -106626 306030 -162031
11172a62031k27278R72248n79311L15661o64410R48204l79656L19173o22999Q7152
$$ -162031 -389309 582939 3628 319289 -345121 603083 223427 542600 -80399 6753
11162F753N61483k6410N4322n09841n87604K91757N11259O9159k34301r1489M34542
$$ 6753 568236 541826 596148 86307 -501297 -209540 301719 370878 136577 45088 479630
11151D79630K42417q96710J031113j404332L97295Q01245m8279K73649q73533
$$ 479630 722047 -174663 856450 -547882 -150587 650658 602379 876028 2495
11142B495J43664Q36429l93758p07727R59258n72970M25867k45629q21426P33970
$$ 2495 146159 982588 588830 -118897 840361 267391 693258 447629 -373797 360173
11132C60173N07085n21658m25540N90257j85978L61923l25521l56517Q53773j41779
$$ 360173 867258 345600 -79940 510317 324339 686262 360741 4224 857997 716218
11122G16218m61251M15683N7475N714m71675J48404j057482R67457N79600k32477
$$ 716218 254967 670650 728125 733839 262164 410568 -646914 320543 900143 667666
11112F67666k16631k47937J056702j858191J203382k00209o31776J22379N42474
$$ 667666 451035 203098 1259800 -598391 604991 404782 -226994 -104615 437859
11103D37859R36285l53017j467423K86974O51266J129528j914462Q14091L52151
$$ 437859 1374144 1021127 -446296 -159322 491944 1621472 -292990 521101 873252
11094H73252K49745K310p76275N08002q54983N73887o91081j62064L84530Q9241
$$ 873252 1122997 1125307 349032 857034 2051 575938 -115143 -277207 107323 196564
11084A96564N37228l28720L14970n08917L95927n3753r0813J22191j87115k33685
$$ 196564 733792 405072 720042 211125 607052 553299 462486 584677 397562 163877
11074A63877p39829P92194J25663q39676J163475m59406k82887Q85421n67421
$$ 163877 -575952 216242 341905 -497771 665704 206298 -76589 808832 241411
11065B41411J107721j524823l47153R46647m78445J406820j675822L39501J006217
$$ 241411 1349132 -175691 -522844 423803 -54642 1352178 -323644 15857 1022074
11056A022074o07849N41282j97325q70473J105715l67297J45178L5300l84403
$$ 1022074 414225 955507 758182 -112291 993424 626127 771305 806605 422202
11047D22202K4974O53845j17300l30782L98100l01189L09583L07689j255487O00101
$$ 422202 447176 1101021 983721 652939 1051039 749850 1059433 1367122 111635 711736
11037G11736m23731m8798P5000Q1029O75842L69572r16986R5724J22701k00905
$$ 711736 288005 239207 314207 395236 1071078 1440650 523664 619388 742089 541184
11027E41184J95490N66274o67493n16383j83849M63416q3608P69749n86884q99620
$$ 541184 736674 1302948 635455 119072 -64777 398639 315031 1084780 497896 -401724
11017d01724P34984Q07869P59693j912924K27384N08232j83060P85463L63546
$$ -401724 333260 1141129 1900822 -12102 215282 723514 540454 1325917 1689463
11008A689463q97682k78070p9728k33463M40684p13407M7373M8540M76880m86573
$$ 1689463 791781 513711 433983 200520 641204 -72203 -24830 23710 500590 14017
10998A4017j23854O31628Q6813K92876P73356m80740m21205l16912M44205n01179
$$ 14017 -109837 521791 608604 901480 1674836 1194096 772891 455979 900184 399005
10988C99005n61350K42068j56924Q94884m80087j28567K95017o22912O41704j2564
$$ 399005 -162345 79723 -77201 817683 337596 209029 504046 -118866 522838 510274
10978E10274K11312m49703J00867K02266k9808j62579N65323o65938J062400j121933
$$ 510274 721586 271883 372750 575016 545208 382629 947952 282014 1344414 222481
10968B22481N33859l32315L04949n84591P30377m04579J9817K54412j78759l37386
$$ 222481 756340 424025 728974 144383 874760 470181 489998 744410 565651 228265
10958B28265N56455r66254O04079j64411N67833k21107N70710p66042O96755q02219
$$ 228265 784720 -181534 422545 258134 825967 604860 1175570 409528 1106283 304064
10948C04064k18175L47696n5441R45320J16401j135210Q55519J32382j074180
$$ 304064 85889 433585 378144 1323464 1439865 304655 1160174 1292556 218376
10939B18376j78884r5856Q25538J021925j223341J47293M1544K96961n03613L83563
$$ 218376 39492 -56364 769174 1791099 567758 715051 756595 1053556 549943 933506
10929I33506o91506Q84539M4111m29848j18271J28645N4649Q54007j088129k15674
$$ 933506 242000 1126539 1170650 740802 622531 751176 805825 1659832 571703 356029
10919C56029M58536n60339j219338J503364M78213r19938M73541M06675m83392
$$ 356029 814565 254226 -965112 538252 1016465 96527 570068 976743 493351
10910D93351K59877o35556l38644J115729k80440K17459k1313l21934k28849L86950
$$ 493351 753228 117672 -220972 894757 614317 831776 810463 488529 259680 646630
10900F46630P39122m99337k64450P4845J838964k046280J59484L98970n10589
$$ 646630 1385752 886415 621965 696810 2535774 489494 648978 1047948 537359
10891E37359j3527m79311Q76189r06595J445762m54297j14179j46931K43778M34340
$$ 537359 523832 44521 920710 14115 1459877 1005580 891401 744470 988248 1422588
10881A422588r55152j95739Q04912r391l74941O39129n73433m25344M52222k51510
$$ 1422588 467436 271697 1076609 1067218 692277 1331406 757973 332629 784851 533341
10871E33341J054455l79212n23453K18493K97996r0310j154851J134367O6081
$$ 533341 1587796 1208584 685131 903624 1201620 1111310 -43541 1090826 1156907
10862A156907m28297O36982n37082n67591J247788l85390l96000Q92567k62327
$$ 1156907 728610 1365592 828510 260919 1508707 1123317 727317 1619884 1357557
10853A357557k0578l31674k61033N0527k96795N54276j67010j56347J75925O36485
$$ 1357557 1336979 1005305 744272 794799 498004 1052280 885270 728923 904848 1541333
10843A541333n84537p53389K32859o70675J601089O14p72505R95429m03376N29831
$$ 1541333 956796 203407 436266 -234409 1366680 1367294 594789 1590218 1186842 1716673
10833A716673l84824q72664J78679N78018J36895K01641j271599P2503J419403
$$ 1716673 1331849 459185 637864 1215882 1352777 1554418 282819 355322 1774725
10824A774725l80916k4533o2326l85460k05088N33800K46943m62031K06040J07040
$$ 1774725 1393809 1369276 1306950 921490 716402 1250202 1497145 1035114 1241154 1348194
10814A348194l25352J5935p70006J243187k24170P3126N91170l69499n32688j98914
$$ 1348194 1022842 1038777 268771 1511958 1287788 1360914 1952084 1582585 1049897 850983
10804H50983P5117K67778p47624N5555k18876J067676k91613l89028N04303M89572
$$ 850983 926100 1193878 446254 501809 282933 1350609 1058996 669968 1174271 1663843
10794A663843j21966p35325O52573M06695j232565N19221K85171n28574J09059
$$ 1663843 1541877 806552 1459125 1865820 633255 1152476 1437647 909073 1018132
10785A018132l66916O88453j23535K36604o07752Q77518k30279l04826l13480
$$ 1018132 651216 1339669 1216134 1452738 844986 1722504 1492225 1187399 873919
10776H73919j64972M54964J000098l23099j329460O55720k99248k98858J157950
$$ 873919 708947 1163911 2164009 1840910 511450 1167170 867922 569064 1727014
10767A727014J51835J23597m13570q7892l56959l75013J139965m97840L07931
$$ 1727014 1878849 2002446 1588876 1500984 1144025 769012 1908977 1411137 1719068
10758A719068m62335k22598O43104k09582o24342O33831r67316P96064l86755
$$ 1719068 1256733 1034135 1677239 1467657 843315 1477146 509830 1305894 919139
10749I19139r34660P53193l14600P75817O87165o98041L83702M61401j057584
$$ 919139 -15521 737672 423072 1198889 1886054 1188013 1571715 2033116 975532
10740I75532L48404j000186P40296P93182o52961k69839m8418R2751M48437l53256
$$ 975532 1323936 323750 1064046 1857228 1204267 934428 886010 978761 1427198 1073942
10730A073942j36723K27984j50985L83967j245309J384069O32828j550844J540941
$$ 1073942 937219 1165203 1014218 1398185 152876 1536945 2169773 618929 2159870
10721B159870j253786N2860k1392l22216P55632N054m51413J201707o83526o28218
$$ 2159870 906084 958944 937552 615336 1370968 1376022 924609 2126316 1442790 814572
10711H14572P4125K74342O27196o46890O938l18000L45114k44240k67242M68804
$$ 814572 888697 1163039 1790235 1143345 1150283 832283 1177397 933157 665915 1134719
10701A134719q0788M71595o2425l45199Q72014p76016N83826l22262l72880L51708
$$ 1134719 1053931 1525526 1463101 1117902 1989916 1213900 1797726 1475464 1102584 1454292
10691A454292J33498P19908l97049k29017J30262p33512J368829j257791Q38955
$$ 1454292 1587790 2307698 1910649 1681632 1811894 1078382 2447211 1189420 2028375
10682B028375j061202Q1584L60022m33306Q55434J072304j524725q64558P08294
$$ 2028375 967173 1048757 1408779 975473 1830907 2903211 1378486 513928 1222222
10673A222222k29432M83197N27636q16205J32664J315233m81808L44513p11042
$$ 1222222 992790 1475987 2003623 1187418 1320082 2635315 2153507 2498020 1786978
10664A786978k93378L68021K15072o71869o20201P26310m22155Q18182Q05495
$$ 1786978 1493600 1861621 2076693 1404824 784623 1510933 1088778 1906960 2712455
10655B712455j752958M15391J21237N89759q71380j18244q5721K86283J40318
$$ 2712455 959497 1374888 1496125 2085884 1214504 1096260 1010539 1296822 1437140
10646A437140R58368L3921l87590m62924K37266R5508k26239l7860n38008k09439
$$ 1437140 2395508 2429429 2041839 1578915 1816181 1911689 1685450 1647590 1109582 900143
10636I00143O95134O37541j264068Q86043L85783j07601r09038n75903P69178
$$ 900143 1595277 2232818 968750 1854793 2240576 2132975 1223937 648034 1417212
10627A417212K28964J72871m67556K71898K29198J23914M48704p95596P85377
$$ 1417212 1646176 1819047 1351491 1623389 1852587 1976501 2425205 1629609 2414986
10618B414986j066997Q46623K2351j1432j88144r4150M87252K50883q34525M00718
$$ 2414986 1347989 2194612 2216963 2205531 2017387 1923237 2410489 2661372 1826847 2227565
10608B227565m668p78282j37256O8391q0795J113911l68426p7327M53778K09205
$$ 2227565 2222897 1444615 1307359 1375750 1294955 2408866 2040440 1963113 2416891 2626096
10598B626096j074469O96562m77585j90002M01563N02948L46403j119254J98009
$$ 2626096 1551627 2248189 1770604 1580602 1982165 2485113 2831516 1712262 1910271
10589A910271Q28196j779344J86458j18027K30892J065242n24869J070445j109774
$$ 1910271 2738467 959123 1145581 1027554 1258446 2323688 1798819 2869264 1759490
10580A759490M47414k9506n40183m88590R95479N90735J501699j900908q36691
$$ 1759490 2206904 2177398 1637215 1148625 2144104 2734839 4236538 2335630 1498939
10571A498939O68989j7746Q05845j478961j86096J204284j26601Q32329o43355
$$ 1498939 2167928 2150182 2956027 1477066 1290970 2495254 2368653 3200982 2557627
10562B557627k32136J26948K10402l6564M21378o2343j255809Q99854J78721k67626
$$ 2557627 2325491 2452439 2662841 2626277 3047655 2985312 1729503 2629357 2808078 2540452
10552B540452M97885k64301N45911q85036j2566l73710j23305L38310O0076Q84979
$$ 2540452 3038337 2774036 3319947 2434911 2422345 2048635 1925330 2263640 2323716 3208695
10542C208695j381311J211376j304356J483260L47302j303513L9204K59111j85520
$$ 3208695 1827384 3038760 1734404 3217664 3564966 2261453 2300657 2559768 2374248
10533B374248J47796K01192r03950J254700n00630m9898P42950k16485M56622
$$ 2374248 2522044 2723236 1819286 3073986 2573356 2523458 3266408 3049923 3506545
10524C506545o45563r00407P10703J62260K80366n94241j4048j2375L20561R22117
$$ 3506545 2860982 1960575 2671278 2833538 3113904 2519663 2505615 2493240 2813801 3735918
10514C735918j005845J44086n71993L6215P72513K34144m397m49732O81881n78146
$$ 3735918 2730073 2874159 2302166 2338381 3110894 3345038 3340641 2890909 3572790 2994644
10504B994644o36351L31210j53750M88400J26415p06418j14210Q68779R1260r09484
$$ 2994644 2358293 2689503 2535753 3024153 3150568 2444150 2329940 3198719 3289979 2380495
10494B380495J198214j576860J49271n0368K05738l04617J74659J185334r00282
$$ 2380495 3578709 2001849 2151120 2100752 2306490 2001873 2176532 3361866 2461584
10485B461584R31690k42047N2547L29875j084317N18498l09188N89668m255J28102
$$ 2461584 3393274 3151227 3203774 3533649 2449332 2967830 2658642 3248310 3244055 3372157
10475C372157q81149J98078L79974P87734j079533Q18999n00334N03930o07998
$$ 3372157 2491008 2689086 3069060 3856794 2777261 3596260 3095926 3599856 2991858
10466B991858k99487N60482k36994M39857L66649l59681q84714j4039J303788
$$ 2991858 2692371 3252853 3015859 3455716 3822365 3462684 2577970 2563931 3867719
10457C867719o10701n82426N98298j7480N37108l54718n44725L29364k46081M1435
$$ 3867719 3257018 2674592 3272890 3255410 3792518 3437800 2893075 3222439 2976358 3017793
10447C017793p31652Q12507Q26685l82108O9867j50033L91490L78254j422839
$$ 3017793 2286141 3098648 3925333 3543225 3613092 3463059 3854549 4232803 2809964
10438B809964m02135L11935J222937o12897l4689J032542n09052K51490q96589
$$ 2809964 2407829 2719764 3942701 3329804 3295115 4327657 3818605 4070095 3173506
10429C173506K74587N1231J10455m94123J162917j010815J192032q71926N64105
$$ 3173506 3448093 3499324 3609779 3115656 4278573 3267758 4459790 3587864 4151969
10420D151969m46966o63411N25067k19738L27789J46167j91890J90905k8007J319474
$$ 4151969 3705003 3041592 3566659 3346921 3674710 3820877 3628987 3819892 3791885 5111359
10410E111359o75099l84825m16808M7510L8773r4552k24692K50165N47989j33311
$$ 5111359 4436260 4051435 3634627 3682137 3720910 3626358 3401666 3651831 4199820 4066509
10400D066509l8656l04938k73261O25771j145957P48977J123437j644306J161883
$$ 4066509 4027853 3722915 3449654 4075425 2929468 3678445 4801882 3157576 4319459
10391D319459M52893p86094m18764J95692Q2174J219671k88247n45580l5773J383445
$$ 4319459 4772352 3986258 3567494 3763186 3845360 5065031 4776784 4231204 4195431 5578876
10381E578876j726116N1278J41923m12163L60939k61674R4422J31106O04138j203825
$$ 5578876 3852760 3904038 4045961 3633798 3994737 3733063 3827485 3958591 4562729 3358904
10371C358904J220950r56385P69862p52498O45668Q47231j452437R05127K74757
$$ 3358904 4579854 3623469 4393331 3640833 4286501 5133732 3681295 4586422 4861179
10362D861179J02348J55991j150241O09168L05328J07493j199695N38761L01654
$$ 4861179 4963527 5119518 3969277 4578445 4883773 4991266 3791571 4330332 4631986
10353D631986N13000K13245j227089O9226l69181K82235P9434J09005P75356r69401
$$ 4631986 5144986 5358231 4131142 4200368 3831187 4113422 4192856 4301861 5077217 4107816
10343D107816R73703k42904M60778j462481J258291K88547l36615m60594K67134
$$ 4107816 5081519 4838615 5299393 3836912 5095203 5383750 5047135 4586541 4853675
10334D853675O7499J06592q11797P00682p94962Q67458l3978o06798R92042m18865
$$ 4853675 4921174 5027766 4215969 4916651 4121689 4989147 4955169 4348371 5340413 4921548
10324D921548r63051O87887M21714l85240Q97177j15241P0152n6020j17081j493047
$$ 4921548 3958497 4646384 5068098 4682858 5580035 5464794 5534946 5478926 5361845 3868798
10314C868798K60877J566399p62304J69570J86055n54257J071736j838150J395621
$$ 3868798 4129675 5696074 4933770 5103340 5289395 4735138 5806874 3968724 5364345
10305E364345q26310J06964L76618O34966n46882M8026K26608k16903Q28205o23102
$$ 5364345 4538035 4644999 5021617 5656583 5109701 5157727 5384335 5167432 5995637 5372535
10295E372535l34741m89909L14061J62348L91302m81364j20595J032379j16304
$$ 5372535 5037794 4547885 4861946 5024294 5415596 4934232 4813637 5846016 5729712
10286E729712m12958m33693J28868L30942J36146k22905n50380R43907j11731
$$ 5729712 5316754 4883061 5011929 5342871 5479017 5256112 4705732 5649639 5537908
10277E537908k99804J107932j145953J257029l59271r78255O1854Q34880j2904
$$ 5537908 5238104 6346036 5200083 6457112 6097841 5119586 5181440 6016320 6003416
10268F003416N87479j246066j06677K73419k92612L27000k46826O42524P92088
$$ 6003416 6590895 5344829 5238152 5511571 5218959 5545959 5299133 5941657 6733745
10259F733745n57067l08733M14864O8129n3243l65045p60398N70459L76173r62170
$$ 6733745 6176678 5867945 6282809 6350938 6297695 5932650 5172252 5742711 6118884 5156714
10249E156714J301013k64560m82784K30729k74177K004J94570m9844J02277K56296
$$ 5156714 6457727 6193167 5710383 5941112 5666935 5668939 5863509 5813665 5915942 6172238
10239F172238K23657o89441j2046n49383K00006K49990J35727O26030L4074n29296
$$ 6172238 6395895 5706454 5694408 5145025 5345031 5595021 5730748 6356778 6390852 5861556
10229E861556P16468k56768l28793p8165m01958J376320j112109r30772J256736
$$ 5861556 6578024 6321256 5992463 5914298 5512340 6888660 5776551 4845779 6102515
10220F102515M80059p94490Q21802m97087J2972j42785n43197L02238J63945K21691
$$ 6102515 6582574 5788084 6609886 6112799 6125771 5982986 5439789 5742027 5905972 6127663
10210F127663l38004P7482J92023j15151p0809j12611J60191N65177m25975P6431
$$ 6127663 5789659 5867141 6059164 5944013 5873204 5760593 5920784 6485961 6059986 6136417
10200F136417M25343K55294j018708P90789o83159L45068L88671q79460Q3097
$$ 6136417 6561760 6817054 5798346 6589135 5905976 6251044 6639715 5760255 5843352
10191E843352J047706r48626J441865q59949j69375k46124M37591K84645j79513
$$ 5843352 6891058 5942432 7384297 6524348 6354973 6108849 6546440 6831085 6651572
10182F651572M1368p09870Q28734O8653j114869K59101q0181Q17954n68095N59682
$$ 6651572 6692940 5983070 6811804 6880457 5765588 6024689 5944508 6762462 6194367 6754049
10172F754049m38562O17908q34584K63644o5559J15062O08263r97223O81266k83147
$$ 6754049 6315487 6933395 6098811 6362455 6296896 6411958 7020221 6022998 6704264 6421117
10162F421117k78318N2158l28723J292788j162973J606805j543281Q59127N20631
$$ 6421117 6142799 6194957 5866234 7159022 5996049 7602854 6059573 6918700 7439331
10153G439331p04112L50128j003405L58776O07139n5283j379004Q48437J54715
$$ 7439331 6735219 7085347 6081942 6440718 7047857 6992574 5613570 6462007 6616722
10144F616722Q70236n17858j88332o79445J368918j156920r641n988R3609P63310
$$ 6616722 7486958 6969100 6780768 6101323 7470241 6313321 6303680 6297692 6391301 7154611
10134G154611p96917R52938O27637k264255J779027J16017o99447o6861L5695
$$ 7154611 6357694 7310632 7938269 5674014 7453041 7569058 6869611 6802750 6838445
10125F838445n13720O22555Q5881n11634N37376m58127j81564q6055P92937l0499
$$ 6838445 6324725 6947280 7033161 6521527 7058903 6600776 6419212 6333157 7126094 7095595
10115G095595q13897R29935j19093L21967O35519o82526j81914J219931l41200
$$ 7095595 6281698 7211633 7092540 7414507 8050026 7367500 7185586 8405517 8064317
10106H064317P14550P10105Q80856j18706J266736m3493o34967m37157j605483
$$ 8064317 8778867 9488972 10369828 10251122 11517858 11474365 10839398 10402241 8796758
10097H796758K86478J51217p41393k82406P478n12966K0995j206397L476N43204
$$ 8796758 9083236 9234453 8493060 8210654 8218132 7705166 7726161 6519764 6523240 7066444
10087G066444j03402J66149J25761k19185p35876L12944L56369j017253Q74955
$$ 7066444 6963042 7129191 7254952 7035767 6299891 6612835 6969204 5951951 6826906
10078F826906j63604l66088J025684l55891L08448r02666p9147K3703R06386j295054
$$ 6826906 6663302 6297214 7322898 6967007 7275455 6372789 6293642 6317345 7223731 5928677
10068E928677J178641j126581J323044m26838k47462L01215k05532m85673O27699
$$ 5928677 7107318 5980737 7303781 6876943 6629481 6930696 6725164 6239491 6867190
10059F867190o4729M53082q98353J17667p1125l7338j19549l70684J455151q44131
$$ 6867190 6802461 7255543 6357190 6474857 6403732 6366394 6246845 5876161 7331312 6487181
10049F487181l21841J68452J83175Q5464l12516J66305J50289M15432j042983
$$ 6487181 6165340 6333792 6516967 6602431 6289915 6456220 6606509 7021941 5978958
10040E978958q3359N6331P04334o9372j406498J785215j96632k21914R0747l44510
$$ 5978958 5895599 5951930 6656264 6586892 5180394 6965609 6768977 6547063 6637810 6293300
10030F293300j33723R37914j609008J450966m94130N47478m1940q93345N4489
$$ 6293300 6159577 7097491 5488483 6939449 6445319 6992797 6950857 6057512 6112001
10021F112001Q76186p49078N67677p15525n9529O14827n33830R72605l89930o35943
$$ 6112001 6988187 6239109 6806786 6091261 6031732 6646559 6112729 7085334 6695404 6059461
10011F059461l21040K22045N04080N29211q89066K99295j9194q54498O54218L30257
$$ 6059461 5738421 5960466 6464546 6993757 6104691 6403986 6384792 5530294 6184512 6514769
10001F514769q07028P56424J29584p0696N95672j047389q632K99128m96057P49788
$$ 6514769 5707741 6464165 6593749 6523053 7118725 6071336 6062704 6361832 5865775 6615563
9991F615563j362341M65674n0249J614377j245361q40212N17724Q20442L33721
$$ 6615563 5253222 5718896 5668647 7283024 6037663 5197451 5715175 6535617 6869338
9982F869338K71426k426513J684128K48911q12502K14431o0417J40048n03614
$$ 6869338 7140764 4714251 6398379 6647290 5834788 6049219 5988802 6128850 5625236
9973E625236L75177m82181n78120M26369j14422Q09156Q3495L30478k22279q0117
$$ 5625236 6000413 5518232 4940112 5366481 5252059 6061215 6144710 6475188 6252909 6172792
9963F172792q39058p6663K53262K42305L21136q6333n21488k1237K77878J157631
$$ 6172792 5333734 5257071 5510333 5752638 6073774 5987441 5465953 5444716 5722594 6880225
9953F880225j348031N69949N1589j57q25043M20480J26232n97777P94793n23324
$$ 6880225 5532194 6102143 6153732 6153575 5328532 5749012 5875244 5277467 6072260 5548936
9943E548936L99844K39555n40764m14621Q48006r95507R73802M9235k62578r9750
$$ 5548936 5948780 6188335 5647571 5232950 6080956 5085449 6059251 6108486 5845908 5746158
9933E746158L41940o40203N9851Q50638n10673l74922j79178l47836L65064M85952
$$ 5746158 6088098 5447895 5507746 6358384 5847711 5472789 5293611 4945775 5310839 5796791
9923E796791k11524O31145p42465j92763P41990q610j68518m72501j62319N55089
$$ 5796791 5585267 6216412 5473947 5281184 6023174 6014564 5846046 5373545 5211226 5766315
9913E766315m87207o07380O46169Q8152K03923j30645p35059o2649N41807k77950
$$ 5766315 5279108 4671728 5317897 5406049 5609972 5479327 4744268 4681619 5223426 4945476
9903D945476P29482j88981k37113n70917J039033o0519j066568N67860p18337
$$ 4945476 5674958 5485977 5248864 4677947 5716980 5656461 4589893 5157753 4439416
9894D439416O63009J28388N13259j89832j023093J89239M17493K86667j50989
$$ 4439416 5102425 5230813 5744072 5554240 4531147 4720386 5137879 5424546 5273557
9885E273557k12889k12263K86680J01640O11842r59224k57015J195011j300090
$$ 5273557 5060668 4848405 5135085 5236725 5848567 4889343 4632328 5827339 4527249
9876D527249O43615k94071m19902J391172j013596j81199K51621J40622P6019
$$ 4527249 5170864 4876793 4456891 5848063 4834467 4653268 4904889 5045511 5121530
9867E121530n35087l60769J125191j66597j12457m33610Q08601j406258R68677
$$ 5121530 4586443 4225674 5350865 5184268 5071811 4638201 5446802 4040544 5009221
9858E009221P5964O6170K1248p43450p3371J085852k030419K299532r30783j30197
$$ 5009221 5085185 5151355 5172603 4429153 4355782 5441634 3411215 5710747 4779964 4649767
9848D649767N11336K45925l59579L30965j255597P35465N20569q54742J77977
$$ 4649767 5161103 5407028 5047449 5378414 4122817 4858282 5378851 4524109 4702086
9839D702086J079323l56587r27465N79566l25887o3824l08465M27767o08538P46529
$$ 4702086 5781409 5424822 4497357 5076923 4751036 4687212 4378747 4806514 4197976 4944505
9829D944505p97021O32304m60688j84533j19108L30670O24872j303485J674430
$$ 4944505 4147484 4779788 4319100 4134567 4015459 4346129 4971001 3667516 5341946
9820E341946L30334j129653Q13031k47894l85608p6604m17687J83909J82806o19532
$$ 5341946 5672280 4542627 5355658 5107764 4722156 4645552 4227865 4411774 4594580 3975048
9810C975048O20958k57839J38477l97141K82322J61542n61274L61507m90233J402130
$$ 3975048 4596006 4338167 4476644 4079503 4361825 4523367 3962093 4323600 3833367 5235497
9800E235497j164792m15905N8968J48333P85497m26397N57516n54234J00728m1855
$$ 5235497 4070705 3654800 3713768 3862101 4647598 4221201 4778717 4224483 4325211 4283356
9790D283356n97578J342738q39783K94141m50399O5146j13975m29648L13438o46072
$$ 4283356 3685778 5028516 4188733 4482874 4032475 4097621 3983646 3553998 3867436 3221364
9780C221364N38088R67395j080616J47299J73898p37146K82273L79597P14275
$$ 3221364 3759452 4726847 3646231 3793530 3967428 3230282 3512555 3892152 4606427
9771D606427m44144o12525O74098J6818m97794m45811M87251P16126q38243O65141
$$ 4606427 4162283 3549758 4223856 4240674 3742880 3297069 3784320 4500446 3662203 4327344
9761D327344j012225O95135k97270m23393l6440L19185N47873o94319n6175R19219
$$ 4327344 3315119 4010254 3712984 3289591 3253151 3572336 4120209 3425890 3369715 4288934
9751D288934j269508J64958M5087Q1861M66324P51579R055o33055L22858m54438
$$ 4288934 3019426 3184384 3229471 3311332 3777656 4529235 4538290 3905235 4228093 3773655
9741C773655j9520Q95577j176232o6532O56504k29196n57175K9290Q706N23423
$$ 3773655 3754135 4649712 3473480 3406948 4063452 3834256 3277081 3306371 3315077 3838500
9731C838500q31808m25738J076071k60321Q76785j564153M99977J20831J411872
$$ 3838500 3006692 2580954 3657025 3396704 4273489 2709336 3209313 3330144 4742016
9722D742016q95722L17881k86341o62221J73218r17809K45229J247987j008862
$$ 4742016 3846294 4164175 3877834 3215613 3388831 2471022 2716251 3964238 2955376
9713B955376J82939Q2249m05066j10857K31703N54061p07680J62258J94840k3624
$$ 2955376 3138315 3220564 2815498 2704641 2936344 3490405 2782725 2944983 3139823 3116199
9703C116199K28896J27728p79909M73508j33551O68723L76699p38098M67078q76889
$$ 3116199 3345095 3472823 2692914 3166422 3032871 3701594 4078293 3340195 3807273 2930384
9693B930384M37576J879J076253j546883J25314M36206m46341O44684j93098n89048
$$ 2930384 3367960 3369839 4446092 2899209 3024523 3460729 3014388 3659072 3465974 2876926
9683B876926J076061q533j727795O52492Q38124q94555O20036O04342M8475j378039
$$ 2876926 3952987 3944454 2216659 2869151 3707275 2812720 3432756 4037098 4085573 2707534
9673B707534Q35513N2187r90189N62496L78536p72717Q6471m69247N29500P2972
$$ 2707534 3543047 3595234 2605045 3167541 3546077 2773360 2859831 2390584 2920084 2993056
9663B993056p68782P90165O9719l49094K45754L74482n32619L95303M46307K2316
$$ 2993056 2224274 3014439 3084158 2735064 2980818 3355300 2822681 3217984 3664291 3686607
9653C686607j23846o42104j89530k06110L87557L70321n17398J352524j679104
$$ 3686607 3562761 2920657 2731127 2525017 2912574 3282895 2765497 4118021 2438917
9644B438917J050485N82627o52825O1112l63565o6620L68627o20249J51931o77393
$$ 2438917 3489402 4072029 3419204 3480316 3116751 3050131 3418758 2798509 2950440 2273047
9634B273047J122633O61457m86107j013155j01842N25881o28151Q12881o99026
$$ 2273047 3395680 4057137 3571030 2557875 2456033 2981914 2353763 3166644 2467618
9625B467618L40950N6799P76624m89575o93229L38716O97897l69356L85550n87644
$$ 2467618 2808568 2865367 3641991 3152416 2459187 2797903 3495800 3126444 3511994 2924350
9615B924350J151206j209648l6414r11105J267277L81485j547834O72826j82448
$$ 2924350 4075556 2865908 2829494 1918389 3185666 3567151 2019317 2692143 2509695
9606B509695M58833M03909j281472M1916J90563J002945k79010L32693n15622
$$ 2509695 2968528 3372437 2090965 2132881 2323444 3326389 3047379 3380072 2864450
9597B864450k38085L80043P80494j861454J49963l66938M01024J222439o49068
$$ 2864450 2626365 3006408 3786902 1925448 2075411 1708473 2109497 3331936 2682868
9588B682868l35177N23403o75833L27076J00983J030217j226678L55627k92859
$$ 2682868 2347691 2871094 2195261 2522337 2623320 3653537 2426859 2782486 2489627
9579B489627j163039R53111J84322N05309n60448L10838M15699j56238j108567
$$ 2489627 1326588 2279699 2464021 2969330 2408882 2719720 3135419 2979181 1870614
9570A870614L04130J43994M38425j06141l89322M9815N90555j88940J210406j445467
$$ 1870614 2174744 2318738 2757163 2651022 2261700 2311515 2902070 2713130 3923536 2478069
9560B478069m06114J20767M34325j75718p65447n05097J454511L01228j047160
$$ 2478069 2071955 2192722 2627047 2451329 1685882 1180785 2635296 2936524 1889364
9551A889364J383311j081532Q8688O05048m59840J099215r23775M24495p36480
$$ 1889364 3272675 2191143 2279831 2884879 2425039 3524254 2600479 3024974 2288494
9542B288494k80303M50308k75976Q10406j154050J267495M45695p85306O1469
$$ 2288494 2008191 2458499 2182523 2992929 1838879 3106374 3552069 2766763 2828232
9533B828232k59847N47801K20761J94351N26756j04364J342119J02767p81221
$$ 2828232 2568385 3116186 3336947 3531298 4058054 3953690 5295809 5398576 4617355
9524D617355o10075q6128j3714m78308j75797J86822l39975L14425m74846o1174
$$ 4617355 4007280 3921152 3907438 3429130 3253333 3440155 3100180 3414605 2939759 2878585
9514B878585O67832j018999N0383O7112j64272J019689O02056o03357j48421l06702
$$ 2878585 3546417 2527418 2577801 2644913 2480641 3500330 4102386 3499029 3350608 3043906
9504C043906O32927J6551J213474n78376J569899o28338J148076l64593K76285
$$ 3043906 3676833 3693384 4906858 4328482 5898381 5270043 6418119 6053526 6329811
9495F329811p08353J354697q94513j220537o50558m02028Q53603j130825o81830
$$ 6329811 5621458 6976155 6081642 4861105 4210547 3808519 4662122 3531297 2849467
9486B849467O4616P00754n34044n39901J159004j764987J054495k99197j35538
$$ 2849467 2914083 3614837 3080793 2540892 3699896 1934909 2989404 2690207 2554669
9477B554669M83789p38594M2153p69457M30337O60159o25320J85920P13410p20089
$$ 2554669 3038458 2299864 2342017 1572560 2002897 2663056 2037736 2223656 2937066 2216977
9467B216977k84025J43288R29152l74411N80337q54892K34465r6641j99990J156191
$$ 2216977 1932952 2076240 3005392 2630981 3211318 2356426 2590891 2494250 2294260 3450451
9457C450451j157170L01923N97755m26458j25491K36945n17560P88930m54558
$$ 3450451 2293281 2595204 3192959 2766501 2641010 2877955 2360395 3149325 2694767
9448B694767R3076L43179o19764O07854r6483m85902O62563P58047j93120Q9056
$$ 2694767 2787843 3131022 2511258 3119112 3022629 2536727 3199290 3957337 3764217 3853273
9438C853273N31175p23478J070869l34978P21975l03859j97602J26520q44771
$$ 3853273 4384448 3660970 4731839 4396861 5118836 4814977 4617375 4743895 3899124
9429C899124L84429J46895p30189J609857o67002k78859N64470O59234j249257
$$ 3899124 4283553 4430448 3700259 5310116 4643114 4364255 4928725 5587959 4338702
9420D338702P64076P21366p86441m4540k24662j65358J97446N31396j435943N27865
$$ 4338702 5102778 5824144 5037703 4993163 4768501 4603143 4800589 5331985 3896042 4423907
9410D423907R02011k159910J128867l34232K97685J22411R5481L04668m24292
$$ 4423907 5325918 3166008 4294875 3960643 4258328 4380739 4476220 4780888 4356596
9401D356596J642072p82450l28057P84468Q84417j59751J72582n7598p06262R02889
$$ 4356596 5998668 5216218 4888161 5672629 6557046 6397295 6569877 6512279 5806017 6708906
9391F708906k14989J69613R77834K70824p66652R24578K30459J53447K000616
$$ 6708906 6493917 6663530 7641364 7912188 7145536 8070114 8300573 8454020 10454636
9382A0454636j22858J91641j070399P36546j2825o5119l94328K50714m16384j188117
$$ 10454636 10331778 10523419 9453020 10189566 10176741 10111622 9717294 9968008 9551624 8363507
9372H363507J210547q55857r34932N47493j428326K40475P42250o43739m28125
$$ 8363507 9574054 8718197 7783265 8330758 6902432 7142907 7885157 7241418 6813293
9363F813293N8148P97902j343013L89502p71884K7824M7444p71783O30395r28247
$$ 6813293 6871441 7669343 6326330 6715832 5943948 5971772 6019216 5247433 5877828 4949581
9353D949581M02166n72993J094402p27967j051386L98267M77858j34138O19423
$$ 4949581 5351747 4778754 5873156 5145189 4093803 4492070 4969928 4835790 5455213
9344E455213k14229K99785j87151k68193Q4881j89198K54292K7663l52278K22287
$$ 5455213 5240984 5540769 5353618 5085425 5170306 4981108 5235400 5263063 4910785 5133072
9334E133072L38339o30809R75529o22624k46441N92939k62672Q7670o40785R94553
$$ 5133072 5471411 4840602 5816131 5193507 4947066 5540005 5277333 5365003 4724218 5718771
9324E718771o55041P68186r5127r08673J207588m42321r37323R04440m63837K32033
$$ 5718771 5063730 5831916 5736789 4828116 6035704 5593383 4656060 5560500 5096663 5328696
9314E328696P83980j156015N42912n78800r2361N31656K4532M22609M63649K67143
$$ 5328696 6112676 4956661 5499573 4920773 4828412 5360068 5384600 5807209 6270858 6538001
9304F538001n03190r21826P43883k73297j04308N38275N91930m20721R27330M42656
$$ 6538001 6034811 5112985 5856868 5583571 5479263 6017538 6609468 6188747 7116077 7558733
9294G558733K01747L13j225148J497219r10167K64314R14030m41325J43891q73120
$$ 7558733 7760480 7760793 6535645 8032864 7122697 7387011 8301041 7859716 8003607 7130487
9284G130487J748363j328277j81727l1306r54704K08367J167093j593350l57704
$$ 7130487 8878850 7550573 7368846 7337540 6382836 6591203 7758296 6164946 5807242
9275E807242J205214k83316K04296J039308L8842J47534N12135j98099R39264
$$ 5807242 7012456 6729140 6933436 7972744 8011586 8159120 8671255 8473156 9412420
9266I412420K44461K157189m17601J216576R2419O95998L55309j282367K04570
$$ 9412420 9656881 11814070 11396469 12613045 12705464 13401462 13756771 12474404 12678974
9257A2678974j82180L7074j348997m86668k5052R9435m27258p0457j24997l41906
$$ 12678974 12496794 12533868 11184871 10698203 10673151 10772586 10345328 10274871 10149874 9807968
9247I807968P9651L25826o61341o3557L46514K75680n2868l2885O89242k29803
$$ 9807968 9887619 10213445 9552104 9488547 9835061 10110741 10057873 10024988 10714230 10484427
9237A0484427o30408l25958M95528J10159R20478p81518J204697j25093J043374
$$ 10484427 9854019 9528061 10023589 10133748 11054226 10272708 11477405 11352312 12395686
9228A2395686Q65896r36208J500482p79110J357839n04556J298759Q12164k94729
$$ 12395686 13261582 12325374 13825856 13046746 14404585 13900029 15198788 16010952 15716223
9219A5716223j38259q45552R27721m33607k22466K90218j766931P31124o0792
$$ 15716223 15577964 14732412 15660133 15226526 15004060 15294278 13527347 14258471 14197679
9210A4197679r24187N27513k04783M26976l86059q9668o23890q11781J985990
$$ 14197679 13273492 13801005 13596222 14023198 13637139 13547471 12923581 12111800 14097790
9201A4097790O06765J139241K33J173138j510523K51065j299877o83224L41833
$$ 14097790 14704555 15843796 15844029 17017167 15506644 15757709 14457832 13774608 14116441
9192A4116441r44238R45726M34660r60236j6867k76023j049802r9497Q08700p02788
$$ 14116441 13172203 14117929 14552589 13592353 13575486 13299463 12249661 12150164 12958864 12256076
9182A2256076n37556j28681N30096J271226j167311P85992m53868o139l45449
$$ 12256076 11718520 11589839 12119935 13391161 12223850 13009842 12555974 12549835 12204386
9173A2204386J52311m10384K01666P27609M47906J341866Q8215j67010J219442
$$ 12204386 12356697 11946313 12147979 12875588 13323494 14665360 14753575 14586565 15806007
9164A5806007q32056j17569P48083J55526o49071K07353j3861j94681m7308j064400
$$ 15806007 14973951 14856382 15604465 15759991 15110920 15318273 15304412 15109731 15062423 13998023
9154A3998023M13807m89857n67143O44900m53599j31042J51664m84523J049090
$$ 13998023 14411830 13921973 13354830 13999730 13546131 13415089 13566753 13082230 14131320
9145A4131320L17102n71086Q77726O30862P79386N4886o28211J552883J36711
$$ 14131320 14448422 13877336 14755062 15385924 16165310 16220196 15591985 17144868 17281579
9136A7281579K69022M90113Q87377K71522J063105j168293Q26693m86844l80093
$$ 17281579 17550601 18040714 18928091 19199613 20262718 19094425 19921118 19434274 19054181
9127A9054181Q40913j834331N57877J586476n69161O0937J414083J027502J99293
$$ 19054181 19895094 18060763 18618640 20205116 19635955 19696892 21110975 22138477 22337770
9118B2337770J590476R12764K341766K270964K053800J358709K537648L34503
$$ 22337770 23928246 24841010 27182776 29453740 31507540 32866249 35403897 35738400
9110C5738400O26341Q93869p68679k03605J036588J153492m35123J047268L29169
$$ 35738400 36364741 37258610 36489931 36286326 37322914 38476406 38041283 39088551 39417720
9101C9417720M5562R23238M88658J568439J993104K496985J704841L740917M904213
$$ 39417720 39463282 40386520 40875178 42443617 44436721 46933706 48638547 52379464 57283677
9092E7283677M881467R786783J5824977M1512135P5284845R6528384M8513506
$$ 57283677 62165144 71951927 87776904 129289039 204573884 301102268 349615774
9085C49615774l1593355q4421214o0893341l6097212k1844472j3987235q444234
$$ 349615774 318022419 233601205 172707864 136610652 114766180 100778945 92334711
9078I2334711p135202p110625o474521k923225k028031k724680j68255l32297
$$ 92334711 85199509 78088884 71614363 68691138 66663107 63938427 63770172 63437875
9070F3437875k298300q62399K63811j313548k22833O04831K73134J799672K693910
$$ 63437875 61139575 60277176 60540987 59227439 59004606 59609437 59882571 61682243 64376153
9061F4376153M416890N475556Q987381J3943037K5567831L6972644L6499677J7114678
$$ 64376153 68793043 74268599 83255980 97199017 122766848 159739492 196239169 213353847
9053B13353847j3501671k4532860l0202275k5578048j6854746j1298844r150177
$$ 213353847 199852176 175319316 145117041 119538993 102684247 91385403 82235226
9046H2235226p464821m338663l131293j465421M01664o01413J425860J675480
$$ 82235226 74770405 70431742 67300449 65835028 66236692 65635279 67061139 68736619
9038F8736619L082809L659657M960017M687604L938330J608550p55124j656465
$$ 68736619 71819428 75479085 80439102 85126706 89065036 90673586 89918462 88261997
9030H8261997m663794j987338m329101j664514k41032q7983J093981K055671K166039
$$ 88261997 83598203 81610865 77281764 75617250 75376218 75288235 76382216 78437887 80603926
9021H0603926K033311J422593k282782m026213m048855m869067m559411k860701
$$ 80603926 82637237 84059830 81777048 77750835 73701980 68832913 64273502 61412801
9013F1412801m646213j227461j122837j393341o88165k24674L88386J466744o82230
$$ 61412801 56766588 55539127 54416290 53022949 52334784 52110110 52498496 53965240 53283010
9004E3283010J431371K006154K176029O24740O18822J24575l043907l151315l064324
$$ 53283010 54714381 56720535 58896564 59521304 60140126 60264701 57220794 54069479 51005155
8995E1005155n418048l506444l037728l691022j987225j477648j921575m94667
$$ 51005155 45587107 42080663 39042935 35351913 33364688 31887040 29965465 29470798
8987B9470798j596271l79609j609830J87907j199375L24536l32530j86083r04712
$$ 29470798 27874527 27494918 25885088 26072995 24873620 25198156 24865626 24679543 23774831
8978B3774831j387415k72195p66135j250014j43709l93901j531250m31495J40221
$$ 23774831 22387416 22115221 21349086 20099072 19955363 19561462 18030212 17598717 17738938
8969A7738938j145120N78334l8231j268303j054813m15321j35266K31574p08767
$$ 17738938 16593818 17172152 17133921 15865618 14810805 14395484 14260218 14491792 13783025
8960A3783025m26786K85665J83254Q337j723937P54873j080042j36010Q98501
$$ 13783025 13356239 13641904 13825158 13833495 12109558 12864431 11784389 11648379 12546880
8951A2546880l2929j086424M89333j195821M34663j57687j069581o07937P40233
$$ 12546880 12513951 11427527 11916860 10721039 11155702 10998015 9928434 9320497 10060730
8942A0060730K83421o15255K78625n43296m6395K08682q50430n2657K62236j515750
$$ 10060730 10344151 9728896 10007521 9464225 9417830 9626512 8776082 8723425 8985661 7469911
8932G469911N80318o5056j77507Q11599j057198O75909j21192m46007o8844J96269
$$ 7469911 8050229 7985173 7807666 8619265 7562067 8237976 8116784 7670777 7601933 7798202
8922G798202q37560J365120p56041n63119J024866j30228l34772K72089J46027
$$ 7798202 6960642 8325762 7569721 7006602 8031468 7901240 7566468 7838557 7984584
8913G984584q45235J035341N73844J16719q31357M68092k85228q881L88701j462171
$$ 7984584 7139349 8174690 8748534 8865253 8033896 8501988 8216760 8207879 8596580 7134409
8903G134409l49053O62162n65732M25075r8948O17268n54549m97178J08777j00724
$$ 7134409 6785356 7447518 6881786 7306861 7207913 7825181 7270632 6773454 6882231 6781507
8893F781507K34973N41987J47002m32142J50034q4514Q43449j224688j96223J79342
$$ 6781507 7016480 7558467 7705469 7273327 7423361 7338847 8182296 6957608 6761385 6940727
8883F940727J56199j033936J277992l09851Q37492k50328p48676N50386l43379
$$ 6940727 7096926 6062990 7340982 7031131 7868623 7618295 6869619 7420005 7076626
8874G076626n64639l93915L38593K75734r54787M77284p14742R52936n64249j63987
$$ 7076626 6511987 6118072 6456665 6732399 5777612 6254896 5540154 6493090 5928841 5764854
8864E764854O07750j054486N38317l49980M97620j041291M49509l73442m01504
$$ 5764854 6372604 5318118 5856435 5506455 6004075 4962784 5412293 5038851 4637347
8855D637347M24554j111873P6376R2373N74529N84515p16818N34435r50357L78530
$$ 4637347 5061901 3950028 4026404 4118777 4693306 5277821 4561003 5095438 4145081 4523611
8845D523611j051723N46705n35308K86425j94202J13864Q8315r28180J022182
$$ 4523611 3471888 4018593 3483285 3769710 3575508 3689372 3777687 2849507 3871689
8836C871689j040852p29223R05698M84447l77044k66975P91726j027361J107812
$$ 3871689 2830837 2101614 3007312 3491759 3114715 2847740 3639466 2612105 3719917
8827C719917m70132p73206O52150n98987N03402r6638l86770K81034p2796o19227
$$ 3719917 3249785 2476579 3128729 2529742 3033144 2936506 2549736 2830770 2757974 2138747
8817B138747p5615M73547j96850N07271l0043n90975M55606l21230K11438R5282
$$ 2138747 2063132 2536679 2339829 2847100 2817057 2226082 2681688 2360458 2571896 2667178
8807B667178r96828P46616M79531q96332k02033j99798P72668O29918j018479
$$ 2667178 1670350 2416966 2896497 2000165 1798132 1598334 2371002 3000920 1982441
8798A982441Q76748q19065O97094n96219k65220p0738O78770j85569N79148j183692
$$ 1982441 2859189 2040124 2737218 2140999 1875779 1805041 2483811 2298242 2877390 1693698
8788A693698j35343R15420j34098o78810K863O057N589L49372M17370q40938k49595
$$ 1693698 1558355 2473775 2339677 1660867 1663730 1669787 1675376 2024748 2442118 1601180 1351585
8777A351585J185664n50728K41584o66308k96359J355289j092070J214713k90916
$$ 1351585 2537249 1986521 2228105 1561797 1265438 2620727 1528657 2743370 2452454
8768B452454J03379q70410j87711j342O58175j01519J77865M30667l38517O7677
$$ 2452454 2555833 1685423 1497712 1496370 2154545 2053026 2230891 2661558 2323041 2390718
8758B390718N38840n63787o11699L48919M44010l63871J25882k19670j11636Q56853
$$ 2390718 2929558 2365771 1754072 2102991 2547001 2183130 2309012 2089342 1977706 2834559
8748B834559j263597R93366n55803Q83901m09576j690635J888056k61016L13362
$$ 2834559 1570962 2564328 2008525 2892426 2482850 792215 2680271 2419255 2732617
8739B732617l50832p72183M16631L82374n50984j70867q09816J282862r24176
$$ 2732617 2381785 1609602 2026233 2408607 1857623 1686756 876940 2159802 1235626
8730A235626J067193j25879j5358J24215J33473O9074m08225K6945M40350m30168
$$ 1235626 2302819 2176940 2161582 2285797 2419270 2488344 2080119 2107064 2547414 2117246
8720B117246n4822N36713j40727l49984L90613q75504L87532R43116j178951M0670
$$ 2117246 2062424 2599137 2458410 2108426 2499039 1623535 2011067 2954183 1775232 1815902
8710A815902l22083K69050J13364r0250M93157L04941p26118j98299O83087m07040
$$ 1815902 1493819 1762869 1876233 1785983 2279140 2584081 1857963 1659664 2342751 1935711
8700A935711J059769m76565m34932J30555K63667j91036l93682j24215J06968
$$ 1935711 2995480 2518915 2083983 2214538 2478205 2287169 1893487 1769272 1876240
8691A876240j76429K26546m12223P30730o38985Q8638o39824J68000j37748O93707
$$ 1876240 1699811 1926357 1514134 2244864 1605879 1694517 1054693 1222693 1084945 1778652
8681A778652q56616O48541r26313l59856O31346J138807j771275M67920J106602
$$ 1778652 922036 1570577 644264 284408 915754 2054561 283286 751206 1857808
8672A857808P05158m93375M01644J37524l40132m46713r1136l51022o3398j23311
$$ 1857808 2562966 2069591 2471235 2608759 2268627 1821914 1730778 1379756 1316358 1193047
8662A193047k29616o28130Q17290j156226O14315J150809j107767O90962o44375
$$ 1193047 963431 335301 1152591 -3635 610680 1761489 653722 1344684 700309
8653G00309j08121m01391J249021j175440K55166r0784m45484J280516l81460
$$ 700309 592188 190797 1439818 264378 519544 428760 -16724 1263792 882332
8644H82332m48678J002955j622693J339191J52776j249704K15445p25059R70217
$$ 882332 433654 1436609 -186084 1153107 1305883 56179 271624 -453435 516782
8635E16782O18267j16852p31211p82095Q61827o29589Q3687Q83520q04097O78364
$$ 516782 1135049 1018197 286986 -495109 366718 -262871 -179184 704336 -99761 578603
8625E78603M04873o94534k1553l94516O25822o43168L57021M85189n8356M96116
$$ 578603 983476 288942 267389 -127127 498695 -144473 212548 697737 639381 1135497
8615A135497r85730j55209J80885L35161k58110j88459P2634O3994J378704j518903
$$ 1135497 149767 -5442 175443 510604 252494 64035 136669 200663 1579367 60464
8605F0464P2340l08698R0888L06951N19442o66649k03133P44645P64657j019121
$$ 60464 132804 -175894 -85006 221945 741387 74738 -128395 616250 1380907 361786
8595C61786K98177o44257L97668q4571k50728M14204N84444l64786k2744l06091
$$ 361786 659963 15706 413374 328803 78075 492279 1076723 711937 689193 383102
8585C83102L7891o59956N32899j35880r7547l42294l71601J332707L11010q10290
$$ 383102 420993 -238963 293936 158056 60509 -281785 -653386 679321 990331 180041
8575A80041j0318r76003j06757J033615L69358j812054J361190J83676P22491
$$ 180041 169723 -806280 -913037 120578 489936 -1322118 39072 222748 945239
8566I45239K24025j980439J747099j314155j33125J10781q9710Q62342o96969
$$ 945239 1169264 -811175 935924 -378231 -511356 -400575 -490285 372057 -324912
8557c24912L15507R24250q16410j012064P63906O80286j749935J102074j8746
$$ -324912 -9405 914845 98435 -913629 -149723 530563 -1219372 -117298 -136044
8548a36044M14614L8125L00479L50754r07714l1972q61998J441135r81407J098602
$$ -136044 278570 316695 617174 967928 60214 28242 -833756 607379 -374028 724574
8538G24574n69444m4794R29348j679187K58812m87775p06103K845740j252271
$$ 724574 155130 110336 1039684 -639503 -380691 -868466 -1574569 1271171 18900
8529A8900k96560K66390J172328p95798n79461L19549O00140r16046K47384K34020
$$ 18900 -277660 -11270 1161058 365260 -214201 105348 705488 -210558 36826 270846
8519B70846k98113P11952l35813n88162j20718M29061n4340k0540K27992r04174
$$ 270846 -27267 684685 348872 -239290 -360008 69053 14713 -5827 222165 -682009
8509f82009J390719j072428j91855J00235L81674l84441J302733O83702j467043
$$ -682009 708710 -363718 -555573 -455338 -73664 -458105 844628 1528330 61287
8500F1287P78213l66072j233128R25100k54501k38102O09661j20287j394682J775370
$$ 61287 839500 473428 -759700 165400 -89101 -327203 282458 162171 -1232511 542859
8490E42859j98618n85924L07133P7373j001379L95227r5560M49951j28572Q9m05701
$$ 542859 344241 -241683 65450 142823 -858556 -463329 -558889 -108938 -237510 -237421 -643122
8479f43122R44905l69985l57131p2392J103676j092384J178072r49696N21494
$$ -643122 301783 -68202 -425333 -497725 605951 -486433 691639 -258057 263437
8470B63437k55649m62055l77142N51639K3903L52638K46057K54695q37726N37428
$$ 263437 7788 -454267 -831409 -279770 -255867 96771 342828 597523 -240203 297225
8460B97225m85016K78074K62486q87093N95091k91068N0022O97618k3679q77091
$$ 297225 -187791 90283 352769 -534324 60767 -230301 -180279 517339 493660 -383431
8450c83431K35916O61714q16077J58406J095958o90491Q11156j963803N29479
$$ -383431 -147515 514199 -301878 -143472 952486 261995 1073151 -890652 -361173
8441c61173o191Q47526p47442j75721N34706n13203k526J308979p18506k5372
$$ -361173 -367364 480162 -267280 -443001 91705 -421498 -424024 884955 166449 141077
8431A41077K74856l09093J40771L65810m26673J045914j425227O40347N40882
$$ 141077 415933 106840 247611 613421 186748 1232662 -192565 447782 988664
8422I88664o20608m9566k73910k15881J93367k18811j70636O34982J04912J108034
$$ 988664 368056 318490 44580 -171301 22066 -196745 -367381 267601 372513 1480547
8412A480547r89458o09116m29921R74017Q00108o20703j069382J109647O50696
$$ 1480547 491089 -118027 -547948 426069 1226177 605474 -463908 645739 1296435
8403A296435k84710j063548L52542l95457J107413j305293Q8422P75482k15289
$$ 1296435 1011725 -51823 300719 -94738 1012675 -292618 -204196 571286 355997
8394C55997j59424K20709r23251O35287J133765r74858k37884O43781J095029
$$ 355997 196573 417282 -505969 129318 1263083 288225 50341 694122 1789151
8385A789151j052439j079512Q44361j191359J370915P1383n54599l25578M76922
$$ 1789151 736712 -342800 501561 -689798 681117 752500 197901 -127677 349245
8376C49245O42284m68262n17647K13018J005535j45031l95802j349003J759575
$$ 349245 991529 523267 5620 218638 1224173 1079142 683340 -665663 1093912
8367A093912o13159l23409l63655Q10907j813m04624N37196K322J08725j7408
$$ 1093912 480753 157344 -206311 604596 602783 198159 735355 737677 846402 828994
8357H28994N73374o7167n03178L59518o72041N7786m85922j38040M95618M93539
$$ 828994 1402368 1335201 832023 1191541 519500 577286 91364 -46676 448942 942481
8347I42481j14711j07116j48923j58369R60821j508627J227831o14759j68635
$$ 942481 827770 720654 571731 413362 1374183 -134444 1093387 478628 309993
8338C09993R53942j638182J411946Q88655j721862K31529K3066J66066J200958
$$ 309993 1263935 -374247 1037699 1926354 204492 436021 459087 625153 1826111
8329A826111p43149N81836m61645q01317J376917o16268l53296J99709q12894
$$ 1826111 1082962 1664798 1203153 401836 1778753 1162485 809189 1008898 196004
8320A96004L52876P98715J09716K65979j30639Q8384q33823J1363O58745q6055
$$ 196004 548880 1347595 1457311 1723290 1592651 1681035 847212 858575 1517320 1431265
8310A431265J10855N28991r17433J111691o10220L53035o74345j38322n8296K59534
$$ 1431265 1542120 2071111 1153678 2265369 1655149 2008184 1333839 1195517 1137221 1396755
8300A396755O65902M03559j764627J685089r13904j35195P48323j80758K63341
$$ 1396755 2062657 2466216 701589 2386678 1472774 1337579 2085902 1905144 2168485
8291B168485k4120O15802q43777J13402k5204N50900l0196R26117j066901j10980
$$ 2168485 2144365 2760167 1916390 2029792 2004588 2555488 2525292 3451409 2384508 2273528
8281B273528Q26917k25120J96532K62038j312263J760083j224678J131342m27294
$$ 2273528 3100445 2875325 3071857 3333895 2021632 3781715 2557037 3688379 3261085
8272C261085j9212J64651m55907J517337O90295j100316L17367K60933K70898
$$ 3261085 3241873 3406524 2950617 4467954 5158249 4057933 4375300 4636233 4907131
8263D907131K36166l4180n4145P35514j52510O89739n8251o18365M11083K01071
$$ 4907131 5143297 5109117 5054972 5790486 5637976 6327715 6269464 5651099 6062182 6263253
8253F263253N66871m11962O99878J48465j16022k96531J403810o6665n59395L29347
$$ 6263253 6830124 6418162 7118040 7266505 7150483 6853952 8257762 8191097 7631702 7961049
8243G961049K05680M49308q39284M72966j59028J41559J065294k11085L1335k91603
$$ 7961049 8166729 8616037 7776753 8249719 8090691 8232250 9297544 9086459 9117794 8826191
8233H826191L20584K21755p2071l73487j84158J005699j226164K8961M10432O98583
$$ 8826191 9146775 9368530 9296459 8922972 8738814 9744513 8518349 8547310 8957742 9656325
8223I656325l70462o08691K01216k92260j070889M40470J127714j068597Q0572
$$ 9656325 9285863 8677172 8878388 8586128 7515239 7955709 9083423 8014826 8095398
8214H095398N51159m9410l7668k58850P7288L98095j293077L58169N61673j432356
$$ 8095398 8646557 8597147 8559479 8300629 8377917 8776012 7482935 7841104 8402777 6970421
8204F970421J83800N8642M13815J41123j69219M52615r37230n17609l8341q28306
$$ 6970421 7154221 7212863 7626678 7767801 7598582 8051197 7113967 6596358 6558017 5729711
8194E729711Q23552m29455N436530n846646J463109j035161r5236l94083q37742
$$ 5729711 6553263 6123808 11560338 5713692 7176801 6141640 6046404 5652321 4814579
8185D814579k77243L10209m67168p75519J531915j628327J235436n13024k55955
$$ 4814579 4537336 4847545 4380377 3604858 5136773 3508446 4743882 4230858 3974903
8176C974903P6756J3775R08262j812484R844L10082J48923k55884j87594o84103
$$ 3974903 4051659 4065434 4973696 3161212 3171056 3481138 3630061 3374177 3186583 2502480
8166B502480N94021K78180j664530R32668R8936m27036J96699p08479L76541l65443
$$ 2502480 3096501 3374681 1710151 2642819 2741755 2314719 2511418 1802939 2179480 1814037
8156A814037K22974Q29104n66716o51810R71049L40588j96897m59718j224240
$$ 1814037 2037011 2866115 2299399 1647589 2618638 2959226 2762329 2302611 1078371
8147A078371J638581p23813j70426j103461Q30857k13575o25585L72248P17991
$$ 1078371 2716952 1993139 1822713 719252 1550109 1336534 710949 1083197 1801188
8138A801188q67023P19602n95090J58798l01267P68194o39541K59436m38910M74528
$$ 1801188 934165 1653767 1058677 1217475 916208 1684402 1044861 1304297 865387 1339915
8128A339915o98509K17331L85130l7102r49288N82189K06606k09223l65838q15115
$$ 1339915 641406 858737 1243867 1206765 257477 839666 1046272 837049 471211 -343904
8118c43904M17952N09981L5816L36413m02193P59206L84117n31002k39678J56006
$$ -343904 74048 584029 619845 956258 554065 1313271 1697388 1166386 926708 1082714
8108A082714m9148l36433m53520l74128Q14308J69454j82499j06369L77218l05630
$$ 1082714 1033566 697133 243613 -130515 683793 853247 670748 564379 941597 635967
8098F35967p8101o41949K61695J25579n88927J528412j181333O01554J57819p51356
$$ 635967 557866 -84083 177612 303191 -285736 1242676 61343 662897 820716 69360
8088F9360J319599l21108o45913l86926M81152j173447J581123m51491P31959
$$ 69360 1388959 1067851 421938 35012 516164 -657283 923840 472349 1204308
8079A204308n73113m24976M20039N78371j553560l6662Q10136K55026k48009m22567
$$ 1204308 631195 206219 626258 1204629 -348931 -385593 424543 679569 431560 8993
8069H993j06549n67958R89546P95476j165677J079868j388168Q39205l27217k95123
$$ 8993 -97556 -665514 324032 1119508 -46169 1033699 -354469 484736 157519 -137604
8059a37604J65140N31764m15822q3591L81486m51767O97135L49925j044023L04931
$$ -137604 27536 559300 143478 59887 441373 -10394 686741 1036666 -7357 297574
8049B97574J97105O1609R3128M3626O59801j129212J338109j418399Q79812j512506
$$ 297574 494679 556288 649416 693042 1352843 223631 1561740 143341 1023153 -489353
8039d89353N91511m65929M02077M58802k46913m02350O18891j21244k16485n65972
$$ -489353 102158 -363771 38306 497108 250195 -152155 466736 345492 129007 -436965
8029d36965Q97395j006048J173147o18677R56509O58977k73356k61182n9672k28125
$$ -436965 460430 -545618 627529 8852 965361 1624338 1350982 1089800 1030128 802003
8019H02003l37122J42325p91450l5804R20605l40186k99128o03315N13007j61521
$$ 802003 464881 607206 -184244 -220048 700557 360371 61243 -542072 -29065 -190586
8009a90586N43741k37542M88488K37601k2019j75383M35522Q19101l43445r05518
$$ -190586 353155 115613 604101 841702 819683 644300 1079822 1898923 1555478 649960
7999F49960L68580q45346j50449k75334J95004r3170p22448J211249m96209L86795
$$ 649960 1018540 173194 22745 -252589 -57585 -150755 -873203 338046 -158163 228632
7989B28632k42012L37477M26498j060958J134052k78077m72242K47578K51404
$$ 228632 -13380 324097 750595 -310363 823689 545612 73370 320948 572352
7980E72352m39438O91964O77032j692476K37496N39446j555577J219842m26494
$$ 572352 132914 824878 1501910 -190566 46930 586376 -969201 250641 -175853
7971a75853N25269L83427l16870n66293k5751L48741j06933j63766N68284J75627
$$ -175853 349416 732843 415973 -150320 -176071 172670 65737 -98029 470255 645882
7961F45882m32950j54858m20795P21880o1296m09497k60550O39458o81599Q34629
$$ 645882 212932 58074 -362721 359159 297863 -111634 -372184 267274 -414325 420304
7951D20304N2269m82124k97330o8022L01407l88211l3305o37526J795638k58415
$$ 420304 472573 -9551 -306881 -374903 -73496 -461707 -495012 -1132538 663100 404685
7941D04685q18848O99628R1221j046312N86188K42366k92941J97074n18352K71715
$$ 404685 -414163 285465 376686 -669626 -83438 158928 -134013 63061 -455291 -183576
7931a83576K07170L28021k11192k84137R38350q23681n1732m53324L93731J95016
$$ -183576 23594 351615 140423 -143714 794636 -29045 -80777 -534101 -140370 54646
7921E4646J067917j420939J60572J162663j372902L93088K52595j06678J8618
$$ 54646 1122563 -298376 -137804 1024859 -348043 45045 297640 190962 209580
7912B09580L54662Q75113j98682j158433k38515l25987n3304J104626j232137
$$ 209580 564242 1439355 1240673 82240 -156275 -482262 -535566 569060 -663077
7903f63077N49414J3344N61178j406605O07747J45654M08050l27282j127409J362461
$$ -663077 -113663 -100319 460859 -945746 -337999 -192345 215705 -111577 -1238986 123475
7893A23475j96661N33029K11353j164442J61750R63756k54087k91610r17970R67049
$$ 123475 -73186 459843 671196 -493246 -331496 632260 378173 86563 -831407 135642
7883A35642m20396M51215r08715K64483k344l81319O13132m83540L89350K44980
$$ 135642 -284754 166461 -742254 -477771 -480115 -861434 -248302 -731842 -342492 -97512
7873i7512O11392j119244M86308J07231o73970J002845K68806k95278k90585M24961
$$ -97512 513880 -605364 -119056 -11825 -685795 317050 585856 290578 -7 424954
7863D24954q17828Q8010P17890p0382l51239L22207n20663P20907k86610J44713
$$ 424954 -392874 -304864 413026 342644 -8595 313612 -207051 513856 227246 371959
7853C71959p85176J013369j621479J421589M57744o83891L7307r947R5060l1919
$$ 371959 -413217 600152 -1021327 400262 858006 174115 211422 201475 296535 264616
7843B64616n35749M35828o3595O854m73684Q68671P0570p15641P15916m94454
$$ 264616 -271133 164695 101100 107954 -365730 502941 573511 -142130 573786 79332
7833G9332m7426m43837J605360o36484j50018l358j004767J03325K33431Q99701
$$ 79332 31906 -411931 1193429 556945 406927 403569 -601198 -497873 -264442 635259
7823F35259j96090o45331J050414o83031K81382p22447k36766M99969l3408k52576
$$ 635259 439169 -206162 844252 161221 442603 -279844 -516610 -16641 -50049 -302625
7813c02625L22689J18874P10003o24710M52172j68197L49350n39413l16456m40906
$$ -302625 20064 138938 848941 224231 676403 508206 857556 318143 1687 -439219
7803d39219L95313J022282r56508Q74061o67587r6575k22081J098423j347129
$$ -439219 -43906 978376 21868 895929 228342 131767 -90314 1008109 -339020
7794c39020R97553o89276L66149l70515l03544n91236J466826j174278J464254
$$ -339020 658533 -30743 335406 -35109 -338653 -929889 536937 -637341 826913
7785H26913n87421P36758q05013M2483l50398M42442l40238O61553L20060o70728
$$ 826913 239492 976250 171237 213720 -136678 305764 -34474 627079 947139 276411
7775B76411M63215j87056q7843n40063k23895P98957R628K57367n12926Q1720
$$ 276411 739626 552570 464727 -75336 -299231 499726 509354 766721 253795 335515
7765C35515J79483L9124M42784o24422K08606m10714N64010n20737J052956m37874
$$ 335515 514998 554122 996906 372484 581090 170376 734386 213649 1266605 828731
7755H28731k29359k43691N8369J73649j95860k44347k08007J573639n20362r8966
$$ 828731 599372 355681 414050 587699 391839 147492 -60515 1513124 992762 893796
7745H93796q65595r4476R87209j052230N38484o890k9317N51676K5913n42847
$$ 893796 28201 -66275 920934 -131296 407188 400298 370981 922657 948570 405723
7735D05723R8112p07926L37953Q93728j305156P26755n74420N48700Q88572m67270
$$ 405723 503835 -204091 133862 1027590 -277566 449189 -125231 423469 1312041 844771
7725H44771p8025k91198M8881J9334N32247o33272M77652K87282l37184M51592
$$ 844771 766746 475548 524429 543763 1076010 442738 920390 1207672 870488 1322080
7715A322080l10594r91651m26079J674107n22460q72877P07345l26564N5858P26683
$$ 1322080 1011486 19835 -406244 1267863 745403 -127474 579871 253307 309165 1035848
7705A035848o94552j206954J210232p07757P97623L90654k21517N62858j7723
$$ 1035848 341296 -865658 344574 -363183 434440 825094 603577 1166435 1148712
7696A148712q48411N13552o70046P47072r7117n2289P03249K21988j019644M14759
$$ 1148712 300301 813853 143807 890879 793762 741473 1444722 1666710 647066 1061825
7686A061825j74410n2045n61440Q89569o06550n1413P98823p32048k40333P02531
$$ 1061825 887415 835370 273930 1163499 556949 505536 1304359 572311 331978 1034509
7676A034509j01081L5160O71817n98520k55635l64558J23847L54144j51566N32935
$$ 1034509 933428 968588 1640405 1041885 786250 421692 545539 899683 748117 1281052
7666A281052n36979J25030j21926r74695J870135j461371P7268l54534J93830
$$ 1281052 744073 869103 747177 -227518 1642617 181246 258514 -96020 97810
7657I7810K31362M55852O0564o45304k56940R43316j192762R55116r49354J207232
$$ 97810 329172 785024 845588 200284 -56656 886660 -306102 649014 -300340 906892
7647I06892m80658K2073J50197q4256j61173R30095m58645l17627K15630n15169
$$ 906892 426234 448307 598504 514248 353075 1283170 824525 506898 722528 207359
7637B07359K73163m66206J2805q4106R49076o52268O11533r56898Q42084j106142
$$ 207359 480522 14316 27121 -56985 892091 239823 851356 -105542 736542 -369600
7627c69600O87134m67675P85147J25210M28208p59096l57403K32355k47744J127053
$$ -369600 317534 -150141 635006 760216 1188424 429328 71925 304280 56536 1183589
7617A183589o0023j261304N67671R6119O36073j081359P33591l51503M45437n27363
$$ 1183589 1123566 -137738 429933 526052 1162125 80766 814357 462854 908291 380928
7607C80928k70351M18105R21215p11191L92983m76358k05382l09336m4865j110679
$$ 380928 110577 528682 1449897 738706 1131689 655331 449949 140613 95748 -1014931
7597a014931L56079J424432L93707o98250o1300J95804J70170l10616j85787l94211
$$ -1014931 -658852 765580 1159287 461037 399737 595541 765711 455095 269308 -124903
7587a24903J429948P90213n84410j307694N65931n90003O41648n01723p35665
$$ -124903 1305045 2095258 1510848 203154 769085 179082 820730 319007 -416658
7578d16658J129487K93379J77483p0010k10384k14398l6750n7196o6501j00264
$$ -416658 712829 1006208 1183691 1113681 903297 688899 652149 594953 528452 428188
7568D28188k38962J027753L75375j359033J660058n27320j675066J07499O04667
$$ 428188 189226 1216979 1592354 233321 1893379 1366059 -309007 -201508 403159
7559D03159J386223j627214M07980Q06579j379060J463116o14445n9378L63895
$$ 403159 1789382 162168 570148 1376727 -2333 1460783 846338 786960 1150855
7550A150855m95374j21843J256203j071405r81458R44870Q76011l76842j96754
$$ 1150855 655481 533638 1789841 718436 -263022 681848 1557859 1181017 984263
7541I84263j96240j016756J714554q53235J218379l84881j654182J062053O65594
$$ 984263 788023 -228733 1485821 632586 1850965 1466084 -188098 873955 1539549
7532A539549j210179k51486K32387M92230R20437r80934K3923m86096P29029k29678
$$ 1539549 329370 77884 310271 802501 1722938 742004 765927 279831 1008860 779182
7522G79182m70293k66434N45582M33347J25294r19110R72200M29441j00174l4047
$$ 779182 308889 42455 588037 1021384 1146678 227568 1199768 1629209 1529035 1494988
7512A494988k21182O7243j269804J36812L70468L70363p77880L01513L97674J85334
$$ 1494988 1273806 1341049 71245 208057 578525 948888 171008 472521 870195 1055529
7502A055529m41213l86748M06563M71013m78333P8780o50722J009319m06926l28528
$$ 1055529 614316 227568 634131 1105144 626811 705591 54869 1064188 657262 328734
7492C28734N67452k56081N02129o96925j50917O80178N19621q62473R3906l885
$$ 328734 896186 640105 1142234 445309 294392 974570 1494191 631718 725624 721739
7482G21739J012102l75862L6808q09360K83942k15451O23439m51930J46853K69204
$$ 721739 1733841 1357979 1394787 585427 869369 653918 1277357 825427 972280 1241484
7472A241484K26038o17394N24133m17531L85365N7651k90021P16573j503440J359562
$$ 1241484 1467522 850128 1374261 956730 1342095 1399746 1109725 1826298 322858 1682420
7462A682420l33810m71352K09953K17635J83106j387734N35501k10016O18920
$$ 1682420 1348610 877258 1087211 1304846 1487952 100218 635719 425703 1044623
7453A044623J16624j183442J994028q33364K34880j38722j83858n67472R83370
$$ 1044623 1161247 -22195 1971833 1138469 1373349 1234627 1050769 483297 1466667
7444A466667l64702K81937p39637O81414K97984K93213l95524j63991l36509J265687
$$ 1466667 1101965 1383902 644265 1325679 1623663 1916876 1521352 1357361 1020852 2286539
7434B286539r80548K72296k58004j95305q5294N93016l61165K39000n7237r1117
$$ 2286539 1305991 1578287 1320283 1124978 1039684 1632700 1271535 1510535 1453298 1362181
7424A362181L78889p6400K33001m64299J30287r3012l6567k38886o4913M08516
$$ 1362181 1741070 1664670 1897671 1433372 1563659 1470647 1434080 1195194 1130281 1538797
7414A538797O20222N5690n40048l91206J172795j279316k56568L56959M69382
$$ 1538797 2159019 2214709 1674661 1283455 2456250 1176934 920366 1277325 1746707
7405A746707k40443J87164K90654l4974j12252K19761m95226L48937K92415j55215
$$ 1746707 1506264 1693428 1984082 1949108 1836856 2056617 1561391 1910328 2202743 2047528
7395B047528P69170k98619j53323o16427M73090M84088l37264L59487L8979m96397
$$ 2047528 2816698 2518079 2364756 1748329 2221419 2705507 2368243 2727730 2766709 2270312
7385B270312L92618L820j026823k21084J373074j80958j112946M34754m62113
$$ 2270312 2662930 2666750 1639927 1418843 2791917 2610959 1498013 1932767 1470654
7376A470654N57350M91697j80302N28385m49376M37043K32137n61706n83860n42789
$$ 1470654 2028004 2519701 2339399 2867784 2418408 2855451 3087588 2525882 1942022 1399233
7366A399233N96426O14386p34231R64067l86147K51881K40200m3717k33740L00689
$$ 1399233 1995659 2610045 1875814 2839881 2453734 2705615 2945815 2902098 2668358 2969047
7356B969047J8524L44009o85617N50468L65417J72027M24740J41661K57296Q11054
$$ 2969047 2987571 3331580 2645963 3196431 3561848 3733875 4158615 4300276 4557572 5368626
7346E368626N58497O89574J584813R7878Q70700j479979J81484k71895j263768
$$ 5368626 5927123 6616697 8201510 8299388 9170088 7690109 7871593 7599698 6335930
7337F335930l27924p52996j145345M38241k77865L17579j286753J22853j67880
$$ 6335930 6008006 5255010 4109665 4547906 4270041 4587620 3300867 3423720 3255840
7328C255840K31769m03411p65153P33059N24927l29810M7825L84956j743833J510137
$$ 3255840 3487609 3084198 2319045 3052104 3577031 3247221 3295046 3680002 1936169 3446306
7318C446306m96930Q6123n31607K37586J393945k79875M71322j175984R68991
$$ 3446306 2949376 3035499 2503892 2741478 4135423 3855548 4326870 3150886 4119877
7309D119877L74424p96943K21512K35889Q4391O3899J296J90496r81964m96697
$$ 4119877 4494301 3697358 3918870 4154759 4239150 4303049 4304345 4494841 3512877 3016180
7299C016180O62195J46776r89615r5028N38858J040219l59266l93492n42648L22455
$$ 3016180 3678375 3825151 2835536 2740508 3279366 4319585 3960319 3566827 3024179 3346634
7289C346634k83721K83028K55968k12855l24044M20074L03888j73882M92291q94059
$$ 3346634 3062913 3345941 3601909 3389054 3065010 3485084 3788972 3615090 4107381 3213322
7279C213322n2051N72022l82995n17821K55302M12786n47266J70626o10468L57641
$$ 3213322 3161271 3733293 3350298 2832477 3087779 3500565 2953299 3123925 2513457 2871098
7269B871098J8373R9274Q61247l38607m41288K66226k5174k72777J88979M50408
$$ 2871098 2889471 2988745 3849992 3511385 3070097 3336323 3311149 3038372 3227351 3677759
7259C677759k07091L46998j34744N84274n81434K63273k25320n86137L76573l56064
$$ 3677759 3470668 3817666 3682922 4267196 3685762 3949035 3723715 3137578 3514151 3158087
7249C158087m23124N21705K8332N21987j41335j1321O79514o60522j231187M52478
$$ 3158087 2734963 3256668 3285000 3806987 3665652 3654331 4333845 3673323 2442136 2894614
7239B894614P98395J9721m44506K82875P50831k98347L29711p23198r20745N80631
$$ 2894614 3693009 3712730 3268224 3551099 4301930 4003583 4333294 3610096 2689351 3269982
7229C269982O51224q66925P52813K79200k57097R3897l36992n41046P16686M14752
$$ 3269982 3921206 3054281 3807094 4086294 3829197 3923094 3586102 3045056 3761742 4176494
7219D176494l27500q25670J55531J468534q66469k5701o42046k915K03435J69235
$$ 4176494 3848994 3023324 3178855 4647389 3780920 3755219 3113173 3110258 3313693 3482928
7209C482928n01605J61241K23568J011132m46339k58983k20771M36173p09993
$$ 3482928 2981323 3142564 3366132 4377264 3930925 3671942 3451171 3887344 3177351
7200C177351N52402p14516K33358M43772L82845q09211J26645K4087M00764r3
$$ 3177351 3729753 3015237 3248595 3692367 4075212 3266001 3392646 3416733 3817497 3817404
7190C817404l74201m31374L9112P09488r43743J242903j514615K64308J52656
$$ 3817404 3443203 3011829 3050941 3760429 2816686 4059589 2544974 2809282 2961938
7181B961938m43409M67372J47372j06774N29798q6390r15972J213442k13810J87795
$$ 2961938 2518529 2985901 3133273 3026499 3556297 3469907 2553935 3767377 3553567 3741362
7171C741362j54797k37761J100209r49991n74388Q50187q09413K80674n90605
$$ 3741362 3586565 3348804 4449013 3499022 2924634 3774821 2965408 3246082 2655477
7162B655477o5930R38246o31766Q13687j156739L03013k25580K15758J308292
$$ 2655477 2589547 3527793 2896027 3709714 2552975 2855988 2630408 2846166 4154458
7153D154458j20375j591125k16746J004904o03131m42425J149334O2909j21205
$$ 4154458 4034083 2442958 2226212 3231116 2627985 2185560 3334894 3397803 3276598
7144C276598q815P6046o211L3514R3236n85889J44667L7034j41735j97822m90926
$$ 3276598 3267783 3343829 3337618 3371132 3464368 2878479 3023146 3060180 2918445 2720623 2229697
7133B229697J49320N70626O99061j139219J38898p4942J017422j240396r6331
$$ 2229697 2379017 2949643 3648704 2509485 2648383 2573441 3590863 2350467 2254136
7124B254136J85823J272318p91310J59873q20620j13594J199212K51182k59077
$$ 2254136 2439959 3712277 2920967 3080840 2260220 2146626 3345838 3597020 3337943
7115C337943k8580o09732K23055r64183Q97891J00655L7366M48135k02407J28095
$$ 3337943 3309363 2699631 2922686 1958503 2856394 2957049 2994415 3442550 3240143 3368238
7105C368238k34253L56628L00838q51456L80002L13381J0746l1197M83733j609553
$$ 3368238 3133985 3490613 3791451 2939995 3319997 3633378 3644124 3612927 4096660 2487107
7095B487107J214923N80617j515799Q04143l44005P03873o809r41192N82526k9985
$$ 2487107 3702030 4282647 2766848 3570991 3226986 3930859 3924050 2982858 3565384 3535399
7085C535399K83869Q87637j557191J439836J39442J00348q1339q15675J433556
$$ 3535399 3819268 4706905 3149714 4589550 4728992 4829340 4748001 3932326 5365882
7076E365882j182639N62718o2186J27585L87628O94292l12584M55241l50822J16854
$$ 5365882 4183243 4745961 4683775 4811360 5198988 5893280 5580696 6035937 5685115 5801969
7066E801969J051876O33557n49761J79579J8707j07908N92481n59989n32011R5378
$$ 5801969 6853845 7487402 6937641 7117220 7135927 7028019 7620500 7060511 6528500 6623878
7056F623878n42572K17882J32512k08617L57990k69787K25229J195412q49852
$$ 6623878 6081306 6299188 6431700 6223083 6581073 6311286 6536515 7731927 6882075
7047F882075l97910m4302l28725j28728j24364L11459R5688N32005r02104L99519
$$ 6882075 6484165 6439863 6111138 5982410 5858046 6169505 6265193 6797198 5895094 6294613
7037F294613K072892j241462l7542Q75334J282676n73940P03015M62628R61288
$$ 6294613 8367505 7126043 7088501 7963835 9246511 8672571 9375586 9838214 10799502
7028A0799502R63780j21510m72152J304193K83474L75439J599447J126600J212276
$$ 10799502 11763282 11641772 11169620 12473813 12757287 13132726 14732173 15858773 17071049
7019A7071049K230725K266949L199174L729151P781524O898442Q867336O357081
$$ 17071049 19301774 21568723 24767897 28497048 36278572 43177014 52044350 58401431
7011E8401431L016357k857501n937689o819540p080629p356312m336411m624822
$$ 58401431 61417788 58560287 52622598 45803058 38722429 31366117 27029706 22404884
7003B2404884l110045k998836k659064j294948p34893j823614m20421j13901q28591
$$ 22404884 19294839 16296003 13636939 12341991 11607098 9783484 9363063 9249162 8420571
6994H420571m45224q27912k20717R88095r80277p27476P92480n2481r58943P96485
$$ 8420571 7975347 7147435 6926718 7914813 6934536 6207060 6999540 6947059 5988116 6784601
6984F784601r66705J56516R30780p41037p07753N38120R9627L40834o32028O23494
$$ 6784601 5817896 5974412 6905192 6164155 5456402 5994522 6094149 6434983 5802955 6426449
6974F426449M71967q40739J091279k77218J782900J089849m67800J940226k3814
$$ 6426449 6898416 6057677 7148956 6871738 8654638 9744487 9276687 11216913 11193099
6965A1193099J41254j243513n20899j831656m75933l07820n13429P37049n96303
$$ 11193099 11334353 10090840 9569941 7738285 7262352 6954532 6441103 7178152 6581849
6956F581849N9890l7830P24739o02156o47053Q08935r64124J137572k26282l04859
$$ 6581849 6641739 6603909 7328648 6726492 6079439 6888374 5924250 7061822 6835540 6530681
6946F530681J288548K31943J744037K212225K077280L695090M094702K470042
$$ 6530681 7819229 8051172 9795209 12007434 14084714 17779804 21874506 24344548
6938B4344548K418724j914363j764009l332402l983148k643707j976364j703379
$$ 24344548 26763272 24848909 23084900 19752498 15769350 13125643 11149279 9445900
6930I445900n37195k79009j669268J00276M23354k89612k09294l89240J035945
$$ 9445900 8908705 8629696 6960428 7060704 7484058 7194446 6985152 6595912 7631857
6921G631857N57829q95759J04461J433112L65390J347233N30165L892648J974864
$$ 7631857 8189686 7293927 7398388 8831500 9196890 10544123 11074288 14966936 16941800
6912A6941800L922627M242328J985631j932064k225509l954225l041090m057828
$$ 16941800 20864427 25106755 27092386 25160322 22934813 18980588 15939498 11881670
6904A1881670k073109j723236o84033j081118K2228j703711J116732j046465N32113
$$ 11881670 9808561 8085325 7401292 6320174 6342402 4638691 5755423 4708958 5241071
6895E241071o90862O01755L06910o7738q28003P59610K81138K96503k14953J531939
$$ 5241071 4550209 5151964 5458874 5391136 4563133 5322743 5603881 5900384 5685431 7217370
6885G217370J601311J117673L2553P50929j66365q55029p52463j461177j52160
$$ 7217370 8818681 9936354 9968907 10719836 10553471 9698442 8945979 7484802 7332642
6876G332642j011178j905886L1416K63561p60609K61830j313859J924524l92508
$$ 7332642 6321464 4415578 4446994 4710555 3949946 4211776 2897917 4822441 4429933
6867D429933l37994r9155j71605k73315P49757m05738J77395k03808R35253p86492
$$ 4429933 4091939 3992784 3821179 3547864 4297621 3891883 4069278 3865470 4800723 4014231
6857D014231N21166j023450J346961j492687J316709o83411R78585r09068m54142
$$ 4014231 4535397 3511947 4858908 3366221 4682930 3999519 4978104 4069036 3614894
6848C614894K13214l50109j153773J502464j001937O90776o68903J171986J45907
$$ 3614894 3828108 3477999 2324226 3826690 2824753 3515529 2846626 4018612 4164519
6839D164519j89913j028238J214656j247332L37881O8182J37886M0494L43832
$$ 4164519 3974606 2946368 4161024 2913692 3251573 3319755 3457641 3498135 3841967
6830C841967j845712R71291j69980N82928j43907n20107L87354l51636J861437
$$ 3841967 1996255 2967546 2797566 3380494 3236587 2716480 3103834 2752198 4613635
6821D613635j296673k41346Q18153q3106j98872j01534k53195L84456l08909p99352
$$ 4613635 3316962 3075616 3893769 3810663 3611791 3510257 3257062 3641518 3332609 2533257
6811B533257k23517J106085j241716J223067n83757j9758J223682K07856l92397
$$ 2533257 2309740 3415825 2174109 3397176 2813419 2793661 4017343 4225199 3832802
6802C832802J234994j38194L41532K94856n89831o39590J559099j158268p96378
$$ 3832802 5067796 4929602 5271134 5565990 4976159 4336569 5895668 4737400 3941022
6793C941022k64107k4813k11236j092247j75458l12912J308658q16177P47521
$$ 3941022 3676915 3652102 3440866 2348619 2173161 1860249 3168907 2352730 3100251
6784C100251l33945N34395k71404k99747L42767M00174p20700o64049K34412J445588
$$ 3100251 2766306 3300701 3029297 2729550 3072317 3472491 2751791 2087742 2322154 3767742
6774C767742r67358r82959R04891L45978j82466Q51869r61735k60179M64903P56535
$$ 3767742 2800384 1817425 2722316 3068294 2885828 3737697 2775962 2515783 2980686 3737221
6764C737221j189306N0037N76846k46402M7559p93465M06540p9683K74402P58331
$$ 3737221 2547915 2597952 3174798 2928396 2975955 2182490 2589030 2509347 2783749 3542080
6754C542080m28805K26146K00959k55457j01558n21127k18750K69771O64206J80286
$$ 3542080 3113275 3339421 3540380 3284923 3183365 2662238 2443488 2713259 3377465 3557751
6744C557751Q40674p82677J35980k18667o96152J01392L77763K49047M17012O27906
$$ 3557751 4398425 3615748 3751728 3533061 2836909 2938301 3316064 3565111 3982123 4610029
6734D610029N43139q33258j64681N75822J3151O71866j835424K94970N28606k02855
$$ 4610029 5153168 4319910 4155229 4731051 4744202 5416068 3580644 3875614 4404220 4201365
6724D201365k6404p30542K36250N74087p11914N10309n43117R4417o11369J930462
$$ 4201365 4174961 3444419 3680669 4254756 3542842 4053151 3510034 3604451 2993082 4923544
6714D923544q53982J131250k3273j227550J209653K01051R86701R14424O12286
$$ 4923544 4069562 5200812 5177539 3949989 5159642 5360693 6347394 7261818 7874104
6705G874104R51522Q87537j794641Q0816j916589k72567l2277n24612J310872
$$ 7874104 8825626 9713163 7918522 7999338 6082749 5810182 5777905 5253293 6564165
6696F564165j308787j82605Q05059o65335m40664L33028o98184R79362J47056
$$ 6564165 5255378 5072773 5877832 5212497 4771833 5104861 4406677 5386039 5533095
6687E533095j076112J667015N2536o70963K312930j66449J471017J817686L296540
$$ 5533095 4456983 6123998 6176534 5505571 7818501 7652052 9123069 10940755 14237295
6678A4237295M197973K238324q38884j379864j658960l656698j883539j796259
$$ 14237295 18435268 20673592 19834708 18454844 16795884 13139186 11255647 9459388
6670I459388j757234p77118n38576j07323j368451l2340J019775p41319J301531
$$ 9459388 7702154 6925036 6386460 6279137 4910686 4878346 5898121 5156802 6458333
6661F458333j530656J37249L25778J017108q46533J610666O00817P76J775834
$$ 6458333 4927677 5064926 5390704 6407812 5561279 7171945 7772762 7773538 9549372
6652I549372J976893J926521L199762M116244N92267j525966k157439l739206
$$ 9549372 11526265 13452786 16652548 20768792 21361059 19835093 17677654 13938448
6644A3938448l030214j746731j459290k49864j391474j17651j261922M55682k80523
$$ 13938448 10908234 9161503 7702213 7452349 6060875 5943224 4681302 5136984 4856461
6635D856461n6421m59442o1712K39068n20435k78280Q45357K91695L06366J183052
$$ 4856461 4800040 4340598 4278886 4517954 3997519 3719239 4564596 4856291 5162657 6345709
6625F345709J80942J82161O85572K7861J520495N03401p6942q78610j565786k31955
$$ 6345709 6526651 6708812 7394384 7422245 8942740 9446141 9369199 8490589 6924803 6692848
6615F692848j165751m54790n49511n10424r02454J163189q45690p21648Q66985
$$ 6692848 5527097 5072307 4522796 4012372 3109918 4273107 3427417 2705769 3572754
6606C572754m98137Q82457K06597j410402J277806n50968J250379O53320N02508
$$ 3572754 3074617 3957074 4163671 2753269 4031075 3480107 4730486 5383806 5886314
6597E886314K00634n39422o50685J21331j245628K54598m44271p78427Q85460
$$ 5886314 6086948 5547526 4896841 5018172 3772544 4027142 3582871 2804444 3689904
6588C689904m71379K63117j59219k38804K42222k4165J83391M37692m82951o46075
$$ 3689904 3218525 3481642 3322423 3083619 3325841 3301676 3485067 3922759 3439808 2793733
6578B793733N39756M05559j41205O30875o24670O40735r1219j38762k2083J832496
$$ 2793733 3333489 3739048 3597843 4228718 3604048 4244783 4153564 4014802 3992719 5825215
6568E825215j249967M36190N905j098973R27726o48238j012095l1392R69939l90018
$$ 5825215 4575248 5011438 5017343 3918370 4846096 4197858 3185763 3154371 4124310 3734292
6558C734292J52099l98721L07987J31358j90069M1337M2826r38905J998614o60584
$$ 3734292 3886391 3487670 3795657 3927015 3736946 3778283 3821109 2882204 4880818 4220234
6548D220234M77206m60977M17832j95724J245706J063949n23449J94240L40961
$$ 4220234 4697440 4236463 4654295 4458571 5704277 6768226 6244777 6439017 6779978
6539F779978l18686J111136j685548j044987N42396o44178m14707q34847P73687
$$ 6779978 6461292 7572428 5886880 4841893 5384289 4740111 4325404 3490557 4264244
6530D264244K82716O74007q96029K49061J59550n19317K09800q94631m7371O65971
$$ 4264244 4546960 5220967 4324938 4573999 4733549 4214232 4424032 3529401 3482030 4148001
6520D148001o16084K84030K04194O36096j346253J060111m29927j342399Q93777
$$ 4148001 3531917 3815947 4020141 4656237 3309984 4370095 3940168 2597769 3491546
6511C491546M35376L35710M3190j01559N60347p09803L63107q51859J203894k8476
$$ 3491546 3926922 4262632 4305822 4204263 4764610 4054807 4417914 3566055 4769949 4741473
6501D741473k29816l16272Q08035r40753L4340n95385R47980M17710q04075k92091
$$ 4741473 4511657 4195385 5003420 4062667 4097007 3501622 4449602 4867312 4063237 3771146
6491C771146L75993R91956l96406o64769L74609R80363k70735o48924K1109O27063
$$ 3771146 4147139 5139095 4742689 4077920 4452529 5432892 5162157 4513233 4534342 5161405
6481E161405l99261P6025N8628P31387k9186p71406Q61610M61329Q4160j15522
$$ 5161405 4762144 4838169 4896797 5628184 5598998 4827592 5689202 6150531 6234691 6119169
6471F119169L05131M5328l08224k15934J57457O26748m1824J84195Q33044J16485
$$ 6119169 6424300 6469628 6161404 5945470 6102927 6729675 6687851 6872046 7705090 7821575
6461G821575j072729J060846J99635L201N97919l76227l52262K040432o92397
$$ 7821575 6748846 7809692 8009327 8012528 8610447 8234220 7881958 9922390 9229993
6452I229993M5110J126544l41750N36703M46470n50743J621521j4290K4927K101885
$$ 9229993 9275103 10401647 10059897 10596600 11043070 10492327 12113848 12099558 12124485 14226370
6442A4226370o28816J766058J806465M67611J559739Q05468R45200M72998j404470
$$ 14226370 13597554 15363612 17170077 17637688 19197427 20002895 20948095 21421093 20016623
6433B0016623l63002j301764j94341o00544p96949k82578j438423K0909L19319
$$ 20016623 19653621 18351857 18157516 17556972 16760023 16477445 15039022 15059931 15379250
6424A5379250J16786K37168p07375R38235j048095P03600r7077K35683M38676
$$ 15379250 15496036 15733204 15025829 15964064 14915969 15619569 15522492 15758175 16196851
6415A6196851P63592J29932p36265P20877k1546L25929J115486N85254L22278
$$ 16196851 16960443 17090375 16354110 17074987 17053441 17379370 18494856 19080110 19402388
6406A9402388J171496r31128L06402j582096q34816K33239m38045q87130n96109
$$ 19402388 20573884 19642756 19949158 18367062 17532246 17765485 17327440 16440310 15844201
6397A5844201r65936m67735p14750j004931Q45512j6317j130662R51967m35675
$$ 15844201 14878265 14410530 13695780 12690849 13536361 13520044 12389382 13341349 12905674
6388A2905674l0675N89192p90040p62132K22018K29017r7980k08580j39702o34998
$$ 12905674 12874999 13464191 12674151 11912019 12134037 12363054 12265074 12056494 11916792 11281794
6378A1281794J503631n53363K14557K32664o69004J92799R71405K65271n7461
$$ 11281794 12785425 12232062 12446619 12679283 12010279 12203078 13174483 13439754 13382293
6369A3382293j64868m8320L1216Q6392k75102m1180Q32748j58170J31317j02914
$$ 13382293 13217425 13169105 13200321 13286713 13011611 12970431 13803179 13645009 13776326 13673412
6359A3673412L04169o44190Q90213j47351Q42460o9889m30337p0858J240297J83060
$$ 13673412 13977581 13333391 14223604 14076253 14918713 14848824 14418487 14347629 15587926 15770986
6349A5770986M58257N54353L90765j75497J269079l89767j49759N36185O34729
$$ 15770986 16229243 16783596 17174361 16998864 18267943 17878176 17728417 18264602 18899331
6340A8899331M87654R55607q88759P84202J342611O18288L36324R55169J370312
$$ 18899331 19386985 20342592 19453833 20238035 21580646 22198934 22535258 23490427 24860739
6331B4860739k63539J076371K63491M62263K240523J323144J361300K66379K092087
$$ 24860739 24597200 25673571 25937062 26399325 28639848 29962992 31324292 31590671 33682758
6322C3682758K139682K045992L073094K257297L112355K094422J197338P20026
$$ 33682758 35822440 37868432 40941526 43198823 46311178 48405600 49602938 50322964
6314E0322964P28767k77103l662380j538762k970177k540855k678678j252589
$$ 50322964 51051731 50774628 47112248 45573486 42603309 40062454 37383776 36131187
6306C6131187l329447k006378j720954p08269j391067j664082j474626K62419
$$ 36131187 32801740 30795362 29074408 28366139 26975072 25310990 23836364 24098783
6298B4098783q40340k63921j078274l96891L31806j052680j005808m82036k1975
$$ 24098783 23258443 22994522 21916248 21519357 21851163 20798483 19792675 19310639 19288664
6289A9288664K6072o21498j061195O29907O3276l05651k778q79532J099185m58085
$$ 19288664 19314736 18693238 17632043 18261950 18325226 18019575 18016797 17137265 18236450 17778365
6279A7778365O38537P36315j38953O61563k12830r4154R1919q23943L03340J9039
$$ 17778365 18416902 19153217 19014264 19675827 19462997 19368843 19460762 18636819 18940159 18959198
6269A8959198J279096j234890J61133k9036m56625k21255J359906q33515J031080
$$ 18959198 20238294 19003404 19164537 19135501 18678876 18457621 19817527 18984012 20015092
6260B0015092L33014K50084J746081J580675R04155K785640Q52918j212o41994
$$ 20015092 20348106 20598190 22344271 23924946 24829101 27614741 28467659 28466447 27824453
$$ [...]
##END NTUPLES=NMR SPECTRUM
##END=
