##TITLE=abcd
##JCAMPDX= 6.0         $$ Bruker NMR JCAMP-DX V2.0
##DATA TYPE= NMR SPECTRUM
##DATA CLASS= NTUPLES
##ORIGIN= UXNMR, Bruker Analytische Messtechnik GmbH
##OWNER= root
$$ XWIN-NMR		Version 3.5
$$ Fri Aug  7 16:47:46 2026 Russian Standard Time (UT+4h)  servis@DPX200
##.OBSERVE FREQUENCY= 200.131235884673
##.OBSERVE NUCLEUS= ^1H
##.ACQUISITION MODE= SIMULTANEOUS
##.ACQUISITION SCHEME= undefined
##.AVERAGES= 32
##.DIGITISER RES= 18
##SPECTROMETER/DATA SYSTEM= spect
##.PULSE SEQUENCE= zg
##.SOLVENT NAME= CDCl3
##.SHIFT REFERENCE= (INTERNAL, CDCl3, 0, 16.4885)
##AUDIT TRAIL= $$ (NUMBER, WHEN, WHO, WHERE, WHAT)
$$ ##TITLE= Audit trail, XWIN-NMR		Version 3.5
$$ ##JCAMPDX= 5.01
$$ ##ORIGIN= Bruker BioSpin GmbH
$$ ##OWNER= servis
$$ F:\spectra/data/av/nmr/H1/1/pdata/1/auditp.txt
$$ ##AUDIT TRAIL=  $$ (NUMBER, WHEN, WHO, WHERE, WHAT)
(   1,<2026-08-07 16:47:21.26 +0400>,<servis>,<DPX200>,
      <created by zg, POWCHK disabled, PULCHK disabled
       configuration hash MD5:
       00 E9 B6 7A A2 85 ED C7 34 08 36 98 17 FE 4E 26
       data hash MD5: 32K
       18 4E 86 26 DD A5 62 51 2D 2E 71 A5 34 12 C7 3F>)
(   2,<2026-08-07 16:47:24.17 +0400>,<servis>,<DPX200>,
      <Start of raw data processing
       efp BC_mod = 2 LB = 0.05 FT_mod = 6 PKNL = 1 PHC0 = -413.9518 PHC1 = 3.101563 SI = 16K 
       data hash MD5: 16K
       43 40 7A CF CB 08 6C 3D 40 93 C4 4C 8C 42 DF 60>)
$$ ##END=
$$ 
$$ hash MD5
$$ C5 08 1F E1 7D EE 1D 11 4F 0A 4E 93 C7 1A C7 CB
##$RELAX= 
##$RELAX= 
##$RELAX= 
##$RELAX= 
##$RELAX= 
##$RELAX= 
##$RELAX= 
##$RELAX= 
$$ Bruker specific parameters
$$ --------------------------
##$DU= <F:\spectra>
##$EXPNO= 1
##$NAME= <H1>
##$PROCNO= 1
##$TYPE= <nmr>
##$USER= <av>
##$AMP= (0..31)
100 100 100 100 100 100 100 100 100 100 100 100 100 100 100 100 100 100 
100 100 100 100 100 100 100 100 100 100 100 100 100 100 
##$AQSEQ= 0
##$AQ_mod= 1
##$AUNM= <au_zg>
##$AUTOPOS= <>
##$BF1= 200.13
##$BF2= 200.13
##$BF3= 200.13
##$BF4= 200.13
##$BF5= 500.13
##$BF6= 500.13
##$BF7= 500.13
##$BF8= 500.13
##$BYTORDA= 1
##$CFDGTYP= 0
##$CFRGTYP= 5
##$CHEMSTR= <none>
##$CNST= (0..31)
1 1 145 1 1 1 1 1 1 1 1 1 1 1 1 1 1 1 1 1 1 1 1 1 1 1 1 1 1 1 1 1 
##$CPDPRG= <>
##$CPDPRG1= <>
##$CPDPRG2= <>
##$CPDPRG3= <>
##$CPDPRG4= <mlev>
##$CPDPRG5= <mlev>
##$CPDPRG6= <mlev>
##$CPDPRG7= <mlev>
##$CPDPRG8= <mlev>
##$CPDPRGB= <>
##$CPDPRGT= <>
##$D= (0..31)
0 2 0 0 0 0 0 0 0 0.06 0 0 0 0 0 0 0.0002 0 0 0 0 0 0 0 0 0 0 0 0 0 0 
0 
##$DATE= 1786106840
##$DBL= (0..7)
120 120 120 120 120 120 120 120 
##$DBP= (0..7)
150 150 150 150 150 150 150 150 
##$DBP07= 0
##$DBPNAM0= <>
##$DBPNAM1= <>
##$DBPNAM2= <>
##$DBPNAM3= <>
##$DBPNAM4= <>
##$DBPNAM5= <>
##$DBPNAM6= <>
##$DBPNAM7= <>
##$DBPOAL= (0..7)
0.5 0.5 0.5 0.5 0.5 0.5 0.5 0.5 
##$DBPOFFS= (0..7)
0 0 0 0 0 0 0 0 
##$DE= 6
##$DECBNUC= <off>
##$DECIM= 32
##$DECNUC= <off>
##$DECSTAT= 4
##$DIGMOD= 1
##$DIGTYP= 9
##$DL= (0..7)
0 120 120 120 120 120 120 120 
##$DP= (0..7)
150 150 150 150 150 150 150 150 
##$DP07= 0
##$DPNAME0= <>
$$ [...]
##$SUBNAM4= <"">
##$SUBNAM5= <"">
##$SUBNAM6= <"">
##$SUBNAM7= <"">
##$SUBNAM8= <"">
##$SUBNAM9= <"">
##$SW= 20.6817932712277
##$SWIBOX= (0..15)
0 0 3 0 0 0 0 0 0 0 0 0 0 0 0 0 
##$SW_h= 4139.07284768212
##$TD= 32768
##$TD0= 1
##$TE= 0
##$TE2= 300
##$TE3= 300
##$TEG= 300
##$TL= (0..7)
0 120 120 120 120 120 120 120 
##$TP= (0..7)
150 150 150 150 150 150 150 150 
##$TP07= 0
##$TPNAME0= <>
##$TPNAME1= <>
##$TPNAME2= <>
##$TPNAME3= <>
##$TPNAME4= <>
##$TPNAME5= <>
##$TPNAME6= <>
##$TPNAME7= <>
##$TPOAL= (0..7)
0.5 0.5 0.5 0.5 0.5 0.5 0.5 0.5 
##$TPOFFS= (0..7)
0 0 0 0 0 0 0 0 
##$TUNHIN= 0
##$TUNHOUT= 0
##$TUNXOUT= 0
##$USERA1= <user>
##$USERA2= <user>
##$USERA3= <user>
##$USERA4= <user>
##$USERA5= <user>
##$V9= 5
##$VALIST= <valist>
##$VCLIST= <CCCCCCCCCCCCCCC>
##$VD= 0
##$VDLIST= <DDDDDDDDDDDDDDD>
##$VPLIST= <PPPPPPPPPPPPPPP>
##$VTLIST= <TTTTTTTTTTTTTTT>
##$WBST= 1024
##$WBSW= 30
##$XGAIN= (0..3)
0 0 0 0 
##$XL= 0
##$YL= 0
##$YMAX_a= 128178
##$YMIN_a= -173118
##$ZGOPTNS= <>
##$ZL1= 120
##$ZL2= 120
##$ZL3= 120
##$ZL4= 120
##$ABSF1= 0
##$ABSF2= 0
##$ABSG= 0
##$ABSL= 0
##$ALPHA= 0
##$AQORDER= 0
##$ASSFAC= 0
##$ASSFACI= 0
##$ASSFACX= 0
##$ASSWID= 0
##$AUNMP= <proc_1d>
##$AZFE= 0.1
##$AZFW= 0.1
##$BCFW= 0
##$BC_mod= 2
##$BYTORDP= 0
##$COROFFS= 0
##$CY= 18.4799938201904
##$DATMOD= 1
##$DC= 0
##$DFILT= <>
##$DTYPP= 0
##$F1P= 9.9274215381318
##$F2P= -0.165520771350173
##$FCOR= 1
##$FTSIZE= 16384
##$FT_mod= 6
##$GAMMA= 0
##$GB= 0
##$INTBC= 1
##$INTSCL= 4.127829e-11
##$ISEN= 128
##$LB= 0.05
##$LEV0= 0
##$LPBIN= 0
##$MAXI= 10000
##$MC2= 0
##$MEAN= 0
##$ME_mod= 0
##$MI= 50
##$NCOEF= 0
##$NC_proc= -7
##$NLEV= 6
##$NOISF1= 3.799351
##$NOISF2= 2.8
##$NSP= 0
##$NTH_PI= 0
##$NZP= 0
##$OFFSET= 16.48848
##$PC= 4
##$PHC0= -413.9518
##$PHC1= 3.101563
##$PH_mod= 1
##$PKNL= yes
##$PPARMOD= 0
##$PSCAL= 4
##$PSIGN= 0
##$REVERSE= no
##$SF= 200.130005582386
##$SI= 16384
##$SIGF1= 3
##$SIGF2= 2
##$SINO= 400
##$SIOLD= 16384
##$SREGLST= <1H.CDCl3>
##$SSB= 0
##$STSI= 16384
##$STSR= 0
##$SW_p= 4139.07284768211
##$SYMM= 0
##$S_DEV= 0
##$TDeff= 32768
##$TDoff= 0
##$TI= <>
##$TILT= no
##$TM1= 0
##$TM2= 0
##$TOPLEV= 0
##$USERP1= <user>
##$USERP2= <user>
##$USERP3= <user>
##$USERP4= <user>
##$USERP5= <user>
##$WDW= 1
##$XDIM= 16384
##$YMAX_p= 415064440
##$YMIN_p= -1745033
$$ End of Bruker specific parameters
$$ ---------------------------------
##NTUPLES= NMR SPECTRUM
##VAR_NAME=  FREQUENCY,     SPECTRUM/REAL,   SPECTRUM/IMAG
##SYMBOL=    X,             R,               I
##VAR_TYPE=  INDEPENDENT,   DEPENDENT,       DEPENDENT
##VAR_FORM=  AFFN,          ASDF,            ASDF
##VAR_DIM=   16384,         16384,           16384
##UNITS=     HZ,            ARBITRARY UNITS, ARBITRARY UNITS
##FACTOR=    0.252644378177508, 1,           1
##FIRST=     3299.83951724647, 0,            0
##LAST=      -839.233330435636, 0,           0
##MIN=       -839.233330435636, -1745033,    0
##MAX=       3299.83951724647, 415064440,    0
$$ Real data points
##PAGE= N=1
##DATA TABLE= (X++(R..R)), XYDATA
$$ [...]
7357D32859j96647L08629k68616L56933k29665m1830J56836K55313n80379P4191
7347B67624P91960m06171m1272j57430m37931N92904o19731P97829m23096k20340
7337A44346L33409J59371q3940j99954n05825K80945L3733j7038k55948M25526
7327C14625r9021R3794j31053k86827L7404J09877j22566j32246N57507l55336
7317a3842R6726J24419M3248j2177j84772j87749O33006k79596M53239n31919
7307A40583p4121M60371n22347O89420m96589q6288q2848J94485p9946j91768
7297d9048J19575M3198j75720K79890k61208J37230K7130o37801M60709o7568
7287a23613M21670j84488L78732n87066L49137l24313N51425j48763m34067M80902
$$ y = [432859, 236212, 544841, 276225, 633158, 403493, 361663, 518499, 773812, 193433, 267624, 1059584, 653413, 612141, 454711, 16780, 609684, -10047, 787782, 364686, 144346, 477755, 637126, 553186, 353232, -152593, 128352, 162085, 145047, -110901, 314625, 215604, 309398, 178345, -108482, -71078, 38799, -83767, -216013, 341494, -13842, 82884, 207303, 250551, 238374, 53602, -134147, 498859, 219263, 672502, 140583, 66462, 526833, 4486, 693906, 197317, 111029, 28181, 222666, 142720, -49048, 70527, 113725, -61995, 217895, -43313, 93917, 121047, -516754, -56045, -123613, 298057, 113569, 492301, -94765, 254372, -69941, 481484, 332721, -101346, 379556]
7277C79556l5643o00878L11326m997l71929M18005Q4669m01679j0320J20847L09149
7266A98106l26768N7086M35572P0247p25719J00848M13742p96761R96289o25557
7256b02915J65912P25873n05180K3893P1579N2361L55345m60731K51313l25898
7246A51552J46510J33339k32196L31231l77163O76150L3338m26834j02757j47289
7236A85881k18910J8464N91093m37884j33084L29074l20053K49004o55268L13923
7226g7760K28635j73625L22105m3396k69292k39306j4788O09609k344l78844K22002
7215A82996K78253m6318m67947Q1224K25666k04348K21620k3432j53099k03443
7205a08828k21820O18921K9639l57358j56677J90566k75361K50093l12460L70388
$$ y = [379556, 343913, -256965, 54361, 49364, -322565, 95440, 180109, -221570, -231890, -111043, 198106, -128662, -71576, 363996, 434243, -291476, -190628, 223114, -573647, 422642, -202915, -37003, 688870, 183690, 207583, 279162, 331523, 686868, 226137, 477450, 151552, 298062, 431401, 199205, 530436, 153273, 829423, 862761, 435927, 333170, 185881, -33029, -14565, 576528, 138644, 5560, 334634, 14581, 263585, -391683, -77760, 150875, -22750, 299355, 255959, -13333, -252639, -267427, 342182, 339838, -39006, 182996, 461249, 414931, -53016, 28208, 253874, 49526, 271146, 247714, 94615, -108828, -330648, 288273, 317912, -39446, -196123, -5557, -280918, -30825, -343285, 27103]
7195B7103n14204Q79530n59144R5520L58667n88462O04428l14944M96658j94971
7185B90181j59694l72230Q01372o97043Q7494L33374j07843k20382J80843j08882
7175B7190j29705K89904P0371P9k78367k40104m61122J084795n22074N03813m63378
7164a18598j55997K31453L62132m45899O04440n20971K32638j6123K8233j20182
7154H1126m69813N10967p9360K17000L59243p521j94949j83936m11260M77286
7144B98783o02153L97307j06188J96693l19435j36517j4029O6316j8686L63359
7134A25450n00657J75126J73622m73608M4932J68848N69504m25481O52427k42435
7124B67728o4938m76549N28369J09857J58578l65232L69592q3628l52396L75717
$$ y = [27103, -487101, 392429, -166715, -71195, 287472, -300990, 303438, -11506, 485152, 290181, 130487, -241743, 559629, -137414, -49920, 283454, 175611, -44771, 136072, 27190, -102515, 187389, 257760, 257839, -20528, -260632, -721754, 363041, -159033, 344780, -118598, -274595, -43142, 318990, -126909, 477531, -43440, 189198, 173075, 201308, 81126, -388687, 122280, 42920, 259920, 619163, 611642, 416693, 232757, -178503, 298783, -303370, 93937, -12251, 184442, -134993, -271510, -285539, -219223, -237909, 125450, -375207, -200081, -26459, -500067, -455135, -286287, 283217, -142264, 510163, 267728, 202790, -273759, 254610, 364467, 523045, 157813, 527405, 443777, 91381, 467098]
7114D67098k23041O2395k26991k55546m7367N69805k38659n5800m71584Q16942
7104C97252q7261m46350P8284j20456k11873J52657m947L87240K11441k42067
7094A13920K72964j94861K81911m07804M05026l79694J27383o992l16455L15679
7084B11077l920K75379j89368k07048K86843k98141J34M57297l07863K77873l07276
7073A94987j52081j8188L52406O5050m39584L24844r7323l43545q4250K85883
7063H8199m67031K11685R6898K78551O185L8538L016o4728J1709O6855q7291l29649
7051a47063N51789r9140k54414L92893k49935p5433L52100M34268k9084r83317
7041a07336M96546L43964R2880M2489J17461J99308r31083Q5196K18186k66861
$$ y = [467098, 244057, 306452, 79461, -176085, -223452, 346353, 107694, 51894, -419690, 397252, 309991, -136359, -58075, -178531, -390404, -237747, -242694, 144546, 355987, 113920, 386884, 192023, 473934, 66130, 471156, 91462, 218845, 211853, -104602, 211077, 207157, 482536, 293168, 86120, 372963, 74822, 74956, 532253, 224390, 502263, 194987, 42906, 24718, 377124, 442174, 2590, 327434, 230111, -113434, -197684, 88199, -378832, -167147, -70249, 208302, 214487, 253025, 256041, 191313, 203022, 269877, 182586, -147063, 404726, 305586, 51172, 444065, 194130, 118697, 470797, 905065, 875981, -107336, 389210, 733174, 826054, 868543, 986004, 1185312, 254229, 339425, 557611, 290750]
7031B90750k00049O43781N9405k32158L82507l18177o79133O07902l20214j71436
7021F3178P28225o36919M16742p80990Q05894m06712J20173q8532J87384J76459
7011E84902k91869r3635N8494q0030r6565n6780l32478O68026R1796q2392r9732
7000B69737L12952j57595l51665l50803K61172K62976K82959o62365L10411J13880
6990B91659l99813J62085N98318P782j64664j58084n29769J36693l17008K89918
6980h2883K2713P99130n23606J79236j75529l1046J88474m58194J82148K78924
6970C79367p1468j74950K09191l77365m32092O76487n16531M91157k64477N26806
6960D46125l60609Q08J54517L8068m11844M20105L21882n23283K7997N8492R4415
$$ y = [290750, 90701, 734482, 793887, 561729, 944236, 626059, -53074, 554828, 234614, 63178, 791403, 154484, 571226, -209764, 596130, 189418, 309591, 221059, 408443, 584902, 293033, 199398, 257892, 177862, 81297, 24517, -307961, 360065, 451861, 369469, 269737, 582689, 425094, 73429, -277374, -16202, 246774, 529733, -132632, 177779, 291659, -108154, 53931, 652249, 660031, 495367, 337283, -192486, -55793, -372801, -82883, -60170, 738960, 215354, 394590, 219061, 188015, 376489, -81705, 100443, 379367, 307899, 132949, 342140, -35225, -467317, 209170, -307361, 183796, -80681, 446125, 85516, 86324, 240841, 278909, -132935, 287170, 609052, 85769, 113766, 172258, 266673]
6949B66673K0802q6129L27993j28483J11019K28253m31500j52362L55358m23976
6939H7648k59520N51096m37670J3118J10235K71045N2480L8398R6070n64365K79337
6928B37872L08322l30295k32484O7592r0141J51837K68855J0874J68492n17970
6918D2954J11978L1505j89478N49043k75688j45169M72148k62467j71827J0339
6908A73338k87248M23483j05379l98492L35829N4960k42272L71612K00058m10804
6898A15085k33518K53083J22262K81040j63004m78834M12899J14532k45595L08338
6888D86288Q1594K8594J78115p10032L25974j10821L34001p49838P38878o92765
6878i0012J13362M04639n08002k00057Q03727q0095m88936p3482L09806j84813
$$ y = [266673, 287475, 201346, 529339, 400856, 511875, 740128, 308628, 156266, 511624, 87648, -171872, 379224, -58446, -45328, 64907, 335952, 388432, 426830, 522900, -41465, 237872, 546194, 215899, -16585, 51007, -39134, 112703, 381558, 392432, 560924, 42954, 154932, 186437, -3041, 546002, 270314, 125145, 597293, 334826, 162999, 173338, -113910, 309573, 204194, -194298, 141531, 196491, -45781, 325831, 525889, 115085, -118433, 134650, 256912, 537952, 374948, -103886, 309013, 423545, 177950, 486288, 567882, 596476, 774591, 64559, 390533, 279712, 613713, -136125, 602753, -90012, 23350, 427989, -80013, -280070, 523657, 443562, -45374, -118856, 190950, 6137]
6868F137K89678l19164J67723J11455l91275N97421n97389o0797K90332j03027
6858h906J51538N2323L59297k46353l74838L95655O4805l8285k26902K92465n31264
6847a10465L33879N4711N5078p9009k5045l18996K94074l52453j93418M6443o0205
6836c55406L89137l91721K93332J50017O96408p4526m10505P22241q01936K23380
6826D40421K76382n39881J9406K13632k85969O47554l56779k8224l48711M02878
6816D40709q35274O70295J48964Q2278J8508j50723n15253M18072j39434l54902
6806b16760R34677j49723O1241j8901O38765J93145K92524n53944p16953N92817
6796A056888n4267K46252l53731n69135N52790o90178J83156L4087j90531K33932
$$ y = [6137, 295815, -23349, 144374, 255829, -135446, 461975, -135414, -196211, 94121, -8906, 142632, 194955, 554252, 307899, -66939, 328716, 393521, 355236, 128334, 420799, -110465, 223414, 278125, 333203, 254194, 229149, -89847, 204227, -148226, -341644, -295201, -355406, 33731, -357990, -64658, 85359, 781767, 707241, 296736, 1018977, 217041, 440421, 716803, 176922, 196328, 409960, 123991, 771545, 414766, 386542, 37831, 440709, -394565, 275730, 424694, 506972, 525480, 374757, -140496, 277576, 138142, -216760, 717917, 568194, 629435, 610534, 1249299, 1442444, 1734968, 1181024, 464071, 1056888, 1002621, 1248873, 895142, 326007, 878797, 188619, 371775, 405862, 215331, 449263]
6786D49263M29003q94283Q38654m37511K16387l24888J5148j34039M00700K00824
6776G59258P8334M47820r4037K33812j69910K93335j77529k95585q5688o8867
6766I20943K00283J92311m34900N69310m54821M37842J38400J8501l96280l961
6756A187628P07911Q201j09588j455k3055R9289l92874l5482o9783q4509j4991
6745A271292N36662L148o75654K36970J86820p11225k72424O92084J80835P86350
6735B234858k70714k69367o6081k38618R63970m82760L42984Q36963L15666K91024
6725C657925l75884L21828J17229p28994Q08596j033982l39456o85289N56970
6716B298943p06721N42452j95077o55671j55336N07761K04542m83392J14782O037
$$ y = [449263, 878266, -16017, 822637, 385126, 601513, 276625, 291773, 157734, 558434, 759258, 837592, 1285412, 1191375, 1425187, 1255277, 1548612, 1371083, 1075498, 989810, 920943, 1121226, 1313537, 878637, 1447947, 993126, 1430968, 1569368, 1587869, 1191589, 1187628, 1895539, 1903740, 1794152, 1792697, 1769642, 1868931, 1476057, 1440575, 1370792, 1286283, 1271292, 1807954, 1811102, 1135448, 1372418, 1559238, 848013, 575589, 1267673, 1448508, 2234858, 1964144, 1694777, 1628696, 1390078, 2354048, 1871288, 2214272, 3051235, 3366901, 3657925, 3282041, 3603869, 3721098, 2992104, 3800700, 2766718, 2427262, 1741973, 2298943, 1592222, 2134674, 1939597, 1283926, 1128590, 1636351, 1840893, 1357501, 1472283, 1478320]
6706A478320K65103j88595K46963J37024Q9918L43545Q93504m5806M05670N63771
6696D189417k25714j80577o78385L70920p51635n50143P01302j009382m77249
6687A388554M4099J74977j62964J39081q55242Q90320n51758j56793K00717j36939
6677I74052N03594K77486m25158K95298n60239Q12545p51511J207936l2017l86308
6667A915678J73738m17994K56844m35068j60771p6592K21562k87260l10635J69272
6657A048774Q05480o26557J89611k70740K84132n87505K29207J27409l4705J36425
6647A301531p58982P18678j12804R03324p51242L11869j08245K69096m2664k86828
6637A443733L82402J03875K5617N82162J039613L49603M11776o10616R98775j004948
$$ y = [1478320, 1743423, 1554828, 1801791, 1938815, 2028733, 2372278, 3265782, 3219976, 3625646, 4189417, 3963703, 3783126, 3104741, 3475661, 2724026, 2173883, 2875185, 1865803, 1388554, 1432653, 1607630, 1444666, 1583747, 728505, 1618825, 1067067, 910274, 1110991, 974052, 1477646, 1755132, 1329974, 1625272, 1065033, 1877578, 1126067, 2334003, 2301986, 1915678, 2089416, 1671422, 1928266, 1493198, 1332427, 1255835, 1477397, 1190137, 879502, 1048774, 1854254, 1227697, 1417308, 1146568, 1430700, 843195, 1072402, 1199811, 1165106, 1301531, 542549, 1261227, 1148423, 2051747, 1300505, 1612374, 1504129, 1773225, 1730561, 1443733, 1826135, 1930010, 1955627, 2537789, 3577402, 3927005, 4338781, 3728165, 4726940, 3721992]
6627C721992n98001k02268l58689j24540k37004q52269K34413K83679j76676j34383
6617A556254n62202J335807m34968j16289k42770K58477K68626o4302P00963J15463
6607B815059M16529J830312J842358J706254J348051N6647n98487r14090j131252
6598G371381j230636j050022r72306o80984l0018j160256M74454r72805k07547
6589A541261L12168M7289P59510q30612L35795j58360l15267L54099L0072N53745
6579B629700R43964J296583J990469K304470Q11408O61343q47153o65583j387946
6570G737255p78687j512276o56505m48224j362371m99414r1372j1160j83155O0597
6560B254688m80887o59617J55459L93152L33226m55670J94362p73519L72308J041841
$$ y = [3721992, 3123991, 2921723, 2563034, 2438494, 2201490, 1349221, 1583634, 1867313, 1690637, 1556254, 994052, 2329859, 1894891, 1778602, 1535832, 1794309, 2062935, 1998633, 2699596, 2815059, 3231588, 5061900, 6904258, 8610512, 9958563, 10015210, 9416723, 8502633, 7371381, 6140745, 5090723, 4118417, 3437433, 3407415, 2247159, 2721613, 1748808, 1541261, 1853429, 1900718, 2660228, 1829616, 2165411, 2007051, 1691784, 2045883, 2075955, 2629700, 3573664, 4870247, 6860716, 9165186, 9976594, 10637937, 9790784, 9125201, 7737255, 6958568, 5446292, 4789787, 4341563, 2979192, 2479778, 2388406, 2377246, 2194091, 2254688, 1773801, 1114184, 1269643, 1662795, 1996021, 1540351, 1734713, 961194, 1333502, 2375343]
6550B375343Q3392L43068J120382O66370m69823m22277N54403n97976n92185o86772
6540B373925k88509K2675m34711N9262N91703l71396j0565j6028l39887M25562
6530B012031J20963m03079n07750k75848j05082k7255j41059Q52976n36804l8905
6520I50188l1621m148j59996r45480J023048l30198M25201l37445P1647M3345
6510G04541j3465l6455p6652j59006J277565m02142l34439Q6249k51231m28889
6500C66076K56787O90814m58442J57718m80359P90022o24561N09959o86732Q6468
6490F07750J95972J38783l58095J54583j00139M18669j93054l03622K97531n24287
6480C34091j13402m33071J058681j07392q90449N04909J82241L70366m2630k70547
$$ y = [2375343, 2458735, 2801803, 3922185, 4588555, 4118732, 3696455, 4250858, 3652882, 3060697, 2373925, 2085416, 2108091, 1673380, 1732642, 2324345, 1952949, 1942384, 1926356, 1586469, 2012031, 2132994, 1729915, 1222165, 946317, 841235, 813980, 672921, 1525897, 989093, 950188, 918567, 914419, 754423, -191057, 831991, 501793, 926994, 589549, 661196, 704541, 691076, 654621, 577969, 418963, 1696528, 1294386, 959947, 1046196, 794965, 366076, 622863, 1313677, 855235, 1012953, 532594, 1322616, 698055, 1208014, 521282, 607750, 803722, 942505, 584410, 738993, 638854, 1057523, 864469, 560847, 858378, 334091, 220689, -212382, 846299, 738907, -151542, 353367, 535608, 905974, 863344, 592797]
6470E92797J54930L29440l84846O3950n32875N70847k93914J40648R5691m09559
6460C27109K30149l72261L89562L9537K16018n96987P13562l43032M25284n74356
6450D54585L26626l93654q8219k41290O98477k95130k95291J33188m8029K78077
6440E29340m35350Q87374l80088P5749k19476O7220L01683k24522J70770k76769
6430D95931j05496L53315J74725M30167j74933o53585O18858r65553K48420p024
6420D14825k99284O94270N8699j00956j61589l77050K03414k17156L27035r51
6410E41257L42363M24509l41369l32864M7663j00435K9953K63225P0689j10846
6400H34145L8331l02416m65964P44434m29279K14145K68139j58351r6480l8969
$$ y = [592797, 747727, 1077167, 692321, 756271, 223396, 794243, 500329, 640977, 736668, 327109, 557258, 184997, 574559, 614096, 830114, 233127, 946689, 603657, 1028941, 454585, 781211, 387557, 299338, 58048, 756525, 461395, 166104, 299292, 251263, 529340, 93990, 981364, 601276, 677025, 457549, 524769, 826452, 601930, 772700, 495931, 390435, 743750, 918475, 1348642, 1173709, 520124, 1138982, 173429, 421849, 414825, 115541, 809811, 868510, 767554, 605965, 228915, 432329, 215173, 542208, 541257, 883620, 1308129, 966760, 633896, 681559, 581124, 611077, 874302, 944991, 834145, 872476, 570060, 104096, 848530, 419251, 633396, 901535, 743184, 646704, 607735]
6390F07735k52731N02337l43715N84750j027441O37660M7106l62699j37137M46544
6380G02409l45188r1438k0632O03792k97773K85043k10840j16894P43635p40716
6370E11398n7985j68072K47596L96812j45241M41017l10682m17662N79600l96493
6360F80288J53575L0101J95787p8724l31121r5955l10449J94585j0597L95004
6350H22494M00872O9727l09523j82628M83893l93393N07475k06169o6530L51576
6340A477794p16751O76796q17892P22297l39073L02978o4871l98347j07838O30484
6330A365577j23907J93045j34277m27057L29463o23940K68816p7614L8990O02016
6320A411112l81516J46352m33485J5297N40564m59720L08675n662M31485J30723
$$ y = [607735, 355004, 857341, 513626, 1098376, 70935, 708595, 755701, 393002, 255865, 702409, 357221, 265783, 245151, 848943, 551170, 836213, 625373, 508479, 1252114, 511398, 453413, 285341, 532937, 929749, 784508, 1225525, 914843, 497181, 1076781, 680288, 833863, 863964, 1059751, 981027, 649906, 553951, 243502, 438087, 427490, 822494, 1223366, 1293093, 983570, 800942, 1284835, 891442, 1398917, 1192748, 1126218, 1477794, 761043, 1437839, 619947, 1342244, 1003171, 1306149, 1241278, 842931, 735093, 1365577, 1241670, 1434715, 1300438, 873381, 1202844, 578904, 847720, 770106, 809096, 1411112, 1029596, 1175948, 742463, 757760, 1298324, 838604, 1147279, 1141617, 1573102, 1703825]
6310A703825p0864l97339J53913n59151Q76672m60817O49703n35936j98643j76970
6300I84393J94479k97040L56441l75630L99841l77797M1305J4199K99512L41930
6290A581633k31774n96285K45814J13425q768N60387l40400L76851r22360M91175
6280A269698j95520M1208P8526o5785k45877N90484m71194r6601l13106O98596
6270A290429M17550n63301J58518k38759K58687n73266J95067k28862O69641J52942
6260A538646M12183l81018j66815p11650k23853Q08031j31892K80874l0122J6483
6250A410867l90095J04932j53039J60059R7882Q62943r17049J36268m1190q6402
6240A185176M99395m95709j51586K73561K19041j54228P75265j059105N53944
$$ y = [1703825, 1632961, 1235622, 1389535, 830384, 1707056, 1246239, 1895942, 1360006, 1161363, 984393, 1178872, 881832, 1238273, 862643, 1262484, 884687, 925992, 940191, 1239703, 1581633, 1349859, 753574, 999388, 1112813, 1104045, 1664432, 1324032, 1700883, 778523, 1269698, 1074178, 1115386, 1193912, 1128127, 882250, 1472734, 1001540, 904939, 591833, 1290429, 1707979, 1144678, 1303196, 1064437, 1323124, 749858, 944925, 716063, 1385704, 1538646, 1950829, 1569811, 1402996, 691346, 467493, 1275524, 1143632, 1424506, 1394384, 1410867, 1020772, 1125704, 972665, 1132724, 1230606, 2093549, 1176500, 1312768, 1271578, 1185176, 1684571, 1188862, 1037276, 1310837, 1529878, 1375650, 2150915, 1091810, 1645754]
6231A645754m69319M47567p2590J7597K01283j88687K61384P9816k75511k83297
6221A363997M67939j96083k09211K8757K08452j66689N13794j56179L21613l40546
6211A835844L53263m46135L32338k96659l9146L4388j63336P05175k95343J94007
6201B214396l48192K50906k51465l85959J20551P19272n96249L08992N0689r5046
6191A987895n19852M6855J69264o0101N56906o60267R93826m01328k72708l27488
6181A513002L548N37722k883K68618j31169j38493K2136o2797K02113j08888J42038
6170B244947L46588l12282k73232K68039R8667l71300K38294J78963J17032M7722
6160B583438j06086n12191P84267n86104N11143j74345k1131k52450j16226Q9234
$$ y = [1645754, 1176435, 1624002, 1551412, 1569009, 1770292, 1581605, 1842989, 1922805, 1647294, 1363997, 1831936, 1635853, 1426642, 1455399, 1663851, 1497162, 2010956, 1854777, 2176390, 1835844, 2189107, 1742972, 2075310, 1778651, 1739505, 1773893, 1610557, 2315732, 2020389, 2214396, 1866204, 2117110, 1865645, 1479686, 1600237, 2319509, 1723260, 2032252, 2082941, 1987895, 1468043, 1514898, 1684162, 1624061, 2180967, 1520700, 2514526, 2113198, 1840490, 1513002, 1516550, 2054272, 2051389, 2320007, 2188838, 2050345, 2072481, 2009684, 2211797, 2102909, 2244947, 2591535, 2279253, 2006021, 2274060, 2372727, 2001427, 2239721, 2418684, 2535716, 2583438, 2477352, 1965161, 2749428, 2163324, 2674467, 2500122, 2478991, 2226541, 2110315, 2199549]
6150B199549L12606o1586J2739L87748l43873J09360J28393L64642o12179m90367
6140B007032N56544O4704J91297j49913O64784p95974P44866m03535k60147K30292
6130B849950j78885Q53762q15245O06397l54787K90196J50398l92359o6165J4310
6120B957572K5481K47506r87017K04941J85441L37056j09174o9668k07086J83537
6110B768589j73540K67216l11572R4225M36285K33061N81636p27199j03343K9422
6100C094780Q77473q7775L48025m61552R7135M60304j07998M15332p81939O91008
6090D544793o53746P97908k97720J95495K68076r12704J04117N50390p20785N86052
6080D461876O6102k20607R97900m23695o7236J92212K96543N1320l95776K16207
$$ y = [2199549, 2512155, 2450569, 2463308, 2851056, 2507183, 2616543, 2744936, 3109578, 2497399, 2007032, 2563576, 2628280, 2819577, 2669664, 3334448, 2538474, 3283340, 2879805, 2619658, 2849950, 2671065, 3524827, 2709582, 3315979, 2961192, 3251388, 3401786, 3009427, 2943262, 2957572, 2983053, 3230559, 2243542, 2448483, 2633924, 2970980, 2861806, 2792138, 2585052, 2768589, 2595049, 2862265, 2550693, 2644918, 3081203, 3314264, 3895900, 3168701, 3065358, 3094780, 3972253, 3884478, 4232503, 3770951, 3868086, 4328390, 4220392, 4635724, 3853785, 4544793, 3891047, 4688955, 4391235, 4586730, 4854806, 3942102, 4046219, 4596609, 3875824, 4461876, 4527978, 4307371, 5305271, 4881576, 4814340, 5006552, 5303095, 5354415, 4958639, 5174846]
6070E174846K04215J90894O19554j62920O4591p8718n82278K41273O4204k62909
6060E472752N58595J06421q5808n05677J3921P000J28588j84064o7416j20363
6050E323949Q04173o78356J30965k32409Q25560n73706K91079l27851K8396n34794
6040E057006M87049j10942J92520l57492j32150P6554l74984K24308o39803M50548
6030D872614l98022J99192j28962J68194J9924j25178p0403k85786l652O96398
6020D944319m15477J76486k76450J1051q3373J51711M05116m79144p05594N04808
6010D233453L815k40225K46114p7319o99415K9158L21405m10619J22730J25857
6000C654954r25124L94689P01043m35189k26210P04272K09899p39297K01911k85966
$$ y = [5174846, 5379061, 5569955, 6189509, 6026589, 6091180, 6012462, 5430184, 5671457, 5735661, 5472752, 6031347, 6137768, 6051960, 5546283, 5560204, 5567204, 5695792, 5511728, 5444312, 5323949, 6128122, 5449766, 5580731, 5348322, 6173882, 5600176, 5891255, 5563404, 5591800, 5057006, 5544055, 5433113, 5625633, 5268141, 5135991, 5212545, 4837561, 5061869, 4422066, 4872614, 4474592, 4673784, 4544822, 4713016, 4732940, 4607762, 4537359, 4251573, 4247921, 4944319, 4528842, 4705328, 4428878, 4439929, 4356556, 4508267, 4913383, 4434239, 3728645, 4233453, 4237268, 3997043, 4243157, 4165838, 3466423, 3495581, 3816986, 3406367, 3529097, 3654954, 2729830, 3124519, 3825562, 3390373, 3164163, 3868435, 4078334, 3339037, 3540948, 3254982]
5990C254982K18501K06648K65408K03631j35708l52859L72383K84023O16596j54813
5980D778792j20362N64460j96931L78585n92595L97668n50745M23516K59004M98145
5970E839537l27395L27436N9383l53799j25032M38662k4646p9876L43421J33409
5960F231100Q8087J23789m81589O14600L67056j09589J1961Q856N86623j68152
5950G272742J49338k88375J86666k49276K84889N93229j19859l38488N27064J76576
5940H194506k57016J87468q59438K08350J96003j53853L90964o50813M1189m12832
5930F884528k03170K55965l63469l35658j57431M27889l08082o3859o1506M7745
5920F122952K13824j46265l95709j87882L15081j4548j06290J31716l02074L08252
$$ y = [3254982, 3473483, 3680131, 3945539, 4149170, 4013462, 3660603, 4032986, 4317009, 4933605, 4778792, 4658430, 5222890, 5025959, 5404544, 4811949, 5209617, 4658872, 5082388, 5341392, 5839537, 5512142, 5839578, 5898961, 5545162, 5420130, 5858792, 5834146, 5754270, 6097691, 6231100, 6319187, 6442976, 5961387, 6575987, 6943043, 6833454, 6845415, 6854271, 7440894, 7272742, 7422080, 7133705, 7320371, 7071095, 7355984, 7949213, 7829354, 7490866, 8017930, 8194506, 7937490, 8124958, 7265520, 7473870, 7669873, 7516020, 7906984, 7256171, 7297360, 6884528, 6681358, 6937323, 6573854, 6238196, 6080765, 6508654, 6200572, 6136713, 6075207, 6122952, 6336776, 6190511, 5794802, 5606920, 5922001, 5907453, 5801163, 5932879, 5630805, 5939057]
5910E939057o8915K2738k23228j63792L22366r8209N0958L1530J8448l37349k88186
5899E205418M12465j11444k64847O58533o16299K50765J30818Q6602j95499K31633
5889E788145M76135l81959j79424k19574R36027n13276l28390M03281l23762O14813
5879F272016l2268L39774J37252Q11429l50328K1452L3158K45397j9290J39665
5869G598257n507J70257M66666K99537K99845J79551N32022J74534j65721J053178
5859A0602619k29526P01944P05769P37318Q54939J25244J878291Q88057J710658
5850A7975313J724338K039355K657149L137348L758550K698861J947676K369593
5842C8308183j99856K55288q78976j149736r96264q94427j45428q77604J53802
$$ y = [5939057, 5870142, 5892880, 5669652, 5505860, 5828226, 5730017, 5780975, 5812505, 5830953, 5493604, 5205418, 5617883, 5506439, 5241592, 5900125, 5283826, 5534591, 5665409, 5752011, 5556512, 5788145, 6264280, 5882321, 5702897, 5483323, 6419350, 5906074, 5577684, 5980965, 5657203, 6272016, 6239748, 6579522, 6716774, 7528203, 7177875, 7199327, 7232485, 7477882, 7458592, 7598257, 7592750, 7763007, 8229673, 8529210, 8829055, 9008606, 9540628, 9715162, 9549441, 10602619, 10373093, 11075037, 11780806, 12518124, 13373063, 13498307, 15376598, 16264655, 17975313, 19699651, 21739006, 24396155, 27533503, 31292053, 33990914, 35938590, 38308183, 38108327, 38363615, 37484639, 36334903, 35338639, 34444212, 34298784, 33421180, 33574982]
5833C3574982M44394J175008J394273K430052K927571L115264M227111L513411
5825E2802066L945179L447504L391160K829688K656210M039088O227754P133898
5817H6472547Q201153P564503N518383K808177k63135l158888m249464n800835
5809I7092441n408694n049528m799748l169195k242069m17376P66379K497762
5801G9269972M290980N882928Q494162R505536Q350359P245922M572499R35241
5793A28547599q21072j671509p34913l49347K151220K746821L109528J272731
5785A34251058q32690l238286n662244p902856p561653p161391p446237n785916
5777H8659785m961170l218874j472944k34781J363985L347594N513864O293973
$$ y = [33574982, 34019376, 35194384, 36588657, 39018709, 41946280, 45061544, 49288655, 52802066, 56747245, 60194749, 63585909, 66415597, 69071807, 73110895, 79338649, 86472547, 94673700, 102238203, 107756586, 110564763, 110301628, 107142740, 102893276, 97092441, 91683747, 86634219, 81834471, 78665276, 76423207, 76005831, 76772210, 79269972, 83560952, 89443880, 97938042, 107443578, 115793937, 123039859, 127612358, 128547599, 127726527, 126055018, 125320105, 124970758, 127121978, 129868799, 132978327, 134251058, 133418368, 130180082, 124517838, 116614982, 109053329, 101891938, 94445701, 88659785, 83698615, 80479741, 79006797, 78772016, 80136001, 83483595, 88997459, 95291432]
5769I5291432Q123061O964228M693067J821774j686543l551119n750324p073812
5761I8831764n096207m922754m954232l931151l768367m507038m163267l532723
5753F3956025m691033l880101l753309l629814k650313k486822j750475j713737
5745C9400421j03178J14243N80280R75494J727755J640366J372307L88674k64764
5736D5831598j241584k527837k335648k998115l362142l137861k611096j864558
5728B5752757k548591j696574j452984j106055j219630j230758m86152p35676
5720A5276337k15745n70769n50627m93101l75634o06893M09872n54569o58166
5711A1660705p80747J4980k63249j9177p48008q3627L17788k8254l69748n12786
$$ y = [95291432, 103414493, 110378721, 115071788, 116893562, 115207019, 111655900, 105905576, 98831764, 93735557, 88812803, 83858571, 79927420, 76159053, 71652015, 67488748, 63956025, 59264992, 55384891, 51631582, 48001768, 45351455, 42864633, 41114158, 39400421, 39297243, 39411486, 39991766, 40967260, 42695015, 44335381, 45707688, 46096362, 45831598, 44590014, 42062177, 39726529, 36728414, 33366272, 30228411, 27617315, 25752757, 23204166, 21507592, 20054608, 18948553, 17728923, 16498165, 16012013, 15276337, 15060592, 14489823, 13939196, 13446095, 13070461, 12463568, 12873440, 12318871, 11660705, 10879958, 10894938, 10631689, 10612512, 9864504, 9780877, 10098665, 10070411, 9700663, 9187877]
5701I187877k31793k12746M02725o5882J98666j91866m62329M52203l61878J12509
5691H827486q9699o73990O77234m25515l7050p18385m76397K44756J63115l98366
5681G093189m88663M8911m40600N81256l87934k80248M16880k49701k61736L03794
5671F335148m35826M8669m64607n5423K91468K09101m14558j06450L27458N5624
5661E790604p57272K53139n00678M14018k60447m05231r4649l71736J97888m60272
5651C805364O60239m82847l8796n1689p8501K01489O8203o71166N59611r32814
5641C039093M52969l69909m9659L86304n57999J74958N1479l65892K91590L81178
5631C434112j69671k05113l19865J80562M02522l78808p8208J47158j15170J45401
$$ y = [9187877, 8956084, 8743338, 9146063, 9080181, 9278847, 9086981, 8624652, 9076855, 8714977, 8827486, 8737787, 8063797, 8741031, 8315516, 8278466, 7560081, 7083684, 7328440, 7491555, 7093189, 6604526, 6653437, 6212837, 6794093, 6406159, 6125911, 6542791, 6293090, 6031354, 6335148, 5899322, 5947991, 5483384, 5427961, 5719429, 5928530, 5513972, 5407522, 5734980, 5790604, 5033332, 5286471, 4785793, 5199811, 4939364, 4534133, 4439484, 4067748, 4265636, 3805364, 4465603, 3982756, 3943960, 3892271, 3813770, 4015259, 4083462, 3412296, 3971907, 3039093, 3492062, 3122153, 3072494, 3458798, 2900799, 3075757, 3127236, 2761344, 3052934, 3434112, 3264441, 3059328, 2739463, 2920025, 3322547, 2943739, 2865531, 3012689, 2897519, 3042920]
5621C042920o7825n76546L54103l55237O91134k41282n5644K6151j45504k48560
5611B423710o0534O69130r05370N53510l9997j53352k10514K03736k22633J92991
5601B450677J34039M7773J068K17396j94608K989m21897K60442K02456o36532
5591B063803L56671K65903n9985k48196J31585k21260P7304J15973N03258k02242
5581B782814K5616m68781m29852J338788m54310J34283l96344L09567O16357m66158
5571B991980l22463L56598L30120j02969k54420P63144K4785k42175j00064M10666
5561C855202K50916j39710n98681N15606j04665j95443J38783n51211K80576L80986
5551C832359O7716o2903J32021J87760k49845P6548K00837M9571J93149q4821
$$ y = [3042920, 2975095, 2398549, 2752652, 2397415, 3088549, 2847267, 2791623, 2817774, 2672270, 2423710, 2363176, 3032306, 2126936, 2680446, 2640449, 2487097, 2276583, 2480319, 2257686, 2450677, 2584716, 2632489, 2633557, 2850953, 2656345, 2659334, 2237437, 2497879, 2700335, 2063803, 2420474, 2686377, 2626392, 2378196, 2509781, 2288521, 2365825, 2481798, 2985056, 2782814, 2808430, 2339649, 1909797, 3248585, 2794275, 2928558, 2532214, 2841781, 3458138, 2991980, 2669517, 3026115, 3356235, 3253266, 2998846, 3761990, 3786775, 3544600, 3444536, 3855202, 4106118, 3966408, 3367727, 3883333, 3778668, 3583225, 3722008, 3170797, 3451373, 3832359, 3900075, 3837172, 3969193, 4156953, 3907108, 3983656, 4184493, 4234064, 4427213, 4342392]
5541D342392M1645L64217l86439L31954j19411j18100r4527L19183j33408J46625
5531D694131L53832l71339k12374M62571p74553N27034l66522K94309K06321n1522
5521D761888l93740j65262j0306M11660L35601m20047k09094J55408k6923J97768
5511D636953m1563k0163k03601k38885M95348m10336M19643K19911q07262N2426
5501D102471j73690K59845J62040m12236Q78j04481m43009L32174M09437R812
5491D143241K9199k91739l28959j04496L73024k46983P95667j92155k74833L25601
5481D227567N9845l56217n10720L47735K15771k7878k41009j78010J033368k61949
5471D308503r82489M23069K86341K70954j14510L52494J40629q26316L28285M4018
$$ y = [4342392, 4384037, 4748254, 4361815, 4693769, 4574358, 4456258, 4361731, 4680914, 4547506, 4694131, 5047963, 4676624, 4464250, 4926821, 4152268, 4679302, 4312780, 4607089, 4813410, 4761888, 4368148, 4202886, 4192580, 4604240, 4939841, 4519794, 4310700, 4466108, 4439185, 4636953, 4595390, 4575227, 4371626, 4132741, 4628089, 4217753, 4637396, 4857307, 4050045, 4102471, 3928781, 4188626, 4350666, 3938430, 3939308, 3834827, 3391818, 3723992, 4133429, 4143241, 4172440, 3880701, 3551742, 3447246, 3820270, 3573287, 4368954, 4176799, 3901966, 4227567, 4287412, 3931195, 3420475, 3768210, 3983981, 3956103, 3715094, 3537084, 4570452, 4308503, 3326014, 3749083, 4035424, 4306378, 4191868, 4544362, 4684991, 3858675, 4186960, 4230978]
5461D230978P1281J26675j53452N6081j7542M83455K01908k48625Q69205J050923
5451F670887J004257K92409k34148j37648j016482m11109r57603n95296l87779
5442D227488j51112Q7236q50892K31209m10407q3381k90116j88126J85079j47576
5432B609402k26369J48532j74683n58895J7590M18721K29880k31495j58974l97852
5422A675857l4915j43967J1747P69068n68473L11657m93102N98704j06741Q4809
5412B104644J41046m12129J81811k25737j0553Q2732l30285K06843o12319O29496
5402A755549R6182l07887L3285l99807K75920M2411J64437l46095M57630l94130
5392A377495M2102j23394L0154M16549j04262l9414J07830K65713j265045K03389
$$ y = [4230978, 4302259, 4428934, 4275482, 4331563, 4314021, 4797476, 4999384, 4750759, 5619964, 6670887, 7675144, 7967553, 7733405, 7595757, 6579275, 6168166, 5210563, 4615267, 4227488, 4076376, 4163612, 3312720, 3543929, 3133522, 3050141, 2760025, 2571899, 2756978, 2609402, 2383033, 2531565, 2356882, 1797987, 1815577, 2234298, 2464178, 2232683, 2073709, 1675857, 1640942, 1496975, 1508722, 2277790, 1709317, 2020974, 1527872, 2126576, 2019835, 2104644, 2245690, 1833561, 2015372, 1789635, 1779082, 1861814, 1531529, 1738372, 1126053, 1755549, 1851731, 1543844, 1577129, 1177322, 1453242, 1495653, 1660090, 1313995, 1771625, 1377495, 1419597, 1296203, 1326357, 1742906, 1638644, 1599230, 1707060, 1972773, 707728, 911117]
5382I11117K83074N05850K8271q10169L67519L21885R9469J31847l84619k1636
5372A432608j80715O0596K68295m12276l6654N305m32998N17282q4301K85590
5362A422732k47752r2099L71493m25476M53965J97241n50415K70520K5135M8121
5352A473465k17173N80096m4893j97575k38557N22647l84996K99823Q36061j157068
5342A471830L42581n31551J59662q0018O92075p88806O51870l00875K64738J34704
5332B016210k11935k33652j37327n5054P9455L17696m23276K0100J63398J92830
5322A728445j79874k47292P20608k3282l805j31095k99141J28687k27477L10872
5312A776646K13558l20363O097k72717J61845K58054j20252j62062J87481P63523
$$ y = [911117, 1194191, 1700041, 1728312, 918143, 1285662, 1607547, 1707016, 1838863, 1454244, 1432608, 1251893, 1312489, 1580784, 1168508, 1131854, 1137159, 704161, 1221443, 1137142, 1422732, 1174980, 1082881, 1454374, 1028898, 1482863, 1680104, 1129689, 1400209, 1425344, 1473465, 1256292, 1836388, 1791495, 1593920, 1355363, 1878010, 1493014, 1792837, 2628898, 1471830, 1814411, 1282860, 1442522, 1362504, 2054579, 1265773, 1917643, 1616768, 1881506, 2016210, 1804275, 1570623, 1433296, 1378242, 1457697, 1775393, 1352117, 1372217, 1535615, 1728445, 1548571, 1301279, 2021887, 1998605, 1994800, 1863705, 1564564, 1693251, 1465774, 1776646, 1990204, 1669841, 1675938, 1403221, 1565066, 1823120, 1702868, 1540806, 1728287, 2491810]
5302B491810j3658q71479J81143l13877N05787n5589k34143k3729P32230k60342
5292B138153K3588M61557n07154J68651O40453L24979n69795j47570k18818N10805
5282B824849M67145j90020Q0936j85769K77102o7158J4857K85892m78680M31123
5272C460277K63816K67359j9358k48546n17748P56028K05752o36982j79638R2706
5262C443666K37869l61895J5533K97004k78063L8830p1592r8241L68637K33801
5252C825549o48547o85K22344L8267l95831J55120j38400j64147N30303p20644
5242B703329M17854m04729L83786n62577M71270m20073J09299J42297k09019J33994
5232B765431m52726j92517J5496L06780L02581l52878j3727J90383j50488M79518
$$ y = [2491810, 2478152, 1606673, 1787816, 1473939, 1979726, 1924137, 1689994, 1666265, 2398495, 2138153, 2161741, 2623298, 2116144, 2284795, 2925248, 3250227, 2680432, 2532862, 2314044, 2824849, 3291994, 3101974, 3182910, 2997141, 3274243, 3207085, 3221942, 3507834, 3029154, 3460277, 3724093, 3991452, 3972094, 3723548, 3205800, 3961828, 4167580, 3530598, 3350960, 3443666, 3681535, 3319640, 3335173, 3632177, 3354114, 3392944, 3321352, 3223111, 3591748, 3825549, 3177002, 3176317, 3398661, 3436928, 3041097, 3196217, 3057817, 2893670, 3423973, 2703329, 3121183, 2716454, 3100240, 2537663, 3008933, 2588860, 2698159, 2840456, 2631437, 2765431, 2312705, 2120188, 2135684, 2442464, 2745045, 2392167, 2378440, 2568823, 2418335, 2897853]
5222B897853l92039J94787j057068J045488m18581L76103m67500R29215k24068
5213B884190n98858J17056J98524r8309j82383L36870m38368Q29031q573l1689
5203C007491j67850N24408q91404Q28601n66769L64657K44022p68205J52564O7909
5193B795424j09549K4642M67235j90279L2642J027473l48855p85869L18635M24557
5183C656056l60915J14110K84429n499J46356l13125P24449k03558L67471J20371
5173D530145k8684l39730l34604K66882j244674R9441P27245p3367N63373p80388
5163C385639J13852K66362K19361Q4542j44061L37630K05659Q3315N2656p00825
5153C904130O05972j67675n48086O62496K57162k6393N42521o8327l79723M43693
$$ y = [2897853, 2505814, 2700601, 1643533, 2689021, 2270440, 2646543, 2179043, 3108258, 2884190, 2285332, 2402388, 2600912, 2502603, 2320220, 2657090, 2218722, 3047753, 3039180, 3007491, 2839641, 3364049, 2472645, 3301246, 2734477, 3099134, 3343156, 2574951, 2727515, 2795424, 2685875, 2710517, 3177752, 2987473, 3020115, 4047588, 3698733, 2912864, 3231499, 3656056, 3295141, 3409251, 3693680, 3688181, 3834537, 3521412, 4245861, 4042303, 4409774, 4530145, 4501461, 4161731, 3827127, 4094009, 2849335, 2948776, 3676021, 3602654, 4166027, 3385639, 3499491, 3765853, 3985214, 4069756, 3925695, 4263325, 4468984, 4552299, 4604955, 3904130, 4510102, 4342427, 3794341, 4456837, 4713999, 4687606, 5230127, 5161800, 4782077, 5225770]
5143E225770k38793k66534K2874L82082j4239p53918k26476J14705P03623k71454
5133D677640o174M97738k81235N88736l62995j89757M29671K39390k20893L01841
5123E673962Q1160j25143k34516L39243K53026k5524L06129l46021J58047K91845
5113F372208m40694M5498k88364K15204k12843O1883K49295O844M8693j5827n48810
5102E493087L71976m08998M89921M37748l02930k0835n75101L11960j31831P63622
5092F428619k54272J10870j77975l22882L85989m78904M10345m87877l63723K09817
5082E460007Q47831m24885p45525l5358J4534j78241P0083p5602L20859k59842
5072D993861r6191n76535L23899k31867J33965K17245J34114j31792l65904j15976
$$ y = [5225770, 4986977, 4720443, 4743317, 5125399, 5111160, 4357242, 4130766, 4245471, 4949094, 4677640, 4671466, 5169204, 4887969, 5476705, 5113710, 4923953, 5353624, 5593014, 5372121, 5673962, 5755122, 5629979, 5395463, 5734706, 5987732, 5962208, 6268337, 5922316, 6080363, 6372208, 5931514, 5977012, 5688648, 5903852, 5691009, 5752892, 6002187, 6009031, 6057724, 6041897, 5493087, 5865063, 5456065, 5945986, 6383734, 6080804, 6059969, 5484868, 5796828, 5664997, 6428619, 6174347, 6285217, 6107242, 5784360, 6170349, 5691445, 6101790, 5613913, 5250190, 5460007, 6307838, 5882953, 5137428, 5102070, 5116604, 4938363, 5008446, 4932844, 5253703, 4993861, 4897670, 4321135, 4645034, 4413167, 4547132, 4764377, 4898491, 4766699, 4400795, 4284819]
5062D284819K22253J103517r32014r9428m47774N05484J05741k06470K0895m55747
5052D101276o42l68766O41534l37554J54549l34314l71179j3059L39598k40355
5042C571088j32735J92619l18906k30449O3840J03310m17090Q21498l60091o69378
5032B623706Q7010Q8863J25291K6342O4958K10264q28468P85153l06472L51834
5022C228481k96889k86749M47712m23985R9909K82864k60478l93343O81270r75863
5012B102929M43385k03425L19911K83163l01953M6766m79779N33551k55572J30607
5002B619583o2524M03658j19288L36876n34771P87313q58071K44819M34833J82687
4992C435115j18957n7250K6867K43137k70812L11752m71773Q15463j25350O03576
$$ y = [4284819, 4507072, 5610589, 4678575, 4579147, 4131373, 4636857, 4742598, 4536128, 4557023, 4101276, 4100634, 3731868, 4373402, 4035848, 4190397, 3856083, 3484904, 3471845, 3811443, 3571088, 3438353, 3630972, 3312066, 3081617, 3145457, 3248767, 2831677, 3653175, 3293084, 2623706, 2710716, 2799579, 2924870, 2951212, 3016170, 3226434, 2397966, 3183119, 2876647, 3228481, 2931592, 2644843, 3092555, 2668570, 2768479, 3051343, 2790865, 2397522, 3078792, 2102929, 2546314, 2342889, 2662800, 2945963, 2644010, 2690776, 2210997, 2744548, 2488976, 2619583, 2557059, 2960717, 2841429, 3178305, 2643534, 3430847, 2572776, 2817595, 3252428, 3435115, 3316158, 3258908, 3285775, 3528912, 3258100, 3569852, 3098079, 3913542, 3788192, 4391768]
4982D391768j77713n36428J74671j45588L03880K64623L13136M04251N1112M1844
4972E085556n1839p62253M36218l86927J103158l26487J5632K48783M78587k98937
4962E541491M22612O84358N65564l28821Q14535k92386J138366J58197O08720
4953I312636P90836K436099O779088R755420R851798M901336L188775k236390
4945D4779598n212440n331154n029912n036861m934336k654116k393872k132961
4937A2053946j723150n82751o51802L84573p0334m22399l97030J50911N6864l7779
4927H761049r67505L90971L71856n0827j09765n9031k67490j85468K30391J3568
4917H127749J28356j6363m4778M02324l92265k49223J15016j74220N57841l16136
$$ y = [4391768, 4214055, 3677627, 3852298, 3706710, 4010590, 4275213, 4588349, 4992600, 5043712, 5085556, 5033717, 4271464, 4707682, 4320755, 5423913, 5097426, 5113058, 5361841, 5840428, 5541491, 5964103, 6648461, 7214025, 6885204, 7699739, 7407353, 8545719, 8703916, 9312636, 10103472, 12539571, 19318659, 29074079, 38925877, 43827213, 47015988, 44779598, 39567158, 34236004, 29206092, 24169231, 19234895, 16580779, 14186907, 12053946, 10330796, 9748045, 9096243, 9480816, 9410482, 8988083, 8591053, 8741964, 8798828, 8761049, 7793544, 8184515, 8556371, 8505544, 8395779, 8336748, 8069258, 7883790, 8114181, 8127749, 8256105, 8239742, 8194964, 8597288, 8205023, 7955800, 8070816, 7896596, 8454437, 8138301]
4907H138301N07244j41184M74994p01431R7637M98000r35966P26150j80727L27088
4897H810106j04089k42394p6668l68098N58063l20066o1501m39506L91510o1018
4887H086339j52566l16144O89703j40524R6816j24763M03985p23164N01688j16434
4877H204936J1492R8362p2785K39700J77140M34222l08553M00835j61475J40716
4867I164590K8600J35737m1142M33030K8562o8192R3378L69460k84714Q21502
4857A0680811j51475K47303J038545m93340j86427j91709J187712P1488m31901
4848A1771007K71515N74069O87659k62765R70857M21688k20130O65228k46394
4839A4632734N49248L99040N43635O4011k1187R89226K7463M55895K23006Q77861
$$ y = [8138301, 8645545, 8504361, 8979355, 8277924, 8375561, 8873561, 7937595, 8663745, 8483018, 8810106, 8706017, 8463623, 8386955, 8018857, 8576920, 8256854, 8195353, 7755847, 8147357, 8086339, 7933773, 7617629, 8307332, 8166808, 8263624, 8138861, 8542846, 7819682, 8321370, 8204936, 8216428, 8314790, 8242005, 8481705, 8658845, 9093067, 8784514, 9185349, 9023874, 9164590, 9193190, 9328927, 9287785, 9720815, 9749377, 9681185, 9774563, 10144023, 9859309, 10680811, 10529336, 10776639, 11815184, 11321844, 11135417, 10943708, 12131420, 12202908, 11771007, 12042522, 12616591, 13304250, 13041485, 14012342, 14434030, 14213900, 14879128, 14632734, 15181982, 15581022, 16124657, 16188668, 16167481, 17156707, 17184170, 17640065, 17863071, 18740932]
4829A8740932j57263K96307J43953O23314L84680J26688L25684N01363o0554N85826
4819B1510930N27652O83633L08762J7288L06588J66333N16948j0268J52930J018177
4809B5198973j90056L46629J60511N52647J10283O05629J64721L89984R0917j93434
4799B7236804Q77042k21844O46095L81068O7658K72664R24135m01673O40326j57085
4789C0265190Q49179l2525P55183P0877R19323j47997M07796l2973P46989N59077
4779C4360119Q0691L58077R31180R35383l71265N78790L64032M15048L82336L94813
4769C8429204L76879M68444r0839L20270K18469M98525O3020K4721N8931Q6919
4759D0454543M35293k84944O30907j138668K49021p18181O51041m35291j264092
$$ y = [18740932, 18583669, 18879976, 19023929, 19647243, 20031923, 20158611, 20484295, 20985658, 20925104, 21510930, 22038582, 22722215, 23030977, 23048265, 23354853, 23521186, 24038134, 24027866, 24180796, 25198973, 25008917, 25355546, 25516057, 26068704, 26178987, 26784616, 26949337, 27339321, 27430238, 27236804, 28113846, 27892002, 28538097, 28919165, 28986823, 29259487, 30183622, 29781949, 30422275, 30265190, 31114369, 31081844, 31837027, 31907904, 32827227, 32679230, 33087026, 33054053, 33801042, 34360119, 34440810, 34798887, 35730067, 36665450, 36294185, 36872975, 37237007, 37652055, 38034391, 38429204, 38806083, 39274527, 39183688, 39503958, 39722427, 40220952, 40283972, 40308693, 40367624, 40454543, 40889836, 40604892, 41235799, 40097131, 40346152, 39627971, 40279012, 39843721, 38579629]
4750C8579629R4711R0124l87683q64408n41431r80626k34683o88760m46858n10159
4740C4109856l42769o17237k31834j036967l54223l78921r75034k15381k83870
4731B9673620q0308j378078Q5486m72677j75529j546822j00194p51413J55963
4722B5410048j070133l89365p30874l98731k62307m93784m10545o78751j0448
4713B0965110r66319K16270n39292k41126o95260N48875j106670O5397k27067
4704A8019918N44174j62630j91315J7423l59765q6088n92928K4462q50788k78936
4694A6083527q62767m776j34796m53587m67052k64983M27108m98321n62022P2094
4684A3334425m84489k58848K93137l4363j97581o64413j91876P9324R8874p7652
$$ y = [38579629, 38674340, 38764464, 38376781, 37512373, 36970942, 35990316, 35755633, 35066873, 34620015, 34109856, 33767087, 33149850, 32918016, 31881049, 31526826, 31147905, 30172871, 29957490, 29673620, 29593312, 28215234, 28300720, 27828043, 27652514, 26105692, 26005498, 25254085, 25410048, 24339915, 23950550, 23219676, 22820945, 22558638, 22064854, 21654309, 20975558, 20965110, 19998791, 20215061, 19675769, 19434643, 18739383, 19288258, 18181588, 18246985, 18019918, 18564092, 18401462, 18210147, 18227570, 17867805, 17781717, 17188789, 17213251, 16362463, 16083527, 15220760, 15215984, 15081188, 14627601, 14160549, 13895566, 14322674, 13824353, 13262331, 13334425, 12849936, 12591088, 12884225, 12849862, 12652281, 11987868, 11795992, 11875316, 11974190, 11896538]
4674A1896538K20270k42688J85220n844K22192l95615l96898n01571N19977q46746
4664A0654835J67600k79916N61276P4510l21366N94339k24508k26764j4682L56448
4654A1341772l92680J87036J33916n58095O46399l04746l70121l30217m94616
4645I858648j57556Q0534k98880K53967J4066q82032J97492Q1477M81087k63016
4635I365787o68635Q84328o24387M50640K05430l42019K66817o57262M86541j76261
4625I190979K60864n84713R13118o34662J48970J76119m16985j21615J307315
4616A0239390j58742j01431N35890L44692l66697M4753j58300J9265L02664k12819
4606A0488665M27906M78012j84662j43780L53135k04378J17088M14321o7827L8961
$$ y = [11896538, 12116808, 11874120, 12059340, 12053496, 12275688, 11880073, 11483175, 10981604, 11501581, 10654835, 10822435, 10542519, 11103795, 11178305, 10856939, 11451278, 11226770, 11000006, 10985324, 11341772, 10949092, 11136128, 11270044, 10711949, 11358348, 11053602, 10683481, 10353264, 9858648, 9701092, 9781626, 9482746, 9736713, 9750779, 8868747, 9066239, 9147716, 9628803, 9365787, 8697152, 9581480, 8957093, 9407733, 9613163, 9271144, 9537961, 8880699, 9367240, 9190979, 9451843, 8867130, 9780248, 9145586, 9294556, 9470675, 9053690, 8932075, 10239390, 10080648, 9979217, 10515107, 10859799, 10493102, 10537855, 10379555, 10398820, 10701484, 10488665, 10916571, 11394583, 11209921, 11066141, 11419276, 11214898, 11331986, 11746307, 11678480, 11717441]
4596A1717441O19311J08570N08259M67997O20739k95204K86173K71528m21226
4587A3883588j23465m884p54416n86834q0516q2287n83018k90672o25993J21586
4577A0873089M09738l01196l3514n56728K76772q5772J64311m38218M97268m08373
4567A0397377M65768M7700K69424n53773j04527J70830M46531R9948n83424L13756
4557A0969610L5423L06999l36440L80416m50085P01415m61761K34903q8055J91042
4547A1483467l47978K63443Q75778k43124n16962J06826K08747n8062J02498K7287
4537A1901920O26649J39753K12433K90180K83067j28235L19233L3965j23154M71593
4527A4027404K69793O71027n3652O11332m25870N50141p1360K79745k43245j34081
$$ y = [11717441, 12336752, 12445322, 12953581, 13421578, 14042317, 13747113, 14033286, 14304814, 13883588, 13760123, 13755239, 13000823, 12413989, 12333473, 12251186, 11668168, 11377496, 10751503, 10873089, 11282827, 10981631, 10948117, 10391389, 10668161, 10582389, 10746700, 10308482, 10805750, 10397377, 10863145, 10910845, 11180269, 10626496, 10521969, 10692799, 11139330, 11239278, 10655854, 10969610, 11005033, 11312032, 10975592, 11356008, 10905923, 11607338, 11145577, 11380480, 11292425, 11483467, 11135489, 11398932, 12274710, 12031586, 11514624, 11621450, 11830197, 11772135, 11874633, 11901920, 12528569, 12668322, 12880755, 13170935, 13454002, 13325767, 13645000, 13678965, 13555811, 14027404, 14297197, 14968224, 14914572, 15525904, 15100034, 15650175, 15578815, 15858560, 15615315, 15481234]
4517A5481234O65953N77210M07617r9699l8502N46852R42244o75805L21724M57343
4507A8586171R22170n453O94367O00509J056524J97332R29856J086263R72900
4498B5040639N86123J491346J357090J245788J005007J367940K173855K517005
4490C6784793K128111L895728L371394L386361N534744O040151Q704416J0228639
4482H0074337J4637219J9546313K4230617K6108010K3951021J7956393Q771012
4475B15274922j78736q139624j2677304j5847284j5956746j5979804j3781171
4468A32714253j1752300r899395p230797n966358k740196r85844l52941J775167
4460I5561589K643519M197377O267518Q000737J0379367J3838859J9157758K7687526
$$ y = [15481234, 16147187, 16724397, 17132014, 17032315, 16993813, 17540665, 18482909, 17807104, 18128828, 18586171, 19508341, 19502888, 20197255, 20797764, 21854288, 22051620, 22981476, 24067739, 25040639, 25626762, 27118108, 28475198, 29720986, 30725993, 32093933, 34267788, 36784793, 38912904, 42808632, 46180026, 49566387, 55101131, 61141282, 69845698, 80074337, 94711556, 114257869, 138488486, 164596496, 188547517, 206503910, 215274922, 215096186, 206956562, 194279258, 178431974, 162475228, 146495424, 132714253, 120961953, 111062558, 103831761, 97865403, 95125207, 94139363, 93786422, 95561589, 98205108, 102402485, 108670003, 116670740, 127050107, 140888966, 160046724, 187734250]
4452A87734250L8932207N1644829N5836909M6280805K7326605P308835j2877253
4445D02187187k7595295l5453172l8177536l6747152l4190441l0560383k5659108
4438A73804100k1541551j6772890j2214349q908888p468207m627739l340409k302043
4430I6628024j0380J214895J971305L679688O001433R174216J1640127J6736935
4422A47036243K0566654K0270262J7015377R779029J177210o853861j3720918
4415A95269996j7377300j8364958j8531169j7164136j5494616j3227969j1195357
4408H3914491q820041q035335n297650m712483l674540k735390j522180j959274
4400D7157598k047150j290089p17270p12671k35143Q20540l35203m2406p7235
$$ y = [187734250, 226666457, 278311286, 334148195, 380429000, 407755605, 415064440, 402187187, 374591892, 339138720, 300961184, 264214032, 230023591, 199463208, 173804100, 152262549, 135489659, 123275310, 114366422, 106898215, 102270476, 98930067, 96628024, 96617644, 97832539, 99803844, 103483532, 109484965, 118659181, 130299308, 147036243, 167602897, 187873159, 204888536, 214667565, 215844775, 208990914, 195269996, 177892696, 159527738, 140996569, 123832433, 108337817, 95109848, 83914491, 75094450, 67059115, 61761465, 57048982, 53374442, 50639052, 49116872, 47157598, 45110448, 43820359, 43103089, 42390418, 42155275, 42975815, 42640612, 42598206, 42520971]
4391D2520971p66233r86701n64084j586149n03471q1709r6870l71203j321443
4382C6243108j01927m49362q8731l09216K0745k79573J25798j71623m2912p7324
4372C4868983M95345L40635M28643L48371O49379L43205J915579q35757O53111
4363C9207494K87450k69675K42457L71499l19959M84623P02557L16585P58960
4354D1781991K454558K947478K494243J144250K34431j92258j171977p53095k70305
4345D8669316k81550m21575K44842O05966J010911J260984Q10990O83563L37814
4336E2921261J822539J941106J822775K241068K400777K980207K721420L929736
4328G2780889M267995M905103Q429851J1504289J1864786R978819J0580392J1048139
$$ y = [42520971, 41754738, 40768037, 40203953, 38617804, 38114333, 38032624, 37935754, 37564551, 36243108, 36141181, 35691819, 35603088, 35293872, 35314617, 35035044, 35160842, 34989219, 34946307, 34868983, 35364328, 35704963, 36133606, 36481977, 37131356, 37474561, 39390140, 38554383, 39207494, 39494944, 39225269, 39467726, 39839225, 39519266, 40003889, 40706446, 41023031, 41781991, 44236549, 47184027, 49678270, 50822520, 51056951, 50864693, 49692716, 48939621, 48669316, 48387766, 47966191, 48211033, 48816999, 49827910, 51088894, 51899884, 52583447, 52921261, 54743800, 56684906, 58507681, 60748749, 63149526, 66129733, 68851153, 72780889, 77048884, 81953987, 90383838, 101888127, 113752913, 123731732, 134312124, 145360263]
4320A45360263J1576110J4084142J5489881J5898405J1974187N980552l238265
4313B17125275r070674j4825755j7441301j7560662j7279527j6025587j3969940
4306A10951829j1721480r647651p332425n686153n577175l803973k677305k355756
4298F2149911j633210J129524Q79855j30385o04457j648574j943321j871485j911139
4289E4416719j539075j919851r60467j362644k208302o4896j244933j232376j037083
4280D2847092r93174j278662j451194j323481j444339j448828q30171j120577
4272C2956666j076438q75580j010090r59519j214264j029542O34587j415318j90192
4263B5820310O5494n92960l83965k10082N54777r01028m76568p44771j017795
$$ y = [145360263, 156936373, 171020515, 186510396, 202408801, 214382988, 220363540, 217125275, 208054601, 193228846, 175787545, 158226883, 140947356, 124921769, 110951829, 99230349, 89582698, 82250273, 76564120, 70986945, 67182972, 64505667, 62149911, 60516701, 61646225, 62526080, 62395695, 61791238, 60142664, 58199343, 56327858, 54416719, 52877644, 50957793, 49997326, 48634682, 46426380, 46361484, 45116551, 43884175, 42847092, 41853918, 40575256, 39124062, 37800581, 36356242, 34907414, 34077243, 32956666, 31880228, 31004648, 29994558, 29035039, 27820775, 26791233, 27425820, 26010502, 25820310, 25885804, 25292844, 24908879, 24698797, 25253574, 24352546, 23875978, 23131207, 22113412]
4254B2113412R03822o38186j30251n30103p42811l09623p08662r98600k8219m72540
4244A8458239q72789K03583l65429p54097n48473j45343N50114m69002j99805
4235A5856998p2122P0984M47979p11350K55383n51960k29523j86700J47244K3276
4225A5050209m1892K81548o65823K21997L88667j050444j51251m78694m16769
4216A3137548J5826K56124l73986o85058M34519p33803j08385l06211K78640J4868
4206A1930082M0583k52144l8297J64678k24109N35323j08488j9840O41163k43122
4196A2425829M7361j19221M75359k6923k06873n4714O7966o84315l01790k45099
4186A1377580j13331k04787K00187p43866L47448j139771L21940q31422J62928
$$ y = [22113412, 23017234, 22379048, 22248797, 21718694, 20975883, 20666260, 19957598, 18958998, 18930779, 18458239, 17585450, 17789033, 17423604, 16669507, 16121034, 15975691, 16525805, 16056803, 15856998, 15784876, 15855860, 16303839, 15592489, 15847872, 15295912, 15066389, 14879689, 15026933, 15050209, 15008317, 15289865, 14624042, 14846039, 15234706, 14184262, 14033011, 13554317, 13137548, 13153374, 13409498, 13035512, 12350454, 12784973, 12051170, 11942785, 11636574, 11915214, 11930082, 11970665, 11718521, 11680224, 11844902, 11620793, 12156116, 12047628, 12027788, 12668951, 12425829, 12473190, 12353969, 12829328, 12802405, 12595532, 12540818, 12608784, 11924469, 11622679, 11377580, 11264249, 11059462, 11259649, 10515783, 10863231, 9723460, 10045400, 9213978, 9376906]
4177I376906j80641J1864P61637j46787r85513K31745n5892k97309j88708K83829
4167H811131J99201n01217Q13264p16069J88574J79095M14358o99423L36931q29343
4157H196502L90958k94397k60728j11085l35317M4177k41369j59245J24259k61415
4147G092340J50187j80428L277j15706l01837Q0070J37116M27944r58642O98012
4137G032333k68465m2253k29965k12193J053422n94163L0848J19293k32459J19244
4127F775642j01581L19417n63656j73829L36576n22600O07267n55029o8039L45815
4117F399983N4950L51778J73425q21963N44932m49690J09537k01500K74265l48529
4107F087188p9627N20190l63096k2141k1045M3078K96396K3149j98323J79444
$$ y = [9376906, 9196265, 9208129, 9969766, 9822979, 8837466, 9069211, 9013319, 8716010, 8527302, 8811131, 9010332, 8509115, 9322379, 8606310, 8794884, 8973979, 9388337, 8688914, 9025845, 8196502, 8587460, 8293063, 8032335, 7921250, 7585933, 7630110, 7388741, 7229496, 7353755, 7092340, 7242527, 7062099, 7065376, 6949670, 6647833, 6727903, 6865019, 7292963, 6334321, 7032333, 6763868, 6721615, 6491650, 6279457, 7332879, 6738716, 6769564, 6888857, 6656398, 6775642, 6674061, 6993478, 6429822, 6255993, 6592569, 6069969, 6677236, 6122207, 6054168, 6399983, 6454933, 6806711, 6980136, 6158173, 6703105, 6253415, 6362952, 6161452, 6435717, 6087188, 6007561, 6527751, 6164655, 6142514, 6121469, 6164547, 6460943, 6484092, 6285769, 6465213]
4097F465213j67811r2014k06781K17244k8895J62304J93190J1253O2213k88974
4087F326942P25609k95205O93589l91408j21972K36567k986N69997q08804j51176
4077F781153k38658K58726K8052l2287L857K99782r0224M78594k12717M05164
4067G681442n2748J5630J42474k9867j66696L87135k56353N02360P65268K1667
4057I010312Q46018M88830M32853N7728M47467K57162R35777m00943J237939r2861
4047A3220282M45187J88941L40444J36686P85944k44794Q6969K60038j83731l40882
4037A4695084j6481O03440K15568L9863L04652N73989Q5017J035767J8554J136509
4027A8691962M13402Q26346Q4089J983171J092899J604452J153062P76897J045261
$$ y = [6465213, 6297402, 6205388, 5998607, 6215851, 6186956, 6349260, 6542450, 6553703, 6615916, 6326942, 7052551, 6757346, 7450935, 7059527, 6937555, 7174122, 7171136, 7741133, 6932329, 6781153, 6542495, 6801221, 6829273, 6796986, 6800843, 7100625, 7010401, 7488995, 7276278, 7681442, 7628694, 7644324, 7786798, 7756931, 7590235, 7977370, 7721017, 8223377, 8988645, 9010312, 9856330, 10345160, 10778013, 10835741, 11283208, 11540370, 12476147, 12075204, 13313143, 13220282, 13665469, 13854410, 14194854, 14331540, 15117484, 14872690, 14959659, 15219697, 15035966, 14695084, 14678603, 15282043, 15497611, 15537474, 15842126, 16416115, 16501132, 17536899, 17555453, 18691962, 19105364, 19931710, 20015799, 21998970, 23091869, 24696321, 25849383, 26626280, 27671541]
4018B7671541k18701j165370j122595j364660j314684j861655r29950l07497j79039
4009A9207390R9568m17901M23242O93147O54494Q45692Q15534J204614M43941
4000B3969721N53904P67417K84936L45833l48066J59404J67766j37201n46272
3991B5217442n06494j266464p98850j686461p50680p82558l98037j004171N0442
3982A8074169K51891k28033L2942K74191J49389J93958N8156k49758M54120l16014
3972A8695011o94216l68550k69696j121613q81891o10050q48949l11985q90114
3963A2697947l45598r72835j20783p88271K865j221968O23784l05218N6285r56172
3953H670036O77307m83697m08513m9369M99324j138159K23155m24219j19869L57974
$$ y = [27671541, 27452840, 26287470, 25164875, 23800215, 22485531, 20623876, 19693926, 19386429, 19207390, 19306958, 18889057, 19312299, 20005446, 20659940, 21505632, 22321166, 23525780, 23969721, 24523625, 25291042, 25575978, 25921811, 25573745, 25733149, 25900915, 25763714, 25217442, 24710948, 23444484, 22645634, 20959173, 20208493, 19425935, 19027898, 18023727, 18074169, 18326060, 18098027, 18130969, 18405160, 18554549, 18748507, 18806663, 18556905, 19011025, 18695011, 18000795, 17632245, 17362549, 16240936, 15359045, 14748995, 13900046, 13588061, 12697947, 12352349, 11379514, 11258731, 10470460, 10473325, 9251357, 9875141, 9569923, 9626208, 8670036, 9347343, 8863646, 8455133, 8405764, 8905088, 7766929, 7990084, 7565865, 7445996, 7803970]
3943G803970n29200m04083o8465k88854n0767m68088l7461M54076k92413m11636
3933E707079q6083l09719o4719J63406q3840k54542L2996Q3889m65541L73708
3923E096634j20086j97890Q890k69797L06215k46785N32403R6731o9697J44276
3913E280894j23372m58091K0625K47264l1567r96579J42198j44324l87198J88790
3903C738640J72490j1162p81598P16072k78911p5530m7209R9333n74625J63240
3893C120740N22795m02899L80574J48734J36566K17729j00079o339M47457k9493
3883D435785l05378l14423o92585j78150M40343m31288m624m39366j05147M64914
3873B870081n43358J83214n427n83485K0518N50878o09279O91846q7918j09619
$$ y = [7803970, 7274770, 6870687, 6802222, 6513368, 6462601, 5994513, 5957052, 6411128, 6118715, 5707079, 5620996, 5311277, 5246558, 5409964, 5326124, 5071582, 5104578, 5188467, 4722926, 5096634, 4976548, 4778658, 4787548, 4517751, 4823966, 4577181, 5109584, 5206315, 5136618, 5280894, 5157522, 4699431, 4720056, 4967320, 4935753, 3939174, 4081372, 3937048, 3549850, 3738640, 3911130, 3899968, 3118370, 3834442, 3555531, 3480001, 3432792, 3532125, 2957500, 3120740, 3643535, 3240636, 3621210, 3769944, 3906510, 4124239, 4024160, 4017821, 4465278, 4435785, 4130407, 3815984, 3123399, 2945249, 3385592, 2954304, 2949680, 2510314, 2405167, 2870081, 2326723, 2509937, 2504510, 1921025, 1941543, 2492421, 1883142, 2574988, 2487070, 2377451]
3863B377451p16662O07696p3782k5060n26K28077j08544J96209l45090J5134p7888
3852B077015j9849M90154p84597K80731k32612K44660m17776K8132k94830K2442
3842A393470n1077M64988J38901k74760l71729m27057j2591K16165L68877p45487
3832F99700O22316J04420L9807o3989N54690o17483L27300q33924O13226J42812
3822A588875j99635j5684m52408O8092M20257l00519J55165j87870J63636J61804
3812A401713q50876Q13945k31610R8332q5889K66574l72312m13071M19749M02267
3802A448822o49325N73423J7698l32359Q8671k94110K22351K44834j88874J21910
3792A253041k04858p7712Q3315K25852l99564K3603L18305k85722j74735j35381
$$ y = [2377451, 1660789, 2268485, 2194703, 2169643, 2169117, 2397194, 2288650, 2484859, 2139769, 2154903, 2077015, 2057166, 2547320, 1762723, 2043454, 1810842, 2055502, 1637726, 1665858, 1371028, 1393470, 1342393, 1807381, 1946282, 1671522, 1299793, 872736, 860145, 1076310, 1445187, 699700, 1322016, 1426436, 1466243, 1402254, 1956944, 1339461, 1666761, 832837, 1446063, 1588875, 1389240, 1373556, 921148, 989240, 1409497, 1108978, 1264143, 1076273, 1239909, 1401713, 550837, 1364782, 1133172, 1231504, 1145615, 1412189, 1039877, 626806, 1046555, 1448822, 799497, 1372920, 1390618, 1058259, 1146930, 852820, 1075171, 1320005, 1131131, 1253041, 1048183, 970471, 1053786, 1279638, 880074, 903677, 1221982, 936260, 761525, 626144]
3782F26144O87025K43524j59148n18943j44914j16575p1613L2316O1871N72458
3772A212145n86101L60784j03926M290j01004N5176L3811O8841P539k04989j89957
3761E56609J99129m9422K90334K41845k10374l54372k67311O09052j18556j90127
3751G06807L68388k62449m892J78391m23148M62215J94356l30633j77074J57767
3741H69728l55795L3265J89159j16259j82769K82891o4981j56880O49385o79479
3731D68265J38478n36844P50367m86808R4886K06382m179M42828j10764R9945
3721A062556l07581M1962M2566j20914o05281O69269n30726K42273l3433P62480
3711A223171m95209k35238M36852l9256q0091k79922k03970L70171j0451n36702
$$ y = [626144, 1313169, 1556693, 1397545, 878602, 733688, 617113, 545500, 577816, 639687, 1212145, 626044, 986828, 882902, 887192, 786188, 841364, 875175, 944016, 951555, 746566, 556609, 755738, 706316, 996650, 1238495, 1028121, 673749, 406438, 1015490, 896934, 706807, 1075195, 812746, 807854, 986245, 563097, 1025312, 1219668, 889035, 711961, 869728, 513933, 547198, 736357, 620098, 437329, 720220, 655239, 498359, 1147744, 468265, 606743, 69899, 820266, 333458, 428344, 634726, 630547, 1073375, 962611, 1062556, 754975, 796937, 839503, 718589, 113308, 782577, 251851, 494124, 460691, 1223171, 727962, 492724, 929576, 890320, 810229, 530307, 326337, 696508, 686057, 149355]
3701A49355K27600K87411P1814j18999L34012p48461L34309k87286N01637k25076
3691E26316L27500k18826k09023M106q81M88866p3154k18238l57159L76504J45979
3680G91990j2263m74148L11409j04592L91827k35961k64935j86640L01683j42416
3670C75954K04553j62256M80103n48429m37595M57849N71822k00696m19422j71568
3660A50315J35624O64989k43786Q9912q04862P29222p4385r4141Q0864n3106p0679
3649E09967m92631N02899j7532J76378k61121K0656K74251o17770N15611k1787
3639E88921j00495J74923L174m30096k84950M68889N56265m90387M89176m62541
3629E12879J7779k46945M88694k75127k15176M87130m81432R5863K86461j18983
$$ y = [149355, 376955, 664366, 736180, 617181, 951193, 202732, 537041, 249755, 751392, 526316, 853816, 634990, 425967, 430073, 429192, 918058, 844904, 626666, 269507, 646011, 791990, 779727, 305579, 616988, 512396, 904223, 668262, 403327, 216687, 518370, 375954, 580507, 418251, 898354, 349925, -87670, 370179, 942001, 741305, 321883, 150315, 285939, 950928, 707142, 797054, -7808, 721414, 647029, 552888, 633752, 580646, 509967, 17336, 520235, 502703, 679081, 417960, 438616, 712867, 95097, 610708, 588921, 488426, 663349, 666523, 236427, -48523, 420366, 976631, 486244, 975420, 512879, 530658, 283713, 772407, 497280, 282104, 769234, 287802, 383665, 670126, 551143]
3619E51143M69523k67654J05238K30366l92373K20461r31474L79415m5316L62119
3609F81448J03833J93267l28483k84988k45864J85324J19603m17087N50339r0212
3599D67180J51738J62132m15272L20785k83805K83817L15480o7857n55850Q3143
3589D61491J49845j64212M45676o66518k8158M81587K45121n29141N11554k37597
3579F69648j40347o96547N91933m1031p0405j35730K87709L75724R833n5301m16265
3568C79221l591r9384k17694K97321N9973L75703l70978k61443J74433J09916
3558D43477O60918n36201O30691k60639p391r7799k26578k87775P12676o3449
3548I67930k94119R461j56336J31359j3071L18633j70166J43558p74546K70149
$$ y = [551143, 1020666, 753012, 858250, 1088616, 696243, 916704, -14770, 364645, 319329, 681448, 785281, 978548, 650065, 365077, 119213, 304537, 424140, 7053, 557392, 467180, 618918, 781050, 365778, 686563, 402758, 686575, 1002055, 934198, 378348, 461491, 611336, 447124, 892800, 226282, 198124, 679711, 924832, 395691, 907245, 669648, 529301, -167246, 424687, 383656, 313251, 177521, 465230, 840954, 850787, 795486, 379221, 375630, 276246, 58552, 355873, 415846, 791549, 420571, 159128, 333561, 443477, 1104395, 568194, 1198885, 938246, 930855, 833056, 606478, 318703, 1031379, 967930, 673811, 683272, 526936, 658295, 645224, 963857, 793691, 937249, 162703, 432852]
3538D32852L31162M3836m42651P38454m94257O48933n44747k89941l59386K61664
3528C25919M52726m2257J14245n26851r8035m21443J94297J9044M25512k7183
3518D15974M87104j85243J34342r25853L82232m53339O38628J36486K56767l38293
3508E48805p3248l6264m94192M54397M18206l97418r8823M70702n84875J44854
3498C52144n07685R55087n87016J14650N18682r40201N26337O1929l59365J71613
3488C06175N92432m83311k89051J10900K89636n58204N56675k6222J89956n77222
3478A11764N21378k04193J81574K80160j88331L77636n94269L20881l81827L94791
3468H19564n58064N32258n023k68301q06O386j07275l0519j37663J40515O36986
$$ y = [432852, 764014, 807850, 365199, 1103653, 609396, 1258329, 713582, 423641, 64255, 325919, 778645, 736388, 850633, 323782, 225747, -195696, -1399, 17645, 443157, 415974, 903078, 717835, 852177, -73676, 308556, -144783, 493845, 630331, 887098, 548805, 475557, 439293, -54899, 399498, 817704, 420286, 321463, 792165, 207290, 352144, -155541, 799546, 212530, 327180, 845862, -94339, 431998, 493927, 134562, 306175, 898607, 415296, 126245, 237145, 526781, -31423, 525252, 499030, 688986, 111764, 633142, 428949, 610523, 890683, 702352, 1079988, 485719, 806600, 424773, 819564, 261500, 793758, 788735, 520434, 519628, 526014, 418739, 388220, 250557, 391072, 1028058]
3457A028058p44492L2874k62340N97242m87898P02313q81643Q33857k6911j85780
3447F05280L90918k48780k24539k7272K3896l64589M14533p5038q9255L22187
3437G27341Q8892l59934K94295j97013J68981j143841O81554M95130j69399m8161
3427E37845J43320k04301l06936K04897M3160J06153k03778K41762M77358o89236
3417C50244L00070L32484Q8216l14364K20321p5993k14281L99055l84994J52424
3407H53182K20144M850O16823n72702j95583K02427k32784j18926N00233k08968
3397A068696o1259N37548m86873L18424J3856Q848J64459l01729M23647o8348
3387A617269k49136J06988l47278N16472M60310K65878O03642P21324J128448
$$ y = [1028058, 283566, 316440, 54100, 651342, 163444, 865757, -15886, 817971, 791060, 605280, 996198, 747418, 522879, 495607, 519503, 154914, 569447, 494409, 405154, 727341, 816233, 456299, 750594, 553581, 722562, -421279, 260275, 755405, 586006, 537845, 681165, 476864, 169928, 374825, 417985, 524138, 320360, 562122, 1039480, 350244, 650314, 982798, 1071014, 756650, 976971, 900978, 686697, 1085752, 700758, 853182, 1073326, 1078176, 1694999, 1122297, 926714, 1129141, 896357, 777431, 1277664, 1068696, 1007437, 1544985, 1058112, 1376536, 1390392, 1399240, 1563699, 1261970, 1685617, 1617269, 1368133, 1475121, 1127843, 1644315, 2104625, 2370503, 2974145, 3695469, 4823917]
3378D823917L87880p59962o1121o01065K4471m49750j14084n21237k64186j52038
3368B312825k11282m39756j76571N0999k05978L22794J33899L89634p64813Q43972
3358B255723m75297J75933n64806K36838k23117j02510O75519n3758n87002m6385
3348A291138M94744k03375N16795j51622O12302J48202K81954k20438J05360P3129
3338B948189R65617R46887N67004j5435O89557M61760J70814M48413K44661J001524
3328H428991J399255K838145O548370J6548943J6091704J0166890K426691j495232
3320F2953757p432850r241493p923517p157705o947529n491367m553204l348001
3312A0858091k000277r53365m23481p00399n85060k87821j57277q05516n33635
$$ y = [4823917, 5211797, 4451835, 4390714, 3789649, 3814120, 3364370, 3250286, 2729049, 2464863, 2312825, 2101543, 1661787, 1485216, 1536215, 1330237, 1653031, 1786930, 2176564, 1411751, 2255723, 1780426, 1956359, 1391553, 1628391, 1405274, 1302764, 1978283, 1924525, 1337523, 1291138, 1785882, 1582507, 2099302, 1947680, 2559982, 2708184, 2990138, 2769700, 2875060, 2948189, 3913806, 4860693, 5427697, 5412262, 6101819, 6563579, 6734393, 7182806, 7427467, 8428991, 9828246, 12666391, 19214761, 35763704, 51855408, 62022298, 64448989, 62953757, 55520907, 46279414, 38355897, 31198192, 24250663, 18759296, 14206092, 10858091, 8857814, 7904449, 7480968, 6780569, 6195509, 5907688, 5750411, 4944895, 4411260]
3303D411260n20952n82717l4468n70087M51948j40675l81324o32776l39729P74168
3293B434648l05062J84070j26689k0429L85905m81019K42410n48391L36879j15507
3283A986815n18664M27376m3546J44684o61966K74066K22465m25780l2702j28306
3273A244442P15222n90258o3491N8308L59781l96131J65878l20234M01286j3649
3263A561154J26693o88630Q50400q90966K27621m61788M11689j90104j88855L18011
3253A075225K59077j88526j68075j10703K85019l06756R6681k48622j39508O47206
3243A201018J7466n66563J08924n0030r881L82337j031923J029373K85977r95356
3233C71342M72960J59277n09760l9470O68153p63164J3204L15609J12838J23910
$$ y = [4411260, 3890308, 3307591, 3273123, 2703036, 3154984, 3014309, 2632985, 2000209, 1660480, 2434648, 2129586, 2313656, 2186967, 2166538, 2552443, 2071424, 2313834, 1765443, 2102322, 1986815, 1468151, 1895527, 1851981, 1996665, 1334699, 1608765, 1831230, 1405450, 1372748, 1244442, 1959664, 1369406, 1305915, 1364223, 1724004, 1327873, 1493751, 1173517, 1574803, 1561154, 1687847, 999217, 1849617, 958651, 1186272, 724484, 1136173, 946069, 757214, 1075225, 1334302, 1145776, 977701, 866998, 1152017, 845261, 941942, 693320, 553812, 1201018, 1218484, 651921, 760845, 710815, 700934, 1083271, 51348, 1080721, 1366698, 371342, 844302, 1003579, 493819, 454349, 1122502, 359338, 372542, 688151, 800989, 924899]
3223I24899k90788p897j05286k23862J96799j48507K89443N4342R5281p0051n60743
3212A53630L79561K9857k38744Q9543J81204M49275p58899O94875l38508K9045
3202F70839J99902K23884j065618O87844m58672O86782r35513M04491j46840J47165
3192D14264N4567L72562m70095J04741J51066k10064J90472l72278P61757p63853
3182B33139O97503m61409R1161k05956K90539j25159N15913j88956J87528o70352
3172C63951M8213M38708m23397k25283K53963M11114m92745J39673q7351M16378
3162H43224l97762M85074o96619M02749l8986O6394l9749p92473M94586m5727
3152B80711k0266L32904K04124l00532R6742N4555k13348j39978R6934N13416
$$ y = [924899, 634111, 626214, 520928, 297066, 493865, 345358, 634801, 689143, 784424, 714373, 153630, 533191, 563048, 324304, 413847, 595051, 1044326, 285427, 980302, 641794, 670839, 870741, 1094625, 29007, 716851, 258179, 944961, 9448, 413939, 267099, 414264, 468831, 841393, 371298, 476039, 627105, 417041, 607513, 235235, 996992, 233139, 930642, 469233, 560394, 354438, 644977, 519818, 1035731, 846775, 1034303, 363951, 412164, 850872, 427475, 202192, 456155, 867269, 374524, 514197, 426846, 843224, 445462, 930536, 233917, 636666, 597680, 664074, 624325, -168148, 326438, 280711, 260445, 593349, 797473, 496941, 593683, 648238, 434890, 294912, 391846, 905262]
3142I05262j97406J40921j39132j61710k03353l23932J67392l96113P74393j02781
3132D63541k74203J77338l27777N94506J0102n93485M65418l86274L76792l87151
3122A18807M91508k16426K11080J39852k4308l0551m02723K00033k39854K6526
3112B73944n20098M07219L16304l81581J03643k91392Q36466J26874m75235k95435
3102A00709O9722K26615j91984J73954k17517M31275l61104L16989j42540K3058
3092D29177M35514j50927l48731O36882m55026l24586O97608l07901N81188n42062
3082F51136m49428O4081M7141j9443K78795n6834j19304k32536N63556p9678j88094
3071D59392l39942J61614p0596j46846J11483N62839m26123J85097l21568j13400
$$ y = [905262, 707856, 848777, 709645, 547935, 344582, 20650, 188042, -208071, 566322, 463541, 189338, 366676, 38899, 633405, 643507, 50022, 515440, 129166, 505958, 118807, 610315, 393889, 604969, 744821, 720513, 689962, 287239, 487272, 247418, 273944, -246154, 161065, 477369, 95788, 199431, -91961, 744505, 871379, 396144, 100709, 170431, 397046, 205062, 379016, 161499, 592774, 231670, 548659, 406119, 429177, 864691, 713764, 365033, 1001915, 546889, 222303, 919911, 612010, 1193198, 651136, 201708, 265789, 312930, 293487, 572282, 515448, 396144, 163608, 727164, 647486, 459392, 119450, 281064, 210468, 63622, 175105, 737944, 311821, 496918, 175350, 61950]
3061F1950L53033k86742O45308p1160j24389n95457j09562n2707N21906j68199
3051A73981J91438k04838K6144J80562J936K73232k65625N18783r93023K20974
3041A23564O73973r3079k50091J25628J5836k21209K69527k01552r8219P12976
3031A057354p75520J13264m00436L53300J49276k13614k00948N38655m47301k33629
3021e9599M45316k72465K04919n5404K16976j20927J12511J80593j53442q09745
3011c11267N17045k04204J52045n9610J97546L8528j16930Q863m1393L69753K23465
3000G73841k28362n07501L1963N55467n19471J3195N1769j96580j87433P47001
2990E33889L57997o80314l15297L08736m37713P04719k31281k12j09343n0993
$$ y = [61950, 414983, 128241, 773549, 702389, 578000, -17457, -127019, -179726, 342180, 173981, 365419, 160581, 186725, 367287, 369223, 642455, 376830, 895613, -97410, 123564, 797537, 704458, 454367, 579995, 595831, 374622, 644149, 442597, 344378, 1057354, 281834, 395098, -5338, 347962, 497238, 283624, 82676, 621331, 174030, -59599, 385717, 113252, 318171, 262767, 479743, 358816, 471327, 651920, 498478, -311267, 205778, 1574, 153619, 94009, 291555, 330083, 213153, 222016, 180623, 550376, 773841, 545479, 37978, 69941, 625408, 105937, 119132, 170901, -25679, -213112, 533889, 891886, 211572, -103725, 205011, -232702, 472017, 240736, 240524, 131181, 80188]
2980H0188N4858n7456j309M01628J76482L1426O352n02873j05764J6272J1563
2969A11367k24575N80904n4360L58643m55537J78069j69751p64565M89299K82801
2959C32295K123K03688o28820J84545l28622L74353j75224L16230J75791n73407
2949a17048K23779O5892K17966k88309L76381l20939K26443n49058N43833k4801
2939C54139J06818M3827p2817k85148N73227m41033j79960J57992R4382m63092
2929a11665M11324k15677K4241J51440l4018N5916j92339L4328j29502Q03364
2919G97412l42059K85699p76220K22656k81618N38210P8278n1032m1196L59192
2909G89322l39294j82802N3886P8076K4811o52534O15817K4674L5239k76927L79769
$$ y = [80188, 135046, 77590, 76281, 477909, 654391, 685817, 692169, 189296, 83532, 99804, 111367, -113208, 467696, 413336, 771979, 316442, 494511, 324760, -439805, 49494, 332295, 334418, 538106, -90714, 93831, -234791, 139562, -35662, 280568, 456359, -117048, 106731, 172623, 390589, 102280, 478661, 157722, 384165, -164893, 378940, 354139, 460957, 504784, 431967, 146819, 720046, 279013, 99053, 257045, 351427, -111665, 299659, 83982, 108223, 259663, 225645, 281561, 89222, 123550, -5952, 797412, 455353, 741052, -35168, 187488, -94130, 444080, 522358, 471326, 430130, 789322, 450028, 267226, 321112, 399188, 423999, -228535, 387282, 411956, 447195, 170268, 550037]
2898E50037m24380P5163l16492P37108k32847K43098j89820q27446P24893l19806
2888A9508M67025n63289M31340N6081j04081l23183M98741l38774N8826j92721
2878I473K77172p7954j13248p7288p6863M44114P8520m29848k93705O00551Q690
2867C49614m64136j46591N54660m45507J64363J90696J04601j85360K62655J58431
2857E43426k58494k35453J99271J24628L16298o090m88383K57221n23658Q76901
2847H05667l44542K5304k0557J38817k37605j75676p2640j1794K84408n07174
2837a15792K72188k2762P2204j94239K03168j41692N76064m55793K08245n39766
2827a38175K11902j15406O7912p691N11389l27566l95615N91370k15640K7312
$$ y = [550037, 125657, 200820, -115672, 621436, 388589, 631687, 441867, -385579, 339314, 19508, 486533, -76756, 354584, 410665, 306584, -16599, 482142, 143368, 202194, 9473, 286645, 208691, 95443, 18155, -58708, 385406, 463926, 34078, -259627, 340924, 349614, -114522, -261113, 293547, -151960, 12403, 203099, 307700, 122340, 384995, 543426, 284932, 49479, 248750, 373378, 689676, 683586, 195203, 452424, -71234, 805667, 461125, 486429, 465872, 604689, 367084, 191408, 118768, 106974, 391382, -115792, 156396, 133634, 205838, 11599, 214767, 73075, 649139, 193346, 401591, -138175, 73727, -41679, 26233, 18542, 529931, 202365, -193250, 398120, 182480, 209792]
2817B09792J25769j28561l43847K13459K21155K61458o21550N659j6218K03047
2807A30163l07286O73724n11437J88630j5429k09197M00500K28269m63934K02500
2797C16503J02569k09933j80161p462Q14091j96179k4863j17700n9964l35694
2787A01207M40060n96414N42028m50836M22037j22196J13862m58522M26573l49825
2777F7974p0287O79145l00467l05229J53847Q2026k53232R9300J07665K73904
2767E34646p47295N14867n22495M33631J43177n5366l92076K88350M2172j08862
2757A30749K35764r1158O41739p22643k89697L19433k78561k20895K85147P9426
2747H9304K48460K44419l33923p1673j55771l59444J89953K37870J35587j29572
$$ y = [209792, 335561, 207000, -136847, 76612, 297767, 559225, -62325, -56666, -72884, 130163, -177123, 496601, -14836, 173794, 158365, -50832, 349668, 577937, 114003, 316503, 419072, 209139, 28978, 21516, 835607, 639428, 614565, 496865, 436901, 101207, 541267, -55147, 486881, 36045, 458082, 335886, 449748, -8774, 417799, 67974, -2313, 676832, 376365, 71136, 224983, 307009, 53777, 153077, 260742, 534646, -212649, 302218, -220277, 213354, 356531, 301165, -90911, 197439, 239611, 130749, 366513, 275355, 917094, 194451, -95246, 224187, -54374, -275269, 9878, 89304, 337764, 582183, 248260, 176587, 20816, -338628, -148675, 89195, 224782, 95210]
2737I5210k26967K56864j50104L39269J44588K85173m80641j83222k06773K14393
2727H7790j45408K55381J52078m8153J13882K61632o21871Q2784J00045J43483
2717C81643j90975l53840L26629J71974j53794p8327O0339J21877m32025K70619
2707A24120R4141M365K97252k07420j73393N9959m01523L27561J89471L06380
2697F20913m8491k83469j67727j03703j13356J83677J80907J17063k71629M00665
2687E14850K572l82516k4818j72220r6423L91623K8518q8176j20440K22737n870
2676B69837m84384Q59822j039455J132118P0777l21240j09099k71220k06688O57117
2666E57585l41659O28125p1400m71047n87364j12529P25011p84834N48931M58617
$$ y = [95210, -131757, 125107, -24997, 314272, 458860, 744033, 263392, 80170, -126603, 87790, -57618, 197763, 349841, 301688, 415570, 677202, 55331, 138115, 238160, 381643, 190668, -163172, 163457, 335431, 181637, 103310, 163649, 285526, -146499, 124120, 218261, 222626, 519878, 312458, 139065, 199024, -202499, 125062, 314533, 620913, 572422, 288953, 121226, 17523, -95833, 87844, 268751, 385814, 114185, 514850, 517422, 134906, 110088, -62132, -158555, 233068, 261586, 173410, 52970, 275707, 269837, -214547, 645275, -394180, 737938, 808715, 487475, 378376, 107156, -99532, 557585, 215926, 844051, 772651, 301604, -285760, -398289, 326722, -458112, 90819, 549436]
2656E49436n86582J75825L2719j19334N7405j89881J59761j63099N83405o06039
2646a06384N8232K61831p8931L25939q1172J43412l21320J26607l27555J28279
2636A28938M6299M91383n1774L92547n57576J28215m41189K28020k37644J74801
2626C02020m98633M54771J21632N7432k6148n2308k23948k02400N45719l46552
2616A31585O08685m44123m4712k79777J56454k52768L52799L05188L54074k84730
2606F02675K20595n87898n7082L85444l83154q0971J22594p5248M8253J91066
2596C86274l75256n60358J60902O63303m21691O07225o21358J84840p0948J89224
2586A42157L8791M09425k59420j35382j56684J99708l7143j90324K51179j29751
$$ y = [549436, -37146, 138679, 171398, 52064, 109469, -80412, 79349, -83750, 499655, -106384, -48152, 213679, 134748, 460687, 379515, 522927, 201607, 328214, 659, 128938, 175237, 666620, 614846, 1007393, 449817, 578032, 136843, 364863, 127219, 302020, -196613, 258158, 379790, 437222, 411074, 358766, 134818, -67582, 478137, 131585, 740270, 296147, 251435, -28342, 128112, -124656, 228143, 533331, 887405, 602675, 823270, 235372, 178290, 563734, 180580, 99609, 222203, 146955, 195208, 386274, 11018, -549340, -388438, 274865, -146826, 460399, -160959, 23881, -47067, 142157, 180948, 590373, 330953, 195571, 38887, 238595, 201452, 11128, 262307, 132556]
2576A32556M08923n29457M156M12185k13031J74695k64158J47597K02009m0122
2566D35353K59091l14264p03373O35144p89492N81243o2422l13803K27030R4715
2556D9222L52431l81718K65954j35613J81542n53901O67795j51818Q9468l70322
2546A3040O1771m583J59743J94807l9379l694J56866o31474L40896q4196O2625
2535B26422k21988m6613N68210n58174K45245k12842l38882O68562n31382K26834
2525B5392K76167l71443o695J38032L36876p76419K13090L52317k23903N97608
2515E61022k41049m69668o8767P28746n56747L51109m66232q1632L54038m64840
2505c54020O30622J53028J13150n74983k05593L77344j62323P2456o0976Q07208
$$ y = [132556, 541479, 12022, 16178, 428363, 215332, 390027, 125869, 273466, 475475, 435353, 694444, 380180, -323193, 311951, -477541, 103702, 41280, -272523, -45493, 49222, 401653, 19935, 285889, 150276, 331818, -222083, 445712, 293894, 383362, 13040, 74811, 70228, 229971, 424778, 385399, 381705, 538571, -92903, 247993, 163797, 226422, 4434, -42179, 526031, -32143, 213102, 260, -338622, 329940, -201442, 25392, 301559, -69884, -76579, 61453, 398329, -378090, -165000, 187317, -36586, 561022, 319973, -149695, -218462, 510284, -46463, 304646, -161586, -243218, 110820, -354020, 276602, 429630, 542780, -32203, -237796, 139548, -22775, 49681, -11295, 795913]
2495G95913r45553M87299N3222n79127q5342J51032l32151K98563M71691p2801
2485B42746l61918M16161j36755j9273p9205J97142J69961l81250L95952j188087
2475g44526J180404j75444n44198M05991M00972p34102M2303l394K65512k43134
2465a49616L55081J34264l98900K17584k33061O42990q18614P09428o24003N90088
2455D25241m61477J02074m61303K16376M65076k15412j55181k77628O95139j28132
2445B04773r2956J8994m6323O4531k81332J03082L72540l77554K33554J42012
2435C41321k2447l81562L34634k44833k14123K87472Q8198J48699l13004O03167
2425F27522k88015j91076j30511M97841m53606M9529k49899J72939j30611K75906
$$ y = [795913, -149640, 337659, 390881, -188246, -273588, -122556, -454707, -156144, 315547, 242746, -119172, 296989, 160234, 140961, 61756, 258898, 428859, 47609, 443561, -744526, 435878, 260434, -283764, 122227, 523199, -210903, -168600, -171994, 93518, -149616, 205465, 339729, -59171, 158413, -74648, 568342, -250272, 459156, -164847, 425241, -36236, 65838, -395465, -179089, 285987, 70575, -84606, -362234, 332905, 204773, 111817, 130811, 84488, 149019, -132313, -29231, 343309, -34245, 199309, 341321, 318874, -62688, 271946, 27113, -187010, 100462, 188660, 337359, 24355, 627522, 339507, 148431, 17920, 515761, 62155, 111684, -138215, 34724, -95887, 180019]
2415A80019k23130m7548M46062N1459r0210K67486m21830m97596M44266K9761
2405A38739K64132n44431K65247j1662L14091j91854j68253k20778K88784k5529
2395A08486J52220J43846j11339J05207p67038O32088o3089J00018j071918J166610
2385C95091n88052O91352n08316O62437m19068p6635n4515l9438j69722N93831
2375D86965n36694m14293P16918l87702j72067Q07132J75354k27606M5592L4973
2365E28572m15235n70072K58758P4857J79173k49680Q23245l91264M86332q77507
2355a52821O60231m41743j21320O09639n69545j53676J13342L10515m38270N54754
2345C71106k19701j41456n17556Q09749k74283Q6871p6409N31215m90197M73972
$$ y = [180019, -43111, -90659, 355403, 406862, 316652, 584138, 162308, -335288, 108978, 138739, 402871, -141560, 123687, 112025, 426116, 234262, 66009, -154769, 134015, 108486, 260706, 404552, 293213, 398420, -368618, 263470, 200381, 300399, -771519, 395091, -192961, 498391, -9925, 652512, 233444, 156809, 102294, 62856, -106866, 486965, -49729, -464022, 252896, -134806, -306873, 500259, 675613, 448007, 493599, 528572, 113337, -456735, -197977, -123120, 56053, -193627, 629618, 238354, 724686, -152821, 507410, 65667, -55653, 553986, -15559, -169235, -55893, 254622, -183648, 371106, 151405, 9949, -507607, 302142, 27859, 114730, 38321, 569536, 79339, 553311]
2335E53311n20087j81953k3796J00283L94379J12649l76933N59038K03835q25412
2325d686K56681k44221l31731L45432O97283m66407j81969j67060Q2143J38508
2315A23973m16064M10711J50540L45330k83604m34480k10907N6893L13964K82747
2305C39103j74124L96872o79266j19832O36482L46248m75601l42299N49271k31033
2295B45821m25128l87758N92213j55316P15924o13213M88869l16753K16496l21500
2285C9655L68509k67430L07798q96461O92522J67206O3364q48576M30527J1772
2275F8886Q6453K31213n88294L37213K60192J37777q97549N79373P756J24638
2265C47658p02047J08667L81770k56700L00017Q5179P3917j9200j04986k55438
$$ y = [553311, 33224, -148729, -172525, -72242, 322137, 434786, 57853, 616891, 820726, -4686, 251995, 7774, -323957, 21475, 718758, 252351, 70382, -96678, -14535, 123973, -292091, 118620, 269160, 614490, 330886, -103594, -314501, -257608, 56356, 339103, 164979, 561851, -117415, -237247, 399235, 745483, 269882, -72417, 476854, 245821, -179307, -567065, 25148, -130168, 585756, -27457, 461412, 144659, 361155, 39655, 408164, 140734, 448532, -447929, 244593, 411799, 475163, -373413, 57114, 68886, 155339, 386552, -201742, 135471, 395663, 533440, -364109, 215264, 223020, 347658, -354389, -245722, 136048, -120652, 179365, 264544, 338461, 319261, 214275, -41163]
2255d1163M65899o21333N54725j27387j79810J10257o0279n44449N27579J19397
2245B03436m16550j22314K04210L33117j14824M33462k70488k10717m06561L34410
2235c2819q8017K60091j71877K03681O2200K93507o19189j61761M40792P6071
2225B62679M01283j31989m3205m51994N00001n71630O2857k79431K87972k7136
2215I407K87698n54134O15439p52694N77571m20379M67812l4177l91120L09816
2205A15239l15188L71689m04205Q30682n65800K33094j69916K33183o50402L73229
2195E1605L11894j34373m1223K73794l08822o17703M80953L7440l57315K00706
2185a03044N49916n13242O0603K16694k17787k28255M18226n742J08147n99682
$$ y = [-41163, 424736, -196597, 358128, 230741, 50931, 161188, 100909, -443540, 84039, 203436, -213114, -335428, -131218, 201899, 87075, 520537, 250049, 39332, -367229, -32819, -120836, 139255, -32622, 171059, 233259, 526766, -92423, -254184, 186608, 262679, 663962, 531973, 488768, 36774, 536775, -34855, 28002, -251429, 36543, 9407, 297105, -257029, 358410, -394284, 183287, -237092, 230720, 196543, -194577, 115239, -199949, 171740, -232465, 598217, 32417, 265511, 95595, 328778, -321624, 51605, 363499, 229126, 187903, 461697, 152875, -464828, 16125, 53565, -303750, -103044, 446872, -66370, -5767, 210927, -6860, -235115, 183111, 177369, 285516, -314166]
2175c14166N67035J59115j65976m66133J52615j44205K89674o63616K15157J33742
2165b36758O62808j7517n54710K40276l75294K33023n16431J78002O49322m73612
2155b10891L29631L47354j41519j06451p41466O84930m72626Q18945p85831J74718
2145a03206K33600N2582l3807J3128N91226l97903n16534P61267j33897R0648
2135E57104k11333l841M87435p06680O51740q73273N63099l54907n4107R1332
2125A46569j04563p829M12176p51993L47319k38070P73426n59336K8447K55364
2115C01510m76487K29147K1933K92191o85452R26561l10699O4006k32994k1865
2105A07851m34936N06704k53704N38412K9469r3902L8042p38979m521O73589j08870
$$ y = [-314166, 252869, 411984, 246008, -220125, -67510, -211715, 77959, -585657, -370500, -236758, 426050, 408533, -146177, 94099, -281195, -48172, -564603, -386601, 262721, -210891, 118740, 466094, 324575, 218124, -523342, 161588, -311038, 507907, -277924, -103206, 130394, 182976, 149169, 162297, 753523, 355620, -160914, 600353, 466456, 557104, 345771, 341930, 829365, 122685, 774425, -98848, 464251, 109344, 55237, 146569, 42006, 34177, 446353, -305640, 41679, -196391, 577035, 17699, 46146, 301510, -174977, 54170, 76103, 368294, -317158, 609403, 298704, 362710, 129716, 107851, -327085, 179619, -74085, 464327, 493796, 399894, 437936, -301043, -305564, 368025, 259155]
2094B59155l36371K31408L22248m21470l77160O90884q55812O68284K39134m77412
2084e7112j26333M57230M4576l63242p7685J46983J24466K34855p4200k7466K99963
2073E82035o35652r261M05181r119j81139J75086l98898Q7652K62022l00843K82909
2062B59973j89536K61698l30807N71498o44755L51604o0858k72080K80438L68835
2052E96010o55483K11727k62161J84397l18258K52785J96479l68213L33386k82336
2042a11667K14964M4506K64709n23038N22402l38616O0056J60942L8030l80964
2032d8676k15351L74946l91826L83512j80959M72009n52346N90368n67595M52271
2022C16353l80043J72101k2409j53013M00485l16985L96777j76900K06234m11545
$$ y = [259155, -77216, 154192, 476440, 54970, -322190, 368694, -487118, 181166, 420300, -57112, -183445, 273785, 318361, -44881, -122566, 24417, 148883, 383738, 309538, 282072, 582035, -53617, -62878, 342303, 333184, 152045, 327131, -71767, 15885, 277907, -22936, 259973, 70437, 332135, 1328, 572826, -71929, 279675, 218817, -53263, 227175, 596010, -59473, 152254, -109907, 74490, -243768, 9017, 205496, -162717, 170669, -111667, 103297, 147803, 412512, -110526, 411876, 73260, 133316, 294258, 332288, -48676, -264027, 110919, -280907, 102605, -78354, 393655, -158691, 431677, -135918, 316353, -63690, 108411, 86002, -67011, 333474, 16489, 413266, 236366, 442600, 31055]
2012C1055K35526j77117L13669K3958j97333k53580J06680N75571o75519j39112
2002a56202J19261K41024k27550j02152j17705K44964L18636J3488O38264p52612
1992B19416j68033l9284L5209J17440l26953M88647M09193q47381L44885m23906
1982a90767J06200k58249K30481K28468j00440P28957o70150l10105M33980l84235
1972a85860o861O42239j1935j32348J19836k36065p0844l21746N30773n29845
1962b02656L86819K04323k46487j60644N7621j86002N25159p35715L50682K21410
1952B14510n26169K56543K29461r253O6157J55506o02792M88577o07107R57360
1942F22793r93671Q38800q9472n16303J46660M8796K34590J35002n10372M58176
$$ y = [31055, 266581, 89464, 403133, 427091, 229758, -23822, 82858, 658429, -17090, -156202, -36941, 204083, -23467, -125619, -243324, 1640, 320276, 333764, 972028, 219416, 51383, 12099, 47308, 164748, -162205, 326442, 735635, -111746, 233139, -190767, -84567, -342816, -112335, 116133, 15693, 744650, 74500, -235605, 198375, -185860, -192721, 449518, 437583, 305235, 425071, 189006, 118162, -203584, 327189, -202656, 184163, 388486, 141999, -18645, 38976, -147026, 378133, -357582, -6900, 214510, -311659, -55116, 174345, 165092, 231249, 386755, -216037, 272540, -334567, 622793, -370878, 467922, 378450, -137853, 8807, 57603, 292193, 427195, -83177, 374999]
1932C74999n4837j53258l93311O2357N85932n63777Q66671r41755Q41975p09553
1922h4557j7380j14552J21914j04327K61006j5460J81220j28326l16043l1423
1912b47928n8391P64519p66621J13522K37448L93263n42900M66998k83453l04974
1902b28517J84130n90562O64825O3493m44209K98566K91704Q0916m29601k48079
1892c57334O12252N1843n99254N20454N5667O0591m98364L43112j78889J13763
1882A23841K22342n50521L07684N03549n76700M300J07784j06877K00305N5538
1872B91245l89773J8623P908N4582M85065m92458M39264o42664K39858j29952
1862a18302J43471J81451p5056n927J21375m83988L9706M55510j29875K24295
$$ y = [374999, 320162, 166904, -226407, -164050, 421882, -141895, 724776, -216979, 624996, -84557, -101937, -216489, -94575, -198902, 62104, 46644, 227864, 99538, -216505, -247928, -306319, 458200, -308421, -194899, 42549, 435812, -107088, 359910, 76457, -228517, -44387, -634949, 29876, 93369, -350840, -52274, 239430, 320346, -109255, -357334, 254918, 306761, -292493, 227961, 283628, 344219, -154145, 188967, 10078, 123841, 346183, -204338, 103346, 606895, 30195, 34495, 142279, 35402, 235707, 291245, -98528, -79905, -71997, -17415, 467650, -24808, 414456, -228208, 11650, -118302, 25169, 206620, 131564, 125637, 247012, -236976, -197270, 258240, 128365, 352660]
1852C52660m60615O13892p13683M65727p5795M2704J70228k30335J2132p5739
1842A01176j98383N75042p57166J98665N0414p5863L01550j71086M2448l17267
1832b50470M59144j37080K02902N3878Q2524j66726K21726j98221R5549j40606
1822B22620m49065N38834k40937O17839o52337K19739k22035K60191L7438l77969
1812d5682j13718R1251K25366K46824k58168k41129L45798p89189M86064J30282
1802G7699N37684j1647k41849m28949J6611j25996K38881k99066P84060l31725
1792B15703q3203l99136M98773L27648q80566N64391j91628L18164q30882R86085
1782E25349o26319K74855j92870N67444j190134N84508Q4326j63102l65179L86349
$$ y = [352660, -107955, 505937, -207746, 257981, 182186, 224890, 395118, 164783, 176915, 101176, -97207, 477835, -279331, -80666, -30252, -106115, 195435, 24349, 66797, -250470, 208674, 71594, 274496, 328374, 410898, 244172, 465898, 267677, 363226, 222620, -226445, 312389, 71452, 689291, 36954, 256693, 34658, 294849, 332287, -45682, -159400, -68149, 157217, 404041, 145873, -95256, 250542, -538647, -52583, 77699, 615383, 603736, 361887, -67062, -50451, -176447, 62434, -236632, 547428, 215703, 132500, -266636, 232137, 559785, -320781, 243610, 51982, 370146, -460736, 525349, -100970, 173885, -18985, 548459, -641675, -57167, 27159, -135943, -501122, -114773]
1772a14773Q9051L99122n22115j68461N93433p18980Q45952o95393M54721l6109
1762A26448N2375k01744J51149M51533j69725o58073J058321r59166J28479j90762
1752b11165L04790M08314j73268o8150j83950m13821j4283K48240n9379O81756
1742E19084p46451J88009j08924O68877q77897K4840N63838K5703r8301j18681
1732D0097J59971l58792l73255O12529K39929k51670j98706J75291M9615J01695
1722A96704k97643K26299M22404p87408M16939k18029m51214M74909K12888o14839
1712d18990R97810l89610j31135j86395N22201m83664L5090L45554j01859M7638
1702B36640l71545j49017O4794M29468K11975k45020M3970k01412L78213o11224
$$ y = [-114773, -25722, 373400, -148715, -317176, 276257, -442723, 403229, -292164, 162557, 126448, 178823, -22921, 128228, 579761, 410036, -248037, 810284, -148882, -20403, -211165, 93625, 501939, 328671, 260521, 76571, -337250, -351533, -103293, -162672, 519084, -227367, -39358, -148282, 520595, -357302, -332462, 231376, 257079, 158778, 40097, 200068, -158724, -531979, 80550, 320479, 68809, -129897, 45394, 95009, 196704, -100939, 125360, 547764, -239644, 177295, -40734, -491948, -17039, 195849, -418990, 578820, 189210, 58075, -128320, 393881, -89783, -54693, 290861, 189002, 236640, -134905, -283922, -219128, 210340, 422315, 177295, 221265, 19853, 398066, -213158]
1692b13158O26711j28578r511m4508j09279J82844l60613J29417n1734j54763
1682a33172N67122k23850J82715l04239j56110J41732O4041q1056l15756J56186
1672a02387K9710K29978k02317J80359l19862L95328m93627L78803l81229Q19543
1662E34299j77278j68540k11907k69819J061974q67146n9704K70773J77562l1622
1652B58592p2961M2147J88184r50667N83083m03402J207994p50247j99975L15816
1642B18564k98565j0201J48166M40465k05582p48595Q37193k20556K48467j5135
1632C94221j27769N7691k29236P8983m75110N09864k48920J8105l40436N75887
1622B13280j22430L63794l93569K14367l12378L01325J50280m30590N4098J51893
$$ y = [-213158, 413553, 284975, 275464, 230956, 121677, 304521, -56092, 73325, 21591, -133172, 433950, 210100, 392815, 88576, -67534, 74198, 138239, 57183, -258573, -102387, -72677, 157301, -45016, 135343, -184519, 210809, -282818, 95985, -285244, 534299, 357021, 188481, -23426, -293245, 768729, -98417, -158121, 112652, 290214, 258592, 185631, 227778, 415962, -534705, 48378, -355024, 852970, 102723, -97252, 218564, -80001, -90202, 57964, 498429, 292847, -455748, 381445, 160889, 409356, 394221, 266452, 324143, 94907, 173890, -301220, 208644, -40276, -22171, -362607, 213280, 90850, 454644, 61075, 275442, -36936, 264389, 414669, -15921, 38177, 190070]
1612A90070N16008j026846j2456j1303L69413k28064L34920k02116K35474n97954
1602d32854N63507l25254K97318p0424K11815l2499j5635l0993k54831J04893
1592A5043l65497M00055J97062l059l23430K39183k48243L26536j51621l61769
1582b75740O37672j76382k8939Q8787o3742n73873N15275L37810l33435O3460
1572A90893n01840O55226j52806o2105J080Q5788L6279o66541M03485L11909j92764
1561A08604R4879k96788j01777j52132J55408N58660k61018J29305j0672l8482
1551A85987j00365k22970M68094j77270k74840N49539n72352K74488j70920L77200
1541C36591m23158O47352l57885j36271j46145L09900n90184P97861m00076m07027
$$ y = [190070, 706078, -320768, -333224, -344527, 24886, -203178, 131742, -70374, 165100, -432854, 130653, -194601, 102717, 32293, 244108, 211609, 195974, 164981, -89850, 15043, -350454, 49601, 246663, 243604, -79826, 159357, -88886, 237650, 86029, -275740, 361932, 185550, 156611, 245398, 181656, -392217, 123058, 460868, 127433, 190893, -310947, 344279, 191473, 129368, 130448, 216236, 252515, -414026, -10541, 301368, 108604, 203483, -93305, -195082, -347214, -191806, 366854, 105836, 235141, 224469, 185987, 85622, -137348, 330746, 153476, -121364, 428175, -144177, 130311, -40609, 336591, -86567, 560785, 202900, 66629, -79516, 230384, -359800, 438061, 37985, -369042]
1531c69042O61098n14887L64003m40842q7093O4453J83816K37459L3628j1813
1521A20780R2769j82549L5055M80849l16942l07392Q08758l67877n70691L83419
1511A76179j49467J82056P261L1729r2963K22643n5730R1648k76011K16609l46203
$$ y = [-369042, 292056, -222831, 141172, -299670, -386763, -322310, -138494, 98965, 132593, 120780, 213549, 31000, 66055, 546904, 229962, -77430, 731328, 363451, -207240, 176179, 26712, 208768, 216029, 247758, 154795, 377438, 321708, 413356, 137345, 353954, 7751]
$$ [...]
##END NTUPLES=NMR SPECTRUM
##END=
