##TITLE=abcd
##JCAMPDX= 6.0         $$ Bruker NMR JCAMP-DX V2.0
##DATA TYPE= NMR SPECTRUM
##DATA CLASS= NTUPLES
##ORIGIN= UXNMR, Bruker Analytische Messtechnik GmbH
##OWNER= root
$$ XWIN-NMR		Version 3.5
$$ Mon Jul 27 17:07:57 2026 Russian Standard Time (UT+4h)  servis@DPX200
##.OBSERVE FREQUENCY= 200.131235884673
##.OBSERVE NUCLEUS= ^1H
##.ACQUISITION MODE= SIMULTANEOUS
##.ACQUISITION SCHEME= undefined
##.AVERAGES= 32
##.DIGITISER RES= 18
##SPECTROMETER/DATA SYSTEM= spect
##.PULSE SEQUENCE= zg
##.SOLVENT NAME= MeOD
##.SHIFT REFERENCE= (INTERNAL, MeOD, 0, 16.4885)
##AUDIT TRAIL= $$ (NUMBER, WHEN, WHO, WHERE, WHAT)
$$ ##TITLE= Audit trail, XWIN-NMR		Version 3.5
$$ ##JCAMPDX= 5.01
$$ ##ORIGIN= Bruker BioSpin GmbH
$$ ##OWNER= servis
$$ F:\spectra/data/av/nmr/H1/1/pdata/1/auditp.txt
$$ ##AUDIT TRAIL=  $$ (NUMBER, WHEN, WHO, WHERE, WHAT)
(   1,<2026-07-27 17:06:45.01 +0400>,<servis>,<DPX200>,
      <created by zg, POWCHK disabled, PULCHK disabled
       configuration hash MD5:
       00 E9 B6 7A A2 85 ED C7 34 08 36 98 17 FE 4E 26
       data hash MD5: 32K
       C3 22 2B 7A 82 7E 9A 72 63 58 BF 5B 3B 59 39 66>)
(   2,<2026-07-27 17:06:51.04 +0400>,<servis>,<DPX200>,
      <Start of raw data processing
       efp BC_mod = 2 LB = 0.05 FT_mod = 6 PKNL = 1 PHC0 = -420.9321 PHC1 = 3.101563 SI = 16K 
       data hash MD5: 16K
       CE 9D 64 26 F6 E7 0E 24 77 78 39 9E 77 84 07 C9>)
(   3,<2026-07-27 17:07:03.48 +0400>,<servis>,<DPX200>,
      <pk PHC0 = 3 PHC1 = 0 
       data hash MD5: 16K
       66 52 C8 FB 7E 8A 30 A2 25 CB AB 56 F8 E3 22 3A>)
$$ ##END=
$$ 
$$ hash MD5
$$ CC 6F AD 27 B6 10 B3 D3 DB E1 D8 4A 66 34 31 87
##$RELAX= 
##$RELAX= 
##$RELAX= 
##$RELAX= 
##$RELAX= 
##$RELAX= 
##$RELAX= 
##$RELAX= 
$$ Bruker specific parameters
$$ --------------------------
##$DU= <F:\spectra>
##$EXPNO= 1
##$NAME= <H1>
##$PROCNO= 1
##$TYPE= <nmr>
##$USER= <av>
##$AMP= (0..31)
100 100 100 100 100 100 100 100 100 100 100 100 100 100 100 100 100 100 
100 100 100 100 100 100 100 100 100 100 100 100 100 100 
##$AQSEQ= 0
##$AQ_mod= 1
##$AUNM= <au_zg>
##$AUTOPOS= <>
##$BF1= 200.13
##$BF2= 200.13
##$BF3= 200.13
##$BF4= 200.13
##$BF5= 500.13
##$BF6= 500.13
##$BF7= 500.13
##$BF8= 500.13
##$BYTORDA= 1
##$CFDGTYP= 0
##$CFRGTYP= 5
##$CHEMSTR= <none>
##$CNST= (0..31)
1 1 145 1 1 1 1 1 1 1 1 1 1 1 1 1 1 1 1 1 1 1 1 1 1 1 1 1 1 1 1 1 
##$CPDPRG= <>
##$CPDPRG1= <>
##$CPDPRG2= <>
##$CPDPRG3= <>
##$CPDPRG4= <mlev>
##$CPDPRG5= <mlev>
##$CPDPRG6= <mlev>
##$CPDPRG7= <mlev>
##$CPDPRG8= <mlev>
##$CPDPRGB= <>
##$CPDPRGT= <>
##$D= (0..31)
0 2 0 0 0 0 0 0 0 0.06 0 0 0 0 0 0 0.0002 0 0 0 0 0 0 0 0 0 0 0 0 0 0 
0 
##$DATE= 1785157604
##$DBL= (0..7)
120 120 120 120 120 120 120 120 
##$DBP= (0..7)
150 150 150 150 150 150 150 150 
##$DBP07= 0
##$DBPNAM0= <>
##$DBPNAM1= <>
##$DBPNAM2= <>
##$DBPNAM3= <>
##$DBPNAM4= <>
##$DBPNAM5= <>
##$DBPNAM6= <>
##$DBPNAM7= <>
##$DBPOAL= (0..7)
0.5 0.5 0.5 0.5 0.5 0.5 0.5 0.5 
##$DBPOFFS= (0..7)
0 0 0 0 0 0 0 0 
##$DE= 6
##$DECBNUC= <off>
##$DECIM= 32
$$ [...]
##$SUBNAM4= <"">
##$SUBNAM5= <"">
##$SUBNAM6= <"">
##$SUBNAM7= <"">
##$SUBNAM8= <"">
##$SUBNAM9= <"">
##$SW= 20.6817932712277
##$SWIBOX= (0..15)
0 0 3 0 0 0 0 0 0 0 0 0 0 0 0 0 
##$SW_h= 4139.07284768212
##$TD= 32768
##$TD0= 1
##$TE= 0
##$TE2= 300
##$TE3= 300
##$TEG= 300
##$TL= (0..7)
0 120 120 120 120 120 120 120 
##$TP= (0..7)
150 150 150 150 150 150 150 150 
##$TP07= 0
##$TPNAME0= <>
##$TPNAME1= <>
##$TPNAME2= <>
##$TPNAME3= <>
##$TPNAME4= <>
##$TPNAME5= <>
##$TPNAME6= <>
##$TPNAME7= <>
##$TPOAL= (0..7)
0.5 0.5 0.5 0.5 0.5 0.5 0.5 0.5 
##$TPOFFS= (0..7)
0 0 0 0 0 0 0 0 
##$TUNHIN= 0
##$TUNHOUT= 0
##$TUNXOUT= 0
##$USERA1= <user>
##$USERA2= <user>
##$USERA3= <user>
##$USERA4= <user>
##$USERA5= <user>
##$V9= 5
##$VALIST= <valist>
##$VCLIST= <CCCCCCCCCCCCCCC>
##$VD= 0
##$VDLIST= <DDDDDDDDDDDDDDD>
##$VPLIST= <PPPPPPPPPPPPPPP>
##$VTLIST= <TTTTTTTTTTTTTTT>
##$WBST= 1024
##$WBSW= 30
##$XGAIN= (0..3)
0 0 0 0 
##$XL= 0
##$YL= 0
##$YMAX_a= 173132
##$YMIN_a= -339374
##$ZGOPTNS= <>
##$ZL1= 120
##$ZL2= 120
##$ZL3= 120
##$ZL4= 120
##$ABSF1= 0
##$ABSF2= 0
##$ABSG= 0
##$ABSL= 0
##$ALPHA= 0
##$AQORDER= 0
##$ASSFAC= 0
##$ASSFACI= 0
##$ASSFACX= 0
##$ASSWID= 0
##$AUNMP= <proc_1d>
##$AZFE= 0.1
##$AZFW= 0.1
##$BCFW= 0
##$BC_mod= 2
##$BYTORDP= 0
##$COROFFS= 0
##$CY= 18.4799938201904
##$DATMOD= 1
##$DC= 0
##$DFILT= <>
##$DTYPP= 0
##$F1P= 9.9274215381318
##$F2P= -0.165520771350173
##$FCOR= 1
##$FTSIZE= 16384
##$FT_mod= 6
##$GAMMA= 0
##$GB= 0
##$INTBC= 1
##$INTSCL= 4.127829e-11
##$ISEN= 128
##$LB= 0.05
##$LEV0= 0
##$LPBIN= 0
##$MAXI= 10000
##$MC2= 0
##$MEAN= 0
##$ME_mod= 0
##$MI= 50
##$NCOEF= 0
##$NC_proc= -5
##$NLEV= 6
##$NOISF1= 3.799351
##$NOISF2= 2.8
##$NSP= 0
##$NTH_PI= 0
##$NZP= 0
##$OFFSET= 16.48848
##$PC= 4
##$PHC0= -417.9321
##$PHC1= 3.101563
##$PH_mod= 1
##$PKNL= yes
##$PPARMOD= 0
##$PSCAL= 4
##$PSIGN= 0
##$REVERSE= no
##$SF= 200.130005582386
##$SI= 16384
##$SIGF1= 3
##$SIGF2= 2
##$SINO= 400
##$SIOLD= 16384
##$SREGLST= <1H.CDCl3>
##$SSB= 0
##$STSI= 16384
##$STSR= 0
##$SW_p= 4139.07284768211
##$SYMM= 0
##$S_DEV= 0
##$TDeff= 32768
##$TDoff= 0
##$TI= <>
##$TILT= no
##$TM1= 0
##$TM2= 0
##$TOPLEV= 0
##$USERP1= <user>
##$USERP2= <user>
##$USERP3= <user>
##$USERP4= <user>
##$USERP5= <user>
##$WDW= 1
##$XDIM= 16384
##$YMAX_p= 346028188
##$YMIN_p= -293445
$$ End of Bruker specific parameters
$$ ---------------------------------
##NTUPLES= NMR SPECTRUM
##VAR_NAME=  FREQUENCY,     SPECTRUM/REAL,   SPECTRUM/IMAG
##SYMBOL=    X,             R,               I
##VAR_TYPE=  INDEPENDENT,   DEPENDENT,       DEPENDENT
##VAR_FORM=  AFFN,          ASDF,            ASDF
##VAR_DIM=   16384,         16384,           16384
##UNITS=     HZ,            ARBITRARY UNITS, ARBITRARY UNITS
##FACTOR=    0.252644378177508, 1,           1
##FIRST=     3299.83951724647, 0,            0
##LAST=      -839.233330435636, 0,           0
##MIN=       -839.233330435636, -293445,     0
##MAX=       3299.83951724647, 346028188,    0
$$ Real data points
##PAGE= N=1
##DATA TABLE= (X++(R..R)), XYDATA
$$ [...]
10571f158p597k0296N9431j0678r6183J850R8169K6094M3541L520j40016l0899
$$ -6158 -13755 -34051 25380 14702 -81481 -79631 18538 44632 88173 91693 -48323 -79222
10559g9222p51N8165k9521J05522n8221N2798p4497j3218J22952l1786j08076
$$ -79222 -79973 -21808 -51329 54193 -4028 48770 -25727 -38945 84007 52221 -55855
10548e5855M9491N4172m7728j6006M3137r796m7550O330M3677k5134J2963j1093
$$ -55855 -6364 47808 80 -15926 27211 17415 -30135 -23805 19872 -5262 7701 -3392
10536c392k1079K5994l4951M1873k3120O2108k6176n5571q7797J05900M1731K4681
$$ -3392 -24471 1523 -33428 8445 -14675 47433 21257 -34314 -122111 -16211 25520 50201
10524E0201p7478P3622J7650j71528J07431J0426L0652l4305M8002m1502j01045
$$ 50201 -27277 46345 63995 -107533 -102 10324 40976 6671 54673 13171 -87874
10513h7874Q6670r502l7828R7526K1190j1347j12422J12595m5124j4899K5239
$$ -87874 -1204 -10706 -48534 48992 70182 58835 -53587 59008 13884 -1015 24224
10502B4224l1174K6652J1393l7880P8286q8566O7503j05512N7201j0556J11725
$$ 24224 -6950 19702 31095 -6785 71501 -17065 50438 -55074 2127 -8429 103296
10491A03296j11943L2208p3268J3216R1401O5133j32514N4304q3281O7863j3461
$$ 103296 -8647 23561 -49707 -36491 54910 120043 -12471 41833 -41448 26415 12954
10480A2954M4354l6231j2793j2604Q7555j691n4984L3400q3060J00140k6421r7010
$$ 12954 57308 21077 8284 -4320 83235 81544 26560 59960 -23100 77040 50619 -46391
10468d6391R9539q0244O1057K7598j3940m3836K5151N3550j3437k4970j9041J8294
$$ -46391 53148 -27096 33961 61559 47619 3783 28934 82484 69047 44077 25036 43330
10456D3330K779L8924r7121J5340Q6255l275J4698q3811K6944k4161l6797Q4271
$$ 43330 46109 85033 -12088 3252 89507 86232 100930 17119 44063 19902 -16895 67376
10444F7376n3536P8974L0676m1357m8588M6039j04143J20122j19382P425N4336
$$ 67376 13840 92814 123490 82133 33545 79584 -24559 95563 -23819 -16394 37942
10433C7942M3996q7750P1071j02011J34356p9844P3459K2876r9033M6141p0616
$$ 37942 81938 -5812 65259 -36752 97604 17760 91219 114095 15062 61203 -9413
10422i413Q3404m0242M8748j55173J03756J5696Q414M0131k1524K7215l7686j7236
$$ -9413 73991 33749 82497 -72676 31080 46776 55190 95321 73797 101012 63326 46090
10410D6090r3949J29913K225q4667R3279q3748K9797Q3532l1395J4830p677r4332
$$ 46090 -47859 82054 84279 -388 92891 9143 38940 122472 91077 105907 98230 3898
10398C898N7345K8129q3975N1619n840q5119J54065k7800J0523J36011k18949
$$ 3898 61243 89372 5397 57016 51176 -33943 120122 92322 102845 238856 19907
10387A9907N8391O4259q6125j0546Q5429O7095l2622q7723p279q6434J60483j31762
$$ 19907 78298 142557 56432 45886 131315 198410 165788 78065 70786 -15648 144835 13073
10375A3073L9131K7813P8173p1761n2057Q8703m3799j1028J26102P1441j15409
$$ 13073 52204 80017 158190 86429 34372 123075 79276 68248 194350 265791 150382
10364A50382J25870j14242P8193N6560j69446J07516l3224K150o7471O6553J4295
$$ 150382 276252 162010 240203 296763 127317 234833 201609 203759 136288 202841 217136
10353B17136k92682J55236j3306J26043l1230q4001o1262P5494j9017Ko2786k1693
$$ 217136 -75546 79690 66384 192427 161197 77196 15934 91428 72411 72413 9627 -12066
10341a2066o0656K11246J294p0319o1641j15919J11421J1802R386O161N9934m3533
$$ -12066 -72722 138524 139818 69499 7858 -108061 3360 15162 24548 30709 90643 47110
10329D7110k3420J4856j7247K0741k342q7556Q0519N752n1115J1328M2714k014
$$ 47110 23690 38546 21299 42040 39698 -47858 32661 38413 -12702 -1374 41340 39326
10317C9326L270M1779j5997L9512K5849j26341J18866n8265J9806j2459k324R216
$$ 39326 42596 84375 68378 107890 133739 7398 126264 67999 87805 75346 73022 82238
10305H2238m4136O8685n8130n5246L4926l2661j8035K02412q4742j37946Q0139
$$ 82238 38102 106787 48657 -6589 28337 -4324 -22359 180053 95311 -42635 37504
10294C7504o6967J00074k9797J1604O7055p6466O6764j53217J07259q3019Q8127
$$ 37504 -29463 70611 40814 52418 119473 43007 109771 -43446 63813 -19206 68921
10283F8921j7853R6770n6369l6051O7188j07650M3497J7391j14499O2283Q4643
$$ 68921 51068 147838 91469 55418 122606 14956 58453 75844 -38655 23628 108271
10272A08271m9327j9756j05404J72938p2449j08723L9364P9539q3249O2976K0182
$$ 108271 58944 39188 -66216 106722 34273 -74450 -35086 44453 -38796 24180 44362
10261D4362l4231O5027j30133p179J51692j3292k7983M6901r1203J7143j30870
$$ 44362 10131 75158 -54975 -62154 89538 76246 48263 95164 3961 21104 -109766
10250a09766R4088p6715J01923l525K9390j0726M9195n1126k5055M527J05524
$$ -109766 -15678 -92393 9530 6005 35395 24669 73864 22738 -2317 2210 107734
10239A07734j35869K1431N5705l5753K9768o8334M8608l4152J0290m0636O8558
$$ 107734 -28135 -6704 49001 13248 43016 -25318 23290 -10862 -572 -41208 27350
10228B7350j1262L5492q237j00787J36672o9071k649M3870n3451M2631N0734r8408
$$ 27350 16088 51580 43343 -57444 79228 10157 7508 51378 -2073 40558 91292 -7116
10216g116M901L0253j3430l2783O9138m9464o368J4271M941l5671K5607O233J6472
$$ -7116 -2215 28038 14608 -18175 50963 1499 -4869 9402 14343 -21328 4279 10512 26984
10203B6984k5775J3568q822j2058N5888j01760J30984n6958N1313l1406m4982
$$ 26984 1209 14777 5955 -6103 49785 -51975 79009 22051 73364 41958 -3024
10192c024K8373o6215P5236l0444M5641M953l3922j6221R8012j48495N134M6705
$$ -3024 25349 -40866 34370 3926 49567 54520 20598 4377 102389 -46106 -40972 5733
10180E733L06P6777j5601l064m777p5568P7524N0000n9013J214o7029Q0274O7857
$$ 5733 6039 82816 67215 64151 59374 -16194 61330 111330 52317 53531 -13498 66776 134633
10167A34633n8221j16325O3469O5881J0052l1192m1136N3054P4168o5769o1848
$$ 134633 76412 -39913 23556 89437 99489 68297 27161 80215 154383 88614 26766
10156B6766Q8237k0666k478j7409L2744o9084P4375j8274N9802m8985l3230L2882
$$ 26766 115003 94337 91859 74450 107194 38110 112485 94211 154013 105028 71798 104680
10144A04680p046l8232l2834J10290o7103k5774k0798Q3195j1709L3521j6276
$$ 104680 97634 59402 26568 136858 69755 43981 23183 106378 94669 128190 111914
10133A11914j03685K603Q5068K0711j77L7105j6044M7415J7013j62265J37650
$$ 111914 8229 10832 95900 116611 116434 153539 137495 184910 201923 39658 177308
10122A77308l5851j03780J19331k8900j732K7335l141L3548o4967K8671q317j09442
$$ 177308 141457 37677 157008 128108 126376 153711 150570 184118 119151 147822 139505 30063
10110C0063J68094N6440m0206O5255l9817L0815K0348N1031k817p4383J27810
$$ 30063 198157 254597 214391 279646 239829 270644 290992 342023 339206 264823 392633
10099C92633k8477J03034m6225M1766K00233j7830P7276J05132J90106R4012J59274
$$ 392633 364156 467190 420965 462731 662964 645134 722410 827542 1017648 1111660 1270934
10088A270934J58446J91630l2927k1452n5259j50903l8k55155o1338j76962j64416
$$ 1270934 1429380 1621010 1588083 1566631 1511372 1360469 1360431 1105276 1043938 866976 702560
10077G02560J6089j36750j25429k7746O087p7135J770J8100j33107Q3746q7626
$$ 702560 718649 581899 456470 428724 434811 357676 359446 377546 244439 328185 240559
10066B40559n7929k9929r040J07090p1925k9857K6412j586J466L1763j8782k2526
$$ 240559 182630 152701 143661 250751 178826 148969 175381 173795 175261 207024 188242 165716
10054A65716q3709J46765m3528J1810r3880K0264L2091j4426L5633o1016K0681
$$ 165716 82007 228772 185244 197054 103174 123438 155529 141103 176736 115720 136401
10043A36401j05509R7728l8155R9210j19357M0181k5272l3716R5880m5165P0986
$$ 136401 30892 128620 90465 189675 70318 110499 85227 51511 147391 102226 173212
10032A73212n6160m1126n2400R0760p9321J66188n2810j27597J64568p0961p4567
$$ 173212 117052 75926 23526 114286 34965 201153 148343 20746 185314 114353 39786
10021C9786J01597m9726N7036j5125O6601L5556k7247P542j3324k7511J3056P9357
$$ 39786 141383 91657 148693 133568 200169 235725 208478 216020 202696 175185 188241 267598
10009B67598l6758j10196N8863P0442q3832l865p7670j779N8324K461m1746K0249
$$ 267598 230840 120644 179507 249949 166117 162252 84582 82803 141127 143588 101842 122091
9997A22091l2385J23382j10713r1368J35808n6877L4637j50729O4503K6965J31626
$$ 122091 89706 213088 102375 11007 146815 89938 124575 -26154 38349 65314 196940
9986A96940p7085J8902M963n7191O2593O1413J168r3198L9455k2534p9492L9243
$$ 196940 119855 138757 143720 86529 149122 210535 211703 118505 157960 135426 55934 95177
9974I5177O0714j07635k2509P0245M391o0877Q4169M1579q8996K1853m2224n9998
$$ 95177 155891 48256 25747 95992 100383 39506 123675 165254 76258 98111 55887 -4111
9962d111P9951m2348K3069L5686J7082l532k9186j2267K3971j9559p3059Q1848
$$ -4111 75840 33492 56561 92247 109329 105797 76611 64344 88315 68756 -4303 77545
9950G7545M4284l9730q4254J00037q8585j082R968R2778j09979K0755J4087K6346
$$ 77545 121829 82099 -2155 97882 9297 8215 18183 110961 982 21737 35824 62170
9938F2170m9613N3327k6811K7927n0662L0372k6257l6592L283P7077j09669J18475
$$ 62170 12557 65884 39073 67000 16338 46710 20453 -16139 -12856 64221 -45448 73027
9926G3027k3275O894Q9766j04922j8181L0764l1418M786L4505j16557J98368n8675
$$ 73027 49752 56646 146412 41490 23309 54073 22655 27441 61946 -54611 143757 85082
9914H5082j7297j52330R5846J03125l9435k1261l0058P4682n5614j8072L0277
$$ 85082 67785 -84545 11301 114426 74991 53730 23672 98354 42740 24668 54945
9903E4945l6095m9536P648K35998j67740K7274p1908J3779Q7170m9516j6878k1099
$$ 54945 18850 -30686 -23038 212960 45220 72494 586 14365 101535 52019 35141 14042
9891A4042k12K5744j13441P6427j2471N0039q6478M5304Q1789m6767o2276Q4083
$$ 14042 13830 39574 -73867 2560 -9911 40128 -46350 -1046 80743 33976 -28300 55783
9879E5783q7517K9788O3299n9262Q0906j03923O0073l8506N9264l5700n8082k5712
$$ 55783 -31734 -1946 61353 2091 82997 -20926 39147 641 59905 24205 -33877 -59589
9867e9589N5195O5483J7331n2455L7874j00117J01744l9589q086M0079M3692k6762
$$ -59589 -4394 61089 78420 25965 63839 -36278 65466 25877 17791 57870 101562 74800
9855G4800o4229k9518l9066P4560L94J16444k12549J05368N3872r5001P4422L7008
$$ 74800 10571 -18947 -58013 16547 16941 133385 -79164 26204 80076 -14925 59497 96505
9843I6505k4658k1279j9682L759M4219j0053Q751j9710M3233n2748K2073j6954
$$ 96505 71847 50568 30886 34645 78864 68811 77562 57852 101085 48337 70410 53456
9831E3456K3733n2981m421K2615j0554J00032k43880J56262m1802j0945R0897
$$ 53456 77189 24208 19787 42402 31848 131880 -112000 44262 2460 -8485 82412
9820H2412j43641N1175N1865p0992j7640O7504N502O4732j02573R7575k482j12611
$$ 82412 -61229 -10054 41811 -29181 -46821 20683 26185 90917 -11656 85919 83437 -29174
9808b9174J05063L604p6082J17712j18997J9949P7007p9727K3966J30977j67389
$$ -29174 75889 79493 3411 121123 2126 22075 99082 19355 43321 174298 6909
9797F909q892Q1742n3712L8727M4215l7200j51941N5888L8619j8774m2787J15252
$$ 6909 -1983 79759 26047 64774 108989 71789 -80152 -24264 14355 -4419 -47206 68046
9785F8046m6762J20120o8215o6131M9043n249m3522o4301O3444Q6344l4744j9840
$$ 68046 21284 141404 73189 7058 56101 50852 7330 -56971 6473 92817 58073 38233
9773C8233l753Q9394j37479R1092j135m2087M5465o4407N8849l9138L8698K0405
$$ 38233 34480 123874 -13605 77487 76352 34265 79730 15323 74172 35034 73732 94137
9761I4137k6053m1569K6165P5939j43528P5677K2031p6206P3979k5883R6305j26988
$$ 94137 68084 26515 52680 128619 -14909 60768 82799 6593 80572 54689 150994 24006
9749B4006n6035R3672R19q3935J14506M5902q3489J22022j32647Q5214o3964r8613
$$ 24006 -32029 61643 62562 -21373 93133 139035 55546 177568 44921 130135 66171 -32442
9737c2442J00345O0331q1801j01586J01278Q1432m8161J379O068K347j5409p5923
$$ -32442 67903 128234 46433 -55153 46125 127557 79396 80775 86843 89190 73781 -2142
9725b142Q1529j0084L5928m9373n711k365M5536l9494k9125K3424N362J3812L6695
$$ -2142 79387 69303 105231 55858 50147 47782 93318 53824 24699 48123 53485 67297 103992
9712A03992j4022r777m816P3487r4712r1057J10219L8688o7303J14785j04333
$$ 103992 89970 80193 75377 148864 54152 -36905 73314 112002 44699 159484 55151
9701E5151N8407p209n0712M6079q897o343K6961o5701P6335K8998j253j65339
$$ 55151 113558 106349 55637 101716 92819 86476 113437 47736 124071 153069 151816 -13523
9689a3523R6354L4224l8919K5L9968l2312Q0652j8240M2318J5001k8113n4214
$$ -13523 82831 117055 78136 78161 118129 85817 166469 148229 190547 205548 177435 123221
9677A23221O3308K1538m7697Q504Q346o1003l7322J7539J4751q2332R7904l1588
$$ 123221 186529 208067 160370 168874 177220 116217 78895 96434 111185 28853 126757 95169
9665I5169l9499k4286j5924L3319j2300J09671r7170L3778J6631J0268k9283K5460
$$ 95169 55670 31384 15460 48779 36479 146150 48980 82758 99389 109657 80374 105834
9653A05834n781J28825j07657Q9837r5447O4161L4627p4396J9337J13975o7543
$$ 105834 100053 228878 121221 211058 115611 179772 214399 140003 159340 273315 205772
9642B05772k8310L9308J1356L9772q5652M9761L0542j01404k2179J29414p4069
$$ 205772 177462 216770 228126 267898 182246 232007 262549 161145 138966 268380 194311
9631A94311K8526j19880O3723p7159K9312N3087k9898Q1269j10258p668l3002
$$ 194311 222837 102957 166680 89521 118833 171920 142022 223291 113033 105365 72363
9620G2363R7747k2970j1572j6412j7536Q653n9J6114J4592j6955M4777p276M6348
$$ 72363 170110 147140 135568 119156 101620 110273 110214 126328 140920 123965 168742 161466 207814
9607B07814p1868O0704K0602j4732J3774o595p5720J35847m5587n1236M6195j74520
$$ 207814 135946 196650 217252 202520 216294 209699 133979 269826 224239 173003 219198 44678
9595D4678J45040m7454Q944K373K5372K0876r0091k5520M6422p1446M0656M3476
$$ 44678 189718 142264 151208 153581 178953 199829 109738 84218 130640 59194 99850 143326
9583A43326r9622J06664l1206N4639j09216J15887j15401k9845M211Q4160o2254
$$ 143326 43704 150368 119162 173801 64585 180472 65071 35226 39437 123597 61343
9572F1343m3293R3024j0700j10313J89233j91875R4102n5070J9451J26500q9998
$$ 61343 18050 111074 100374 -9939 179294 -12581 81521 26451 45902 172402 82404
9561H2404r545n6885L3231R2911p3559q0301q345J88047M6868j10895k7567L1669
$$ 82404 72859 15974 49205 142116 68557 -11744 -20089 167958 214826 103931 76364 108033
9549A08033j6437m207l7026N2033j21215L1092j3574K1254J6874N6245n9420J17757
$$ 108033 91596 87389 50363 102396 -18819 12273 -1301 19953 36827 93072 33652 151409
9537A51409j4743R626k8954k4168o5901j3088j2965L7094m6903n4838L3030M1380
$$ 151409 136666 146292 117338 93170 27269 14181 1216 38310 -8593 -63431 -30401 10979
9525A0979K0941l2090J10170j41586M1086j5387o059P0218o4867N854J6164k7490
$$ 10979 31920 -170 110000 -31586 9500 -5887 -11946 58272 -6595 -741 15423 -12067
9513a2067L6523Q821o2842K6404j8635J27519j80382J18208P7368j62937M8579
$$ -12067 24456 33277 -29565 -3161 -21796 105723 -74659 43549 120917 -42020 6559
9502F559J13039j26875R6977j21111r799l984O1856L2107O5765o054l4898l6257
$$ 6559 119598 -7277 89700 -31411 -41210 -45194 16662 48769 114534 108480 73582 37325
9490C7325K5031L3593M6142j33220Q4640M859K5934o1410l4152j5045M5326M2802
$$ 37325 62356 95949 142091 8871 93511 98370 124304 62894 28742 13697 59023 101825
9478A01825o7126K6371N6789n1418j06443N9432M3108J9907l826K4857K7834j46717
$$ 101825 34699 61070 117859 66441 -40002 19430 62538 82445 78619 103476 131310 -15407
9466a5407M3119m8801O5585J2531L243j11798N6095J02873j13490R6584j03285
$$ -15407 27712 -21089 44496 57027 60270 -51528 4567 107440 -6050 90534 -12751
9455a2751L6401n8270o5538M0870R8552l1761j1610R1468j07096J46042k6362
$$ -12751 23650 -34620 -100158 -59288 39264 7503 -4107 87361 -19735 126307 99945
9444I9945j5277q27j5226q524k2468l3299J06P1638m8542P5711k3565p5834Q1453
$$ 99945 84668 83841 68615 60091 37623 4324 4430 76068 27526 103237 79672 3838 85291
9431H5291k249j4437n9076j0177N5287k5704M0853l0432m3393O3939L0831n5905
$$ 85291 83042 68605 9529 -648 54639 28935 69788 39356 -4037 59902 90733 34828
9419C4828J5771Q0852o8189M7626j22893J8155K3083Q334n2797J64559j30757
$$ 34828 50599 131451 63262 110888 -12005 6150 29233 37567 -15230 149329 18572
9408A8572j3846K4467L5417k1039M6299o1565L9986p7653N6545r549N8651q337
$$ 18572 4726 29193 64610 43571 89870 28305 68291 -9362 47183 37634 96285 87948
9396H7948l4101j101P8090j40575P7645o1618j8632J02662j4345k740k8602j5452
$$ 87948 53847 52746 130836 -9739 67906 6288 -12344 90318 75973 73233 44631 29179
9384B9179p0637J15789k5246p1628R8497k6459m5063N2841l3673M8978q8919L3126
$$ 29179 -41458 74331 49085 -22543 75954 49495 4432 57273 23600 72578 -16341 16785
9372A6785n5673P1128q8679J2208M0344M0025L0909J9581j23284Q5663p9946O5966
$$ 16785 -38888 32240 -56439 -44231 -3887 36138 67047 86628 -36656 49007 -30939 35027
9360C5027M5708j6822j3851K4125j233m2711N3167l0077K4694J0487r6710P2476
$$ 35027 80735 63913 50062 74187 72954 30243 83410 53333 78027 88514 -8196 64280
9348F4280j0493j1580J6089O8321r5072j4442L3285P0032m0310l0721n3535L9251
$$ 64280 53787 42207 58296 126617 31545 17103 50388 120420 80110 49389 -4146 35105
9336C5105k0735J09877j04650o1356K0838J06409r9310R5970k6809q3081Q6869
$$ 35105 14370 124247 19597 -41759 -20921 85488 -13822 82148 55339 -27742 59127
9325E9127q0723Q0133m8628J20730j11205M828K7866J08503j07745J17946j41361
$$ 59127 -21596 58537 9909 130639 19434 24262 52128 160631 52886 170832 29471
9314B9471K669n7O3739j584m1632k1597j6665Q799P3081m1549j3186K7899J6505
$$ 29471 32140 32083 95822 94238 52606 31009 14344 23143 96224 54675 41489 69388 85893
9301H5893l1644l6093L6721m7680M9371O1266P266r8903J1647O038L2165p3340
$$ 85893 54249 18156 54877 7197 56568 117834 125100 26197 37844 43882 76047 2707
9289B707J52534j50101J11894j29555j9657J47869m9540j11367J77725p3412j1275
$$ 2707 155241 5140 117034 -12521 -32178 115691 66151 -45216 132509 59097 47822
9278D7822M0388o9786J06118q7015m6048O6040k3439L4186m3683J4422j6529K1415
$$ 47822 88210 18424 124542 37527 -8521 57519 34080 68266 24583 39005 22476 43891
9266D3891N8892j11240j9340J15439m3716N715K6760n5799O173m200M6590K4185
$$ 43891 102783 -8457 -27797 87642 43926 49641 76401 20602 26775 22575 69165 93350
9254I3350q219J8004k8621o7791l419N277M2371K0377k6024M3470p4641N9343
$$ 93350 85131 103135 74514 6723 3304 8581 50952 71329 45305 88775 14134 73477
9242G3477L0517j02846N1580m2663O0190L6928l0043j3866p0571m3995Q7549m0779
$$ 73477 103994 1148 52728 10065 70255 107183 77140 63274 -7297 -51292 36257 -4522
9230d522k6476P6779n7286J1847M1463k873j754k8L7286M239o5844j1254M5775
$$ -4522 -30998 45781 -11505 342 41805 38932 37178 37150 74436 78675 12831 1577 47352
9217D7352P7754l2722m9242l210P5471q2299j7754K9806l9825O6074q4199K13182
$$ 47352 125106 92384 43142 39932 115403 33104 15350 45156 5331 71405 -12794 200388
9205B00388j29963k2015m388K3439j09426J26511k4902O0378j04945L1783M2623
$$ 200388 70425 48410 44022 67461 -41965 84546 59644 120022 15077 46860 89483
9194H9483n0294m7455M1535R97P7959n8894r459K1966o2858P8889m0501k6807
$$ 89483 39189 -8266 33269 34266 112225 53331 43872 65838 2980 81869 41368 14561
9182A4561r1600J84132k4865k0904O7969q9051J26807l8262J2472q0555k0710
$$ 14561 -77039 107093 82228 61324 129293 40242 167049 128787 141259 60704 39994
9171C9994N4999l9055P2387l0328M5721J0651j05339O0326j3905M3714o0607j8740
$$ 39994 94993 55938 128325 97997 143718 154369 49030 109356 95451 139165 78558 59818
9159E9818k7134q9855J68207l0137j8483J30667j6058j40003Q6470j03842N1555
$$ 59818 32684 -57171 111036 80899 62416 193083 177025 37022 123492 19650 71205
9148G1205R7498r4085j4021O0691r1784O2733q1601J10724n3269j8985K3344N9125
$$ 71205 168703 74618 60597 121288 29504 92237 10636 121360 68091 49106 72450 131575
9136A31575m2436q2828R7571r0146N4379N8372n559q3734J34882o9756j02906
$$ 131575 89139 6311 103882 13736 68115 126487 120928 37194 172076 102320 -586
9125e86J90470q2545l1229J8388Q94K3272p831j6955P773P0631j18815P2142l7517
$$ -586 189884 107339 76110 94498 95392 118664 110833 93878 101651 172282 53467 125609 88092
9112H8092L4016J23713o8622l5933M6727j51267J20626r3711N1606n0933R1407
$$ 88092 122108 245821 177199 141266 187993 36726 157352 63641 115247 64314 155721
9101A55721m9638j5103k4743J04798o7725k7297N6272O7803j05113M5248j7684
$$ 155721 106083 90980 66237 171035 103310 76013 132285 200088 94975 140223 122539
9090A22539R5651q1055O3785j30168L9344O6812m5158K0661K6754P0309k2648
$$ 122539 218190 137135 200920 70752 110096 176908 131750 152411 179165 249474 226826
9079B26826o6796O8346j6562j0419P0837K8117j03984j1659J21471m4781k5588
$$ 226826 160030 228376 211814 201395 272232 300349 196365 184706 306177 261396 235808
9068B35808q351L839J9634O3238J9565q3658L0727J56449o4548k2031m7150k8473
$$ 235808 227457 231296 250930 314168 333733 250075 280802 437251 372703 350672 303522 275049
9056B75049J27542j14284J2695n646n8710N5663P7444m3802K0156J9380N1251
$$ 275049 402591 288307 301002 295356 236646 292309 369753 325951 346107 365487 416738
9045D16738m6900N817M0229K491k8892m9040l3919R0963j14582n7052J22041J2800
$$ 416738 369838 375655 415884 418375 389483 340443 306524 397487 282905 225853 347894 360694
9033C60694o3114K3857J2603j39676J07906L3404Q695n9920J5715j4945j2899
$$ 360694 297580 321437 334040 194364 302270 335674 344369 284449 300164 285219 272320
9022B72320j112K3334P6914M4212k5980Q9511o2033J7245M0544j76681O9193p1570
$$ 272320 271208 294542 371456 415668 389688 479199 417166 434411 474955 298274 367467 295897
9010B95897M6358J16699p6909N8940R8607n0765O7183R5503p6002P051j5508n2588
$$ 295897 342255 458954 382045 440985 539592 488827 556010 651513 575511 582562 567054 514466
8998E14466J4862M8160o1595l6678P1743j32639Q4432p50J13652k01215K8479
$$ 514466 529328 577488 515893 479215 550958 418319 502751 502001 615653 414438 442917
8987D42917L0541m4560M5042j17607j1644l7034k0793J8975N1340j56119O451
$$ 442917 473458 428898 473940 356333 344689 307655 286862 305837 357177 201058 207509
8976B07509Q5649r9162J26120k7044q8225P0220j44748P762M3192O3984K5535
$$ 207509 293158 193996 320116 293072 204847 275067 130319 138081 181273 245257 270792
8965B70792l473j17318P1352m6651L1060J2403k1459j1552J91075j61825j0573
$$ 270792 267319 150001 221353 174702 205762 218165 196706 185154 376229 214404 203831
8954B03831P0149j61645O3626o0919R6906M5828j56280M9476l4745p6414J18870
$$ 203831 273980 112335 175961 115042 211948 257776 101496 150972 116227 39813 158683
8943A58683k8026L6403K7051l8016l1871P3779J7156l4104P7120o090j55645R9603
$$ 158683 130657 167060 194111 156095 124224 198003 215159 181055 258175 252085 96440 196043
8931A96043l6265K2434L5740n5148J3149n8467K0753m4104M1568K2354l2412J8879
$$ 196043 159778 182212 217952 162804 175953 117486 138239 94135 135703 158057 125645 144524
8919A44524q2806M15J31528j62199N7739J3279n188k4393J04838k782p3457L3794
$$ 144524 61718 62133 193661 31462 89201 102480 97292 72899 177737 174955 101498 135292
8907A35292J603k1409n4777O5653J4038j9632r547J494n5098J24767o3191K1180
$$ 135292 136895 115486 60709 126362 140400 120768 111221 112715 57617 182384 119193 140373
8895A40373j2126j2139m3660r882J0784O2665j6383L5467j01867N0652j0655n2483
$$ 140373 128247 116108 72448 62566 73350 136015 119632 155099 53232 103884 93229 40746
8883D0746J8886Q3047L9191r4500o735M3680k049N2513r0045l8230R7990m5220
$$ 40746 59632 142679 181870 87370 80635 124315 122266 174779 84734 46504 144494 99274
8871I9274K0401q063j3741M0084m8724M056o3000Q6493l6111J3307k5298R931
$$ 99274 119675 111612 97871 137955 89231 93287 30287 116780 80669 93976 68678 78609
8859G8609J05418j16629J6890N4331r590L0112n3716J97447j69618J6914k1377
$$ 78609 184027 67398 84288 138619 129029 159141 105425 302872 133254 150168 128791
8848A28791k1978o1166O1118m7828N4381k61344K20965j29211J25478N2499K1087
$$ 128791 106813 45647 106765 58937 113318 -148026 72939 -56272 69206 121705 142792
8837A42792j29953P2911J6387j1269P1288R578j25495J05863r9876k396n3583
$$ 142792 12839 85750 102137 90868 162156 171734 46239 152102 52226 49830 -3753
8826c753K5553k2029P5058K0925m990P7743K7865J2753j54899R0357j4797p6320
$$ -3753 21800 -229 74829 95754 90764 168507 196372 209125 54226 144583 129786 53466
8814E3466R1531k4874J2n2115K1274j26166Q2173J19350j15255J669J3938N0785
$$ 53466 144997 120123 120135 68020 89294 -36872 45301 164651 49396 51065 65003 115788
8802A15788j1950R2922j28838J1008J3082o230p4057K690p133L0101J6429j714
$$ 115788 103838 196760 67922 78930 92012 85782 11725 14415 7282 37383 53812 52098
8790E2098n532k9417j4982J20453M4343o4482j9280n7970K595R2822l9893n884
$$ 52098 46566 17149 2167 122620 166963 102481 83201 25231 27826 120648 80755 74871
8778G4871k5567j8413J6216p0497J16455k4325R6775k1406q0981M3598m7879j206
$$ 74871 49304 30891 47107 -23390 93065 68740 165515 144109 63128 106726 58847 57641
8766E7641L7819j2115m284n552K3282l2079j572L3112q1143P3027L9123p1716
$$ 57641 95460 83345 79061 73509 96791 64712 63140 96252 15109 88136 127259 55543
8754E5543M3585j627l4145N1129M1857r1263l0208M2625o5837J19427K6649n4448
$$ 55543 99128 97501 63356 114485 156342 65079 34871 77496 11659 131086 157735 103287
8742A03287L017m7720M1165K859L204n8037J18427j14708R047o812l4653N3414
$$ 103287 106304 58584 99749 102608 105812 47775 166202 51494 60541 53729 19076 72490
8730G2490P8447j10294O9828q811k1032n7705J8649K3853L1247L2754o345J0952
$$ 72490 150937 40643 110471 101660 80628 22923 41572 65425 96672 129426 123081 134033
8718A34033j5790l9179R664l6285M5284m9895K9214l3973M7262q9558j6942Q9274
$$ 134033 118243 79064 88728 52443 97727 47832 77046 43073 90335 777 -16165 73109
8706G3109N5476j29377R0580m9591O6186p1946J4374q0905J44837o7550K6295
$$ 73109 128585 -792 89788 40197 106383 34437 48811 -32094 112743 45193 71488
8695G1488R2518n7886J8347k2642L6030n6516L3610k5155m4048O1233o0697K2420
$$ 71488 164006 106120 124467 101825 137855 81339 114949 89794 45746 106979 46282 68702
8683F8702Q4318n9003l5731J83736j42669k5226Q4527r2127M7159l8635Q2581
$$ 68702 153020 94017 58286 242022 99353 74127 158654 66527 113686 75051 157632
8672A57632p9507M4607K0246l3603M4608p4520k1712M365M0416o0659J29410n3883
$$ 157632 78125 122732 142978 109375 153983 79463 57751 62116 102532 41873 171283 117400
8660A17400n3512L1660J63010j16986j0728M1908N7156k6675j45639k4009k2355
$$ 117400 63888 95548 258558 141572 130844 172752 229908 203233 57594 33585 11230
8649A1230J29261o8120R0484l5661O9254p2530j8828J1963J03505j01132n298
$$ 11230 140491 72371 162855 127194 196448 123918 105090 117053 220558 119426 114128
8638A14128j272o2913M7039o2953N7886P8790j83805N0420K2122M7361L2148m2080
$$ 114128 112856 49943 96982 34029 91915 170705 -13100 37320 59442 106803 138951 96871
8626I6871N696o8262L1357p2039P1249K0839j06479J33982p442R0538q9034j3002
$$ 96871 102567 34305 65662 -6377 64872 85711 -20768 113214 105772 196310 107276 94274
8614I4274R0223J2415q8168j8470J5272N5998j8900K726p4103M8632l182p6139
$$ 94274 184497 196912 108744 90274 105546 161544 142644 145370 71267 119899 116717 40578
8602D0578L597P2134l4907r4201P7776L8907j745r1305J00447L6817p0883P9484
$$ 40578 44175 116309 81402 -12799 64977 103884 102139 10834 111281 148098 77215 156699
8590A56699j18460N8350N5481L5761m7444m8858K2686n9453j729K0657n0824J6495
$$ 156699 38239 96589 152070 187831 140387 91529 114215 54762 53033 73690 22866 39361
8578C9361K7150L2636K3540Q7839k11360J49061o0814K4215m1838J04844o0056
$$ 39361 66511 99147 122687 210526 -834 148227 87413 111628 69790 174634 114578
8567A14578O9714l999Q113j84149J00360l2196K2826r2059l389J63278k02513
$$ 114578 184292 180293 188406 4257 104617 72421 95247 3188 -201 163077 -39436
8556c9436J80234q6897l8949K07940j22467k118K0612O6369j30126L6146l313
$$ -39436 140798 53901 14952 222892 100425 98307 118919 185288 55162 91308 87995
8545H7995P7689j53225J28957q4087N6788j843N8787j9204j01446P7800p3304
$$ 87995 165684 12459 141416 57329 114117 112274 171061 151857 50411 128211 54907
8534E4907N9120N8313q1071J60382Q8177l51718O8430l0125J9543K5783P5850
$$ 54907 114027 172340 91269 251651 339828 -11890 56540 26415 45958 71741 147591
8523A47591m4342J139J2922o9135J29181o4119l444j7272M7482j3686R0544r9631
$$ 147591 103249 104388 117310 48175 177356 113237 109793 92521 140003 126317 216861 117230
8511A17230l9604q8329J34283k2118M3653o5465p579L7579j15289O7037Q252l3964
$$ 117230 77626 -10703 123580 101462 145115 79650 72071 109650 -5639 61398 69650 35686
8499C5686K6427K9720M1614l7546q5097N7488k8943p6834K01647n4453P7982m6006
$$ 35686 62113 91833 133447 95901 10804 68292 39349 -37485 164162 109709 187691 141685
8487A41685q7385m9725L0663M5064o8290l4877J42407j05736O6925P648o5004
$$ 141685 54300 4575 35238 80302 12012 -22865 119542 13806 80731 88379 23375
8476B3375j69L0737m8776Q9069J59699r6903m1644M4028p8161l1978P6974j12676
$$ 23375 23206 53943 5167 94236 253935 157032 115388 159416 81255 49277 126251 13575
8464A3575J54319j06509k3582m5822J12932m2865M6662l0081j4426q349N3687
$$ 13575 167894 61385 37803 -8019 104913 62048 108710 78629 64203 55854 109541
8453A09541r678O035p2017N4922P5447r7726k2829J16706k9898K3433o2190O4230
$$ 109541 99863 105898 33881 88803 164250 66524 43695 160401 130503 153936 91746 155976
8441A55976j22039R3466m8122M5061J1036k7580q827q7200J08068j0759q289l6770
$$ 155976 33937 127403 79281 124342 135378 107798 98971 11771 119839 109080 100791 64021
8429F4021R881n36J28492m8132J1535m7179O4643j03455r9250J02381k9470L019
$$ 64021 73902 73366 201858 153726 165261 118082 182725 79270 -19980 82401 52931 55950
8417E5950N3655K194o2028J93320j67874q3483J24479o9812K6989M6418m8364
$$ 55950 109605 111799 49771 243091 75217 -8266 116213 46401 73390 119808 71444
8406G1444J23366j787j95056P7295K4644J3976o2188J37009q4814K8103l4314
$$ 71444 194810 193023 -2033 75262 99906 113882 51694 188703 103889 131992 97678
8395I7678O0382m1057p0291J06796n1606J22177k10393M4388m5352N373L7117
$$ 97678 158060 117003 46712 153508 101902 224079 13686 58074 12722 18095 55212
8384E5212R831l632R001N0614o1702j30678J54991O9118q3255N744P6000M3530
$$ 55212 65043 61411 70412 121026 59324 -71354 83637 152755 69500 75244 151244 194774
8372A94774n5796L0351p5610l7597j898M839P4166n7269k4187J9658J164K4142
$$ 194774 138978 169329 93719 56122 54224 59063 133229 75960 51773 71431 72595 96737
8360I6737k8587K817p3231J01984K6632o704k0197J6000j4546l11j8783l8393
$$ 96737 68150 70967 -2264 99720 126352 119648 99451 115451 100905 100594 81811 43418
8348D3418M6505m2652M2191l9430j56676K58053j19309k5081P0472N3968J5160
$$ 43418 89923 47271 89462 50032 -106644 151409 32100 7019 77491 131459 146619
8337A46619N3771p3108k9811M979o7224J30394j41546J9234M6726K6624L3145
$$ 146619 200390 127282 97471 102450 35226 165620 24074 43308 90034 116658 149803
8326A49803p1296L5444r3846L793J03183n4879j0861J27238j22463P4909j28746
$$ 149803 78507 113951 20105 23898 127081 72202 61341 188579 66116 141025 12279
8315A2279l2797K53834j55071k7678O4J4879R4608j18283K5851J87M6490Q1214
$$ 12279 -20518 233316 78245 50567 50631 65510 160118 41835 67686 67873 114363 195577
8303A95577r7100O801J2562l3015L7122Q2867j91653J41584o1940O3423k9969
$$ 195577 98477 105278 117840 84825 121947 204814 13161 154745 92805 156228 126259
8292A26259j1915M6114j19366J6771J08294j69585J45089q9899O1939k1092m3135
$$ 126259 114344 160458 41092 57863 166157 -3428 141661 51762 113701 92609 49474
8281D9474J41072j00914K3891j3499j04902J35957K3519j2779J9244K0254p4581
$$ 49474 190546 89632 113523 100024 -4878 131079 154598 141819 161063 181317 106736
8270A06736m1536O0095j9211q8732L4253O7913j0345j03834R5948j0602j01084
$$ 106736 65200 125295 106084 17352 51605 119518 109173 5339 101287 90685 -10399
8259a0399J52565q3229J0025M0515j18243J08395L6629L1726j29867n3726O8155
$$ -10399 142166 58937 68962 109477 -8766 99629 136258 167984 38117 -15609 52546
8248E2546R6642n3000j6560J6260N7432p6882M0407j8713j7148m2034L4888J00346
$$ 52546 149188 96188 79628 95888 153320 76438 116845 98132 80984 38950 73838 174184
8236A74184j00429M3596J11410j38449j8888N3547P7642j33784P1568q1960L8121
$$ 174184 73755 117351 228761 90312 71424 124971 202613 68829 140397 58437 96558
8225I6558j3853J1093j5685J10012k3194j8971J12971n6286j08012J4447K9284
$$ 96558 82705 93798 78113 188125 164931 145960 258931 202645 94633 109080 138364
8214A38364k4224J2753r6261P8955L4771L6699j38804Q5522J27306j77659l5787
$$ 138364 114140 126893 30632 109587 144358 181057 42253 127775 255081 77422 41635
8203D1635O7051O7293m8261M1644j7926p8542Q1311R3393m880j69651J50511Q24185
$$ 41635 108686 175979 127718 169362 151436 72894 154205 247598 242718 73067 223578 1047763
8191A047763q85128k99172K12208N8065K0530q4353k0586k2468m412R9964o4842
$$ 1047763 162635 -136537 75671 133736 154266 69913 49327 26859 22447 122411 57569
8180E7569Q4283J06206j60017J3284N3586j32041J00852m6407K7353r1404J15523
$$ 57569 141852 248058 88041 101325 154911 22870 123722 77315 104668 13264 128787
8169A28787M3842r0429J82834j78144J9834P6993o5618N445m0724M7481p2638
$$ 128787 172629 82200 265034 86890 106724 183717 118099 123544 82820 130301 57663
8158E7663L2531M0258K7243l1587P3608j48238M8624p0460M3992P3421j6791J1542
$$ 57663 90194 130452 157695 126108 199716 51478 100102 29642 73634 147055 130264 141806
8146A41806j8551n0681L0397M1294j43453J4077M5960N0170K5637k1325J11211
$$ 141806 123255 72574 102971 144265 812 14889 60849 111019 136656 115331 226542
8135B26542j70719O2635P7270j46076M7070N6125Q723m5209L7967p0799P0088
$$ 226542 55823 118458 195728 49652 96722 152847 161570 116361 154328 83529 153617
8124A53617Q95m7407N4136L589q7480J72547q0191o8933K7565r716M3376m2396
$$ 153617 154512 107105 161241 164830 77350 249897 169706 100773 128338 118622 161998 119602
8112A19602n8506K6172k601o7536L6442M5504k2699K8125l9240L5971j415L9519
$$ 119602 61096 87268 84667 17131 53573 99077 76378 104503 65263 101234 99819 139338
8100A39338j4704O0447o0669R0633j49038L0783J06183q4332M6508K2386q0452
$$ 139338 124634 185081 124412 215045 66007 96790 202973 118641 165149 187535 107083
8089A07083N613K476j7278R4057j66989R0344j00332J22550K684k8412O6345j3107
$$ 107083 112696 115172 97894 191951 24962 115306 14974 137524 140208 111796 178141 165034
8077A65034p4724l6006K2616p254N2632k3623J6935Q248n4362l9329Q186L3657
$$ 165034 90310 54304 76920 69666 122298 98675 115610 123858 69496 30167 38353 72010
8065G2010R7715M5731j36555m0431Q2821p654O2603j06643K3041L178P4894K8132
$$ 72010 169725 215456 78901 38470 121291 113637 176240 69597 92638 95816 170710 198842
8053A98842o6060p183n5968M9838J48678j08882L622p0842l8437R7092q7073N8372
$$ 198842 132782 125599 69631 119469 268147 159265 162887 92045 53608 150700 63627 121999
8041A21999J6858R467M5390j22966J6482J14156j57012K5767M3242N6508M3504
$$ 121999 138857 148324 193714 70748 87230 201386 44374 70141 113383 169891 213395
8030B13395o8573K6437r6382R2548p2821M0812n9091R9370k7337j2571o9962K761
$$ 213395 144822 171259 74877 167425 94604 135416 76325 175695 148358 135787 65825 68586
8018F8586J22371p2644m3364L1675J20200j29759l7717o986P6510l3775Q4982
$$ 68586 190957 118313 74949 106624 226824 97065 59348 52362 128872 95097 180079
8007A80079l3162r413L8709l7772J5101M0p792K4600o1255m2757K8326R5735l2384
$$ 180079 146917 137504 176213 138441 153542 153582 145790 170390 109135 66378 94704 190439 158055
7994A58055O293N3313j40918K11327r3583l3491n2124m6400R4052m0982K4945
$$ 158055 164348 217661 76743 288070 194487 160996 108872 62472 156524 115542 140487
7983A40487Q87p0714J28286k6870J07482j11884j10754Q9265K5542l1632O6486
$$ 140487 141374 70660 198946 172076 279558 167674 56920 146185 171727 140095 206581
7972B06581o3793k4301N3412m7031K6600L0961m013J3150k9730l9940l8520M7722
$$ 206581 142788 118487 171899 124868 151468 182429 178416 191566 161836 121896 83376 131098
7960A31098l766j8282k7699L2671l517Q7297j2711n7549m9116K8993O1062J0330
$$ 131098 127332 109050 81351 114022 110505 197802 185091 127542 78426 107419 168481 178811
7948A78811j02684N2465m6579J10596P6919k20443O0983N1351J0497k6375K9344
$$ 178811 76127 128592 82013 192609 269528 49085 110068 161419 171916 145541 174885
7937A74885M740n5641Q4255n5857r913j1K0322K6760j27256P2235p9412R4592
$$ 174885 179625 123984 208239 152382 142469 142458 162780 189540 62284 134519 55107 149699
7925A49699l8637K389K0376M7057n3813m2673Q8338O2993j08318L1187o8674J84106
$$ 149699 111062 113451 133827 180884 127071 84398 172736 235729 127411 158598 89924 274030
7913B74030j27028l9374O9496l5628J39484m8928l8984j3550p1112O9098M7188
$$ 274030 147002 107628 177124 141496 280980 232052 193068 179518 108406 177504 224692
7902B24692q6508J37186j23370k762R3112q5993N2984m7751m1675L6151k3705
$$ 224692 138184 275370 152000 149238 242350 156357 209341 161590 119915 156066 132361
7891A32361N1906N6537j41455l5388L3563J00336N7986j07258O269l5295l2686
$$ 132361 184267 240804 99349 63961 97524 197860 255846 148588 154857 119562 86876
7880H6876J69416p5886n7597O3329J1813r3921J03794N119m1079J17938j11040
$$ 86876 256292 180406 122809 186138 197951 104030 207824 212943 171864 289802 178762
7869A78762J9416L0201o4357N1131j8104o8321m5326K4225Q710K3965m7818p575
$$ 178762 198178 228379 164022 215153 197049 128728 83402 107627 116337 140302 92484 84909
7857H4909M3034j55646l5084j37512J85592K35656R0419r9340L348o2303K5605
$$ 84909 127943 -27703 -62787 -200299 -14707 220949 311368 212028 215376 153073 178678
7846A78678L1001M5751j18108J49180j21106Q4959L936L515m0129j7414q4429
$$ 178678 209679 255430 137322 286502 165396 250355 254291 257806 217677 200263 115834
7835A15834O6049N706j3350R6062N409j16215P7692p2396M4012j1466J8736J9592
$$ 115834 181883 187589 174239 270301 275710 159495 237187 164791 208803 197337 216073 235665
7823B35665q5217J06620Q5975j57785K7772j9710k8150L2083M9933n7824L4035
$$ 235665 150448 257068 343043 185258 213030 193320 165170 197253 247186 189362 223397
7812B23397Q4793j38120L4896K7624k3556j5371p7655Q6482j7791p1893J12644
$$ 223397 308190 170070 204966 232590 209034 193663 116008 202490 184699 112806 225450
7801B25450N5691m8318n2832J5855q8374J62668j65677Q6272l902N7545o3767
$$ 225450 281141 232823 179991 195846 107472 270140 104463 190735 186833 244378 180611
7790A80611M1545l5753l2067P6005l6328R1766q5143P5069p7436L4467j562q1838
$$ 180611 222156 186403 154336 230341 194013 285779 200636 275705 198269 232736 231174 149336
7778A49336N6726j03841R6358N1569r2160M2247K517o4050m3158J41691R175n7568
$$ 149336 206062 102221 198579 250148 157988 200235 202752 138702 95544 237235 246410 188842
7766A88842m7851M8703N3593L04n4319J8086k2562m7281K9633n4324M7753O1343
$$ 188842 140991 189694 243287 243591 189272 207358 184796 137515 167148 112824 160577 221920
7754B21920r644N7338k2095n4648j1128O6679J2087M6050l6399l0258K5667n0440
$$ 221920 212276 269614 247519 192871 181743 248422 260509 306559 270160 239902 265569 215129
7742B15129Q6211j03847O0200n2794l4244J11167m0190n2444m1084J02066k2401
$$ 215129 301340 197493 257693 204899 170655 281822 241632 189188 148104 250170 227769
7731B27769N8963k1006j8243L2160m1457L3466o1944k7767M4688K9327j04346
$$ 227769 286732 265726 247483 279643 238186 271652 209708 181941 226629 255956 151610
7720A51610R4761n9383N0893n5387Q9010m800q959P0728j21461M0695R234J6620
$$ 151610 246371 186988 237881 182494 271504 266704 257745 328473 207012 247707 256941 273561
7708B73561n2685M3969K3318p6274L0419K081K4147J2091m1982K4375n2194J1383
$$ 273561 220876 264845 288163 211889 242308 244389 268536 280627 238645 263020 210826 222209
7696B22209P321m6354J20219r599l6342Q793l4527n814L4534n2739O810J7851
$$ 222209 229530 183176 303395 293796 257454 266247 231720 225906 260440 207701 214511 232362
7684B32362N7959j31686O0378Q3133K5078j41957Q5161j5973K1952j0969k3596
$$ 232362 290321 158635 219013 302146 327224 185267 270428 254455 276407 265438 241842
7673B41842L7329n4973P4401O4766o345j79551J52766n3468o2549O0909M8611
$$ 241842 279171 224198 298599 363365 357020 177469 330235 276767 214218 275127 323738
7662C23738l9720l0655M5282k3366Q171O7376k2026n6338j3463N1894j7835M7730
$$ 323738 284018 253363 298645 275279 283450 350826 328800 272462 258999 310893 293058 340788
7650C40788m7465Q456P3427j44845R2082k0213j0622N3955n0125K9717p5378J72497
$$ 340788 293323 301779 375206 230361 322443 302230 291608 345563 295438 325155 249777 422274
7638D22274j33596j7725j0277J31426l2462j0034J6704n9704J1141k5416J09653
$$ 422274 288678 270953 260676 392102 359640 349606 366310 306606 317747 292331 401984
7627D01984j403N1527r4938m8956M7341P5986p670j24013R0821m487j03274n0672
$$ 401984 400581 452108 357170 308214 355555 431541 423871 299858 390679 386192 282918 232246
7615B32246J80727o2081j1946M8352l9138J550q455k476K9260O6906l4180J2799
$$ 232246 412973 350892 338946 387298 348160 349710 341255 338779 368039 434945 400765 413564
7603D13564J1189N1593J8556M508R8312j85538J4532k186l1511L8607m4808O9049
$$ 413564 424753 476346 494902 499410 597722 412184 426716 424530 393019 431626 386818 455867
7591D55867K7743n2579K9036J1714j0303Q912l0027n2403J47641L8302j4759l2033
$$ 455867 483610 431031 460067 471781 461478 470390 440363 387960 535601 573903 559144 527111
7579E27111M7980J7548r9705o77K3223l5020k5033K2414J2093L428k7112K7017
$$ 527111 575091 592639 492934 492257 515480 480460 455427 477841 489934 493362 466250 493267
7567D93267Q1356q2562J3056N7717j1667r9926Q5335K1736m8269P4185r1027j0375
$$ 493267 574623 492061 505117 562834 551167 451241 536576 558312 510043 584228 493201 482826
7555D82826J04051q0501M3287p6301J79834j21400K9912j6979R77j7677k4400
$$ 482826 586877 506376 549663 473362 653196 531796 561708 544729 545706 528029 503629
7544E03629l9490P1963K0786L1331k8318K2483K3449m1458m8231J12559q8573
$$ 503629 464139 536102 556888 588219 559901 582384 605833 564375 516144 628703 540130
7533E40130J0181O4388J7052j12560Q7679j6769L2812p401q8710O1257K1404k8414
$$ 540130 550311 614699 631751 519191 606870 590101 622913 615512 526802 588059 609463 581049
7521E81049J8483M4092j26754N3089O3055m8948N1971l7531M4865j7299M9190
$$ 581049 599532 643624 516870 569959 633014 584066 636037 598506 643371 626072 675262
7510F75262q1137N167k992J18855o4209J7066M7151l3751k4156l724L0565l7010
$$ 675262 594125 599292 596300 715155 650946 668012 715163 681412 657256 653532 684097 647087
7498F47087O6138k9090M0920j666n2906Q309Q4834j23591K5143J28219k9875k0673
$$ 647087 713225 684135 725055 723389 670483 678792 763626 640035 665178 793397 763522 742849
7486G42849J09860j55868J54870o0342j8571k4055J35160j11229O3573j3402l7787
$$ 742849 852709 696841 851711 791369 772798 748743 883903 772674 836247 822845 785058
7475G85058L3598Q2112j6758P005j0622R6468p2686Q891o5365N9958J53575j03022
$$ 785058 818656 900768 884010 891015 880393 976861 904175 913066 847701 907659 1061234 958212
7463I58212p9265Q9179m1381J13632q3930j1155Q7912j4647K9985j16594J06722
$$ 958212 878947 968126 926745 1040377 956447 945292 1033204 1018557 1048542 931948 1038670
7452A038670m3026P8778j12587P508N7388k2381K3606j8976l8699J06718K2048
$$ 1038670 995644 1074422 961835 969343 1026731 1004350 1027956 1008980 970281 1076999 1099047
7441A099047o9455O5699L8540o811q3K7822N6371q5872n3027J21036M3466m6905
$$ 1099047 1029592 1095291 1133831 1127020 1126937 1154759 1211130 1125258 1072231 1193267 1236733 1189828
7429A189828j566N6842J1896M3583m2321m4769Q2872j3838R0174R2846K0050j08203
$$ 1189828 1188262 1245104 1257000 1300583 1258262 1213493 1296365 1282527 1372701 1465547 1485597 1377394
7417A377394Q4394j29266J33529K4121p9532O1329K4172l363k1180J67355j70464
$$ 1377394 1461788 1332522 1466051 1490172 1410640 1471969 1496141 1492778 1471598 1638953 1468489
7406A468489J16377l8631J03742l1051o3946P3967P3986p6540J2603J59074q1711
$$ 1468489 1584866 1546235 1649977 1618926 1554980 1628947 1702933 1626393 1638996 1798070 1716359
7395A716359N7066j2922n537J8879J53166j6581o1634M0360N920n9203L4082J70236
$$ 1716359 1773425 1760503 1754966 1773845 1927011 1910430 1848796 1889156 1895076 1835873 1869955 2040191
7383B040191l7686K9097K5248R2819M3823O5624m6390J7882N5699J0386J36004
$$ 2040191 2002505 2031602 2056850 2149669 2193492 2259116 2212726 2230608 2286307 2296693 2432697
7372B432697K802J10908K6601N1645M2453J7642L0526N7717L2721j0091P0240
$$ 2432697 2435499 2546407 2573008 2624653 2667106 2684748 2715274 2772991 2805712 2795621 2865861
7361B865861j4124J02601m5335J49808l9333K3944J42838l4308L8717O3001O7081
$$ 2865861 2851737 2954338 2909003 3058811 3019478 3043422 3186260 3151952 3190669 3253670 3320751
7350C320751o0514N4543J00020Q3870J02316m5548J19827J3623Q219L0247J83924
$$ 3320751 3260237 3314780 3414800 3498670 3600986 3555438 3675265 3688888 3697107 3727354 3911278
7339C911278k1441k3619J71995l1837j664J85991O0356l5936P8132J1900J53338
$$ 3911278 3889837 3866218 4038213 4006376 4004712 4190703 4251059 4215123 4293255 4305155 4458493
7328D458493N7471J06825l7728L02246J9337R7760R1104N8704J44061K650J60616
$$ 4458493 4515964 4622789 4585061 4887307 4906644 5004404 5095508 5154212 5298273 5300923 5461539
7317E461539K01786P2159K23881J5407K69966j3195L00547R6759J26748J28066
$$ 5461539 5663325 5735484 5959365 5974772 6244738 6231543 6532090 6628849 6755597 6883663
7307F883663J13503J79674K18235J17674K11032J27348K45441J78060J76497K07339
$$ 6883663 6997166 7176840 7395075 7512749 7723781 7851129 8096570 8274630 8451127 8658466
7297H658466K37004J99759K29324K35678K52841K90631K84058K35131K39804L01653
$$ 8658466 8895470 9095229 9324553 9560231 9813072 10103703 10387761 10622892 10862696 11164349
7287A1164349M06614M06036K78388L91678J35435N20164L65797L18785M56569
$$ 11164349 11570963 11976999 12255387 12647065 12782500 13302664 13668461 13987246 14443815
7278A4443815M30421N26500N33366N48207O46164N97438O50036P17155Q63966
$$ 14443815 14874236 15400736 15934102 16482309 17128473 17725911 18375947 19093102 19957068
7269A9957068P71727R18212J011007J208798J322573J310450J374768J375286
$$ 19957068 20728795 21647007 22658014 23866812 25189385 26499835 27874603 29249889
7261B9249889J287725J499259J794420J700650K052325K408782K771206L121598
$$ 29249889 30537614 32036873 33831293 35531943 37584268 39993050 42764256 45885854
7253D5885854L663189M102446M737769N385291O502518P390984Q751502J0552963
$$ 45885854 49549043 53651489 58389258 63774549 70277067 77668051 86419553 96972516
7245I6972516J2561894J5212279J8349162K1833127K5576264K9341751L2085911
$$ 96972516 109534410 124746689 143095851 164928978 190505242 219846993 251932904
7238B51932904L2259262K8888992K1688189J1258841n14182j1753910k1003425
$$ 251932904 284192166 313081158 334769347 346028188 345514006 333760096 312756671
7231C12756671k7023667k9999946l0129178k8162482k5087102k1886739j8631383
$$ 312756671 285733004 255733058 225603880 197441398 172354296 150467557 131836174
7224A31836174j5606278j3111915j0878669r131749p735533o591725n677737m966935
$$ 131836174 116229896 103117981 92239312 83107563 75372030 68780305 63102568 58135633
7216E8135633m208241l812769l191231l040280k504571k243526k169576j979010
$$ 58135633 53927392 50114623 46923392 43883112 41378541 39135015 36965439 34986429
7208C4986429j775123j578265j454507j442040j245793j202235j005133j057313
$$ 34986429 33211306 31633041 30178534 28736494 27490701 26288466 25283333 24226020
7200B4226020j019690q96914q24668p87824o41481p55057o72540o49101o04311
$$ 24226020 23206330 22309416 21484748 20696924 20055443 19300386 18627846 17978745 17374434
7191A7374434n57899n99532n20035m85410n07338m29226n51355m10274l55469
$$ 17374434 16816535 16217003 15696968 15211558 14704220 14274994 13723639 13313365 12957896
7182A2957896m30319l76524l45352l20789l60705l20590l05949k48523j88916
$$ 12957896 12527577 12151053 11805701 11484912 11124207 10803617 10497668 10249145 10060229
7173A0060229k67716k87426j70335l05725j50587k98246j97169k02661j01424
$$ 10060229 9792513 9505087 9334752 9029027 8878440 8580194 8383025 8180364 8078940
7164H078940k31346j85711j09017k02900j33218j68436p7179k26875j46146j05695
$$ 8078940 7847594 7661883 7552866 7349966 7216748 7048312 6971133 6744258 6598112 6492417
7154F492417l1207k56836q2913l0794k04362j48011j89290j34677j03226o5068
$$ 6492417 6461210 6204374 6121461 6090667 5886305 5738294 5549004 5414327 5311101 5246033
7144E246033l6168j57299n6936j56699k2547j48745N029j17370r0487k26951l3423
$$ 5246033 5209865 5052566 4995630 4838931 4816384 4667639 4672668 4555298 4464811 4237860 4204437
7133D204437j20154n9718q4524j00052j13165L5924r1250j07454j08329K7962
$$ 4204437 4084283 4024565 3940041 3839989 3726824 3762748 3671498 3564044 3455715 3483677
7123C483677m8021j46758j21330m3478l5206r8499j32521R9414k04081n0291r1127
$$ 3483677 3435656 3288898 3167568 3124090 3088884 2990385 2857864 2957278 2753197 2702906 2611779
7112B611779J14744m5040j91504l9576N8325n6587j48433j8877J5863j59181l1290
$$ 2611779 2726523 2681483 2489979 2450403 2508728 2452141 2303708 2284831 2300694 2141513 2110223
7101B110223K8107O936o1913j69791p555J54342j23134L2097m4992l9896N5268
$$ 2110223 2138330 2145266 2083353 1913562 1906007 2060349 1937215 1969312 1924320 1884424 1939692
7090A939692p564j4473K2292j88947J6352j3144L6613r4632J6287j37738J61145
$$ 1939692 1932128 1917655 1939947 1751000 1767352 1754208 1790821 1696189 1712476 1574738 1735883
7079A735883o5020j48242m345L9812o3521J2611j14254K5621P48n1573k1217P370
$$ 1735883 1670863 1522621 1518276 1558088 1494567 1507178 1392924 1418545 1419293 1367720 1346503 1353873
7067A353873j11960M1059m9834K7175n7503k0344r4007k590J42102o9984N5801
$$ 1353873 1241913 1282972 1233138 1260313 1202810 1182466 1088459 1085869 1227971 1157987 1213788
7056A213788k00400J18177n3242O0226o9403j3240k81Q600j8457j11488J02418
$$ 1213788 1013388 1131565 1078323 1138549 1069146 1055906 1055625 1064225 1045768 934280 1036698
7045A036698r517n0232M6761M915q2401R9767k06368J01571j9407k9585j45606
$$ 1036698 1027181 976949 1023710 1028625 946224 1045991 839623 941194 921787 892202 746596
7034G46596J79971k1420p0209J204N9454j9222q5923Q024m0661m1604J3988n017
$$ 746596 926567 905147 834938 836142 895596 876374 790451 798475 757814 716210 730198 725181
7022G25181O4716l4493N4223j71043N7731Q979k6146O6720o8164k1940p137k899
$$ 725181 789897 755404 809627 638584 696315 705294 679148 745868 677704 655764 648627 645728
7010F45728L3516m5006o344M4823q1490r2167J05552n3663J7081P0582o0541O3840
$$ 645728 679244 634238 627894 672717 591227 499060 604612 550949 568030 638612 578071 641911
6998F41911o8632P0245j08287R2892j1831k6971N4782j5803k1212m8389J4433
$$ 641911 573279 643524 535237 628129 616298 589327 644109 628306 607094 558705 573138
6987E73138J8165p307r8586K2071M4003M0251j81821J29283k5406N0552m3373
$$ 573138 591303 583996 485410 507481 551484 591735 409914 539197 513791 564343 520970
6976E20970p9527J05232n3495M7541n3140j1638K7155N4977l1883Q661K2925n5835
$$ 520970 441443 546675 493180 540721 487581 475943 503098 558075 526192 534853 557778 501943
6964E01943J24159j09986l9037n627N7675m1288N6468q9903K1361N1110k9059
$$ 501943 626102 516116 477079 471452 529127 487839 544307 454404 475765 526875 497816
6953D97816o2849j9519l2382O46P0736q8837l7272j7700L5397o2094M2076R2986
$$ 497816 434967 415448 383066 383712 454448 365611 328339 310639 346036 283942 326018 419004
6941D19004n1933M1782k249r5816J31287k2568k96J6671n017M4844n4010k5682
$$ 419004 367071 408853 406604 310788 442075 419507 419211 435882 430865 475709 421699 396017
6929C96017k1178j8943q1311P086K6948K4817K8375j01144K0437j9882j00614
$$ 396017 374839 355896 274585 281671 308619 333436 361811 260667 281104 261222 160608
6918A60608R3206k3493l865J6040Q0475o1562N4248r8275L9770J2014L371n0230
$$ 160608 253814 230321 226456 242496 322971 261409 315657 217382 257152 269166 272537 222307
6906B22307J0747O1920q4745l4708O2486p8995J46517j70222N1095K9236J8998
$$ 222307 233054 294974 210229 175521 238007 159012 305529 135307 186402 215638 234636
6895B34636j02981P0820m1684p0071J25623K3511l1322r0661J6102M265J19093
$$ 234636 131655 202475 160791 90720 216343 239854 208532 117871 133973 138238 257331
6884B57331q0091N9030K2972k5490K7564K6189o5487q811l8441L0541r2288Q1495
$$ 257331 177240 236270 259242 233752 261316 287505 222018 213207 174766 205307 113019 194514
6872A94514N2420p7839k8644Q0639j25353J32850k0546r2437l91R1812j25665
$$ 194514 246934 169095 140451 221090 95737 228587 208041 115604 115213 207025 81360
6861H1360L7982J6225j5193O2482r7819J58347n0611l0580L8830L6315J4158J9681
$$ 81360 119342 135567 120374 182856 85037 243384 192773 162193 201023 237338 251496 271177
6849B71177j73653M7613m2944M2596K6624l7986j9983K6541l0205j0249M024N7744
$$ 271177 97524 145137 102193 144789 171413 133427 113444 139985 109780 99531 103555 161299
6837A61299P4970k9759o0109k3562O761o7621O8424O4173l6874o688l6368J26362
$$ 161299 236269 206510 146401 122839 129600 61979 130403 194576 157702 151014 114646 241008
6825B41008p3541l5644N9232l66j3185r7230J8869L9303N1520l4975m2780J1268
$$ 241008 167467 131823 191055 190689 177504 80274 99143 138446 189966 154991 112211 123479
6813A23479m272K5784N3339j7819o0417j5119K819J09786l0968o5309m0955R0511
$$ 123479 119207 144991 198330 180511 120094 104975 107794 217580 186612 121303 80348 170859
6801A70859k0467m9251P9707j27711J87687k26467J51805m4719J4540n2029K6000
$$ 170859 150392 101141 180848 53137 240824 14357 166162 121443 135983 83954 109954
6790A09954J030j4547M5127j0922m6131K4711Q2179M260r9469L9920K2013p0297
$$ 109954 110984 96437 141564 130642 84511 109222 191401 195661 96192 136112 158125 87828
6778H7828J38709l5963j70135R7592k1947N7252n0776J21470p6706L6458L7738
$$ 87828 226537 190574 20439 118031 96084 153336 102560 224030 147324 183782 221520
6767B21520J2456j12587L6804j7707J25203k5333q7576J2068P8103K1924j09342
$$ 221520 233976 121389 158193 140486 265689 240356 152780 164848 242951 264875 155533
6756A55533M1167j10332K481P1955Q4424q0008K8627p8104N1100M7544K6332J3231
$$ 155533 196700 86368 88849 160804 245228 165220 193847 115743 166843 214387 240719 253950
6744B53950O532p9789K6968k829j4194J2382q6392J40393j04790K8949r300M4818
$$ 253950 260482 180693 207661 204832 190638 203020 116628 257021 152231 181180 171880 216698
6732B16698o8130J01131o3504N5475k4009n0730K9269L216N6896n4664k2771P6930
$$ 216698 148568 249699 186195 241670 217661 166931 196200 199416 256312 201648 178877 255807
6720B55807R832p8603J6133o2514K2503L9928J92747k31867R2911m8922j2332
$$ 255807 265639 187036 203169 140655 163158 203086 395833 163966 256877 207955 195623
6709A95623L3437Q9926j19397k666Q3308P279r2997K6740Q2339k8996O0447k1690
$$ 195623 229060 318986 199589 196923 280231 287510 194513 221253 303592 274596 335043 313353
6697C13353l4026J8399k7510k811N6441o343j8755J0311k2666J01942o4540p1224
$$ 313353 279327 297726 270216 267405 323846 317503 298748 309059 286393 388335 323795 252571
6685B52571R4288O6943K22l376r6386K6837L5366p066n8711N9305m6617J47417
$$ 252571 346859 413802 414024 410648 314262 341099 376465 369399 310688 369993 323376 470793
6673D70793n8137M898J1284m6551N4143R7849o1818k2203Q5998j01002j914O2279
$$ 470793 412656 417554 428838 382287 436430 534279 472461 450258 536256 435254 433340 495619
6661D95619K4014p0109P8183L3853Q8731M0721r2355N2195n2000l2928M6713N5110
$$ 495619 519633 449524 527707 561560 650291 691012 598657 650852 598852 565924 612637 667747
6649F67747j51503N4664M8097j01171J15051o7145P0J18054J7223m2499K9063
$$ 667747 516244 570908 619005 517834 632885 565740 565810 683864 701087 658588 687651
6638F87651L6564l1751L9009O3713O0409M2417P4032j0321J23655O9166P2099
$$ 687651 724215 692464 731473 795186 855595 898012 972044 961723 1085378 1154544 1226643
6627A226643M4161K67265J49648K93410O05849J038807J106615O94215O3282j20251
$$ 1226643 1270804 1538069 1687717 1981127 2586976 3625783 4732398 5426613 5489895 5369644
6617E369644p91163p09130q82859o05214l17699j97160k99599j62212L2667k6032
$$ 5369644 4578481 3869351 2986492 2381278 2063579 1866419 1566820 1404608 1437275 1411243
6607A411243O9678q3731J43893r0702K79786L4974J90261K52882J07932L98892
$$ 1411243 1480921 1397190 1541083 1450381 1730167 1765141 1955402 2208284 2316216 2715108
6597B715108M64743Q63729J525598L061473L604097K510296N59452p01726j496817
$$ 2715108 3179851 4043580 5569178 8630651 12234748 14745044 15304496 14602770 13105953
6588A3105953k453805k635242k279538j372254r03685n99884m00475k12874l51409
$$ 13105953 10652148 8016906 5737368 4365114 3461429 2861545 2461070 2248196 1896787
6579A896787K8893p6391j04652P4850M4230O3707L8873K07806K21297K31911N58089
$$ 1896787 1925680 1849289 1744637 1819487 1863717 1927424 1966297 2174103 2395400 2627311 3185400
6568C185400O64920J379341K678180L687637K980133R69553l84757j293624k372124
$$ 3185400 3850320 5229661 7907841 11595478 14575611 15545164 15160407 13866783 11494659
6559A1494659k886471k414774j699102j039804o14012n08028m69450j32083j78418
$$ 11494659 8608188 6193414 4494312 3454508 2840496 2332468 1863018 1730935 1552517
6550A552517p3275j35933q6589N8333q7293k3351J50126J5577L5417J36333K25176
$$ 1552517 1479242 1343309 1256720 1315053 1227760 1204409 1354535 1370112 1405529 1541862 1767038
6539A767038L43901P77844J214927J160311M19880m1139m23130p28805q89381
$$ 1767038 2110939 2888783 4103710 5264021 5683901 5642762 5219632 4490827 3601446
6530C601446q97404o54494m76635l01260j30887r5976k23411r2646L031M9682
$$ 3601446 2704042 2049548 1572913 1271653 1140766 1044790 821379 728733 731764 781446
6520G81446j62505l096N0456o3307N680o6910J4358o9087M9906J4181l8929q3021
$$ 781446 618941 615845 666301 602994 608674 541764 556122 487035 536941 551122 512193 429172
6508D29172L4376k1218M0184l6179l5316J805r794J4287O841K0545q25k3872o1678
$$ 429172 463548 442330 482514 446335 411019 412824 403030 417317 424158 444703 443878 420006 358328
6495C58328O3523p5715q1080J21552j1904k978n4179P7992m5442P847q5595Q8664
$$ 358328 421851 346136 265056 386608 374704 371726 317547 395539 350097 357944 272349 361013
6483C61013J54016n6957R8396P813o1910n729j16064j4542K4737l8998o3885M0145
$$ 361013 515029 458072 556468 564281 502371 496642 380578 366036 390773 351775 287890 328035
6471C28035r7784P4204M2309Q5019N7687j01515M6745M2668N879k9228J33637
$$ 328035 230251 304455 346764 431783 489470 387955 434700 477368 483247 454019 587656
6460E87656K2822r1232P0006k0372N5914J11523K3813M9265k6863n7252j18527
$$ 587656 610478 519246 589252 568880 624794 736317 760130 809395 782532 725280 606753
6449F06753l7147k2246r8166L0216n9662J268J57473j16241Q2582l4082o2452
$$ 606753 569606 547360 449194 479410 419748 421016 578489 462248 544830 510748 448296
6438D48296K5020j32959j4826L229L6217L2128p7685K9302Q2512o114R8713N0850
$$ 448296 473316 340357 325531 328760 364977 397105 319420 348722 431234 425120 523833 574683
6426E74683J32634K3643l2354N0638j55471j7405L8395j21379R7688J04994K51603
$$ 574683 707317 730960 698606 749244 593773 576368 614763 493384 591072 696066 947669
6415I47669j12421M021M4812k21199M960j65946r6520o0570j7893l5772J35579
$$ 947669 835248 839269 884081 662882 667842 501896 405376 344806 326913 291141 426720
6404D26720j49416O4517j6751J5842j990q81J40712r2896M9418M309O8613j21222
$$ 426720 277304 341821 325070 340912 338922 338041 478753 385857 435275 439584 508197 386975
6392C86975N2750M8798o3683L62455N7335q2524K5982L5927j30406j41773p8938
$$ 386975 439725 488523 424840 787295 844630 762106 788088 824015 693609 551836 472898
6381D72898r4463r5438J15944o3334l7081n2523K9898J5294k0277m7961J2434
$$ 472898 378435 282997 398941 335607 298526 246003 275901 291195 270918 222957 235391
6370B35391J31661j22283q6559o637M0778P8692p0211j8527J02132K3001J8651
$$ 235391 367052 244769 158210 151573 192351 271043 200832 182305 284437 307438 326089
6359C26089R6365m0893O5781j00844J71q6750k9115M557M0300o6766q0892N498
$$ 326089 422454 381561 447342 346498 346669 259919 230804 235361 275661 208895 128003 133501
6347A33501J24536j06525K4083J5631J4387M2530l1821o085K3395k0030m581k4514
$$ 133501 258037 151512 175595 191226 205613 248143 216322 210237 233632 213602 209021 184507
6335A84507L2792M9375J3759r4857J07299p3538j8770J19066n1961j3989R5473
$$ 184507 217299 266674 280433 185576 292875 219337 200567 319633 267672 253683 349156
6324C49156L4978q8652l5042q7134k2205J0672J52608q8734l8297p4472j8466
$$ 349156 384134 295482 260440 173306 151101 161773 314381 225647 187350 112878 94412
6313I4412J14586q9411J18871o7436J5227J16201o7304P354k2908m2271N6243
$$ 94412 208998 119587 238458 171022 186249 302450 235146 242500 219592 177321 233564
6302B33564J410R3800q6027O5425l1858J10766o5286M9306J216p8088j0758P692
$$ 233564 234974 328774 242747 308172 276314 387080 321794 371100 372316 294228 283470 291162
6290B91162k7085j00234M2836N5077m6333K8958p51r5975J12301J7973o2549j7062
$$ 291162 264077 163843 206679 261756 215423 244381 243630 147655 259956 277929 215380 198318
6278A98318Q3807q1486j0154K4701K037J39933j8040r5805L0310P6602l2440L5691
$$ 198318 282125 200639 190485 215186 217223 357156 339116 243311 273621 350223 317783 353474
6266C53474j14692R4888j1595j5706o9440K8092Q3907l898j31140k3888j7454
$$ 353474 238782 333670 322075 306369 236929 265021 348928 345030 213890 190002 172548
6255A72548K2761P5737k2176O9481l9578k02L701k9451N3097K5353Q1170n8321
$$ 172548 195309 271046 248870 318351 278773 278571 282272 252821 305918 331271 412441 354120
6243C54120P824p1357M9967O9677p3801L5043N6439J6377J64408n7531J23576
$$ 354120 361944 290587 340554 410231 336430 371473 427912 444289 608697 551166 674742
6232F74742l1254q2857P497J06524j61260m867L8984Q879o099j15896J12146j18908
$$ 674742 643488 560631 568128 674652 513392 508525 547509 556388 550289 434393 546539 427631
6220D27631j9741J35628L9415P150r8804N8267j077o0694P6295o6881J7490J15533
$$ 427631 407890 543518 582933 590083 491279 549546 548469 487775 564070 497189 514679 630212
6208F30212J31265O8718J63877N9329m5927l3849J6727k03887k0833m8903k4736
$$ 630212 761477 830195 994072 1053401 1007474 973625 990352 786465 765632 716729 691993
6197F91993l706n8313j882J9117l4467L7335j44915l4007R8911k2380o4475O7165
$$ 691993 688287 629974 628092 647209 612742 650077 505162 471155 570066 547686 483211 550376
6185E50376n8023J02423j26486J65585Q4326Q0811J01321J88116j12970R8167
$$ 550376 492353 594776 468290 633875 718201 799012 900333 1088449 975479 1073646
6175A073646L1655n1528n8763j08698l6733L296J08588J0869m4271l1124n8056
$$ 1073646 1105301 1053773 995010 886312 849579 852875 961463 972332 928061 896937 838881
6164H38881n3346q2445r7785K8404j09305L0505l6058o6490Q5610m6936O3339
$$ 838881 785535 703090 605305 633709 524404 554909 518851 452361 537971 491035 554374
6153E54374Q0859O531M4766N339p0008J89357n9387n5918m4060j9689K700N4630
$$ 554374 635233 641764 686530 691869 621861 811218 751831 695913 651853 632164 634864 689494
6141F89494J42576M1521K0025m3728M948j23485J2344j23370j35237J18455q4475
$$ 689494 832070 873591 893616 849888 854836 731351 743695 620325 485088 603543 519068
6130E19068l4694K5021q8469N4243j0814N0476p0409k361J6096K830r560J5146
$$ 519068 484374 509395 420926 475169 464355 514831 444422 442061 458157 460987 451427 466573
6118D66573j0127L7397O5144J9947J7311j1351k3761J37297j9740j18009N0182
$$ 466573 456446 493843 558987 578934 596245 584894 561133 698430 678690 560681 610863
6107F10863O649j4129j05310j345j07481K15903q4553j1072j3497K2184N3286
$$ 610863 617512 603383 498073 496728 389247 605150 520597 509525 496028 518212 571498
6096E71498m3138l7037N6121n3079k7429J47350j4615j21112J2549L3385J2571
$$ 571498 528360 491323 547444 494365 466936 614286 599671 478559 491108 524493 537064
6085E37064J6117j0342R2677M7718m5083q017R010O1314K905j74625M926j6798
$$ 537064 553181 542839 635516 683234 638151 630134 639144 700458 703363 528738 533664 516866
6073E16866J17460j50235J07428k3944k7991O404K7643J5115M3684N965j2275
$$ 516866 634326 484091 591519 567575 539584 545988 573631 588746 632430 638395 626120
6062F26120p2571K2394K4178m6511N8091J3145n034Q9328p6895Q5672J0943j29519
$$ 626120 553549 575943 600121 553610 611701 624846 619812 709140 632245 717917 728860 599341
6050E99341O2486l4527O2271m7616k4753K9972J6838p6463J48824J1653j7861
$$ 599341 661827 627300 689571 641955 617202 647174 664012 587549 736373 748026 730165
6039G30165J7483KK1383p9841M1280L0519r9955K07583n1690r0724J37522j0862
$$ 730165 747648 747650 769033 689192 730472 760991 661036 868619 816929 726205 863727 852865
6027H52865l5981p1651J00307m0354J33851m7880j6350O9051K6626O848j19658
$$ 852865 816884 745233 845540 805186 939037 891157 874807 943858 970484 977332 857674
6016H57674J57154J4505l8160L8281j06525J63338p3445M2454p268o3697J82467
$$ 857674 1014828 1029333 991173 1029454 922929 1086267 1012822 1055276 1048008 984311 1166778
6005A166778m4529K8338L6653q4750J68827l927L6387n4854j4120J36437M7892
$$ 1166778 1122249 1150587 1187240 1102490 1271317 1267390 1303777 1248923 1234803 1371240 1419132
5994A419132m1021R174J41300j5779P8941K6247p3532J15606O1399O3244J91861
$$ 1419132 1378111 1387285 1528585 1512806 1591747 1617994 1544462 1660068 1721467 1784711 1976572
5983A976572K37474j4355m842o2040K4707J46297O8997P4982P3501J63122L3357
$$ 1976572 2214046 2199691 2194849 2132809 2157516 2303813 2372810 2447792 2521293 2684415 2717772
5972B717772L42949L15733L25835P84837J057218K015877J946035Q82808M88201
$$ 2717772 3060721 3376454 3702289 4487126 5544344 7560221 9506256 10389064 10877265
5963A0877265L13927O21354J723376L242377J793855K63914l21302J8846N42650
$$ 10877265 11191192 11812546 13535922 16778299 18572154 18836068 18514766 18533612 19076262
5954A9076262K963591L297466M36032o71173j566303j871087j440406N99512j29301
$$ 19076262 22039853 25337319 25773351 25102178 23535875 21664788 20224382 20823894 20694593
5945B0694593j047744j540964j651552j978406j056419m71979r98015j016262
$$ 20694593 19646849 18105885 16454333 14475927 13419508 12947529 11949514 10933252
5937A0933252j146646j465113j607922j235478r59202o16273l71666k39683l01201
$$ 10933252 9786606 8321493 6713571 5478093 4518891 3902618 3530952 3291269 2990068
5928B990068k46134p3105n2003l8884j58863j14595p6587j1106l4366j26644L4037
$$ 2990068 2743934 2670829 2618826 2579942 2421079 2306484 2229897 2218791 2184425 2057781 2091818
5917B091818j08344j22069J47618m4490p4280j5842r9392O8177N5416j84491o0118
$$ 2091818 1983474 1861405 2009023 1964533 1890253 1874411 1775019 1843196 1898612 1714121 1654003
5906A654003J17913q8693o1037J08771j13369L1263K7513n5455L4468j0083L291
$$ 1654003 1771916 1683223 1622186 1730957 1617588 1648851 1676364 1620909 1655377 1645294 1648585
5895A648585k9649M9744j14117P2222M3818K3661J2517r673K7818R8088l931J42100
$$ 1648585 1618936 1668680 1554563 1626785 1670603 1694264 1706781 1697108 1724926 1823014 1819083 1961183
5883A961183j42974R4483L8526j04022Q966j5096K3589j3800o8346m5387K3310
$$ 1961183 1818209 1912692 1951218 1847196 1856162 1841066 1864655 1850855 1782509 1737122 1760432
5872A760432p4531q594O7928J2328Q0832l5399k7435R9275J43212m0450J71164
$$ 1760432 1685901 1677307 1745235 1757563 1838395 1802996 1775561 1874836 2018048 1977598 2148762
5861B148762M0435K26251M5865J10734j6038q346p4401j23628j09897L6726k31615
$$ 2148762 2189197 2415448 2461313 2572047 2556009 2547663 2473262 2349634 2239737 2276463 2044848
5850B044848l7558k3573j27936O4394n8264j03044o2383J8825j5131l4693M6234
$$ 2044848 2007290 1983717 1855781 1920175 1861911 1758867 1696484 1715309 1700178 1665485 1711719
5839A711719L4631J5072L5085J25749m5429J1403N6343J38867K2741Q458l3528
$$ 1711719 1746350 1761422 1796507 1922256 1876827 1888230 1944573 2083440 2106181 2114639 2081111
5828B081111j24075m8550R0293o1112p1840j1272J29158o5934m9348j12637j5875
$$ 2081111 1957036 1908486 1998779 1937667 1865827 1854555 1983713 1917779 1868431 1755794 1739919
5817A739919o8131L1195j5145j05226o7777l3490M5922p1982P4295j5549N5428
$$ 1739919 1671788 1702983 1687838 1582612 1514835 1481345 1527267 1455285 1529580 1514031 1569459
5806A569459k0029m3245K9492l200J17610n042Q7905j31906J24867J41740l6793
$$ 1569459 1549430 1506185 1535677 1532477 1650087 1645045 1732950 1601044 1725911 1867651 1830858
5795A830858N0173J3407m489O3634R737M7414j28602K2135n1778k2517J31531
$$ 1830858 1881031 1894438 1889949 1953583 1963320 2010734 1882132 1904267 1852489 1829972 1961503
5784A961503k347O2706J31076n3467J40273k0256R7313N4392J37014J27476J7332
$$ 1961503 1959156 2021862 2152938 2099471 2239744 2219488 2316801 2371193 2508207 2635683 2653015
5773B653015J41642K01472J55312K78570L91591K98571M14128M38053O51211O10733
$$ 2653015 2794657 2996129 3151441 3430011 3821602 4120173 4534301 4972354 5623565 6234298
5763F234298M86959O17503N27877L41550J44128N0370j13841j62828l14970l53388
$$ 6234298 6721257 7338760 7866637 8208187 8352315 8402685 8288844 8126016 7811046 7457658
5753G457658l09089l02641l03002j01915k13200P4455j47949N5431N3975K60899
$$ 7457658 7148569 6845928 6542926 6441011 6227811 6302266 6154317 6209748 6263723 6524622
5743F524622j2681K92207K57877M57210N08675O50079Q90109Q61984R78998J030852
$$ 6524622 6511941 6804148 7062025 7519235 8027910 8677989 9568098 10430082 11409080 12439932
5733A2439932Q60605R34641O33698M19227o765r6058n93196n11137p08866p14164
$$ 12439932 13300537 14235178 14868876 15288103 15281338 15185280 14592084 14080947 13372081 12657917
5723A2657917p35325r14087o71803o38531p12432m83752n23703m15781l68486
$$ 12657917 11922592 11008505 10336702 9698171 8985739 8501987 7978284 7562503 7194017
5714G194017j76365j42939J315N8266O5518J49453M12095J77083L48954N71932
$$ 7194017 7017652 6874713 6876028 6934294 6999812 7149265 7561360 7738443 8087397 8659329
5704H659329L43602M33457L94601L70811L13798J61133q7138j33188l18606m09887
$$ 8659329 9002931 9436388 9830989 10201800 10515598 10676731 10589593 10456405 10137799 9727912
5694I727912m64175n52138m27566n55725m16051l42228l44916j01227j94064k60493
$$ 9727912 9263737 8711599 8284033 7728308 7312257 6970029 6625113 6523886 6329822 6069329
5684F069329j24444r8560k24260j2725k03401m788j39708o9438q1798R1628r8358
$$ 6069329 5944885 5846325 5622065 5609340 5405939 5401151 5261443 5192005 5110207 5201835 5103477
5673E103477J05685J54862m4987M0987O1328K41203K5984J16176J89583N5042
$$ 5103477 5209162 5364024 5319037 5360024 5421352 5662555 5688539 5804715 5994298 6049340
5663F049340L19315O2243J66959J16597L78722R8202J90486l259P9640K7619k10462
$$ 6049340 6368655 6430898 6597857 6714454 7093176 7191378 7381864 7378605 7458245 7485864 7275402
5652G275402K7219j73762j6004j50924k39918k903m5464m3113M0772N5206R8844
$$ 7275402 7302621 7128859 7112855 6961931 6722013 6719110 6673646 6630533 6671305 6726511 6825355
5641F825355J25877J75886J15741J48683K1625K13637J10928P9268J8683L5709
$$ 6825355 6951232 7127118 7242859 7391542 7413167 7626804 7737732 7817000 7835683 7871392
5631G871392k1094L4257K142O1230k2141J720O235l8067q6952k35732n7892q3370
$$ 7871392 7850298 7884555 7886697 7947927 7925786 7927506 7933741 7895674 7808722 7572990 7515098 7431728
5619G431728r0573O9092k9304O2975R0827P3106K83016O7163J77179K73348J25620
$$ 7431728 7341155 7410247 7380943 7443918 7534745 7607851 7890867 7958030 8135209 8408557 8534177
5608H534177J71895K59775K71165J79076J27565K75438K87958K06177K67603K97894
$$ 8534177 8706072 8965847 9237012 9416088 9543653 9819091 10107049 10313226 10580829 10878723
5598A0878723L81792L42400M09988M28902L67666J29952P9012k04968j18615m78928
$$ 10878723 11260515 11602915 12012903 12441805 12809471 12939423 13018435 12813467 12694852 12215924
5588A2215924m17550n01458l34741l16057j45734k16954J2053J89232M2552J09373
$$ 12215924 11798374 11296916 10962175 10646118 10500384 10283430 10295483 10484715 10527267 10636640
5578A0636640K02533J44943K67982J73786K66718N05655N90142N95552Q19810
$$ 10636640 10839173 10984116 11252098 11425884 11692602 12198257 12788399 13383951 14203761
5569A4203761R05915J053049P74066R96705O40144M50371K08782j18575l81704
$$ 14203761 15109676 16162725 16936791 17933496 18573640 19024011 19232793 19114218 18732514
5560A8732514n20102p91960q35919p05922p49108m60626l54710m01047j59177
$$ 18732514 18212412 17420452 16584533 15878611 15129503 14668877 14314167 13913120 13753943
5551A3753943M575J889J87517J30318J35541J97826K95718K45354K14975K98643
$$ 13753943 13758518 13760407 13947924 14078242 14213783 14411609 14707327 14952681 15167656 15466299
5541A5466299M11201M45255L90978M73682N61489L42747j4309r5113m01628n20224
$$ 15466299 15877500 16322755 16713733 17187415 17748904 18091651 18077342 17982229 17580601 17060377
5531A7060377q58818j006844r48844q93023q52927p58698n42721o35433k93380
$$ 17060377 16201559 15194715 14245871 13352848 12499921 11741223 11198502 10563069 10269689
5522A0269689m43872m03103m08915l51217l94644l94597l02099m08546k83615
$$ 10269689 9825817 9422714 9013799 8662582 8267938 7873341 7571242 7162696 6879081
5513F879081k94358k90762k31158k72186k36758j62800l25212l6972r8988j29533
$$ 6879081 6584723 6293961 6062803 5790617 5553859 5391059 5065847 5028875 4929887 4800354
5503D800354l9108j94854J8576o5696r0364q4129j30819M2673k0996j07737P9698
$$ 4800354 4761246 4566392 4584968 4519272 4428908 4344779 4213960 4256633 4235637 4127900 4207598
5492D207598O896r6492k9407r907q7608J7076P7602L4506k7036R8483p1903N8390
$$ 4207598 4214494 4118002 4088595 4078688 3991080 4008156 4085758 4120264 4093228 4191711 4119808 4178198
5480D178198J30042m5009N8719N933l7558P227k1356j00584l5474m7518m7473
$$ 4178198 4308240 4263231 4321950 4327883 4290325 4297552 4276196 4175612 4140138 4092620 4045147
5469D045147j52078L7920j14171n0632j00969p8155o7892p9624j9802l0168n8573
$$ 4045147 3893069 3930989 3816818 3766186 3665217 3587062 3519170 3439546 3419744 3389576 3331003
5458C331003l178j57528L8914j11003P871j29331n6974l3172k28033Q873J050
$$ 3331003 3327825 3170297 3209211 3098208 3106079 2976748 2919774 2886602 2658569 2667442 2668492
5447B668492j35457n7553l4885l9099q6292j2098L7707p4996l9530N4453K1571
$$ 2668492 2533035 2475482 2440597 2401498 2315206 2303108 2340815 2265819 2226289 2280742 2302313
5436B302313n6467l8105j10019O4005M803m4746R1320j15259q7538L7748m6441
$$ 2302313 2245846 2207741 2097722 2161727 2166530 2121784 2213104 2097845 2010307 2048055 2001614
5425B001614J46634j441j10042K129M2606M2894o7311Q5417q6084L8209M1290
$$ 2001614 2148248 2146807 2036765 2038894 2081500 2124394 2057083 2142500 2056416 2094625 2135915
5414B135915L7757M1759q707J0044J5570L9273j26330o1793j8837m5823Q6482
$$ 2135915 2173672 2215431 2206724 2216768 2232338 2271611 2145281 2083488 2064651 2018828 2105310
5403B105310j18442j7640j9028j12678J6624o9364P1600j74775P0871N323J7335
$$ 2105310 1986868 1969228 1950200 1837522 1854146 1784782 1856382 1681607 1752478 1757801 1775136
5392A775136n3168j33918N3275j06793J9897J03714q3357j18294Q2717k7973k0394
$$ 1775136 1721968 1588050 1641325 1534532 1554429 1658143 1574786 1456492 1539209 1511236 1490842
5381A490842j18999o4323k6607Q9318j4255n2146n9405N2721m7393j4497m8441
$$ 1490842 1371843 1307520 1280913 1370231 1355976 1303830 1244425 1297146 1249753 1235256 1186815
5370A186815K1003L2986J0807k3129j00763O1927k2849j26841k7164J73322l4130
$$ 1186815 1207818 1240804 1251611 1228482 1127719 1189646 1166797 1039956 1012792 1186114 1151984
5359A151984l4009L9246K0577q4414R4327l5795o4981J44205n5039J4631K818
$$ 1151984 1117975 1157221 1177798 1093384 1187711 1151916 1086935 1231140 1176101 1190732 1193550
5348A193550K4454o3701J20262n9150J21508q7701n9830J03984M3161J4073N2685
$$ 1193550 1218004 1154303 1274565 1215415 1336923 1249222 1189392 1293376 1336537 1350610 1403295
5337A403295j8483o1619N3076k7512J78782l2824J2390K3162O7630J8811R6674
$$ 1403295 1384812 1323193 1376269 1348757 1527539 1494715 1507105 1530267 1597897 1616708 1713382
5326A713382M1290m2047J19448k3305K07303o80R2527N9558J80556J16763J27626
$$ 1713382 1754672 1712625 1832073 1808768 2016071 2015391 2107918 2167476 2348032 2464795 2592421
5315B592421J27670K48812K07590K49194L03172K51989L12669J96806L71089K97732
$$ 2592421 2720091 2968903 3176493 3425687 3728859 3980848 4293517 4490323 4861412 5159144
5305E159144K94732J22978K35642J23503K12315J26098K12376J41789J06199J64541
$$ 5159144 5453876 5576854 5812496 5935999 6148314 6274412 6486788 6628577 6734776 6899317
5295F899317Q6575K33129J21364J22859M05069L06265L38178L08572N47395M52897
$$ 6899317 6985892 7219021 7340385 7463244 7868313 8174578 8512756 8821328 9368723 9821620
5285I821620L85960J64137K85975M8909j9978k7463l07737k47588l90850m64731
$$ 9821620 10207580 10371717 10657692 10706601 10686623 10659160 10351423 10103835 9712985 9248254
5275I248254n03006m77485l11349m25300l61775k76131l22964j45731k12408k47424
$$ 9248254 8745248 8267763 7956414 7531114 7169339 6893208 6570244 6424513 6212105 5964681
5265E964681L5465j2167l6622l5626O9539m2428q5713K1515j58998k57652o3252
$$ 5964681 6000146 5987979 5951357 5915731 5985270 5942842 5857129 5878644 5719646 5461994 5398742
5254E398742m21412l44614l26053l05944l01420k79988k38858k83285j33745k66810
$$ 5398742 4977330 4632716 4306663 4000719 3699299 3419311 3180453 2897168 2763423 2496613
5244B496613N452k20037j65834k3704j11169q1336j32534N4366o6947q2843r3463
$$ 2496613 2502065 2282028 2116194 2092490 1981321 1899985 1767451 1821817 1754870 1672027 1578564
5233A578564m770j21524N0271j37608J4979O3591j7623K3653r2602p2007P4052
$$ 1578564 1573794 1452270 1502541 1364933 1379912 1443503 1425880 1449533 1356931 1284924 1358976
5222A358976p8142J9640L699K7160l7253k7228m4844M2314m6938n6599K6612l9672
$$ 1358976 1280834 1300474 1304173 1331333 1294080 1266852 1222008 1264322 1217384 1160785 1187397 1147725
5210A147725j02819J20285r0350J69741q1292L6810o4513k6891L0086P062P414
$$ 1147725 1044906 1165191 1074841 1244582 1163290 1200100 1135587 1108696 1138782 1145844 1153258
5199A153258O0759j5323L0713j03161O7371L8193r933m6964O4558N6239q2848
$$ 1153258 1214017 1198694 1229407 1126246 1193617 1231810 1221877 1174913 1239471 1295710 1212862
5188A212862P4037R0990r1444J77208J20049M3540K70916O186K48613J23170O3040
$$ 1212862 1286899 1377889 1286445 1463653 1583702 1627242 1898158 1904344 2152957 2276127 2339167
5177B339167J23316J60906L34074M86522L72983N09359N19815L73361K08343j11881
$$ 2339167 2462483 2623389 2957463 3443985 3816968 4326327 4846142 5219503 5427846 5315965
5167E315965m20958l69092l78941m73600l07478k68056k94588R0268k07536K2066
$$ 5315965 4895007 4525915 4146974 3673374 3365896 3097840 2803252 2893520 2685984 2708050
5157B708050K8535J35797o645N2630J05155J65747J13951M25980L25553L86767
$$ 2708050 2736585 2872382 2865737 2918367 3023522 3189269 3303220 3729200 4054753 4441520
5147D441520M76224L60569M64356M17975M52243L68272K51210O0962q0083j17011
$$ 4441520 4917744 5278313 5742669 6160644 6612887 6981159 7232369 7293331 7213248 7096237
5137G096237l36601m38661l73019m42743j66240l98237k11855l01105r5277j12070
$$ 7096237 6759636 6320975 5947956 5505213 5338973 4940736 4728881 4427776 4332499 4220429
5127D220429p9828R2023p7978l2996J86880L06395K39771K22659N00815L40565
$$ 4220429 4140601 4232624 4154646 4121650 4308530 4614925 4854696 5077355 5578170 5918735
5117E918735L42237N48078N51650O17362L24643N00024L24772l975j72937m01656
$$ 5918735 6260972 6809050 7360700 7978062 8302705 8802729 9127501 9123526 8950589 8548933
5107H548933m39291n49924o98052n47040p18731m65783k52624l66744j81092k31573
$$ 8548933 8109642 7559718 6861666 6314626 5595895 5130112 4877488 4510744 4329652 4098079
5097D098079r7840K6148N3395k05565M4886m5438J79299l8926K29014K63205M04090
$$ 4098079 4000239 4026387 4079782 3874217 3919103 3873665 4052964 4014038 4243052 4506257 4910347
5086D910347K56834M31994L16753K07741J80607j5746j03040l41707l15653m88794
$$ 4910347 5167181 5599175 5915928 6123669 6304276 6288530 6185490 5843783 5528130 5039336
5076E039336m21529l05173m57506k54638k61550j85496n7810j90900L60o7879
$$ 5039336 4617807 4312634 3855128 3600490 3338940 3153444 3095634 2904734 2905094 2837215
5066B837215j49830Q5334p7902M1828m0401k0784J26472J13001L1805m9400J75989
$$ 2837215 2687385 2772719 2694817 2736645 2696244 2675460 2801932 2914933 2946738 2897338 3073327
5055C073327N0129N7784N1687J2075r2971P5637l07444k3823r0737p9695P0846
$$ 3073327 3123456 3181240 3232927 3245002 3152031 3227668 2920224 2896401 2805664 2725969 2796815
5044B796815j98092j07552q565p3436L8269R3753o6155J77806P9985J26611N275
$$ 2796815 2598723 2491171 2482606 2409170 2447439 2541192 2475037 2652843 2732828 2859439 2864714
5033B864714J15413J88774Q9290J17558n0139M936j2796k7593j4440k66988j7466
$$ 2864714 2980127 3168901 3258191 3375749 3325610 3330546 3317750 3290157 3275717 3008729 2991263
5022B991263j52644j24079J1431k8331O604J22705o5160Q2829p7747J10820M1138
$$ 2991263 2838619 2714540 2725971 2697640 2704244 2826949 2761789 2844618 2766871 2877691 2918829
5011B918829J57246J7668L3859J39798J77280J55110J63486J54162J03163J89402
$$ 2918829 3076075 3093743 3127602 3267400 3444680 3599790 3763276 3917438 4020601 4210003
5001D210003J273R5517n861j43858J3492j08043l18357j3937j97329n9775j56885
$$ 4210003 4211276 4306793 4300932 4157074 4170566 4062523 3744166 3730229 3532900 3473125 3316240
4990C316240K7953j07979P7227j30465l9057O702J09488J12813N5455K1412L1758
$$ 3316240 3344193 3236214 3313441 3182976 3143919 3150621 3260109 3372922 3428377 3449789 3481547
4979C481547O4932O4859J58446L983K11974l0947J45135j19164M6582L319R9851
$$ 3481547 3546479 3611338 3769784 3773767 3985741 3954794 4099929 3980765 4027347 4030666 4130517
4968D130517k12887l4818l6706n9865j45988l7129j08063p1049L4167O3694j05241
$$ 4130517 3917630 3882812 3846106 3786241 3640253 3603124 3495061 3424012 3458179 3521873 3416632
4957C416632Q2732K7844J38137K6280R0386N4344J36864J37706J31229N3178J55158
$$ 3416632 3499364 3527208 3665345 3691625 3782011 3836355 3973219 4110925 4242154 4295332 4450490
4946D450490P6049J05592J41283R5128J89750J48343L35363K34100J33847L81625
$$ 4450490 4526539 4632131 4773414 4868542 5058292 5206635 5541998 5776098 5909945 6291570
4936F291570L32916L32018O16069Q70282J430668K045681L965447Q931421J6712868
$$ 6291570 6624486 6956504 7572573 8442855 9873523 11919204 15884651 24816072 41528940
4927D1528940J7199742O391274n85586l988136q486628j3153958j2180762q011953
$$ 41528940 58728682 65119956 64534370 60546234 52059606 38905648 26724886 18712933
4919A8712933m839583l132636k017362j455762q47117n78893l78874l34295j60137
$$ 18712933 13873350 10740714 8723352 7267590 6420473 5841580 5462706 5128411 4968274
4910D968274l56191j39433j61489j87532k6876j31740m2829j20872m912k3895
$$ 4968274 4612083 4472650 4311161 4123629 4096753 3965013 3922184 3801312 3796400 3772505
4900C772505j1221Q5939r9901k3221n1107K3680J08496k0488J09269J00051J08694
$$ 3772505 3761284 3847223 3747322 3724101 3672994 3696674 3805170 3784682 3893951 3994002 4102696
4889D102696K0941J4846K37994k8827J79661Q7128J21698K17886J16273K6231
$$ 4102696 4123637 4138483 4376477 4347650 4527311 4614439 4736137 4954023 5070296 5096527
4879E096527J25938K68758J54193K28027J95540L32013K62480M18932K83174M92397
$$ 5096527 5222465 5491223 5645416 5873443 6068983 6400996 6663476 7082408 7365582 7857979
4869G857979M86558P08364O69468J190814J677684K086775K732703L437673L556773
$$ 7857979 8344537 9052901 9722369 10913183 12590867 14677642 17410345 20848018 24404791
4860B4404791K574613J339031l7202j021353j859917j962197j929436j572149
$$ 24404791 26979404 28318435 28281233 27259880 25399963 23437766 21508330 19936181
4852A9936181j302265r89270q16173o19575n12856m09284k18819k51378j68870
$$ 19936181 18633916 17644646 16828473 16208898 15696042 15286758 15067939 14816561 14647691
4843A4647691J22388J08980N20134O29336P50445Q68843M78499M40736L01932
$$ 14647691 14770079 14879059 15399193 16028529 16778974 17647817 18126316 18567052 18868984
4834A8868984J35120K13762J73045L54575M65109P48384Q39169Q80632P48989
$$ 18868984 19004104 19217866 19390911 19745486 20210595 20958979 21798148 22678780 23427769
4825B3427769O98743L48171k5163j68647o23599o78973o04105q06531m39122m59650
$$ 23427769 24126512 24474683 24449520 24280873 23657274 22978301 22374196 21567665 21128543 20668893
4815B0668893q7163l2915R5858k7072p3085k43681n01885n84934n72287n07763
$$ 20668893 20581730 20548815 20644673 20617601 20544516 20300835 19798950 19214016 18641729 18133966
4805A8133966m73810l17458m90544k81695k72081l69169l82890l95419n49254
$$ 18133966 17660156 17342698 16852154 16570459 16298378 15929209 15546319 15150900 14601646
4796A4601646m27665o28337n63119m02800m49097n40187l47873l47333n56616
$$ 14601646 14173981 13545644 12982525 12579725 12130628 11590441 11242568 10895235 10338619
4787A0338619l29926l76031l19222m45801k34118k14417k06870j49780j84240
$$ 10338619 10008693 9632662 9313440 8867639 8633521 8419104 8212234 8062454 7878214
4778G878214k00422n4945k65643j09115j90638j61374k27949j61696l09344j11036
$$ 7878214 7677792 7622847 7357204 7248089 7057451 6896077 6668128 6506432 6197088 6086052
4768F086052j66363k31456j61303j38036k83620j85203k24893j68820n6512j85776
$$ 6086052 5919689 5688233 5526930 5388894 5105274 4920071 4695178 4526358 4469846 4284070
4758D284070j30117j27641j67215o5585o8831j18483q4899j01735r1157p4905
$$ 4284070 4153953 4026312 3859097 3793512 3724681 3606198 3521299 3419564 3328407 3253502
4748C253502m1766j25826j29522m4835j00639n8283q3946l5856m6603n6542j05473
$$ 3253502 3211736 3085910 2956388 2911553 2810914 2752631 2668685 2632829 2586226 2529684 2424211
4737B424211K6962n1824r9579L7187j46695n0376M1967r491j07098p3079M6086
$$ 2424211 2451173 2399349 2299770 2336957 2190262 2139886 2181853 2172362 2065264 1992185 2038271
4726B038271P2320k33740O2152R764m5149k802K2722l0560n8112Q0945k1954L3974
$$ 2038271 2110591 1876851 1939003 1948767 1903618 1900816 1923538 1892978 1834866 1915811 1893857 1927831
4714A927831j6549l1421l4333N9582r1695r9410k0921P8806M277j18372l9541
$$ 1927831 1911282 1879861 1845528 1905110 1813415 1714005 1693084 1771890 1776167 1657795 1618254
4703A618254N8630k5718J0492j27740P392O5390j43873L1347p841k803j5644M83
$$ 1618254 1676884 1651166 1661658 1533918 1541310 1606700 1462827 1494174 1486333 1483530 1467886 1468369
4691A468369l6375N432l7218l8663K1379O13j5184q0880R2995o635N0689J8017
$$ 1468369 1431994 1437426 1400208 1361545 1382924 1383537 1368353 1287473 1380468 1373833 1424522 1442539
4679A442539r0099P9635O1950J4579j02701J09728q483J29190k9389J16671N103
$$ 1442539 1352440 1432075 1494025 1508604 1405903 1515631 1507148 1636338 1606949 1723620 1728723
4668A728723Q4887p4908O9720j20861j46158j22321O4965q221L5306j38q7142
$$ 1728723 1813610 1738702 1808422 1687561 1541403 1419082 1484047 1475826 1511132 1510994 1423852
4657A423852l4100P7198N9159j8575K8617j91381J16444L4133N1492n5024O0877
$$ 1423852 1389752 1466950 1526109 1507534 1536151 1344770 1461214 1495347 1546839 1491815 1552692
4646A552692j25033J64387n6427j6590p8314N0256j0880O9511K0221j64794J47263
$$ 1552692 1427659 1592046 1535619 1519029 1440715 1490971 1480091 1549602 1569823 1405029 1552292
4635A552292j00015N1372m6827O6375m4136m9134P7582K6659l7045L9881o3524
$$ 1552292 1452277 1503649 1456822 1523197 1479061 1429927 1507509 1534168 1497123 1537004 1473480
4624A473480J52121L3342q8835L409M6378j06342Q1015J935M6842m8615L5280
$$ 1473480 1625601 1658943 1570108 1573517 1619895 1513553 1594568 1596503 1643345 1594730 1630010
4613A630010Q232M2184K0948L1367j4247N6936P4706r6528N3651J26059j40281
$$ 1630010 1638242 1680426 1701374 1732741 1718494 1775430 1850136 1753608 1807259 1933318 1793037
4602A793037n3667O3794J4780J15101l1115K6882L0302l9311M4403O1722O4175
$$ 1793037 1739370 1803164 1817944 1933045 1901930 1928812 1959114 1919803 1964206 2025928 2090103
4591B090103p5347Q5493J09033j7786J8886q4940J42407n3173k840N2091j06143
$$ 2090103 2014756 2100249 2209282 2191496 2210382 2125442 2267849 2214676 2211836 2263927 2157784
4580B157784Q6465J01736n415O065K2228M3019L049L9745N2087L3167L1708m3621
$$ 2157784 2244249 2345985 2340570 2346635 2368863 2411882 2414931 2454676 2506763 2539930 2571638 2528017
4568B528017L3587J36876k0207R4947K2638J10264R6156j352K5750k673M8297
$$ 2528017 2561604 2698480 2678273 2773220 2795858 2906122 3002278 3000926 3026676 3024003 3072300
4557C072300J7326M2208M224M3326J30813P6493N1694K6222k6703K29797P2839
$$ 3072300 3089626 3131834 3136058 3179384 3310197 3386690 3438384 3464606 3437903 3667700 3740539
4546C740539Q319J99411j28426J7918K975K1750n326M6670O2283J56132O32R7201
$$ 3740539 3748858 3948269 3819843 3837761 3840736 3862486 3857160 3903830 3966113 4122245 4122877 4220078
4534D220078R6040J22j7941J88514o8960Q8112k3601J9458N6216J1048J67761
$$ 4220078 4316118 4316240 4298299 4486813 4417853 4505965 4482364 4501822 4558038 4569086 4736847
4523D736847J12541Q2230J95575J5063K4851P8127K9541j4292J00283L6348q313
$$ 4736847 4849388 4931618 5127193 5142256 5167107 5245234 5274775 5260483 5360766 5397114 5388801
4512E388801M7399M9008N0435K9279R6341J40798j476P2637J30030L1196K3647
$$ 5388801 5436200 5485208 5535643 5564922 5661263 5802061 5800585 5873222 6003252 6034448 6058095
4501F058095J68960J35869r697J45270J87340J14167J15290J82617K26916J08776
$$ 6058095 6227055 6362924 6353227 6498497 6685837 6800004 6915294 7097911 7324827 7433603
4491G433603K50389J77036K37743J85683K12268J65769K91891L56223L51445K41023
$$ 7433603 7683992 7861028 8098771 8284454 8496722 8662491 8954382 9310605 9662050 9903073
4481I903073L97855M98984M40950O39303O10295Q83718R42815J168507J345838
$$ 9903073 10300928 10799912 11240862 11880165 12490460 13374178 14316993 15485500 16831338
4472A6831338J729313J997096K694724L447719M379879N401541N826115N353389
$$ 16831338 18560651 20557747 23252471 26700190 31080069 36481610 42307725 47661114
4464D7661114L882914J671619p34987k865477m401878m949724n060582m564084
$$ 47661114 51544028 53215647 52480660 49615183 45213305 40263581 35202999 30638915
4456C0638915l908395l096872k583191k017985j718154j482161r78917j126219
$$ 30638915 26730520 23633648 21050457 19032472 17314318 15832157 14853240 13727021
4448A3727021o62827n95341n03247m77917l63263l56912k94210l53167r9434l40075
$$ 13727021 13064194 12468853 11965606 11487689 11124426 10767514 10473304 10120137 10020703 9680628
4438I680628j06719j27394k28852j38732k15454q6437j80198j67971P4402j65616
$$ 9680628 9573909 9446515 9217663 9078931 8863477 8777040 8596842 8428871 8503273 8337657
4428H337657m6279j03198p3285p2690n2798j39366j47769R7729j21572q516j1326
$$ 8337657 8291378 8188180 8114895 8042205 7989407 7850041 7702272 7800001 7678429 7669913 7658587
4417G658587J9508j8515L320r6114o2542j11192L0008j08777j24524j467j14456
$$ 7658587 7678095 7659580 7662900 7566786 7504244 7393052 7423060 7314283 7189759 7188292 7073836
4406G073836k8666j42242R1121k592O8158l5292O6918J6949N6767N8595J63056
$$ 7073836 7045170 6902928 6994049 6991457 7059615 7024323 7091241 7108190 7164957 7223552 7386608
4395G386608O377j01327P6070j35920q3426j30855o2168n015j17325q7107o8r7910
$$ 7386608 7392985 7291658 7367728 7231808 7148382 7017527 6955359 6950344 6833019 6745912 6745844 6647934
4383F647934K9794r3517o1900Q0282j30064K6371J45370Q0620J41158R8056j5386
$$ 6647934 6677728 6584211 6522311 6602593 6472529 6498900 6644270 6724890 6866048 6964104 6948718
4372F948718J19696M3006J66583l9511R8152j0620J68131J89453K11070K76946
$$ 6948718 7068414 7111420 7278003 7238492 7336644 7326024 7494155 7683608 7894678 8171624
4362H171624K76371L60306M47165P08186J157501J955371J996395R09740Q30429
$$ 8171624 8447995 8808301 9255466 9963652 11121153 13076524 15072919 15982659 16813088
4353A6813088K36351l8227o25769q85067q59787o92457p08723l47912J58489J636923
$$ 16813088 17049439 17011212 16385443 15500376 14640589 13948132 13239409 12891497 13049986 14686909
4343A4686909L933909M453736J148747k64518j250235k080628l218075k283362
$$ 14686909 18620818 23074554 24223301 23958783 22708548 20627920 17409845 15126483
4335A5126483p46378l99168p30503r78886r02848j152777j240611q66253n99090
$$ 15126483 14380105 13980937 13250434 12271548 11368700 10215923 8975312 8109059 7509969
4326G509969k45218j42547P3626N1553P7389J87005L93295N19509Q06425J510932
$$ 7509969 7264751 7122204 7195830 7247383 7324772 7511777 7905072 8424581 9231006 10741938
4316A0741938L481886P391377J0491447L971562P97846j406284k682573o490059
$$ 10741938 14223824 21615201 32106648 36078210 36876056 35469772 32787199 26297140
4308B6297140o646275m786803l040938k080219j576130j072041p81508n24145
$$ 26297140 19650865 14864062 11823124 9742905 8166775 7094734 6313226 5789081
4300E789081k76224k76246m5509j90506q1763Q4917J53983O7018K44046K23672
$$ 5789081 5512857 5236611 5191102 5000596 4918833 5003750 5157733 5224751 5468797 5692469
4290E692469M00049O83827J304653L091372N036827L233028J092549L87618L1736
$$ 5692469 6092518 6776345 8080998 11172370 16209197 19442225 20534774 20922392 20954128
4281B0954128k623729l494435k919111k257163j746201j393024r86846o92897
$$ 20954128 18330399 14835964 11916853 9659690 7913489 6520465 5533619 4840722
4273D840722m61255l89993k67404k07397k21993N2761j8166j11833J57224N0055
$$ 4840722 4379467 3989474 3722070 3514673 3292680 3345441 3327275 3215442 3372666 3422721
4263C422721j10152R0014j39055j40376j7388j32732J79580K58971L95192N87821
$$ 3422721 3312569 3402583 3263528 3123152 3105764 2973032 3152612 3411583 3806775 4394596
4253D394596J1399j9200j13449l34651m67583l32033l12451j25936j91507j59875
$$ 4394596 4405995 4386795 4273346 3938695 3471112 3139079 2826628 2700692 2509185 2349310
4243B349310j10419p6776j4508l6768n1978Q6407r4019O4485o6034j02704m9507
$$ 2349310 2238891 2162115 2147607 2110839 2058861 2145268 2051249 2115734 2049700 1946996 1897489
4232A897489m8434J9434J0215k02805j6586L2267p9154r1224J45885j52416o569
$$ 1897489 1849055 1868489 1878704 1675899 1659313 1691580 1612426 1521202 1667087 1514671 1508102
4221A508102M3130M0319j39622L2613J9284p2531O6210k3399J30323j23068O5386
$$ 1508102 1551232 1591551 1451929 1484542 1503826 1431295 1497505 1474106 1604429 1481361 1546747
4210A546747j48473R4023J168q0035k1805k6372j58764q6921K1982Q6238p3628
$$ 1546747 1398274 1492297 1493465 1413430 1391625 1365253 1206489 1119568 1141550 1227788 1154160
4199A154160o4910q017o209n3894l3016J0005r5382Q4504K2439p327j48308J05974
$$ 1154160 1089250 1081233 1075024 1021130 988114 998119 902737 987241 1009680 1002353 854045 960019
4187I60019j34755M9122m3484N906k7689P2791n5362R8151j29723N9761J5102
$$ 960019 825264 874386 830902 836808 809119 881910 826548 924699 794976 854737 869839
4176H69839j27609L0376J19241j38756J14632n9678k5665M661J2200J83j9558
$$ 869839 742230 772606 891847 753091 867723 808045 782380 787041 799241 799424 779866
4165G79866K9117q0930J4107o6552J05055P792K8987q6271k6665M2919J0021r2539
$$ 779866 808983 728053 742160 675608 780663 788455 817442 731171 704506 747425 757446 664907
4153F64907J5745M917r3721J48316j04638M7063L1755p7967N7925k0678k8428
$$ 664907 680652 685569 591848 740164 635526 682589 714344 636377 694302 673624 645196
4142F45196P5094K1225k2472j8502q1926J01372K7228j42671N7640l6071M5487
$$ 645196 720290 741515 719043 700541 618615 719987 747215 604544 662184 626113 671600
4131F71600p773j2888J8610K4027m3185j3578P8812N7742k6691l9112R6450j1961
$$ 671600 663827 650939 669549 693576 650391 636813 715625 773367 746676 707564 804014 792053
$$ [...]
##END NTUPLES=NMR SPECTRUM
##END=
