##TITLE=abcd
##JCAMPDX= 6.0         $$ Bruker NMR JCAMP-DX V2.0
##DATA TYPE= NMR SPECTRUM
##DATA CLASS= NTUPLES
##ORIGIN= UXNMR, Bruker Analytische Messtechnik GmbH
##OWNER= root
$$ XWIN-NMR		Version 3.5
$$ Tue Jul 28 19:41:59 2026 Russian Standard Time (UT+4h)  servis@DPX200
##.OBSERVE FREQUENCY= 200.131235884673
##.OBSERVE NUCLEUS= ^1H
##.ACQUISITION MODE= SIMULTANEOUS
##.ACQUISITION SCHEME= undefined
##.AVERAGES= 32
##.DIGITISER RES= 18
##SPECTROMETER/DATA SYSTEM= spect
##.PULSE SEQUENCE= zg
##.SOLVENT NAME= DMSO
##.SHIFT REFERENCE= (INTERNAL, DMSO, 0, 16.4885)
##AUDIT TRAIL= $$ (NUMBER, WHEN, WHO, WHERE, WHAT)
$$ ##TITLE= Audit trail, XWIN-NMR		Version 3.5
$$ ##JCAMPDX= 5.01
$$ ##ORIGIN= Bruker BioSpin GmbH
$$ ##OWNER= servis
$$ F:\spectra/data/av/nmr/H1/1/pdata/1/auditp.txt
$$ ##AUDIT TRAIL=  $$ (NUMBER, WHEN, WHO, WHERE, WHAT)
(   1,<2026-07-28 19:40:20.45 +0400>,<servis>,<DPX200>,
      <created by zg, POWCHK disabled, PULCHK disabled
       configuration hash MD5:
       00 E9 B6 7A A2 85 ED C7 34 08 36 98 17 FE 4E 26
       data hash MD5: 32K
       41 50 4A 5D 3A 53 85 7E 20 03 72 26 D0 00 AA F9>)
(   2,<2026-07-28 19:41:39.96 +0400>,<servis>,<DPX200>,
      <Start of raw data processing
       efp BC_mod = 2 LB = 0.05 FT_mod = 6 PKNL = 1 PHC0 = -415.5518 PHC1 = 3.101563 SI = 16K 
       data hash MD5: 16K
       C9 D3 F7 A2 44 FA 09 C9 5C 39 44 46 0D 48 A6 31>)
$$ ##END=
$$ 
$$ hash MD5
$$ DB 88 26 B2 90 B2 3A 86 A7 A3 E0 8B F0 F0 DE 1A
##$RELAX= 
##$RELAX= 
##$RELAX= 
##$RELAX= 
##$RELAX= 
##$RELAX= 
##$RELAX= 
##$RELAX= 
$$ Bruker specific parameters
$$ --------------------------
##$DU= <F:\spectra>
##$EXPNO= 1
##$NAME= <H1>
##$PROCNO= 1
##$TYPE= <nmr>
##$USER= <av>
##$AMP= (0..31)
100 100 100 100 100 100 100 100 100 100 100 100 100 100 100 100 100 100 
100 100 100 100 100 100 100 100 100 100 100 100 100 100 
##$AQSEQ= 0
##$AQ_mod= 1
##$AUNM= <au_zg>
##$AUTOPOS= <>
##$BF1= 200.13
##$BF2= 200.13
##$BF3= 200.13
##$BF4= 200.13
##$BF5= 500.13
##$BF6= 500.13
##$BF7= 500.13
##$BF8= 500.13
##$BYTORDA= 1
##$CFDGTYP= 0
##$CFRGTYP= 5
##$CHEMSTR= <none>
##$CNST= (0..31)
1 1 145 1 1 1 1 1 1 1 1 1 1 1 1 1 1 1 1 1 1 1 1 1 1 1 1 1 1 1 1 1 
##$CPDPRG= <>
##$CPDPRG1= <>
##$CPDPRG2= <>
##$CPDPRG3= <>
##$CPDPRG4= <mlev>
##$CPDPRG5= <mlev>
##$CPDPRG6= <mlev>
##$CPDPRG7= <mlev>
##$CPDPRG8= <mlev>
##$CPDPRGB= <>
##$CPDPRGT= <>
##$D= (0..31)
0 2 0 0 0 0 0 0 0 0.06 0 0 0 0 0 0 0.0002 0 0 0 0 0 0 0 0 0 0 0 0 0 0 
0 
##$DATE= 1785253220
##$DBL= (0..7)
120 120 120 120 120 120 120 120 
##$DBP= (0..7)
150 150 150 150 150 150 150 150 
##$DBP07= 0
##$DBPNAM0= <>
##$DBPNAM1= <>
##$DBPNAM2= <>
##$DBPNAM3= <>
##$DBPNAM4= <>
##$DBPNAM5= <>
##$DBPNAM6= <>
##$DBPNAM7= <>
##$DBPOAL= (0..7)
0.5 0.5 0.5 0.5 0.5 0.5 0.5 0.5 
##$DBPOFFS= (0..7)
0 0 0 0 0 0 0 0 
##$DE= 6
##$DECBNUC= <off>
##$DECIM= 32
##$DECNUC= <off>
##$DECSTAT= 4
##$DIGMOD= 1
##$DIGTYP= 9
##$DL= (0..7)
0 120 120 120 120 120 120 120 
##$DP= (0..7)
150 150 150 150 150 150 150 150 
##$DP07= 0
##$DPNAME0= <>
$$ [...]
##$SUBNAM4= <"">
##$SUBNAM5= <"">
##$SUBNAM6= <"">
##$SUBNAM7= <"">
##$SUBNAM8= <"">
##$SUBNAM9= <"">
##$SW= 20.6817932712277
##$SWIBOX= (0..15)
0 0 3 0 0 0 0 0 0 0 0 0 0 0 0 0 
##$SW_h= 4139.07284768212
##$TD= 32768
##$TD0= 1
##$TE= 0
##$TE2= 300
##$TE3= 300
##$TEG= 300
##$TL= (0..7)
0 120 120 120 120 120 120 120 
##$TP= (0..7)
150 150 150 150 150 150 150 150 
##$TP07= 0
##$TPNAME0= <>
##$TPNAME1= <>
##$TPNAME2= <>
##$TPNAME3= <>
##$TPNAME4= <>
##$TPNAME5= <>
##$TPNAME6= <>
##$TPNAME7= <>
##$TPOAL= (0..7)
0.5 0.5 0.5 0.5 0.5 0.5 0.5 0.5 
##$TPOFFS= (0..7)
0 0 0 0 0 0 0 0 
##$TUNHIN= 0
##$TUNHOUT= 0
##$TUNXOUT= 0
##$USERA1= <user>
##$USERA2= <user>
##$USERA3= <user>
##$USERA4= <user>
##$USERA5= <user>
##$V9= 5
##$VALIST= <valist>
##$VCLIST= <CCCCCCCCCCCCCCC>
##$VD= 0
##$VDLIST= <DDDDDDDDDDDDDDD>
##$VPLIST= <PPPPPPPPPPPPPPP>
##$VTLIST= <TTTTTTTTTTTTTTT>
##$WBST= 1024
##$WBSW= 30
##$XGAIN= (0..3)
0 0 0 0 
##$XL= 0
##$YL= 0
##$YMAX_a= 186838
##$YMIN_a= -292271
##$ZGOPTNS= <>
##$ZL1= 120
##$ZL2= 120
##$ZL3= 120
##$ZL4= 120
##$ABSF1= 0
##$ABSF2= 0
##$ABSG= 0
##$ABSL= 0
##$ALPHA= 0
##$AQORDER= 0
##$ASSFAC= 0
##$ASSFACI= 0
##$ASSFACX= 0
##$ASSWID= 0
##$AUNMP= <proc_1d>
##$AZFE= 0.1
##$AZFW= 0.1
##$BCFW= 0
##$BC_mod= 2
##$BYTORDP= 0
##$COROFFS= 0
##$CY= 18.4799938201904
##$DATMOD= 1
##$DC= 0
##$DFILT= <>
##$DTYPP= 0
##$F1P= 9.9274215381318
##$F2P= -0.165520771350173
##$FCOR= 1
##$FTSIZE= 16384
##$FT_mod= 6
##$GAMMA= 0
##$GB= 0
##$INTBC= 1
##$INTSCL= 4.127829e-11
##$ISEN= 128
##$LB= 0.05
##$LEV0= 0
##$LPBIN= 0
##$MAXI= 10000
##$MC2= 0
##$MEAN= 0
##$ME_mod= 0
##$MI= 50
##$NCOEF= 0
##$NC_proc= -7
##$NLEV= 6
##$NOISF1= 3.799351
##$NOISF2= 2.8
##$NSP= 0
##$NTH_PI= 0
##$NZP= 0
##$OFFSET= 16.48848
##$PC= 4
##$PHC0= -415.5518
##$PHC1= 3.101563
##$PH_mod= 1
##$PKNL= yes
##$PPARMOD= 0
##$PSCAL= 4
##$PSIGN= 0
##$REVERSE= no
##$SF= 200.130005582386
##$SI= 16384
##$SIGF1= 3
##$SIGF2= 2
##$SINO= 400
##$SIOLD= 16384
##$SREGLST= <1H.CDCl3>
##$SSB= 0
##$STSI= 16384
##$STSR= 0
##$SW_p= 4139.07284768211
##$SYMM= 0
##$S_DEV= 0
##$TDeff= 32768
##$TDoff= 0
##$TI= <>
##$TILT= no
##$TM1= 0
##$TM2= 0
##$TOPLEV= 0
##$USERP1= <user>
##$USERP2= <user>
##$USERP3= <user>
##$USERP4= <user>
##$USERP5= <user>
##$WDW= 1
##$XDIM= 16384
##$YMAX_p= 290201981
##$YMIN_p= -1240141
$$ End of Bruker specific parameters
$$ ---------------------------------
##NTUPLES= NMR SPECTRUM
##VAR_NAME=  FREQUENCY,     SPECTRUM/REAL,   SPECTRUM/IMAG
##SYMBOL=    X,             R,               I
##VAR_TYPE=  INDEPENDENT,   DEPENDENT,       DEPENDENT
##VAR_FORM=  AFFN,          ASDF,            ASDF
##VAR_DIM=   16384,         16384,           16384
##UNITS=     HZ,            ARBITRARY UNITS, ARBITRARY UNITS
##FACTOR=    0.252644378177508, 1,           1
##FIRST=     3299.83951724647, 0,            0
##LAST=      -839.233330435636, 0,           0
##MIN=       -839.233330435636, -1240141,    0
##MAX=       3299.83951724647, 290201981,    0
$$ Real data points
##PAGE= N=1
##DATA TABLE= (X++(R..R)), XYDATA
$$ [...]
$$ plain form
6110 12335536 12775764 12691551 12916219 12935298 12286138 11538208 11392716 10890531 10579708 9886250
6100 9886250 10098664 10314573 9676575 10353808 10250310 10206027 10691230 10849787 11190350 11106517
6090 11106517 11497467 12345921 12932460 13076406 12471517 12318025 12450331 11074187 11320347
6081 11320347 10399619 10588780 10428490 9936911 10478403 9808479 9102448 9979716 9593369
6072 9593369 9634227 9382872 9822133 9332376 8921445 9034973 8820290 8756558 8999997 8819333
6062 8819333 9101204 8751659 8611246 9751221 9592531 9582948 9827181 9675844 9436369 9651373
6052 9651373 9149248 9812104 9706467 9660433 9834044 10023937 9867172 9556740 9891191 10406581
6042 10406581 9597067 9920723 9972122 9695045 10160347 9834709 10890693 10839644 10681586 11198988
$$ packed form
6110A2335536M40228q4213K24668J9079o49160p47930j45492n02185l10823o93458
6100I886250K12414K15909o37998O77233j03498m4283M85203J58557L40563q3833
6090A1106517L90950Q48454N86539J43946o04889j53492J32306j376144K46160
6081A1320347r20728J89161j60290m91579N41492o69924p06031Q77268l86347
6072I593369M0858k51355M39261m89757m10931J13528k14683o3732K43439j80664
6062H819333K81871l49545j40413J139975j58690r583K44233j51337k39475K15004
6052I651373n02125O62856j05637m6034J73611J89893j56765l10432L34451N15390
6042A0406581q09514L23656N1399k77077M65302l25638J055984n1049j58058N17402
$$ plain form
6032 11198988 11089880 11121721 11361585 11337980 11879677 11853679 11840821 12119617 12194716 11911493
6022 11911493 12343074 12799214 13472446 13094977 13545196 13968813 13697112 14620738 14788776
6013 14788776 15179627 15223046 15235248 16230158 15604968 16170069 16739113 16697650 16457084 16643668
6003 16643668 17299796 17474864 17791552 18346380 18498534 19089361 19124775 19685936 20041234 20826833
5993 20826833 20974425 21679497 21722108 22083894 21957614 23337827 23615961 24356714 24644426
5984 24644426 25239445 25848715 26588254 26608163 27251969 28141683 28161086 28930767 29620696 29998034
5974 29998034 30549448 31879756 31984125 32690504 33683769 34532162 34809602 35376609 36288561
5965 36288561 36905064 38206676 38323886 40138388 40975720 41675920 42539062 43660431 44573854
$$ packed form
6032A1198988j09108L1841K39864k3605N41697k5998j2858K78796P5099k83223
6022A1911493M31581M56140O73232l77469M50219M23617k71701R23626J68038
6013A4788776L90851M3419J2202R94910o25190N65101N69044m1463k40566J86584
6003A6643668O56128J75068L16688N54828J52154N90827L5414N61161L55298P85599
5993B0826833J47592P05072M2611L61786j26280J380213K78134P40753K87712
5984B4644426N95019O09270P39539J9909O43806Q89714J9403P69681O89929L77338
5974B9998034N51414J330308J04369P06379R93265Q48393K77440N67007R11952
5965C6288561O16503J301612J17210J814502Q37332P00200Q63142J121369R13423
$$ plain form
5956 44573854 45296386 46005377 46765031 47287944 47530912 48242181 48672343 48937361 49063272
5947 49063272 49534116 49878568 50097008 50627003 50364902 50716888 50975472 50168935 50595867
5938 50595867 51124798 51375537 51708044 51707096 52061747 52623072 52417444 51805995 51353851 50859620
5928 50859620 49521257 49012693 48172815 46654413 45766837 45132318 44285386 43439353 42650951
5919 42650951 41549300 40995260 39964895 39817001 40001609 39283819 39177677 38724733 38417003
5910 38417003 37403473 36825901 36216697 35421401 34552009 33481590 32297998 31375194 30563150
5901 30563150 29581381 28692006 28305859 27743650 27162979 26575513 25338739 25660363 24946571
5892 24946571 24519406 24463696 23585187 23117771 22701376 21959239 21990240 21431803 21511787 20578506
$$ packed form
5956D4573854P22532P08991P59654N22913K42968P11269M30162K65018J25911
5947D9063272M70844L44452K18440N29995k62101L51986K58584q06537M26932
5938E0595867N28931K50739L32507r48L54651N61325k05628o11449m52144m94231
5928E0859620j338363n08564q39878j518402q87576o34519q46932q46033p88402
5919D2650951j101651n54040j030365j47894J84608p17790j06142m52944l07730
5910C8417003j013530n77572o09204p95296q69392j070419j183592r22804q12044
5901C0563150r81769q89375l86147n62209n80671n87466j236774L21624p13792
5892B4946571m27165n5710q78509m67416m16395p42137L1001n58437P9984r33281
$$ plain form
5882 20578506 20016636 20178130 19306809 18455391 18514328 18302158 17701709 17451410 17589288 16657958
5872 16657958 16264465 15939633 15748864 15427859 14901788 14948700 14428155 14254584 13946115 14173516
5862 14173516 14105868 13654979 13598965 13653176 13325807 13110707 12660925 12653225 12437219 12309549
5852 12309549 12453568 12431003 12049622 11720915 11234772 11043320 10756210 10914866 11134473 10654330
5842 10654330 10314677 10103300 9439475 9969393 10078912 9747250 9715013 9773571 9597055 9925159
5832 9925159 9501593 9448226 9609848 9390475 9505877 9087666 9080729 8864671 9071226 8759031
5822 8759031 8516213 8113374 7695952 7846946 7817194 7717591 7456999 8219304 7893471 7561161
5812 7561161 7720422 7724187 7073808 6927568 7178367 7225317 7202755 6932054 6947428 7112068
$$ packed form
5882B0578506n61870J61494q71321q51418N8937k12170o00449k50299J37878r31330
5872A6657958l93493l24832j90769l21005n26071M6912n20545j73571l08469K27401
5862A4173516o7648m50889n6014N4211l27369k15100m49782p700k16006j27670
5852A2309549J44019k2565l81381l28707m86143j91452k87110J58656K19607m80143
5842A0654330l39653k11377o63825N29918J09519l31662l2237N8558j76516L28104
5832I925159m23566n3367J61622k19373J15402m18211o937k16058K06555l12195
5822H759031k42818m02839m17422J50994k9752r9603k60592P62305l25833l32310
5812G561161J59261L765o50379j46240K50799M6950k2562k70701J5374J64640
$$ plain form
5802 7112068 6519702 5941411 6629816 6339389 6165789 6284203 5907381 6181552 6032648 5578954
5792 5578954 5822418 5757066 5102164 5359152 5351022 5562402 5513770 5219900 5400234 5118361
5782 5118361 5250321 4890625 5154005 4774384 5125907 5275958 4629555 4689346 5223062 5036236
5772 5036236 4578406 4121225 4703660 4420322 4435157 4844614 4494881 4441930 4867182 4780239
5762 4780239 4337260 4522374 4299783 4398452 4421225 4428778 4648334 4810821 4620110 4641847
5752 4641847 4539121 4265180 4594773 4668236 4263321 5076823 4427259 4471045 4807408 4677420
5742 4677420 4760730 4583757 4243491 4291476 4275125 4321820 4435123 4262794 4006313 4149836
5732 4149836 4048994 4242488 3733383 4160515 4190128 4773043 4138700 4520943 4618444 4755117
$$ packed form
5802G112068n92366n78291O88405k90427j73600J18414l76822K74171j48904m53694
5792E578954K43464o5352o54902K56988q130K11380m8632k93870J80334k81873
5782E118361J31960l59696K63380l79621L51523J50051o46403N9791N33716j86826
5772E036236m57830m57181N82435k83338J4835M09457l49733n2951M25252q6943
5762D780239m42979J85114k22591R8669K2773P553K19556J62487j90711K1737
5752D641847j02726k73941L29593P3463m04915Q13502o49564M3786L36363j29988
5742D677420Q3310j76973l40266M7985j6351M6695J13303j72329k56481J43523
5732D149836j00842J93494n09105M27132K9613N82915o34343L82243R7501J36673
$$ plain form
5722 4755117 4266310 4760338 4512526 4259282 4493231 4835293 4465587 4243756 4484482 4226977
5712 4226977 4223152 4370119 4351911 4425509 4068288 4086780 4434084 4101854 4103483 4353218 4574335
5701 4574335 4924228 4502839 4767208 4900580 5119003 4700381 4554989 4991918 4894753 4876030
5691 4876030 5158618 5108256 5321395 5201293 5388013 5041986 4715654 4722963 5143167 5014793
5681 5014793 5201788 5253863 5906035 5667897 6064943 6447168 6633114 6321181 6795523 7060849
5671 7060849 7927595 7620457 7707463 8221726 7759049 8514476 8348070 7731885 8156348 7921228
5661 7921228 8194534 8020349 8216531 7549215 7812517 7819078 7546158 7466707 7929176 8155710
5651 8155710 8509153 8681303 9208600 9349583 8929110 9871062 10515135 10414085 11445993
$$ packed form
5722D755117m88807M94028k47812k53244K33949L42062l69706k21831K40726k57505
5712D226977l825J46967j8208P3598l57221J8492L47304l32230J629K49735K21117
5701D574335L49893m21389K64369J33372K18423m18622j45392M36929r7165j8723
5691D876030K82588n0362K13139j20102J86720l46027l26332P309M20204j28374
5681E014793J86995N2075O52172k38138L97046L82225J85946l11933M74342K65326
5671G060849Q66746l07138Q7006N14263m62677P55427j66406o16185M24463k35120
5661G921228K73306j74185J96182o67316K63302O561k72920p9451M62469K26534
5651H155710L53443J72150N27297J40983m20473R41952O44073j01050J031908
$$ plain form
5642 11445993 11898616 13046481 13237571 13193877 13577328 12888198 13546854 13668217 12580491
5633 12580491 13472692 12408027 12312520 11841369 11182758 11943084 11824522 11946950 11732113
5624 11732113 12247928 11996073 11802352 12574180 12417298 12922175 13501054 14482571 15157910
5615 15157910 15496301 16203601 17358047 18207876 19129040 20961731 21284834 23002171 24666058
5606 24666058 25358277 26763098 27632210 28755442 29276735 29181182 29998285 29785253 30097507
5597 30097507 29694410 29695720 29690414 29969524 29432004 30043725 30512927 31209523 31304406 32498680
5587 32498680 32996326 34071418 34467993 35665063 36589968 37762152 38926580 40986951 42734115
5578 42734115 44889618 47789181 50085078 52289750 54172997 55910892 56801125 57708492
$$ packed form
5642A1445993M52623J147865J91090m3694L83451o89130O58656J21363j087726
5633A2580491Q92201j064665r5507m71151o58611P60326j18562J22428k14837
5624A1732113N15815k51855j93721P71828j56882N04877N78879R81517O75339
5615A5157910L38391P07300J154446Q49829R21164J832691L23103J717337J663887
5606B4666058O92219J404821Q69112J123232N21293r5553Q17103k13032L12254
5597C0097507m03097J310n306K79110n37520O11721M69202O96596R4883J194274
5587C2498680M97646J075092L96575J197070R24905J172184J164428K060371J747164
5578D2734115K155503K899563K295897K204672J883247J737895Q90233R07367
$$ plain form
5570 57708492 58712084 59041909 58307423 57424798 56372757 55596119 54512009 53757194 53140244
5561 53140244 52992915 51719960 51342603 51675581 51185962 51132494 50952324 50452241 50603100
5552 50603100 49678706 50015766 50191519 50230478 50542472 51189567 52131395 53010268 53417317 54654846
5542 54654846 55867990 56017510 57355386 57925032 58383044 57821629 58285734 58579555 58985769
5533 58985769 59077019 60007366 60798901 61080211 61891364 62328943 62844481 62637492 62329895 62175251
5523 62175251 61466835 60994788 60861061 60750147 60378493 60448531 60713048 61813006 61977154
5514 61977154 62671473 64765935 65641497 66851527 69411658 71214343 73785707 77590002
5506 77590002 80916552 85986702 91257580 95304969 100833298 105900168 109609732 111224504
$$ packed form
5570E7708492J003592L29825p34486q82625j052041p76638j084110p54815o16950
5561E3140244j47329j272955l77357L32978m89619n3468j80170n00083J50859
5552E0603100r24394L37060J75753L8959L11994O47095R41828Q78873M07049J237529
5542E4654846J213144J49520J337876N69646M58012n61415M64105K93821M06214
5533E8985769R1250R30347P91535K81310Q11153M37579N15538k06989l07597j54644
5523F2175251p08416m72047j33727j10914l71654P0038K64517J099958J64148
5514F1977154O94319K094462Q75562J210030K560131J802685K571364L804295
5506G7590002L326550N070150N270878M047389N528329N066870L709564J614772
$$ plain form
5498 111224504 112089706 111274520 108020711 103702609 99342991 93635163 88654957 83482048
5490 83482048 79257377 76390035 72285752 70430197 69120721 66441915 66561747 66362867
5482 66362867 66651284 67221456 68644290 71723393 74765984 79515448 86110021 93616386
5474 93616386 102201490 110784981 119944903 129088282 135400442 140480335 142955794 141798185
5466 141798185 138879360 133029898 125263939 116703515 107530715 99006344 90145413 83263137
5458 83263137 77107263 71518521 67921925 64411909 63063054 62028043 61790543 61769355 62829315
5449 62829315 64276405 66721757 70533724 75387769 81675359 89533311 98501821 108634642
5441 108634642 119220408 128811740 137076278 143006308 146570652 146607765 144441677 139782355
$$ packed form
5498A11224504Q65202q15186l253809m318102m359618n707828m980206n172909
5490H3482048m224671k867342m104283j855555j309476k678806J19832j98880
5482F6362867K88417N70172J422834L079103L042591M749464O594573P506365
5474I3616386Q585104Q583491R159922R143379O312160N079893K475459j157609
5466A41798185k918825n849462p765959q560424r172800q524371q860931o882276
5458H3263137o155874n588742l596596l510016j348855j035011k37500k1188J059960
5449F2829315J447090K445352L811967M854045O287590P857952Q968510J0132821
5441A08634642J0585766R591332Q264538N930030L564344L7113k166088m659322
$$ plain form
5433 139782355 132840852 125049340 116816099 110023337 102753668 96895457 92271335 88715057
5425 88715057 86415472 85857140 85326978 86422653 87427933 90868382 94882197 99766636
5417 99766636 106161047 113239000 121343613 130915985 140708522 150875054 161302757 170085648
5409 170085648 177517589 182181057 184964461 184999739 183206908 180045280 174372474 168597668
5401 168597668 163049399 157693192 153065315 149631238 147125637 146247715 145567894 146653516
5393 146653516 147527262 149003172 150497438 152478614 154387458 155914498 158213948 160500177
5385 160500177 162589199 165945631 168319952 170669324 172222473 172641044 171696040 169072617
5377 169072617 165329851 160265787 154229442 147846388 141597354 135473538 129053907 122345058
$$ packed form
5433A39782355o941503p791512q233241o792762p269669n858211m624122l556278
5425H8715057k299585n58332n30162J095675J005280L440449M013815M884439
5417I9766636O394411P077953Q104613R572372R792537J0166532J0427703Q782891
5409A70085648P431941M663468K783404L5278j792831l161628n672806n774806
5401A68597668n548269n356207m627877l434077k505601q77922o79821J085622
5393A46653516Q73746J475910J494266J981176J908844J527040K299450K286229
5385A60500177K089022L356432K374321K349372J553149M18571r45004k623423
5377A69072617l742766n064064o036345o383054o249034o123816o419631o708849
$$ plain form
5369 122345058 116934022 111497180 106152935 100867653 95766490 91173020 86863229 82301042
5361 82301042 77618587 73570112 69091401 66007419 61900356 58763114 55964017 54028911
5353 54028911 51734246 49414511 47921690 46095139 44394954 42891974 41931129 40782831
5345 40782831 40042108 38824550 37447361 36620293 35154506 34617008 33293732 32550618 31645561
5336 31645561 30554517 29813717 29139450 28651225 27770896 27963010 27373552 27082929 26596869
5327 26596869 26805341 26742488 26775525 27628788 27762374 29027395 30355060 32917862 36379384
5318 36379384 39413440 41908919 44497141 46485907 48994826 53081880 57265050 62873196
5310 62873196 67374385 69450280 70607483 72458837 74661510 79345347 84210109 87917285
$$ packed form
5369A22345058n411036n436842n344245n285282n101163m593470m309791m562187
5361H2301042m682455m048475m478711l083982m107063l137242k799097j935106
5353E4028911k294665k319735j492821j826551j700185j502980r60845j148298
5345D0782831p40723j217558j377189q27068j465787n37498j323276p43114r05057
5336C1645561j091044p40800o74267m88225q80329J92114n89458k90623m86060
5327B6596869K08472o2853L3037Q53263J33586J265021J327665K562802L461522
5318C6379384L034056K495479K588222J988766K508919M087054M183170N608146
5310F2873196M501189K075895J157203J851354K202673M683837M864762L707176
$$ plain form
5302 87917285 89274149 88105972 86618868 84495093 82832148 82099265 80615806 78200761
5294 78200761 74781955 70514280 66438146 63015057 59377744 56305821 53018698 48958515
5286 48958515 45296040 41866746 38445026 35388464 31758641 29015694 26482517 24217309
5278 24217309 22896642 21956137 20889914 20444005 19798936 19440485 19502300 18664350 19577675
5269 19577675 19888124 20378611 21114091 22105117 22432585 22172741 21385105 21230194 20553489
5260 20553489 19797757 19160046 18573596 17201918 17005844 17310517 16748955 16115851 16336468
5251 16336468 15984078 16070138 16167470 15956153 16631245 16332683 16499668 16643616 16679578 16303773
5241 16303773 16966808 16610459 17155264 16988348 16915576 16936553 16587315 16421220 17152732 16979542
$$ packed form
5302H7917285J356864j168177j487104k123775j662945p32883j483459k415045
5294G8200761l418806m267675m076134l423089l637313l071923l287123m060183
5286D8958515l662475l429294l421720l056562l629823k742947k533177k265208
5278B4217309j320667r40505j066223m45909o45069l58451O1815q37950R13325
5269A9577675L10449M90487P35480R91026L27468k59844p87636j54911o76705
5260B0553489p55732o37711n86450j371678j96074L04673n61562o33104K20617
5251A6336468l52390Q6060R7332k11317O75092k98562J66985J43948L5962l75805
5241A6303773O63035l56349N44805j66916p2772K0977l49238j66095P31512j73190
$$ plain form
5231 16979542 17155958 17702709 18009320 18254421 19005159 19217656 19832821 20899039 20526279
5222 20526279 21149463 21966371 23160212 23182328 23829936 24896699 25827406 26636582 27898835
5213 27898835 29134014 30410700 32230272 34625930 36837125 38768206 41133923 43649752
5205 43649752 45912266 48427159 50375484 52305556 53516525 55231697 56923876 58208387
5197 58208387 59309078 60524917 62159842 63145156 64460648 65782747 67794624 69720369
5189 69720369 72385392 74918097 78282357 80883197 84458176 88015767 90272273 93821939
5181 93821939 94924967 96223869 97017112 96153877 94238589 92618546 89577602 86896181
5173 86896181 83146810 80060483 76722035 73244901 69955189 66910173 64867332 62355370
$$ packed form
5231A6979542J76416N46751L06611K45101P50738K12497O15165J066218l72760
5222B0526279O23184Q16908J193841K2116O47608J066763R30707Q09176J262253
5213B7898835J235179J276686J819572K395658K211195J931081K365717K515829
5205D3649752K262514K514893J948325J930072J210969J715172J692179J284511
5197E8208387J100691J215839J634925R85314J315492J322099K011877J925745
5189F9720369K665023K532705L364260K600840L574979L557591K256506L549666
5181I3821939J103028J298902P93243q63235j915288j620043l040944k681421
5173H6896181l749371l086327l338448l477134l289712l045016k042841k511962
$$ plain form
5165 62355370 60403023 59185223 57962952 57189274 56707048 56607105 56019113 55645090 55670720
5156 55670720 54935255 53643241 52255048 50492941 48502030 45456209 43050133 40716658
5148 40716658 38131017 35279221 33107443 30922057 28740751 26813738 25010751 23782984
5140 23782984 22151424 20722630 19507054 18634890 17418178 16537522 15966350 15456507 15242222
5131 15242222 14203928 13858109 13473686 12862625 12974996 12341238 12128545 11841981 11460482
5122 11460482 11166067 11216574 10791334 10608219 10493856 10213100 9897677 9425525 9287556 8904486
5112 8904486 8587650 8586241 8326259 7754901 7699431 7752877 7766549 7592108 7348746 7597159
5102 7597159 7224211 7054217 6773564 6785068 6486241 6320602 6183948 6057720 5989468 5570109
$$ packed form
5165F2355370j952347j217800j222271p73678m82226r9943n87992l74023K5630
5156E5670720p35465j292014j388193j762107j990911l045821k406076k333475
5148D0716658k585641k851796k171778k185386k181306j927013j802987j227767
5140B3782984j631560j428794j215576q72164j216712q80656n71172n09843k14285
5131A5242222j038294l45819l84423o11061J12371o33758k12693k86564l81499
5122A1460482k94415N0507m25240j83115j14363k80756l15423m72152j37969l83070
5112H904486l16836j409k59982n71358n5470N3446J3672j74441k43362K48413
5102G597159l72948j69994k80653J1504k98827j65639j36654j26228o8252m19359
$$ plain form
5092 5570109 5945646 6146717 5919661 5880031 5878009 5763325 6072914 5561476 5544590 5660582
5082 5660582 5166487 5701186 5434669 5469578 5408852 4872221 5366323 5325011 4848434 5352115
5072 5352115 4707663 4994806 4780025 4860025 4738401 4855714 5296862 4857359 5288914 4854682
5062 4854682 4686615 4785767 5217044 4731778 4992860 4774991 4742306 5051405 5253964 5190995
5052 5190995 5022001 4800493 5150442 5212770 5080330 5522225 5487152 5359669 5009512 5564107
5042 5564107 5503909 5084579 5580268 5689977 5249758 5747532 5524237 5648026 5637952 5914120
5032 5914120 5952661 6297870 6305661 6443455 6565253 6395950 7473681 7077461 6746851 7361388
5022 7361388 7531159 7750931 7574979 7416901 8145377 8169653 8004676 8147060 8068031 8511135
$$ packed form
5092E570109L75537K01071k27056l9630k022j14684L09589n11438j6886J15992
5082E660582m94095N34699k66517L4909o0726n36631M94102m1312m76577N03681
5072E352115o44452K87143k14781Q0000j21624J17313M41148m39503M31555m34232
5062D854682j68067R9152M31277m85266K61082k17869l2685L09099K02559o2969
5052E190995j68994k21508L49949O2328j32440M41895l5073j27483l50157N54595
5042E564107o0198m19330M95689J09709m40219M97774k23295J23789j0074K76168
5032E914120L8541L45209P791J37794J21798j69303J077731l96220l30610O14537
5022G361388J69771K19772j75952j58078P28476K4276j64977J42384p9029M43104
$$ plain form
5012 8511135 9498019 10676968 11983362 13756806 15097800 16616590 17063480 17285118 17203575
5003 17203575 15818449 15120701 14635439 13263782 12309070 11921610 11955154 12145490 12014150
4994 12014150 12482501 13122877 13175996 13674320 13673315 14517935 14822094 15230892 15662546 16400831
4984 16400831 15834172 16561772 17513476 17554316 18417488 18523568 19534557 19981120 20882091
4975 20882091 21413084 22789024 23831383 25184677 27346907 29340760 31532445 33836288
4967 33836288 34966001 37065143 37372831 37260727 37257009 36736221 35633824 34926727 34670623
4958 34670623 33675960 33448294 34426501 35132700 36517685 37661656 39590982 41209538 42317366
4949 42317366 43908083 46052916 48519842 50063894 53154599 56333132 59119197 62373197
$$ packed form
5012H511135R86884J178949J306394J773444J340994J518790M46890K21638q1543
5003A7203575j385126o97748m85262j371657r54712l87460L3544J90336j31340
4994A2014150M68351O40376N3119M98324j005Q44620L04159M08798M31654P38285
4984A6400831n66659P27600R51704M0840Q63172J06080J010989M46563R00971
4975B0882091N30993J375940J042359J353294K162230J993853K191685K303843
4967C3836288J129713K099142L07688j12104l718n20788j102397p07097k56104
4958C4670623r94663k27666R78207P06199J384985J143971J929326J618556J107828
4949D2317366J590717K144833K466926J544052L090705L178533K786065L254000
$$ plain form
4941 62373197 66047737 70695933 74704477 78858056 82446077 84259675 85039186 82906638
4933 82906638 80449624 76411928 72118489 68600647 65079561 62170921 60426283 58885308
4925 58885308 59402121 58936122 59541453 60324632 61189034 62605764 63969724 65629581 67878662
4916 67878662 70657098 73003410 75624102 79024125 82343923 87539632 92261036 96241806
4908 96241806 100244197 102029471 102215011 100666685 96493753 92027801 85295874 79188959
4900 79188959 72891870 66650076 62092367 58297015 55723107 54505012 53439069 52999719
4892 52999719 53258104 53307112 52935673 52824286 52647366 51780106 52186457 53659616 54361526
4883 54361526 56207951 59305957 62407546 65144409 66538375 68346523 67701922 66133288
$$ packed form
4941F2373197L674540M648196M008544M153579L588021J813598P79511k132548
4933H2906638k457014m037696m293439l517842l521086k908640j744638j540975
4925E8885308N16813m65999O05331P83179Q64402J416730J363960J659857K249081
4916F7878662K778436K346312K620692L400023L319798N195709M721404L980770
4908I6241806M002391J785274J85540j548326m172932m465952o731927o106915
4900G9188959o297089o241794m557709l795352k573908j218095j065943m39350
4892E2999719K58385M9008l71439j11387j76920q67260M06351J473159P01910
4883E4361526J846425L098006L101589K736863J393966J808148o44601j568634
$$ plain form
4875 66133288 62710379 58877782 55122788 50007287 46167477 43001744 38996093 36112519
4867 36112519 34725764 32296254 30439228 28880955 28277957 27397940 26419806 25889820 25534349
4858 25534349 24689167 24117772 24430033 23890544 24348652 24510261 25778869 25735063 26080330
4849 26080330 26100974 26231675 26151975 25030710 23653575 22706411 21301989 20305138 19327618
4840 19327618 18396971 17480966 16667061 16168502 15441397 15071664 14712233 14601684 14319232
4831 14319232 13961492 13823272 13767413 13522219 14189001 13737475 13847570 14329649 13648015 14497938
4821 14497938 14632858 13969969 14550504 14738365 14656042 14832877 15005333 15899512 15327912 15622757
4811 15622757 16152254 16843854 16736616 16929394 17484087 17838558 17983082 18835469 19450792
$$ packed form
4875F6133288l422909l832597l754994n115501l839810l165733m005651k883574
4867C6112519j386755k429510j857026j558273o02998q80017r78134n29986l55471
4858B5534349q45182n71395L12261n39489M58108J61609J268608m3806L45267
4849B6080330K0644J30701p9700j121265j377135r47164j404422r96851r77520
4840A9327618r30647r16005q13905m98559p27105l69733l59431j10549k82452
4831A4319232l57740j38220n5859k45194O66782m51526J10095M82079o81634Q49923
4821A4497938J34920o62889N80535J87861q2323J76835J72456Q94179n71600K94845
4811A5622757N29497O91600j07238J92778N54693L54471J44524Q52387O15323
$$ plain form
4802 19450792 19606654 19930235 20236183 20935725 21056683 21418971 22264784 22766510 23238691
4793 23238691 24258693 24976488 26535832 27217029 29085887 30645933 31526057 32977543 35028428
4784 35028428 35979100 37650421 39114525 40513098 42183625 43953354 45006856 47064807
4776 47064807 48363678 49819240 51566037 52596859 55075994 56664626 58012254 59943382
4768 59943382 61922789 63579909 65377013 67083447 68542314 70086702 72029772 74215059
4760 74215059 76065005 78407301 80714021 82454043 84654462 85972715 87541650 89988773
4752 89988773 91553005 93737302 96712522 99434285 102717726 107355123 111243558 115034233
4744 115034233 119004595 121906844 125220737 127748811 130412270 132337388 134913758 137636390
$$ packed form
4802A9450792J55862L23581L05948O99542J20958L62288Q45813N01726M72181
4793B3238691J020002P17795J559344O81197J868858J560046Q80124J451486K050885
4784C5028428R50672J671321J464104J398573J670527J769729J053502K057951
4776D7064807J298871J455562J746797J030822K479135J588632J347628J931128
4768E9943382J979407J657120J797104J706434J458867J544388J943070K185287
4760G4215059J849946K342296K306720J740022K200419J318253J568935K447123
4752H9988773J564232K184297K975220K721763L283441M637397L888435L790675
4744A15034233L970362K902249L313893K528074K663459J925118K576370K722632
$$ plain form
4736 137636390 141194890 144676710 150207889 156626553 162742840 168152609 172893081 175924351
4728 175924351 177901993 178824642 179658141 180748606 181695855 184736808 189036629 193932999
4720 193932999 199030377 204029838 208730677 212026670 212312324 212023750 209393185 204047271
4712 204047271 199434882 193615043 187369250 182273773 178126171 174814563 171890856 169016832
4704 169016832 165898613 161923814 156312147 150890188 144630292 137912909 131227065 125946699
4696 125946699 120751202 116347821 112818868 109344629 107214293 103415038 100215622 97086576
4688 97086576 92941784 88684559 84142651 80554258 76306746 72111862 67796146 64633569
4680 64633569 60984045 58509502 54990861 52044654 50081698 47535998 46045862 44113740
$$ packed form
4736A37636390L558500L481820N531179O418664O116287N409769M740472L031270
4728A75924351J977642R22649Q33499J090465R47249L040953M299821M896370
4720A93932999N097378M999461M700839L295993K85654k88574k630565n345914
4712B04047271m612389n819839o245793n095477m147602l311608k923707k874024
4704A69016832l118219l974799n611667n421959o259896o717383o685844n280366
4696A25946699n195497m403381l528953l474239k130336l799255l199416l129046
4688I7086576m144792m257225m541908l588393m247512m194884m315716l162577
4680F4633569l649524k474543l518641k946207j962956k545700j490136j932122
$$ plain form
4672 44113740 42249897 40821510 39922912 39195979 38032559 37206797 36348843 35077436 34312150
4663 34312150 33572320 33225611 31303206 30535464 30348328 29260737 27618603 27182840 26288916
4654 26288916 24843423 24029904 23125366 22904764 22090536 21170456 20880255 20209110 19091462
4645 19091462 18484965 17702347 17066377 16361070 15964946 15061780 14806909 14256786 14163840 13735160
4635 13735160 13487513 12998082 12713750 12387616 11553999 11743888 11087970 10750565 10842989 10587730
4625 10587730 10416310 10384201 10035490 9965805 9986537 10058215 8601012 9083079 9442695 8409967
4615 8409967 8822116 8129245 7907154 8336718 7815511 7696808 8214447 7739274 7703626 7478259
4605 7478259 7080601 7211910 6599818 6641885 6701150 6460701 6467484 6238070 6292864 6452457
$$ packed form
4672D4113740j863843j428387q98598p26933j163420q25762q57954j271407p65286
4663C4312150p39830l46709j922405p67742j87136j087591j642134m35763q93924
4654B6288916j445493q13519r04538k20602q14228r20080k90201o71145j117648
4645A9091462o06497p82618o35970p05307l96124r03166k54871n50123r2946m28680
4635A3735160k47647m89431k84332l26134q33617J89889o55918l37405R2424k55259
4625A0587730j71420l2109l48711o9685K0732P1678j457203M82067L59616j032728
4615H409967M12149o92871k22091M29564n21207j18703N17639m75173l5648k25367
4605G478259l97658J31309o12092M2067N9265k40449O783k29414N4794J59593
$$ plain form
4595 6452457 6418651 6478553 6122035 6135476 6130201 5509917 6141151 5914483 6054931 5792358
4585 5792358 6301047 5994252 5772688 5504578 5388427 5262992 5613069 4963602 5420530 5468323
4575 5468323 5073970 5467789 5131083 5302074 5429562 4984683 5430887 4709345 5447225 5545145
4565 5545145 5268461 5373604 4957039 4862055 4756249 4844667 5126976 4857993 4628235 4910796
4555 4910796 4098987 4217272 3939682 4564444 3874932 4165549 4420209 4264193 4416731 4149370
4545 4149370 4407655 4788832 3833429 3614641 4252699 3380275 3817115 3818609 4228435 4347079
4535 4347079 3960378 4505663 4333701 3647668 4110752 4184083 4152878 4176099 3574062 3902517
4525 3902517 3564914 3578812 3737241 3952715 4584584 3960683 4366850 4132073 3897775 4190983
$$ packed form
4595F452457l3806N9902l56518J3441n275o20284O31234k26668J40448k62573
4585E792358N08689l06795k21564k68110j16151j25435L50077o49467M56928M7793
4575E468323l94353L93819l36706J70991J27488m44879M46204p21542P37880R7920
4565E545145k76684J05143m16565r4984j05806Q8418K82309k68983k29758K82561
4555D910796q11809J18285k77590O24762o89512K90617K54660j56016J52538k67361
4545D149370K58285L81177r55403k18788O38058q72424M36840J494M09826J18644
4535D347079l86701N45285j71962o86033M63084P3331l1205K3221o02037L28455
4525C902517l37603J3898J58429K15474O31869o23901M06167k34777k34298K93208
$$ plain form
4515 4190983 4324868 3732159 4114594 3771580 4655783 3985642 4567792 3905033 4491214 4591073
4505 4591073 3952445 4098398 4728465 4637671 5062377 5085705 5541046 5645600 5735318 5469778
4495 5469778 5797885 5077562 5386019 5790233 5445309 5174982 5244187 5124195 4817404 4088204
4485 4088204 4654456 4320447 4274908 4136151 4532645 4561065 4094422 4212201 4563387 4050306
4475 4050306 4630726 4252742 4517036 4394006 4237757 4642541 4859841 4393698 4854675 4900224
4465 4900224 5704923 5509272 5757390 6281020 6112867 5849530 6018845 5013119 5187145
4456 5187145 4739501 4201285 4146672 4189442 4227890 4093153 4626435 4195926 3875252 4373453
4446 4373453 4760695 4358092 4679707 4649850 4322244 4378492 4372368 4504646 4450345 4175346
$$ packed form
4515D190983J33885n92709L82435l43014Q84203o70141N82150o62759N86181R9859
4505D591073o38628J45953O30067r0794M24706K3328M55341J04554Q9718k65540
4495E469778L28107p20323L08457M04214l44924k70327O9205j19992l06791p29200
4485D088204N66252l34009m5539j38757L96494K8420m66643J17779L51186n13081
4475D050306N80420l77984K64294j23030j56249M04784K17300m66143M60977M5549
4465D900224Q04699j95651K48118N23630j68153k63337J69315j005726J74026
4456E187145m47644n38216n4613M2770L8448j34737N33282m30509l20674M98201
4446D373453L87242m02603L21615k9857l27606N6248o124J32278n4301k74999
$$ plain form
4436 4175346 5070333 5303810 4908343 5743874 5469674 5175264 4893294 4494419 4741027 4630781
4426 4630781 4520063 4993835 5386142 4441360 4421752 4703694 4664330 4344662 4803094 4240359
4416 4240359 4680265 5427138 5192253 5430851 5368954 5110966 5445703 5241455 5029040 5065913
4406 5065913 5298768 5005420 5272140 5211503 5298933 5398231 5273073 5166558 5316898 5345585
4396 5345585 5157641 6133110 5784276 5916438 6254046 6271978 6206731 6572374 7249996 7774634
4386 7774634 7710967 8067155 7939420 7972739 7753408 8300017 8743957 8445864 9030715 9593159
4376 9593159 10291274 11980942 14137088 17209203 21182569 23823652 25485992 25735316 24814778
4367 24814778 23898743 22078194 19688144 17916974 15978150 15326798 14070378 12958372
$$ packed form
4436D175346Q94987K33477l95467Q35531k74200k94410k81970l98875K46608j10246
4426D630781j10718M73772L92307r44782j9608K81942l9364l19668M58432n62735
4416D240359M39906P46873k34885K38598o1897k57988L34737k04248k12415L6873
4406E065913K32855k93348K66720o0637Q7430R9298j25158j06515J50340K8687
4396E345585j87944R75469l48834J32162L37608J7932o5247L65643O77622N24638
4386G774634o3667L56188j27735L3319k19331N46609M43940k98093N84851N62444
4376I593159O98115J689668K156146L072115L973366K641083J662340K49324r20538
4367B4814778r16035j820549k390050j771170j938824o51352j256420j112006
$$ plain form
4359 12958372 13141651 12997473 12758786 12892532 12840383 13138935 13327628 13334944 13784485 14677582
4349 14677582 15671278 16769392 19674685 23621212 29966178 37307999 43683255 46736058
4341 46736058 46645500 45863017 42842717 38655687 34512219 30258195 26225423 23378612 20977714
4332 20977714 20140792 18869859 18258949 17883944 17478740 17364739 16992069 17415585 18097871
4323 18097871 18368877 19405899 20874149 21684603 23465862 25850691 29172888 32760844
4315 32760844 36760291 38794572 39843261 40903955 40795564 40440391 40097258 39462298 38798029
4306 38798029 39028371 38638133 38332434 37994245 37328629 35960420 33760450 31514161 29618229
4297 29618229 26705657 24307772 23333373 21298794 19787437 19115218 18290116 17165497 17117296
$$ packed form
4359A2958372J83279j44178k38687J33746n2149K98552J88693P316M49541Q93097
4349A4677582R93696J098114K905293L946527O344966P341821O375256L052803
4341D6736058r0558p82483l020300m187030m143468m254024m032772k846811k400898
4332B0977714q36922j270933o10910l75005m05204j14001l72670M23516O82286
4323A8097871K71006J037022J468250Q10454J781259K384829L322197L587956
4315C2760844L999447K034281J048689J060694j08391l55173l43133o34960o64269
4306C8798029K30342l90238l05699l38189o65616j368209k199970k246289j895932
4297B9618229k912572k397885r74399k034579j511357o72219q25102j124619m8201
$$ plain form
4288 17117296 16233381 15634833 15435535 15079450 14564898 14542703 14183736 14207010 14233070 13631094
4278 13631094 14198334 14223654 14899389 15802731 16792821 17652170 17799350 18757383 18260163 18114157
4268 18114157 17553010 16264859 15741992 15340350 14580362 14538545 13486180 13092932 13201610
4259 13201610 12866804 12076853 12251432 11883708 11946630 12034642 12519075 13116094 13360613 13906730
4249 13906730 14137608 15212172 17314514 19294793 21738704 24203082 24604734 24301745 24108494
4240 24108494 23515707 22369643 22186958 21356720 22089588 23865804 26782002 30352474 32407175
4231 32407175 32402056 31830316 29669884 27094152 24537153 21682641 19515142 17020554 16196096
4222 16196096 15267093 14547011 14280287 14613795 14981335 15382456 15277553 15137572 14672033
$$ packed form
4288A7117296q83915n98548j99298l56085n14552k2195l58967K3274K6060o01976
4278A3631094N67240K5320O75735R03342R90090Q59349J47180R58033m97220j46006
4268A8114157n61147j288151n22867m01642p59988m1817j052365l93248J08678
4259A3201610l34806p89951J74579l67724O2922Q8012M84433N97019K44519N46117
4249A3906730K30878J074564K102342J980279K443911K464378M01652l02989j93251
4240B4108494n92787j146064j82685q30238P32868J776216K916198L570472K054701
4231C2407175n119n71740k160432k575732k556999k854512k167499k494588q24458
4222A6196096r29003p20082k66724L33508L67540M01121j04903j39981m65539
$$ plain form
4213 14672033 13980686 13620599 12575463 12480768 10807900 10646115 9747892 9302173 8849094
4204 8849094 7769367 8167302 7466969 7086265 7233021 6736622 7140043 6522309 6094769
4195 6094769 6830307 6250772 6244711 6210728 6209156 6443706 6348189 6204936 6166956 5793802 5604318
4184 5604318 5558992 6000199 5235527 5414560 5710545 4891425 4919470 5460262 4609702 5194302
4174 5194302 4438318 4848938 4887419 4193875 4535897 4405793 4475051 4442776 3930969 3855414
4164 3855414 3949287 3829022 3821426 4328683 4076844 3860783 3590507 3993124 3324325 3668153
4154 3668153 4651831 3666448 3916100 3899943 4232217 3646151 3536311 3638653 3446456 3606567
4144 3606567 3495395 3312636 3444530 3035878 3036311 3487046 3113899 3167946 2455065 3274304
$$ packed form
4213A4672033o91347l60087j045136r4695j672868j61785q98223m45719m53079
4204H849094j079727L97935p00333l80704J46756m96399M03421o17734m27540
4195F094769P35538n79535o061l3983j572K34550r5517j43253l7980l73154j89484
4184E604318m5326M41207p64672J79033K95985q19120K8045N40792q50560N84600
4174E194302p55984M10620L8481o93544L42022j30104O9258l2275n11807p5555
4164C855414R3873j20265p596N07257k51839k16061k70276M02617o68799L43828
4154C668153R83678r85383K49652j6157L32274n86066j09840J02342j92197J60111
4144C606567j11172j82759J31894m08652M33M50735l73147N4047p12881Q19239
$$ plain form
4134 3274304 3261269 2466260 3053188 3306932 2373491 2763632 2926774 2511884 2971833 2873981
4124 2873981 2801961 2996981 3262236 3014369 2613974 2727355 2882037 2483459 3061511 2916324
4114 2916324 2939021 2727391 3189365 2950682 2507759 2949991 2100606 2639698 2714752 2481919
4104 2481919 2690629 2343936 2521438 3382317 2501873 3171692 2828786 2451052 2714813 2553913
4094 2553913 3102402 2674539 2886650 2749901 2753989 2937922 2628898 3053902 3287652 2963788
4084 2963788 3055768 3465880 3344393 3409575 3117047 3677197 3073954 3117115 3391428 3069911
4074 3069911 3564960 3297906 3590504 3498428 2678082 2683276 3193130 3143296 3870772 3547217
4064 3547217 4005864 3935913 3204315 3621471 3544740 3030580 2976812 3584030 3614167 4170125
$$ packed form
4134C274304j3035p95009N86928K53744r33441L90141J63142m14890M59949r7852
4124B873981p2020J95020K65255k47867m00395J13381J54682l98578N78052j45187
4114B916324K2697k11630M61974k38683m42923M42232q49385N39092P5054k32833
4104B481919K08710l46693J77502Q60879q80444O69819l42906l77734K63761j60900
4094B553913N48489m27863K12111j36749M088J83933l09024M25004K33750l23864
4084B963788R1980M10112j21487O5182k92528N60150o03243M3161K74313l21517
4074C069911M95049k67054K92598r2076q20346N194N09854m9834P27476l23555
4064C547217M58647o9951p31598M17156p6731n14160n3768O07218L0137N55958
$$ plain form
4054 4170125 4107835 4286660 4616194 4725232 4492811 4469733 4655419 4691993 4802955 4953925
4044 4953925 5825112 5234459 5784667 5195354 5025098 5141813 5005650 4998658 4963661 5101605
4034 5101605 4993902 5073739 5268078 5191760 5923602 5632540 5500726 5910920 6359332 6483460
4024 6483460 6950398 7140538 7916660 7909527 8585463 8929603 8762465 8812992 8696627 8460895
4014 8460895 8447069 7785613 7388938 7300287 6485648 6139817 6053894 5846297 6142874 5977542
4004 5977542 6111413 5576301 6029501 5933783 6485571 6508410 6634373 7166681 7535259 7873056
3994 7873056 8078255 8685693 8651648 8088918 8328630 7868765 7914831 7272732 6903355 6365254
3984 6365254 6118260 5967420 5537271 5710339 5181565 5359557 5484094 5221310 5366307 5087004
$$ packed form
4054D170125o2290J78825L29534J09038k32421k3078J85686L6574J10962J50970
4044D953925Q71187n90653N50208n89313j70256J16715j36163o992l4997J37944
4034E101605j07703P9837J94339p6318P31842k91062j31814M10194M48412J24128
4024F483460M66938J90140P76122p133O75936L44140j67138N0527j16365k35732
4014H460895j3826o61456l96675q8651q14639l45831q5923k07597K96577j65332
4004E977542J33871n35112M53200r5718N51788K2839J25963N32308L68578L37797
3994G873056K05199O07438l4045n62730K39712m59865M6066o42099l69377n38101
3984F365254k46994j50840m30149J73068n28774J77992J24537k62784J44997k79303
$$ plain form
3974 5087004 4590151 4957313 4845347 4672806 5501102 4424191 4582304 4686794 4615791 4733751
3964 4733751 3745866 4797745 4565538 3524589 4062230 3596335 3741952 3356564 3464186
3955 3464186 3387459 3080067 2962891 3159864 3258876 2619062 2537620 2916951 2613306 2746959
3945 2746959 2665992 2714327 2981987 3093521 2464238 2604738 2169959 2001789 2558333 1915407
3935 1915407 2109297 2269613 1785139 1959526 1821919 1774076 1811316 1794420 2066019 2120703
3925 2120703 1831477 2084037 1750077 1550312 1446431 1318048 1892089 1962823 1158956 1091279
3915 1091279 1671048 773258 1354694 1521483 1881282 1620619 1863206 1570274 1817180 1897194
3905 1897194 1817059 1956634 1692461 1087515 1676713 1304433 1650153 1302553 988100 1209928
$$ packed form
3974E087004m96853L67162j11966j72541Q28296j076911J58113J04490p1003J17960
3964D733751r87885J051879k32207j040949N37641m65895J45617l85388J07622
3955C464186p6727l07392j17176J96973R9012o39814q1442L79331l03645J33653
3945B746959q0967M8335K67660J11534o29283J40500m34779j68170N56544o42926
3935A915407J93890J60316m84474J74387j37607m7843L7240j6896K71599N4684
3925B120703k89226K52560l33960j99765j03881j28383N74041P0734q03867o7677
3915A091279N79769q97790N81436J66789L59799k60663K42587k92932K46906Q0014
3905A897194q0135J39575k64173o04946N89198l72280L45720l47600l14453K21828
$$ plain form
3895 1209928 1102814 1213518 1650533 978126 1171325 1304337 825082 1500188 1243207 1008685
3885 1008685 1118426 917214 1245950 1021854 1380918 1019049 1199725 1141985 1250188 1477361
3875 1477361 980117 1205185 1028293 586287 827320 1137449 828397 799049 1275230 995506
3865 995506 570551 536763 896305 69727 364061 498302 713632 351834 654792 1036253
3855 1036253 875664 706356 538409 617119 107392 316642 213876 725230 633482 656119
3845 656119 353544 821667 705890 574287 972377 435055 284105 1080926 732107 799239
3835 799239 612254 585424 1009122 448058 468117 253394 605165 350160 70931 643106
3825 643106 370460 289414 623314 973181 499698 607458 205683 241663 660395 339324
$$ packed form
3895A209928j07114J10704M37015o72407J93199J33012m79255O75106k56981k34522
3885A008685J09741k01212L28736k24096L59064l61869J80676n7740J08203K27173
3875A477361m97244K25068j76892m42006K41033L10129l09052k9348M76181k79724
3865I95506m24955l3788L59542q26578K94334J34241K15330l61798L02958L81461
3855A036253j60589j69308j67947P8710n09727K09250j02766N11354r1748K2637
3845F56119l02575M68123j15777j31603L98090n37322j50950P96821l48819O7132
3835G99239j86985k6830M23698n61064K0059k14723L51771k55005k79229N72175
3825F43106k72646q1046L33900L49867m73483J07760m01775L5980M18732l21071
$$ plain form
3815 339324 209286 526788 437992 -88450 725522 324595 352099 519436 792970 667689
3805 667689 313341 748486 783288 225417 152715 343135 481454 122352 322027 435618
3795 435618 227472 417961 463400 429817 388659 107241 61267 238639 376650 288282 145798
3784 145798 545664 158627 174720 1164006 666136 439991 224155 497451 599138 313736
3774 313736 531770 252597 82795 205463 269655 680174 389340 -78220 263486 398712
3764 398712 309115 -52492 -44157 301455 443934 421122 255268 472072 196000 443096
3754 443096 480818 213593 328403 405689 569740 450000 384664 227568 224048 290032 258715
3743 258715 562188 -1667 186079 154231 208874 341366 274814 188889 313940 35697
$$ packed form
3815C39324j30038L17502q8796n26442Q13972m00927K7504J67337K73534j25281
3805F67689l54348M35145L4802n57871p2702J90420J38319l59102J99675J13591
3795D35618k08146J90489M5439l3583m1158k81418m5974J77372J38011q8368j42484
3784A45798L99866l87037J6093R89286m97870k26145k15836K73296J01687k85402
3774C13736K18034k79173j69802J22668O4192M10519k90834m67560L41706J35226
3764C98712q9597l61607Q335L45612J42479k2812j65854K16804k76072K47096
3754D43096L7722k67225J14810P7286J64051j19740o5336j57096l520O5984l1317
3743B58715L03473n63855J87746l1848N4643J32492o6552q5925J25051k78243
$$ plain form
3733 35697 149097 185405 120114 138558 171602 263184 -111063 35556 314019 -2534 189337
3722 189337 611237 1309 325718 621885 487594 538262 627909 318478 493734 538080
3712 538080 -13161 -175418 -32856 -393752 9782 273486 358452 133749 -59571 137064
3702 137064 287407 271732 74104 896311 336299 467100 411317 198302 -142528 -163536
3692 -163536 227350 806420 -328097 742981 237419 847888 42692 -316323 -18520
3683 -18520 268018 11062 11525 101201 279744 620860 257857 204797 362805 278956 402904
3672 402904 324786 -113996 177101 76758 121785 361049 389676 308922 309336 331305 246995
3661 246995 57748 -223085 565434 717336 452307 685897 607668 417391 254495 182229
$$ packed form
3733C5697J13400L6308o5291J8444L3044R1582l74247J46619K78463l16553J91871
3722A89337M21900o09928L24409K96167j34291N0668Q9647l09431J75256M4346
3712E38080n51241j62257J42562l60896M03534K63704Q4966k24703j93320J96635
3702A37064J50343j5675j97628Q22207n60012J30801n5783k13015l40830k1008
3692a63536L90886N79070j134517J071078n05562O10469q05196l59015K97803
3683a8520K86538k56956M63Q9676J78543L41116l63003n3060J58008q3849J23948
3672D02904p8118m38782K91097j00343M5027K39264K8627q0754M14K1969q4310
3661B46995j89247k80833P88519J51902k65029K33590p8229j90277j62896p2266
$$ plain form
3651 182229 247452 295395 321124 317852 370542 -168590 409126 358867 936171 338017 -252484
3640 -252484 133663 -217537 78617 196686 264264 513775 585676 233080 542683 370398
3630 370398 57071 176997 584148 446189 84604 119717 194279 153329 -46896 127842
3620 127842 351534 468123 137425 -150482 71613 328799 415115 291745 -225143 67664
3610 67664 302644 3191 344596 196904 88889 377184 438274 -201839 75102 -769
3600 -769 144476 534333 286682 448793 263431 683385 15713 428024 166213 178928
3590 178928 644275 -152850 270591 382791 103333 295784 411766 14948 210606 521518
3580 521518 550607 656340 227874 437671 429373 300756 359657 429001 -98508 320364 319717
$$ packed form
3651A82229O5223M7943K5729l272N2690n39132N77716n0259N77304n98154n90501
3640b52484L86147l51200K96154J18069O7578K49511P1901l52596L09603j72285
3630C70398l13327J19926M07151j37959l61585L5113P4562m0950k00225J74738
3620A27842K23692J16589l30698k87907K22095K57186Q6316j23370n16888K92807
3610F7664K34980k99453L41405j47692j08015K88295O1090o40113K76941p5871
3600g69J45245L89857k47651J62111j85362M19954o67672M12311k61811J2715
3590A78928M65347p97125M23441J12200k79458J92451J15982l96818J95658L10912
3580E21518K9089J05733m28466K09797q298j28617N8901O9344n27509M18872o47
$$ plain form
3569 319717 -62577 635439 31836 -26015 255741 631935 593231 815676 824237 875361 788483
3558 788483 1486063 2297770 1831923 1595488 1378656 1201680 1178087 1467145 946512 1242414
3548 1242414 844935 878837 726235 404771 613744 508959 983241 586480 181206 327796
3538 327796 506591 260099 730386 826701 522355 228581 1250705 402908 542609 65080
3528 65080 762102 791131 405716 344081 235811 450682 188279 594258 403017 130713
3518 130713 646276 216525 390348 130430 40020 254635 541098 -622 974883 677572
3508 677572 463853 837305 94164 391741 569447 461441 10962 948278 416982 657642
3498 657642 553905 250131 326044 382369 476822 533466 216229 498699 1188836 739103
$$ packed form
3569C19717l82294O98016o03603n7851K81756L76194l8704K22445Q561N1124q6878
3558G88483O97580Q11707m65847k36435k16832j76976k3593K89058n20633K95902
3548A242414l97479L3902j52602l21464K08973j04785M74282l96761m05274J46590
3538C27796J78795k46492M70287R6315l04346k93774J022124q47797J39701m77529
3528F5080O97022K9029l85415o1635j08270K14871k62403M05979j91241k72304
3518A30713N15563m29751J73823k59918r0410K14615K86463n41720R75505k97311
3508F77572k13719L73452p43141K97577J77706j08006m50479R37316n31296K40660
3498F57642j03737l03774P5913N6325R4453N6644l17237K82470O90137m49733
$$ plain form
3488 739103 436814 876340 826829 870202 870240 996120 782691 311649 445477 1233464 502912
3477 502912 857652 465642 640092 570497 849040 1188231 1006818 1020238 217585 590515
3467 590515 504438 -196971 713986 313906 519738 743298 744677 529213 584639 545616 199713
3456 199713 555896 613575 297970 870668 553201 735221 1174257 502618 586145 587847
3446 587847 897216 784382 455738 790660 397483 1012729 870383 824197 1125506 948080
3436 948080 938115 1415103 1190140 1251610 1659848 1110029 1810388 1406973 928955 1256274
3426 1256274 1440002 1022348 1333772 1649231 1257552 1480847 2046878 1338431 1866123 1274801
3416 1274801 1262143 1847263 629883 1414052 1386667 1432475 1525805 1737552 1886999 2066224
$$ packed form
3488G39103l02289M39526m9511M3373L8J25880k13429m71042J33828P87987p30552
3477E02912L54740l92010J74450o9595K78543L39191j81413J3420q02653L72930
3467E90515q6077p01409R10957m00080K05832K23560J379k15464N5426l9023l45903
3456A99713L56183N7679l15605N72698l17467J82020M39036o71639Q3527J702
3446E87847L09369j12834l28644L34922l93177O15246j42346m6186L01309j77426
3436I48080r965M76988k24963O1470M08238n49819P00359m03415m78018L27319
3426A256274J83728m17654L11424L15459l91679K23295N66031p08447N27692n91322
3416A274801j2658N85120j217380P84169k7385M5808R3330K11747J49447J79225
$$ plain form
3406 2066224 1831218 1970661 2266568 1597010 1842860 2015804 2250839 1905062 2233603 2339987
3396 2339987 1978038 2525689 1724235 2309636 1774872 2296152 2550138 2119943 2398145 2206627
3386 2206627 1977409 2229549 2807266 2909534 2647834 2943893 3100276 2806877 3118545 2920547
3376 2920547 2992028 2907775 3184750 3183658 3681998 3463368 4080253 4487886 4364910 4780547
3366 4780547 4134355 4008910 4112677 4133500 4288087 4722791 4772314 4990363 4984700 5165986
3356 5165986 5067179 5741240 6062431 6579355 6528260 6931792 7303657 7954338 7926766 8243018
3346 8243018 8522155 9190979 10078509 11155955 11570439 13313090 15078709 17533841 20480173
3337 20480173 22851398 24671830 25950699 28360761 29980792 33149206 37046809 42943626
$$ packed form
3406B066224k35006J39443K95907o69558K45850J72944K35035l45777L28541J06384
3396B339987l61949N47651q01454N85401n34764N21280K53986m30195K78202j91518
3386B206627k29218K52140N77717J02268k61700K96059J56383k93399L11668j97998
3376B920547P1481q4253K76975j092M98340k18630O16885M07633j22976M15637
3366D780547o46192j25445J03767K0823J54587M34704M9523K18049n663J81286
3356E165986r8807O74061L21191N16924n1095M03532L71865O50681k7572L16252
3346H243018K79137O68824Q87530J077446M14484J742651J765619K455132K946332
3337B0480173K371225J820432J278869K410062J620031L168414L897603N896817
$$ plain form
3329 42943626 52339792 69772157 108731456 169691606 238612105 289109692 290201981
3322 290201981 286989636 272863508 238289185 203107311 162310092 130883502 95978810
3315 95978810 72187335 59074327 51511185 46768841 42892694 38278397 33560147 30153325
3307 30153325 27085935 24273770 22648955 20501775 19367040 17537755 16421225 15439849
3299 15439849 14742910 14270508 14074153 13429310 12262815 11906290 11178263 11083820 10660716
3290 10660716 10613898 10070977 10039702 9318401 9522437 8998884 8935967 8931113 8394330 8707609
3280 8707609 8326232 7867780 7528605 7259578 6930354 6935247 7006752 6232565 5659944 6085350
3270 6085350 5905015 5388843 5743365 5365641 5525501 5005585 4802372 5000582 4199270 4374784
$$ packed form
3329D2943626R396166J7432365L8959299O0960150O8920499N0497587J092289
3322B90201981l212345j4126128l4574323l5181874m0797219l1426590l4904692
3315I5978810k3791475j3113008p563142m742344l876147m614297m718250l406822
3307C0153325l067390k812165j624815k147180j134735j829285j116530r81376
3299A5439849o96939m72402j96355o44843j166495l56525p28027r4443m23104
3290A0660716m6818n42921l1275p21301K04036n23553o2917m854n36783L13279
3280H707609l81377m58452l39175k69027l29224M893P1505p74187n72621M25406
3270F085350j80335n16172L54522l77724J59860n19916k03213J98210q01312J75514
$$ plain form
3260 4374784 4567762 4453105 4294385 3710242 3855280 3713275 3593941 3977396 3870608 3928363
3250 3928363 3920085 3411040 3843362 3066889 3403787 3226921 2888615 3131701 3089526 2815916
3240 2815916 2899018 2948431 2651315 2520645 2553956 2664386 2136534 2437095 2314406 2760787
3230 2760787 2435438 2059394 2492376 2705040 1790182 2274438 1704982 1848954 1838518 2024373
3220 2024373 1833004 1704718 1871430 1721730 1384616 1589089 1679160 1471081 1621802 1469980
3210 1469980 1316842 1592866 1327285 1587173 1235138 1333877 1412851 1330372 1635550 1347245
3200 1347245 1148218 913438 1244827 1744239 1676391 1035813 1276807 687894 1079501 1339168
3190 1339168 641655 1081732 1093047 962364 1214169 1240640 811147 1409955 1061653 780128
$$ packed form
3260D374784J92978j14657j58720n84143J45038j42005j19334L83455j06788N7755
3250C928363q278n09045M32322p76473L36898j76866l38306K43086m2175k73610
3240B815916Q3102M9413k97116j30670L3311J10430n27852L00561j22689M46381
3230B760787l25349l76044M32982K12664r14858M84256n69456J43972j0436J85855
3220B024373j91369j28286J66712j49700l37114K04473R0071k08079J50721j51822
3210A469980j53138K76024k65581K59888l52035R8739P8974q2479L05178k88305
3200A347245j99027k34780L31389M99412o7848o40578K40994n88913L91607K59667
3190A339168o97513M40077J1315j30683K51805K6471m29493N98808l48302k81525
$$ plain form
3180 780128 866273 1288483 1125372 995766 1082769 406721 772489 1096967 586620 855142
3170 855142 374774 493022 1036495 712664 615926 1026560 715593 779524 1040823 938159
3160 938159 996053 199694 511132 733680 961704 964437 474698 575737 890976 196978
3150 196978 1252730 651557 817376 194960 17013 858703 131534 376111 579028 672923
3140 672923 358427 747846 301535 104901 142294 355090 294618 56880 673691 445253
3130 445253 837131 746386 908585 759476 322596 323204 685792 389458 191433 -219367
3120 -219367 340653 218718 16604 299321 428059 216786 833471 -79775 199884 442684
3110 442684 231951 160535 623315 385261 244999 699693 434861 457428 695947 505344
$$ packed form
3180G80128Q6145M22210j63111j29606Q7003o76048L65768L24478n10347K68522
3170H55142m80368J18248N43473l23831r6738M10634l10967O3931K61299j02664
3160I38159N7894p96359L11438K22548K28024K733m89739J01039L15239o93998
3150A96978J055752o01173J65819o22416j77947Q41690p27169K44577K02917R3895
3140F72923l14496L89419m46311j96634L7393K12796o0472k37738O16811k28438
3130D45253L91878r0745J62199j49109m36880O08L62588k96334j98025m10800
3120b19367N60020j21935k02114K82717J28738k11273O16685r13246K79659K42800
3110D42684k10733p1416M62780k38054j40262M54694k64832K2567K38519j90603
$$ plain form
3100 505344 711412 377767 703860 267868 370893 546024 271691 1271868 779613 1253340
3090 1253340 1098692 1561910 1523667 1488978 1489868 1425850 1642987 1136566 474601 813824 970548
3079 970548 186915 654095 572178 158364 581289 1025821 463289 1134670 335182 380785
3069 380785 38220 46847 155467 -375402 -76701 324376 -57111 1100449 441572 381407
3059 381407 577745 287882 263826 496834 99194 408881 -56010 235716 365806 180239
3049 180239 329668 397883 577362 -62137 218713 248114 -188377 -12535 -84348 -188065
3039 -188065 67206 -21335 116621 260684 -157303 631433 17102 312241 616224 217402
3029 217402 468236 405140 304331 586139 -143079 512577 517502 154226 -142752 -41073
$$ packed form
3100E05344K06068l33645L26093m35992J03025J75131k74333J000177m92255M73727
3090A253340j54648M63218l8243l4689Q90o4018K17137n06421o61965L39223J56724
3079I70548p83633M67180q1917m13814M22925M44532n62532O71381p99488M5603
3069C80785l42565Q627J08620n30869K98701M01077l81487J157560o58877o0165
3059C81407J96338k89863k4056K33008l97640L09687m64891K91726J30090j85567
3049A80239J49429O8215J79479o39499K80850K9401m36491J75842p1813j03717
3039a88065K55271q8541J37956J44063m17987P88736o14331K95139L03983l98822
3029B17402K50834o3096j00809K81808p29218O55656M925l63276k96978J01679
$$ plain form
3019 -41073 -42659 37743 244907 834926 267387 83253 213599 257141 337210 294059 56133
3008 56133 403201 391463 126209 16772 -150145 416822 284743 404187 437141 34373
2998 34373 597901 -527860 445087 242889 -85476 451948 465781 231371 569914 92581
2988 92581 -371282 375515 288026 -252233 179480 236519 -45338 -163864 -184002 -24728
2978 -24728 -430394 314527 40641 380209 50533 38535 405568 28282 -63389 -1917
2968 -1917 268742 -1023 -69773 185793 -198669 -2706 -441320 53230 155234 22009
2958 22009 232866 304045 512459 431587 268377 -170508 157139 48241 146488 -136799
2948 -136799 -54625 -218588 169767 374986 148222 651228 39479 233276 317284 -215174
$$ packed form
3019d1073j586Q0402K07164N90019n67539j84134J30346M3542Q0069m3151k37926
3008E6133L47068j1738k65254j09437j66917N66967j32079J19444L2954m02768
2998C4373N63528j125761R72947k02198l28365N37424J3833k34410L38543m77333
2988I2581m63863P46797q7489n40259M31713N7039k81857j18526k0138J59274
2978b4728m05666P44921k73886L39568l29676j1998L67033l77286r1671O1472
2968a917K70659k69765o8750K55566l84462J95963m38614M94550J02004j33225
2958B2009K10857P1179K08414q0872j63210m38885L27647j08898R8247k83287
2948a36799Q2174j63963L88355K05219k26764N03006o11749J93797Q4008n32458
$$ plain form
2938 -215174 270443 201060 177392 489803 102701 601645 598942 485850 566755 271313 -54938
2927 -54938 -197793 1878 -87190 -615 239161 583392 5469 17410 32672 -293799 -2644
2916 -2644 182763 558657 -250278 135377 379037 -118167 364612 -10422 -293934 200573
2906 200573 -200385 96499 -302476 317556 378975 386663 40825 -192837 -4667 85380
2896 85380 -103907 627643 152824 399094 414461 -81725 35775 -178694 -313267 74768
2886 74768 -95183 104714 26046 210032 -274048 275431 95546 -177246 -181245 172836
2876 172836 -324810 239546 168408 257359 451126 188116 144345 -58980 -85680 -481014
2866 -481014 180379 414673 -413379 81692 184394 -39590 498739 -66065 -47255 -42610
$$ packed form
2938b15174M85617o9383k3668L12411l87102M98944k703j13092Q0905k95442l26251
2927e4938j42855J99671q9068Q6575K39776L44231n77923J1941J5262l26471K91155
2916b644J85407L75894q08935L85655K43660m97204M82779l75034k83512M94507
2906B00573m00958K96884l98975O20032O1419P688l45838k33662J88170R0047
2896H5380j89287P31550m74819K46270J5367m96186J17500k14469j34573L88035
2886G4768j69951J99897p8668J83986m84080N49479j79885k72792l999L54081
2876A72836m97646N64356p1138Q8951J93767k63010m3771k03325k6700l95334
2866d81014O61393K34294q28052M95071J02702k23984N38329n64804J8810M645
$$ plain form
2856 -42610 -221159 -49554 405189 175992 93697 18102 62650 -76329 -214206 -243742 -356925
2845 -356925 209229 -503554 532456 227249 47964 819047 135795 -149745 276290 270607
2835 270607 3911 169958 167156 786061 451232 -116816 452636 -154828 178655 186265
2825 186265 339351 89803 163554 198699 85360 382374 -145191 -214246 366528 164821
2815 164821 -470536 -70917 -71414 79944 120348 -256304 240272 -111026 197296 134618 -109268
2804 -109268 -55031 248678 516819 -283647 326443 198952 -380098 108884 -201971 175052
2794 175052 -66474 163269 -198302 9500 -136896 -212661 213124 75848 65052 -330572
2784 -330572 -239053 286707 163319 431980 406574 196910 -54215 -177029 503360 274967
$$ packed form
2856d2610j78549J71605M54743k29197q2295p5595M4548j38979j37877k9536j13183
2845c56925N66154p12783J036010l05207j79285P71083o83252k85540M26035n683
2835B70607k66696J66047k802O18905l34829n68048N69452o07464L33483P610
2825A86265J53086k49548P3751L5145j13339K97014n27565o9055N80774k01707
2815A64821o35357L99619m97J51358M0404l76652M96576l51298L08322o2678k43886
2804a09268N4237L03709K68141q00466O10090j27491n79050M88982l10855L77023
2794A75052k41526K29743l61571K07802j46396p5765M25785j37276j0796l95624
2784c30572R1519N25760j23388K68661k5406k09664k51125j22814O80389k28393
$$ plain form
2774 274967 619026 -71697 801858 119784 392745 280933 109367 390757 -98224 492303
2764 492303 406811 -28321 572111 -353933 257605 -12038 -566696 56392 -238692 36725
2754 36725 364164 -109540 147699 497299 114334 33009 254070 -170281 207070 132960
2744 132960 326706 127195 254516 -198067 -167220 205748 -461409 552987 23147 555473
2734 555473 236720 184294 46059 253970 -393418 -18472 -566326 -253028 -10714 64759
2724 64759 418159 -23268 -407997 334250 54781 92654 -174435 -97580 -74703 -311524
2714 -311524 496782 212169 604992 568553 30679 887722 405956 78347 695204 -53965
2704 -53965 -127335 -46269 -39595 321347 367004 710331 529198 45261 -326270 156696 -291889
$$ packed form
2774B74967L44059o90723Q73555o82074K72961j11812j71566K81390m88981N90527
2764D92303q5492m35132O00432r26044O11538k69643n54658O23088k95084K75417
2754C6725L27439m73704K57239L49600l82965q1325K21061m24351L77351p4110
2744A32960J93746j99511J27321m52583L0847L72968o67157J014396n29840N32326
2734E55473l18753n2426j38235K07911o47388L74946n47854L13298K42314P5473
2724F4759L53400m41427l84729P42247k79469L7873k67089P6855K2877k36821
2714c11524Q08306k84613L92823l6439n37874Q57043m81766l27609O16857p49169
2704e3965p3370Q1066O674L60942M5657L43327j81133m83937l71531M82966m48585
$$ plain form
2693 -291889 -170775 69791 -127957 139376 -8870 221761 290552 268921 246965 163356
2683 163356 289642 77078 301454 97133 -111384 -2638 -150023 326978 378857 -6963
2673 -6963 398235 67955 -18730 65891 -139955 -4686 -240425 -197160 137514 -13603 -291693
2662 -291693 -205293 -518118 -72008 99423 -226615 -10302 -119443 156830 -395530 334776
2652 334776 583716 236032 1665 221094 68403 248390 51887 -240323 -44614 45993
2642 45993 483920 370627 -268968 165579 33560 -80762 25907 -63069 175039 98653
2632 98653 -217102 -29229 -368857 -347360 -3080 256947 47003 136295 -489645 -389246
2622 -389246 101598 -39205 27621 -87632 23322 -183155 232017 75740 -53566 -35246
$$ packed form
2693b91889J21114K40566j97748K67333j48246K30631O8791k1631k1956q3609
2683A63356J26286k12564K24376k04321k08517J08746j47385M77001N1879l85820
2673f963M05198l30280q6685Q4621k05846J35269k35739M3265L34674j51117k78090
2662b91693Q6400l12825M46110J71431l26038K16313j09141K76273n52360P30306
2652C34776K48940l47684k34367K19429j52691J79987j96503k92210J95709R0607
2642D5993M37927j13293o39595M34547j32019j14322J06669q8976K38108p6386
2632I8653l15755J87873l39628K1497L44280K60027k09944Q9292o25940J00399
2622c89246M90844j40803O6826j15253J10954k06477M15172j56277j29306J8320
$$ plain form
2612 -35246 -150078 548861 118804 3876 -14807 124512 -147813 149529 -53967 309573
2602 309573 -57600 -219602 -453863 285272 308541 355465 34156 82916 140665 -143383
2592 -143383 152458 2280 500700 128987 10889 -116370 156191 363656 347455 62491
2582 62491 -345760 -66748 483603 492565 453173 278865 219522 155088 -265361 89204 153135
2571 153135 17327 -320360 -11922 -21499 -291480 -75663 103201 371424 455137 274084
2561 274084 -685 119699 -21040 -182654 -35546 272300 -63953 122740 -76106 -172541
2551 -172541 84268 -340012 -172857 622677 273830 532249 335747 -18910 -67335 123644
2541 123644 116744 331586 -27144 41148 -78164 253906 248174 522090 -180769 -71283 233108
$$ packed form
2612c5246j14832O98939m30057j14928j8683J39319k72325K97342k03496L63540
2602C09573l67173j62002k34261P39135K3269M6924l21309M8760N7749k84048
2592a43383K95841j50178M98420l71713j18098j27259K72561K07465j6201k84964
2582F2491m08251K79012N50351Q962l9392j74308n9343o4434m20449L54565O3931
2571A53135j35808l37687L08438r577k69981K15817J78864K68223Q3713j81053
2561B74084k74769J20384j40739j61614J47108L07846l36253J86693j98846r6435
2551a72541K56809m24280J67155P95534l48847K58419j96502l54657m8425J90979
2541A23644o900K14842l58730O8292j19312L32070n732K73916p02859J09486L04391
$$ plain form
2530 233108 189374 110907 602833 -191643 146845 329947 69151 -196593 240187 -200517
2520 -200517 59884 -121288 235335 -126766 454323 305725 412985 -114876 120562 171322
2510 171322 107376 -122864 -275398 453589 31643 -186929 14364 -115500 -20053 529072
2500 529072 331589 87238 -166311 -182652 23437 -107593 -157931 543164 13757 338820
2490 338820 -440876 289704 165326 -30753 -57281 -41000 -311344 -21862 -229061 -511377
2480 -511377 -559077 78866 210689 421533 604426 -58254 291081 -48609 -372571 -115296
2470 -115296 114429 -93527 147782 -148141 -284084 286733 235787 725390 353442 -56067
2460 -56067 312600 94874 -525623 -237988 -263980 655597 127482 66281 -414997 -327358
$$ packed form
2530B33108m3734p8467M91926p94476L38488J83102k60796k65744M36780m40704
2520b00517K60401j81172L56623l62101N81089j48598J07260n27861K35438N0760
2510A71322o3946k30240j52534P28987m21946k18572K01293j29864R5447N49125
2500E29072j97483k44351k53549j6341K06089j31030n0338P01095n29407L25063
2490C38820p79696P30580j24378j96079k6528J6281k70344K89482k07199k82316
2480e11377m7700O37943J31823K10844J82893o62680L49335l39690l23962K57275
2470a15296K29725k07956K41309k95923j35943N70817n0946M89603l71948m09509
2460e6067L68667k17726o20497K87635k5992R19577n28115o1201m81278Q7639
$$ plain form
2450 -327358 -134065 -194609 -438437 -119862 1704 39466 244166 521554 -171716 99888
2440 99888 373808 150597 -107393 519108 272701 6381 160815 -351405 -11459 -125646
2430 -125646 -458086 -610296 -214266 -345356 -150246 10594 49533 127246 314107 -275562
2420 -275562 106882 -208219 -467324 -52579 -196963 174336 112670 -126531 555027 434413
2410 434413 25108 -34439 411500 474071 573099 478415 57207 -38950 488789 -170047 -150586
2399 -150586 -154740 -146993 47735 95180 -213780 -193295 180803 -225789 -627736 -205362 -165515
2388 -165515 -59744 -236153 36786 246542 -29702 4420 -5513 -256634 -710360 -19995
2378 -19995 -557544 -235202 292991 517828 69969 440048 -3152 -100038 -10720 -397529
$$ packed form
2450c27358J93293o0544k43828L18575J21566L7762K04700K77388o93270K71604
2440I9888K73920k23211k57990O26501k46407k66320J54434n12220L39946j14187
2430a25646l32440j52210L96030j31090J95110J60840L8939P7713J86861n89669
2420b75562L82444l15101k59105M14745j44384L71299o1666k39201O81558j20614
2410D34413m09305n9547M45939O2571R9028r4684m21208r6157N27739o58836J9461
2399a50586m154P747J94728M7445l08960K0485L74098m06592m01947M22374L9847
2388a65515J05771j76409K72939K09756k76244L4122r933k51121m53726O90365
2378a9995n37549L22342N28193K24837m47859L70079m43200r6886Q9318l86809
$$ plain form
2368 -397529 -119448 396903 -48898 418053 336494 101734 71946 -199707 -270069 -510875
2358 -510875 -124903 38337 218249 91126 -321511 97298 70391 272623 -61162 -25905
2348 -25905 -215886 -253719 34027 -67276 85518 -479932 -603933 -79950 21171 -69910
2338 -69910 60314 129540 249500 -308074 61601 -83897 -125946 -127803 -135913 3467 22709
2327 22709 101283 368505 144902 119921 -147816 -209619 132516 104819 -81233 -263890 -378362
2316 -378362 56414 -301852 72819 -302431 167946 -96369 -418966 -143864 -438452 103208
2306 103208 37493 -181418 553330 -228717 -461838 -127787 -525649 202806 -386387 351588
2296 351588 633166 198383 378081 -42282 -80613 -281615 -297177 49234 232287 27614
$$ packed form
2368c97529K78081N16351m45801M66951q1559k34760k9788k71653p0362k40806
2358e10875L85972J63240J79912j27123m12637M18809k6907K02232l33785L5257
2348b5905j89981l7833K87746j01303J52794n65450j24001N23983J01121r1081
2338f9910J30224O9226J19960n57574L69675j45498m2049j857q110J39380J9242
2327B2709P8574K67222k23603k4981k67737o1803L42135k7697j86052j82657j14472
2316c78362M34776l58266L74671l75250M70377k64315l22597K75102k94588N41660
2306A03208o5715k18911P34748p82047k33121L34051l97862P28455n89193P37975
2296C51588K81578m34783J79698m20363l8331k01002j5562L46411J83053k04673
$$ plain form
2286 27614 -22219 -141126 -335809 196894 -29894 -8594 -221713 374378 -496701 -50083
2276 -50083 -82096 -513433 -116839 17114 123081 -260688 143327 101403 521165 696855
2266 696855 392030 173111 133646 29952 -357016 -83363 -372170 -389902 -132495 615322
2256 615322 354409 -208606 -174520 -60746 -530769 -273952 -320577 47760 -53140 -19228
2246 -19228 -8155 -45992 159954 -582333 288521 485892 173246 190360 -375894 -38820
2236 -38820 -143952 -104773 -84772 -350971 -34146 -151945 -288344 236612 -178310 621646
2226 621646 390899 23802 -217392 50876 -3084 -285945 140295 334218 -17168 185262
2216 185262 374734 548593 728736 -358915 189733 343357 -260918 211716 -422260 -685806
$$ packed form
2286B7614m9833j18907j94683N32703k26788K1300k13119N96091q71079M46618
2276e0083l2013m31337L96594J33953J05967l83769M04015m1924M19762J75690
2266F96855l04825k18919l9465j03694l86968K73653k88807j7732K57407P47817
2256F15322k60913n63015L4086J13774m70023K56817m6625L68337j00900L3912
2246a9228J1073l7837K05946p42287Q70854J97371l12646J7114n66254L37074
2236c8820j05132L9179K0001k66199L16825j17799j36399N24956m14922P99956
2226F21646k30747l67097k41194K68268n3960k82861M26240J93923l51386K02430
2216A85262J89472J73859J80143j087651N48648J53624o04275M72634o33976k63546
$$ plain form
2206 -685806 -450723 -134351 299289 -608252 57180 -294051 -60455 130451 -74108 -49491
2196 -49491 -80822 146066 50936 -81170 187615 -138765 -495074 712411 185520 -274343
2186 -274343 176480 3664 403646 -655697 -603029 -1172 -199522 379722 41036 140087
2176 140087 -230673 -203665 213284 -145216 -219527 -328272 -97636 216821 -143098 122022
2166 122022 463067 -158254 -65061 298067 -155965 67789 309636 121292 10372 -50808
2156 -50808 -58692 270403 269637 -150169 35040 225423 -82340 -171642 -42755 323154 126289
2145 126289 -5527 134093 -25951 -333041 -321552 55362 -250857 -38949 -16991 -34949
2135 -34949 19766 385502 -555878 -55593 -662893 -92939 -438682 -148416 -248513 -162784
$$ packed form
2206f85806K35083L16372M33640r07541O65432l51231K33596J90906k04559K4617
2196d9491l1331K26888r5130j32106K68785l26380l56309J207485n26891m59863
2186b74343M50823j72816L99982j059343N2668O01857j98350N79244l38686R9051
2176A40087l70760K7008M16949l58500p4311j08745K30636L14457l59919K65120
2166A22022L41045o21321R3193L63128m54032K23754K41847j88344j10920o1180
2156e0808p884L29095p66m19806J85209J90383l07763q9302J28887L65909j96865
2145A26289j31816J39620j60044l07090J1489L76914l06219K11908K1958j7958
2135c4949N4715L65736r41380N00285o07300N69954l45743K90266j00097Q5729
$$ plain form
2125 -162784 204632 46558 108862 470176 -17975 -272052 -514930 -115329 131496 89241
2115 89241 82469 179933 239041 419739 283824 -582729 78878 -149780 -123694 -109890 -321049
2104 -321049 -477295 166192 41229 -438 -255071 -685031 -467029 390375 50512 -42691
2094 -42691 567961 -151957 -62596 237626 40627 94944 -7957 -170629 126319 16257
2084 16257 501836 -243206 65074 -146399 -328 368330 225910 209354 213302 -240254
2074 -240254 -106371 -514341 -153048 -117436 -98619 194399 -87601 401425 -335522 -76490
2064 -76490 567800 55175 -113630 -230482 -198179 -53420 -123135 -277575 15957 -74790
2054 -74790 108511 405875 34140 309577 130475 351762 521765 -170424 177412 223856
$$ packed form
2125a62784L67416j58074O2304L61314m88151k54077k42878L99601K46825m2255
2115H9241o772R7464N9108J80698j35915q66553O61607k28658K6086J3804k11159
2104c21049j56246O43487j24963m1667k54633m29960K18002Q57404l39863r3203
2094d2691O10652p19918Q9361L00222j96999N4317j02901j62672K96948j10062
2084A6257M85579p45042L08280k11473J46071L68658j42420j6556L948m53556
2074b40254J33883m07970L61293L5612J8817K93018k82000M89026p36947K59032
2064g6490O44290n12625j68805j16852L2303J44759o9715j54440K93532r0747
2054g4790J83301K97364l71735K75437j79102K21287J70003o92189L47836M6444
$$ plain form
2044 223856 392959 321382 112332 -162958 656472 -268528 -85358 -90242 123391 -557618
2034 -557618 204971 -185923 18226 381253 71790 -291023 67397 -122309 -98505 52662
2024 52662 -241059 -505919 -102902 -93185 -180702 -185293 -30980 -336849 -326412 -431496 33175
2013 33175 -476048 -291905 -384444 -467577 -173177 -251500 803576 -115270 25567 -102956
2003 -102956 34860 -76339 -144484 297598 -62010 -182541 83119 -259809 -227911 49198
1993 49198 163000 886611 -295114 150937 -76526 195006 -107686 -75987 -447442 -84096
1983 -84096 241207 -74982 43785 -152499 87901 64154 -75433 -158725 -264023 -203672
1973 -203672 277873 70010 -322573 -105243 -339344 313284 -6330 -34753 -223463 -91381
$$ packed form
2044B23856J69103p1577k09050k75290Q19430r25000J83170m884K13633o81009
2034e57618P62589l90894K04149L63027l09463l62813L58420j89706K3804J51167
2024E2662k93721k64860M03017R717q7517m591J54313l05869J0437j05084M64671
2013C3175n09223J84143r2539q3133K94400p8323J055076r18846J40837j28523
2003a02956J37816j11199o8145M42082l59608j20531K65660l42928L1898K77109
1993D9198J13802P23611j181725M46051k27463K71532l02692L1699l71455L63346
1983h4096L25303l16189J18767j96284K40400k3747j39587q3292j05298O0351
1973b03672M81545k07863l92583K17330k34101O52628l19614k8423j88710J32082
$$ plain form
1963 -91381 -679035 240434 169991 77500 -28410 -594925 -247474 35817 -463857 -300228
1953 -300228 -218397 -416640 -92142 -212721 -95480 -92176 95900 303450 57663 342473
1943 342473 277922 492737 135434 263169 -259231 -383992 35725 -25176 125362 132252
1933 132252 62222 234105 -239876 311473 92965 -92960 -147984 -251267 169682 -61853
1923 -61853 -402279 219353 193703 453804 105924 130475 -158785 -9967 309652 477357
1913 477357 -121324 254232 71546 87231 426820 9000 -204671 -596121 -43480 528835
1903 528835 13887 155901 9289 -438526 -71150 -187747 -173269 -73965 -328834 -263232
1893 -263232 -511870 -217648 144478 309637 -92421 47361 -103525 -29571 -334446 -724248
$$ packed form
1963i1381n87654R19469p0443r2491j05910n66515L47451K83291m99674J63629
1953c00228Q1831j98243L24498j20579J17241L304J88076K07550k45787K84810
1943C42473o4551K14815l57303J27735n22400j24761M19717o0901J50538O890
1933A32252p0030J71883m73981N51349k18508j85925n5024j03283M20949k31535
1923f1853l40426O21632k5650K60101l47880K4551k89260J48818L19619J67705
1913D77357n98681L75556j82686J5685L39589m17820k13671l91450N52641N72315
1903E28835n14948J42014j46612m47815L67376j16597J4478R9304k54869O5602
1893b63232k48638K94222L62126J65159m02058J39782j50886P3954l04875l89802
$$ plain form
1883 -724248 -609088 -386842 -95813 -330313 -17280 -30554 -213150 465731 36950 -184631
1873 -184631 268117 -151517 -68065 -107749 -271164 76953 49251 285866 804898 312025
1863 312025 366978 23868 319534 -147242 -220345 144163 -9500 -329599 -71328 -369430
1853 -369430 341162 -269107 20002 238544 -464514 39193 -330980 -80175 -228149 -213242
1843 -213242 -223770 17952 -125508 166461 -59638 6137 319949 -34351 124536 69872
1833 69872 -550749 -288876 -219860 -466492 -357868 -100066 51480 -401909 337528 189623
1823 189623 -30533 394073 -184914 -343449 -108307 -241000 31945 165031 98475 128941
1813 128941 318045 252812 119466 92982 215813 -187993 -221473 -205055 175917 -85440
$$ packed form
1883g24248J15160K22246K91029k34500L13033j3274j82596O78881m28781k21581
1873a84631M52748m19634Q3452l9684j63415L48117k7702K36615N19032m92873
1863C12025N4953l43110K95666m66776p3103L64508j53663l20099K58271k98102
1853c69430P10592o10269K89109K18542p03058N03707l70173K50805j47974J4907
1843b13242j0528K41722j43460K91969k26099O5775L13812l54300J58887n4664
1833F9872o20621K61873O9016k46632J08624K57802J51546m53389P39437j47905
1823A89623k20156M24606n78987j58535K35142j32693K72945J33086o6556L0466
1813A28941J89104o5233j33346k6484J22831m03806l3480J6418L80972k61357
$$ plain form
1803 -85440 -29680 216275 608101 157161 234260 -83425 237193 -159283 344789 42137
1793 42137 43330 -41987 -437323 -318921 72632 38723 -12220 -73964 -112755 7702 -453434
1782 -453434 -357465 -128822 -981 -444768 -101092 -194802 55407 -382745 -105723 -45616
1772 -45616 -22119 -6793 -17734 -153838 -97936 -52217 -189499 -35840 99452 -328323 -185816
1761 -185816 29620 -32517 342189 4097 -180018 225786 357419 135426 -9196 100909
1751 100909 335434 -20164 299315 -515112 263442 285311 462870 102579 -8657 -683876
1741 -683876 413239 -89613 80738 -70971 10104 -135041 79920 -195349 30596 494227
1731 494227 22101 272901 234239 92337 -102114 123311 271139 437795 -58670 281907
$$ packed form
1803h5440N5760K45955L91826m50940P7099l17685L20618l96476N04072l02652
1793D2137J193q5317l95336J18402L91553l3909n0943o1744l8791J20457m61136
1782d53434R5969K28643J27841m43787L43676r3710K50209m38152K77022O0107
1772d5616K3497J5326j0941j36104N5902M5719j37282J53659J35292m27775J42507
1761a85816K15436o2137L74706l38092j84115M05804J31633k21993j44622J10105
1751A00909K34525l55598L19479q14427P78554K1869J77559l60291j11236o75219
1741f83876J097115n02852J70351j51709Q1075j45145K14961k75269K25945M63631
1731D94227m72126K50800l8662j41902j94451K25425J47828J66656m96465L40577
$$ plain form
1721 281907 283773 -120932 -312514 -333336 10860 -285526 -273261 99682 -338857 -156437
1711 -156437 -133878 -524838 58011 239059 177975 -49360 -336289 -398656 165051 -64022
1701 -64022 239654 -183011 205267 438535 105510 480409 40680 -219605 226950 148180
1691 148180 -40927 264178 -394996 293861 333590 131641 -108590 -281828 -220876 -480925
1681 -480925 -619650 -7982 105116 -154401 -105476 169468 -74621 71605 142657 156716
1671 156716 -16155 3978 241098 -67574 -195335 -363547 139235 -149076 -31873 168715
1661 168715 -86626 -200518 177584 127197 318471 -281058 -155081 -189216 18065 158378
1651 158378 95627 439746 -304228 -367864 117079 -276698 -208186 -57315 -107366 316650
$$ packed form
1721B81907J866m04705j91582k0822L44196k96386J2265L72943m38539J82420
1711a56437K2559l90960N82849J81048o1084k27335k86929o2367N63707k29073
1701f4022L03676m22665L88278K33268l33025L74899m39729k60285M46555p8770
1691A48180j89107L05105o59174O88857L9729k01949k40231j73238O0952k60049
1681d80925j38725O11668J13098k59517M8925K74944k44089J46226P1052J4059
1671A56716j72871K0133K37120l08672j27761j68212N02782k88311J17203K00588
1661A68715k55341j13892L78102n0387J91274n99529J25977l4135K07281J40313
1651A58378o2751L44119p43974o3636M84943l93777O8512J50871n0051M24016
$$ plain form
1641 316650 -465577 304040 335658 96643 42435 -54228 96894 -11031 -465509 130681
1631 130681 -353323 -45502 107397 -82608 228784 477405 150477 48358 8114 389408
1621 389408 -115758 213598 153692 22322 52617 -191516 407911 307224 -104531 149590
1611 149590 -40561 80181 80420 -252517 -94909 -173616 -191125 -341159 96000 -469064 165476
1600 165476 119509 -3302 -134136 412394 -243466 -210102 -402251 -259897 -211659 -448027
1590 -448027 322377 106664 644639 667763 231759 -279282 -478942 -240658 -530512 333970
1580 333970 526339 266531 -162869 81235 -204909 -272399 126480 118819 -165164 -115148
1570 -115148 24408 -258173 -540035 175351 -90002 514437 259502 67733 12153 -41435
$$ packed form
1641C16650p82227P69617L1618k39015n4208r6663J51122j07925m54478N96190
1631A30681m84004L07821J52899j90005L11392K48621l26928j02119m0244L81294
1621C89408n05166L29356n9906j31370L0295k44133N99427j00687m11755K54121
1611A49590j90151J20742K39l32937J57608p8707j7509j50034M37159n65064O34540
1600A65476m5967j22811j30834N46530o55860L3364j92149J42354M8238k36368
1590d48027P70404k15713N37975K3124m36004n11041j99660K38284k89854Q64482
1580C33970J92369k59808m29400K44104k86144o7490L98879p661k83983N0016
1570a15148J39556k82581k81862P15386k65353O04439k54935j91769n5580n3588
$$ plain form
1560 -41435 -586405 -231849 -330425 -308800 -14044 86653 54067 277421 123763 123933 305617
1549 305617 212629 384122 246100 -244137 -517577 -36293 -289500 -163767 -113243 79146
1539 79146 353 65506 -198874 -177114 557286 -387631 55091 184986 -483981 58857
1529 58857 -234831 -60091 -52737 -545651 164238 433869 314612 -137677 298433 286120
1519 286120 148385 94546 79595 -236539 -54981 68744 -156362 -15015 -122569 130285
1509 130285 413661 -435202 -16744 -101460 311104 -174510 -548753 43601 -134315 -718
1499 -718 626432 137766 -60930 55415 -86508 119756 318993 119967 124271 -154207 -17101
1488 -17101 -143908 197824 383244 82345 -6583 -398543 311433 377836 -444820 227279
$$ packed form
1560d1435n44970L54556r8576K1625K94756J00697l2586K23354j53658J70J81684
1549C05617r2988J71493j38022m90237k73440M81284k53207J25733N0524J92389
1539G9146p8793O5153k64380K1760P34400r44917M42722J29895o68967N42838
1529E8857k93688J74740P354m92914P09889K69631j19257m52289M36110j2313
1519B86120j37735n3839j4951l16134J81558J23725k25106J41347j07554K52854
1509A30285K83376q48863M18458q4716M12564m85614l74243N92354j77916J33597
1499g18O27150m88666j98696J16345j41923K06264J99237j99026M304k78478J37106
1488a7101j26807L41732J85420l00899q8928l91960P09976O6403q22656O72099
$$ plain form
1478 227279 46039 -30059 -446251 14283 158099 -111798 25827 11101 -142834 114663
1468 114663 -436146 88925 151747 -42918 191507 158326 -164939 212123 124414 98315
1458 98315 -194147 -362061 234387 -107056 54162 369362 -82294 -130368 -533854 172634
1448 172634 44944 -180354 -287357 -231755 -48218 -47406 -251786 -354431 -58836 -187862
1438 -187862 -6536 -347206 -44981 -195636 234172 349983 411454 -211089 -88142 203341
1428 203341 490809 -100049 59847 78645 21805 39408 348476 494440 40616 -460745
1418 -460745 583886 38758 -370908 102790 158730 310802 86644 -482283 355451 227198
1408 227198 -128495 274200 325985 -84480 101966 483719 114361 -414102 -233248 -262082
$$ packed form
1478B27279j81240p6098m16192M60534J43816k69897J37625j4726j53935K57497
1468A14663n50809N25071O2822j94665K34425l3181l23265L77062q7709k6099
1458I8315k92462j67914N96448l41443J61218L15200m51656m8074m03486P06488
1448A72634j27690k25298j07003N5602J83537Q12k04380j02645K95595j29026
1438a87862J81326l40670L02225j50655M29808J15811O1471o22543J22947K91483
1428B03341K87468n90858J59896J8798n6840J7603L09068J45964m53824n01361
1418d60745J044631n45128m09666M73698N5940J52072k24158n68927Q37734j28253
1408B27198l55693M02695N1785m10465J86446L81753l69358n28463J80854k8834
$$ plain form
1398 -262082 -145184 224570 276216 503235 -218034 -205016 197177 -464388 223530 -190632
1388 -190632 -11770 293820 -599710 -16234 -45465 362722 44976 -129374 155274 -414663
1378 -414663 -326891 -82251 335085 -30764 210172 -104333 159029 -87842 196860 -24096
1368 -24096 -194152 218947 39682 425028 142091 -328329 351156 227346 -215494 -267771
1358 -267771 198684 251270 -538759 -222934 23471 221786 303495 -455456 257984 -71872
1348 -71872 -342390 204896 -21598 -257680 -91845 55277 389910 -249327 -273834 -332018
1338 -332018 -141195 -138819 73018 108388 -179736 146601 173700 220667 -222859 153242 11972
1327 11972 323606 -370523 -197571 300288 330661 491099 88078 -283512 -3278 -185852
$$ packed form
1398b62082J16898L69754N1646K27019p21269J3018M02193o61565O87918m14162
1388a90632J78862L05590q93530N83476k9231M08187l17746j74350K84648n69937
1378d14663Q7772K44640M17336l65849K40936l14505K63362k46871K84702k20956
1368b4096j70056M13099j79265L85346k82937m70420O79485j23810m42840n2277
1358b67771M66455N2586p90029L15825K46405J98315Q1709p58951P13440l29856
1348g1872k70518N47286k26494k36082J65835J47122L34633o39237k4507n8184
1338c32018J90823K376K11837L5370k88124L26337K7099M6967m43526L76101j41270
1327A1972L11634o94129J72952M97859L0373J60438m03021l71590K80234j82574
$$ plain form
1317 -185852 -193140 87718 -338362 580816 278114 51965 -228159 41668 385238 -578697
1307 -578697 -560450 284747 67741 309842 264678 302037 532064 892 -290352 -220941
1297 -220941 -540249 -243340 -234150 403739 -477039 255198 -101816 -131960 -41692 -261209
1287 -261209 -279014 79640 22325 47615 222515 -43332 -114705 -42899 10302 -23833 -499550
1276 -499550 -293302 -230200 -314396 291964 -169093 -281703 -103089 297268 -362443 -581760
1266 -581760 -406468 -92056 -32200 -206864 -131241 119069 155202 301685 -16582 -121483
1256 -121483 303313 388966 -176776 523176 33037 344373 328518 -309617 -124151 72132
1246 72132 275726 96002 151044 -205092 -115266 66414 -301911 -346100 161554 101714 112790
$$ packed form
1317a85852p288K80858m26080R19178l02702k26149k80124K69827L43570r63935
1307e78697J8247Q45197k17006K42101m5164L7359K30027n31172k91244O9411
1297b20941l19308K96909R190O37889q80778P32237l57014l0144R0268k19517
1287b61209j7805L58654n7315K5290J74900k65847p1373P1806N3201l4135m75717
1276d99550K06248O3102q4196O06360m61057j12610J78614M00357o59711k19317
1266e81760J75292L14412N9856j74664P5623K50310L6133J46483l18267j04901
1256a21483M24796Q5653n65742O99952m90139L11336j5855o38135J85466J96283
1246G2132K03594j79724N5042l56136Q9826J81680l68325m4189N07654n9840J1076
$$ plain form
1235 112790 215133 200140 -350883 15376 215590 231599 -14439 223663 -104362 313558
1225 313558 -333038 496578 462041 241149 11219 179222 -212101 -88690 98600 -200421
1215 -200421 31469 -260766 -638767 -422936 -617478 -590637 -381044 -238372 -86285 -174761
1205 -174761 64194 321834 -463847 276931 279654 -207151 -415997 -454174 230858 27769
1195 27769 -298548 -85854 176215 -83463 -716877 -425172 -33559 -374365 411809 -54688
1185 -54688 430360 802220 85073 -346039 56008 -151577 -269547 117611 69113 -581245
1175 -581245 -220614 -168105 -259747 -144842 -280137 -303347 296660 252006 -410039 -212152
1165 -212152 -11047 187672 -45035 128706 -320934 255998 201035 295791 -99885 -100254 583140
$$ packed form
1235A12790J02343j4993n51023L66259K00214J6009k46038K38102l28025M17920
1225C13558o46596Q29616l4537k20892k29930J68003l91323J23411J87290k99021
1215b00421K31890k92235l78001K15831j94542K6841K09593J42672J52087q8476
1205a74761K38955K57640p85681P40778K723m86805k08846l8177O85032k03089
1195B7769l26317K12694K62069k59678o33414K91705L91613l40806P86174m66497
1185e4688M85048L71860p17147m31112M02047k07585j17970L87158m8498o50358
1175e81245L60631N2509r1642J14905j35295k3210O00007m4654o62045J97887
1165b12152K01105J98719k32707J73741m49640N76932n4963R4756l95676l69O83394
$$ plain form
1154 583140 193811 -211807 355243 -57409 -39662 573672 -9415 43578 -628353 174085
1144 174085 95814 -154416 105083 -103603 -295627 -308655 -326795 395950 50643 108026
1134 108026 24700 134863 174270 -325973 261166 143917 331831 241130 108757 -122688
1124 -122688 453031 -238785 99299 -132281 -224987 -72961 -779521 -247979 -72262 -148598
1114 -148598 366055 -37845 -216512 -194247 -105589 -188512 -89270 -473955 -371339 -351114 -311488
1103 -311488 108907 -427955 101274 263740 -340679 -104022 -187723 -494401 -86912 -306563
1093 -306563 471663 46937 76670 -39351 -379840 -73670 -14781 53811 86696 -172143
1083 -172143 151410 -158927 -79870 31296 -42155 -265611 79240 -47712 818650 -208345
$$ packed form
1154E83140l89329m05618N67050m12652J7747O13334n83087N2993o71931Q02438
1144A74085p8271k50230K59499k08686j92024j3028j8140P22745l45307N7383
1134A08026q3326J10163L9407n00243N87139j17249J87914r0701j32373k31445
1124a22688N75719o91816L38084k31580r2706J52026p06560N31542J75717p6336
1114a48598N14653m03900j78667K2265Q8658q2923R9242l84685J02616K0225L9626
1103c11488M20395n36862N29229J62466o04419K36657q3701l06678M07489k19651
1093c06563P78226m24726K9733j16021l40489L06170N8889O8592L2885k58839
1083a72143L23553l10337P9057J11166p3451k23456L44851j26952Q66362j026995
$$ plain form
1073 -208345 72962 68591 -429581 -237100 -373688 206072 122627 -490275 329842 455556
1063 455556 35814 -194349 28941 -159570 190937 -396052 80069 -91638 -153377 -388430
1053 -388430 49231 -196104 149503 -290015 64976 84887 286081 -16746 -1394 -31630
1043 -31630 -227817 188484 -114944 -146487 87892 5331 377004 -422007 -128643 434686
1033 434686 -192348 -522282 -793393 -357455 188718 -196166 33930 494186 -56325 -29876
1023 -29876 141400 -384850 226819 -483491 -254858 -138506 203709 33449 329204 175038
1013 175038 -177229 128083 -22065 147456 -336334 -246354 -9172 62959 79627 -87792
1003 -87792 136157 133207 -194579 -346123 -55315 40438 -717610 -64578 -435019 -313822
$$ packed form
1073b08345K81307m371m98172J92481j36588N79760q3445o12902Q20117J25714
1063D55556m19742k30163K23290j88511L50507n86989M76121j71707o1739k35053
1053c88430M37661k45335L45607m39518L54991J9911K01194l02827J5352l0236
1043c1630j96187M16301l03428l1543K34379q2561L71673p99011K93364N63329
1033D34686o27034l29934k71111M35938N46173l84884K30096M60256n50511K6449
1023b9876J71276n26250O11669p10310K28633J16352L42215j70260K95755j54166
1013A75038l52267L05312j50148J69521m83790Q9980K37182P2131J6668j67419
1003h7792K23949k950l27786j51544K90808R5753p58048O53032l70441J21197
$$ plain form
993 -313822 -299704 84060 -131438 583740 404893 -178697 -151101 43129 -88594 -8790
983 -8790 -277557 5527 -330251 -239034 -51637 -137647 64340 195440 258196 -471817 -334589
972 -334589 -261925 5613 38566 -56986 -520364 -318137 200053 -265139 93590 137140 -155393
961 -155393 -105629 -224646 148530 102145 -291979 -47445 135192 -28999 -408 156862
951 156862 117719 -256321 123224 -204539 -208729 131021 -389451 -14835 -167216 -239588 352392
940 352392 -624111 227982 -256650 278048 123117 -301935 -238838 50072 -708170 -200834
930 -200834 -440506 -748092 19362 30767 106995 -89911 -429494 236002 -160234 -310505
920 -310505 368746 -641833 -53622 15220 -561158 54843 -539087 -422288 80377 -520424
$$ packed form
993c13822J4118L83764k15498P15178j78847n83590K7596J94230j31723P9804
983h790k68767K83084l35778R1217J87397q6010K01987J31100O2756p30013J37228
972c34589P2664K67538L2953r5552m63378K02227N18190m65192L58729M3550k92533
961a55393M9764j19017L73176m6385l94124K44534J82637j64191K8591J57270
951A56862l9143l74040L79545l27763m190L39750n20472L74616j52381p2372N91980
940C52392r76503Q52093m84632N34698j54931m25052O3097K88910p58242N07336
930b00834k39672l07586P67454J1405P6228j96906l39583O65496l96236j50271
920c10505O79251j010579N88211O8842n76378O16001n93930J16799N02665o00801
$$ plain form
910 -520424 -439552 168046 84702 -109181 -63696 -6592 -115958 -52103 138373 33890 215942
899 215942 -22903 107626 160608 -287095 -128105 -238467 85410 348626 -562005 304465
889 304465 243337 -387459 541634 -272007 375295 -196510 -430105 -40536 -316917 123762
879 123762 -53478 -374642 88461 262793 55660 -427507 -565384 2702 -240043 185268
869 185268 -368381 157060 350934 -271799 -57642 100960 -153890 -466700 -194399 -169995
859 -169995 -156611 -125186 117091 -276371 578444 -47124 28939 -226138 7517 308676
849 308676 82459 122085 -320446 -20537 -1235 -193160 -106342 -135110 -585804 -192272 -25874
838 -25874 -105800 2193 -195178 -404418 -305775 -294950 -131805 -259103 -177547 -137721 -340827
$$ packed form
910e20424Q0872O07598q3344j93883M5485N7104j09366O3855J90476j04483J82052
899B15942k38845J30529N2982m47703J58990j10362L23877K63216r10631Q66470
889C04465o1128o30796R29093q13641O47302n71805k33595L89569k76381M40679
879A23762j77240l21164M63103J74332k07133m83167j37877N68086k42745M25311
869A85268n53649N25441J93874o22733K14157J58602k54850l12810K72301K4404
859a69995J3384L1425K42277l93462Q54815o25568P6063k55077K33655L01159
849C08676k26217L9626m42531K99909J9302j91925Q6818k8768m50694L93532J66398
838b5874p9926J07993j97371k09240R8643J0825J63145j27298Q1556L9826k03106
$$ plain form
827 -340827 596181 -295389 380971 -240007 -316234 -683381 -362411 -342088 97437 -343930
817 -343930 -186958 11958 124234 -64940 226711 29448 -304327 -208068 -466641 -93528
807 -93528 -253603 59922 -229167 75427 341658 -10204 -228235 -177272 -289615 280293
797 280293 -88855 -111286 -399071 79973 135708 64916 53472 -166238 -215544 -22733 -322124
786 -322124 161673 -226904 -84927 91497 -422047 -23401 -335580 -36662 8476 -221443
776 -221443 -91508 347802 -106431 439818 71928 -109630 -390793 -308136 68250 147199
766 147199 -366096 480748 -54069 212724 -428728 -166240 -213447 -402665 -418796 -365374
756 -365374 -17964 -186649 -188539 -90699 -369507 -138717 -8217 -30407 -332185 -56775 -53481
$$ packed form
827c40827R37008q91570O76360o20978p6227l67147L20970K0323M39525m41367
817c43930J56972J98916J12276j89174K91651j97263l33775R6259k58573L73113
807i3528j60075L13525k89089L04594K66231l51862k18031N0963j12343N69908
797B80293l69148k2431k87785M79044N5735p0792j1444k19710m9306J92811k99391
786c22124M83797l88577J41977J76424n13544L98646l12179K98918M5138k29919
776b21443J29935M39310m54233N46249l67890j81558k81163Q2657L76386P8949
766A47199n13295Q46844n34817K66793o41452K62488m7207j89218j6131N3422
756c65374L47410j68685j890R7840k78808K30790J30500k2190l01778K75410L294
$$ plain form
745 -53481 -102897 238265 -48196 331675 220645 -155545 -266271 -194076 270695 -188945
735 -188945 119846 144014 114197 -69817 372315 347708 11492 13851 234001 189824 95993
724 95993 -75541 289022 19825 -341448 -268288 -336744 -85245 79294 148106 229635 292699
713 292699 130806 87999 148797 174413 578161 43241 -141814 239858 -326836 163323
703 163323 -191910 3132 100090 80366 -221398 77895 9495 -96367 -458400 -378983 -105424
692 -105424 134077 -78722 -486204 -243118 226524 -358460 23213 -25352 -391487 -275325
682 -275325 -249005 -185801 102350 -145230 198475 115397 120069 283143 31878 -382759 -528899
671 -528899 -135915 77936 -105637 -101378 -236383 81320 137454 214467 600132 267389 251974
$$ packed form
745e3481m9416L41162k86461L79871j11030l76190j10726P2195M64771m59640
735a88945L08791K4168k9817j84014M42132k4607l36216K359K20150m4177r3831
724I5993j71534L64563k69197l61273P3160o8456K51499J64539O8812Q1529O3064
713B92699j61893m2807O0798K5616M03748n34920j85055L81672n66694M90159
703A63323l55233J95042R6958j9724l01764K99293o8400j05862l62033P9417K73559
692a05424K39501k12799m07482K43086M69642n84984L81673m8565l66135J16162
682b75325K6320O3204K88151k47580L43705q3078M672J63074k51265m14637j46140
671e28899L92984K13851j83573M259j35005L17703N6134P7013L85665l32743j5415
$$ plain form
660 251974 -358356 -3513 -73812 -91219 -431641 641262 -451063 86672 -161969 301931
650 301931 90944 -89345 -196086 -88829 -681360 -246567 -8015 -130792 -629296 8649
640 8649 204086 11065 14494 -269250 -447649 -230092 -607233 -353582 -196178 -349168 169784
629 169784 215049 -10373 -254528 23228 -511066 -692981 -169823 393415 249415 -3459
619 -3459 215 7174 -494279 -486886 -276948 -303141 -1518 412535 3678 223121 -292806
608 -292806 204012 83127 58325 350028 -216905 -472979 79958 -34061 354758 -268884
598 -268884 533108 -340779 100927 33846 -573543 -434730 -8439 8665 -290637 -186592
588 -186592 337562 23701 26574 223419 178391 -281324 -274857 226154 -119675 -237809 298798
$$ packed form
660B51974o10330L54843p0299j7407l40422J072903j092325N37735k48641M63900
650C01931k10987j80289j06741J07257n92531M34793K38552j22777m98504O37945
640H649J95437j93021L429k83744j78399K17557l77141K53651J57404j52990N18952
629A69784M5265k25422k44155K77756n34294j81915N23158N63238j44000k52874
619c459L674O959n01453P393K09938k6193L01623M14053m08857K19443n15927
608b92806M96818j20885k4802K91703n66933k56074N52937j14019L88819o23642
598b68884Q01992q73887M41706o7081o07389J38813M26291J7104k99302J04045
588a86592N24154l13861K873J96845m5028m59715O467N01011l45829j18134N36607
$$ plain form
577 298798 8581 9396 534981 248259 -51897 561224 -52316 330119 82343 -277097
567 -277097 153755 -31622 -316999 -256026 60253 -43063 -286384 -441445 -207242 -154135
557 -154135 326775 -292378 -244468 -182267 -278258 -91494 -85879 -275578 144441 3701 -378764
546 -378764 8906 -471566 -464916 116070 -422196 10123 -225375 269933 -12671 -72677
536 -72677 -351828 40844 -132802 48090 -334828 -432330 -324120 -193358 -172129 -283057
526 -283057 34665 -324494 -329864 -196056 -708078 107114 -272978 260597 604758 -248037
516 -248037 72786 -59434 -152766 -362259 -41088 -371562 -77919 -397919 330082 -251637
506 -251637 65912 -40041 180278 266353 -167589 332082 -210671 -62136 18640 -572044
$$ packed form
577B98798k90217Q15N25585k86722l00156O13121o13540L82435k47776l59440
567b77097M30852j85377k85377O0973L16279j03316k43321j55061K34203N3107
557a54135M80910o19153M7910O2201r5991J86764N615j89699M20019j40740l82465
546c78764L87670m80472O650N80986n38266M32319k35498M95308k82604o0006
536g2677k79151L92672j73646J80892l82918r7502J08210J30762K1229j10928
526b83057L17722l59159n370J33808n12022Q15192l80092N33575L44161q52795
516b48037L20823j32220r3332k09493L21171l30474K93643l20000P28001n81719
506b51637L17549j05953K20319Q6075m33942M99671n42753J48535Q0776n90684
$$ plain form
496 -572044 -339298 96294 -27519 303988 58518 126358 120353 433458 -176980 -65324
486 -65324 -244712 -282986 -64325 168036 -302974 -281702 35973 107715 -91689 52845 -182083
475 -182083 183871 -315467 -245796 -53011 323107 -389711 56405 194147 -263257 -394027
465 -394027 -395381 -13673 50102 -223919 85941 -271996 -86088 -85522 29029 439054 -73496
454 -73496 190402 501738 95683 -315415 -216963 -70044 -64372 -158683 -195662 -495237 -361525
443 -361525 -160092 -149096 223281 -195858 39781 235730 -149036 -173688 -367078 -586175
433 -586175 321764 -166349 277956 -74841 -448591 291436 213638 -65178 31387 -612371
423 -612371 -202051 -193726 -458322 115715 -321630 64455 -107209 116156 546011 -99726
$$ packed form
496e72044K32746M35592j23813L31507k45470O7840o005L13105o10438J11656
486f5324j79388l8274K18661K32361m71010K1272L17675P1742j99404J44534k34928
475a82083L65954m99338O9671J92785L76118p12818M46116J37742m57404j30770
465c94027j354L81708O3775k74021L09860l57937J85908N66J14551M10025n12550
454g3496K63898L11336m06055m11098R8452J46919N672r4311l6979k99575J33712
443c61525K01433J0996L72377m19139K35639J95949l84766k4652j93390k19097
433e86175R07939m88113M44305l52797l73750P40027p7798k78816R6565o43758
423f12371M10320Q325k64596N74037m37345L86085j71664K23365M29855o45737
$$ plain form
413 -99726 400285 136280 -322445 -306617 -496824 125245 -13086 -124437 285416 368419
403 368419 -77689 -31899 -217400 -91539 -445840 178941 -41790 -491192 181399 -714
393 -714 108104 4147 233674 200479 -146495 -634175 395513 57294 -27253 -197572 12121
382 12121 -78971 -121276 -145856 -83852 -242133 541460 97108 191926 -94822 106696 12453
371 12453 -221034 -95072 -63545 -210205 359015 -405312 -397955 -317418 -256741 286138 -192836
360 -192836 143377 206490 -7709 319856 -76072 527588 130782 -175640 92797 -554717
350 -554717 -537202 251345 20910 -629778 -40277 -24451 -36648 -55755 -338659 -101294 -98511
339 -98511 33276 136157 -144928 -248445 -16861 161495 157658 -195447 -5672 -253846
$$ packed form
413i9726N00011k64005m58725J5828j90207O22069j38331j11351M09853Q3003
403C68419m46108M5790j85501J25861l54301O24781k20731m49402O72591j82113
393g14J08818j03957K29527l3195l46974m87680J029688l38219q4547j70319K09693
382A2121r1092m2305k4580O2004j58281P83593m44352R4818k86748K01518r4243
371A2453k33487J25962L1527j46660N69220p64327P357Q0537O0677N42879m78974
360a92836L36213O3113k14199L27565l95928O03660l96806l06422K68437o47514
350e54717J7515P88547k30435o50688N89501J5826j2197j9107k82904K37365K783
339i8511J31787J02881k81085j03517K31584J78356l837l53105J89775k48174
$$ plain form
329 -253846 -2234 -189547 99709 -148884 -680318 -280918 -13140 75145 413544 -210643
319 -210643 86584 -129751 -34790 -148637 -55270 183345 -516334 198122 21168 -824252
309 -824252 -36438 -544978 -213337 36309 -109853 500199 302677 73267 -532367 -265977
$$ packed form
329b53846K51612j87313K89256k48593n31434L99400K67778Q8285L38399o24187
319b10643K97227k16335R4961j13847R3367K38615o99679P14456j76954q45420
309h24252P87814n08540L31641K49646j46162O10052j97522k29410o05634K66390
$$ [...]
##END NTUPLES=NMR SPECTRUM
##END=
