##TITLE=abcd
##JCAMPDX= 6.0         $$ Bruker NMR JCAMP-DX V2.0
##DATA TYPE= NMR SPECTRUM
##DATA CLASS= NTUPLES
##ORIGIN= UXNMR, Bruker Analytische Messtechnik GmbH
##OWNER= root
$$ XWIN-NMR		Version 3.5
$$ Tue Jun  2 19:35:23 2026 Russian Standard Time (UT+4h)  servis@DPX200
##.OBSERVE FREQUENCY= 200.131235884673
##.OBSERVE NUCLEUS= ^1H
##.ACQUISITION MODE= SIMULTANEOUS
##.ACQUISITION SCHEME= undefined
##.AVERAGES= 32
##.DIGITISER RES= 18
##SPECTROMETER/DATA SYSTEM= spect
##.PULSE SEQUENCE= zg
##.SOLVENT NAME= CDCl3
##.SHIFT REFERENCE= (INTERNAL, CDCl3, 0, 16.4885)
##AUDIT TRAIL= $$ (NUMBER, WHEN, WHO, WHERE, WHAT)
$$ ##TITLE= Audit trail, XWIN-NMR		Version 3.5
$$ ##JCAMPDX= 5.01
$$ ##ORIGIN= Bruker BioSpin GmbH
$$ ##OWNER= servis
$$ F:\spectra/data/av/nmr/H1/1/pdata/1/auditp.txt
$$ ##AUDIT TRAIL=  $$ (NUMBER, WHEN, WHO, WHERE, WHAT)
(   1,<2026-06-02 19:34:28.50 +0400>,<servis>,<DPX200>,
      <created by zg, POWCHK disabled, PULCHK disabled
       configuration hash MD5:
       00 E9 B6 7A A2 85 ED C7 34 08 36 98 17 FE 4E 26
       data hash MD5: 32K
       64 6D 36 48 CD C5 E9 53 D3 ED 53 B3 92 D1 C8 2E>)
(   2,<2026-06-02 19:34:51.53 +0400>,<servis>,<DPX200>,
      <Start of raw data processing
       efp BC_mod = 2 LB = 0.05 FT_mod = 6 PKNL = 1 PHC0 = -412.19 PHC1 = 3.101563 SI = 16K 
       data hash MD5: 16K
       12 CB 4C 82 35 16 6D 9E C4 4B 92 6D F6 30 89 D7>)
$$ ##END=
$$ 
$$ hash MD5
$$ 4E 61 B7 0D 88 9E 5D 0D 05 40 46 D6 F3 42 AB F0
##$RELAX= 
##$RELAX= 
##$RELAX= 
##$RELAX= 
##$RELAX= 
##$RELAX= 
##$RELAX= 
##$RELAX= 
$$ Bruker specific parameters
$$ --------------------------
##$DU= <F:\spectra>
##$EXPNO= 1
##$NAME= <H1>
##$PROCNO= 1
##$TYPE= <nmr>
##$USER= <av>
##$AMP= (0..31)
100 100 100 100 100 100 100 100 100 100 100 100 100 100 100 100 100 100 
100 100 100 100 100 100 100 100 100 100 100 100 100 100 
##$AQSEQ= 0
##$AQ_mod= 1
##$AUNM= <au_zg>
##$AUTOPOS= <>
##$BF1= 200.13
##$BF2= 200.13
##$BF3= 200.13
##$BF4= 200.13
##$BF5= 500.13
##$BF6= 500.13
##$BF7= 500.13
##$BF8= 500.13
##$BYTORDA= 1
##$CFDGTYP= 0
##$CFRGTYP= 5
##$CHEMSTR= <none>
##$CNST= (0..31)
1 1 145 1 1 1 1 1 1 1 1 1 1 1 1 1 1 1 1 1 1 1 1 1 1 1 1 1 1 1 1 1 
##$CPDPRG= <>
##$CPDPRG1= <>
##$CPDPRG2= <>
##$CPDPRG3= <>
##$CPDPRG4= <mlev>
##$CPDPRG5= <mlev>
##$CPDPRG6= <mlev>
##$CPDPRG7= <mlev>
##$CPDPRG8= <mlev>
##$CPDPRGB= <>
##$CPDPRGT= <>
##$D= (0..31)
0 2 0 0 0 0 0 0 0 0.06 0 0 0 0 0 0 0.0002 0 0 0 0 0 0 0 0 0 0 0 0 0 0 
0 
##$DATE= 1780414468
##$DBL= (0..7)
120 120 120 120 120 120 120 120 
##$DBP= (0..7)
150 150 150 150 150 150 150 150 
##$DBP07= 0
##$DBPNAM0= <>
##$DBPNAM1= <>
##$DBPNAM2= <>
##$DBPNAM3= <>
##$DBPNAM4= <>
##$DBPNAM5= <>
##$DBPNAM6= <>
##$DBPNAM7= <>
##$DBPOAL= (0..7)
0.5 0.5 0.5 0.5 0.5 0.5 0.5 0.5 
##$DBPOFFS= (0..7)
0 0 0 0 0 0 0 0 
##$DE= 6
##$DECBNUC= <off>
##$DECIM= 32
##$DECNUC= <off>
##$DECSTAT= 4
##$DIGMOD= 1
##$DIGTYP= 9
##$DL= (0..7)
0 120 120 120 120 120 120 120 
##$DP= (0..7)
150 150 150 150 150 150 150 150 
##$DP07= 0
##$DPNAME0= <>
$$ [...]
##$SUBNAM4= <"">
##$SUBNAM5= <"">
##$SUBNAM6= <"">
##$SUBNAM7= <"">
##$SUBNAM8= <"">
##$SUBNAM9= <"">
##$SW= 20.6817932712277
##$SWIBOX= (0..15)
0 0 3 0 0 0 0 0 0 0 0 0 0 0 0 0 
##$SW_h= 4139.07284768212
##$TD= 32768
##$TD0= 1
##$TE= 0
##$TE2= 300
##$TE3= 300
##$TEG= 300
##$TL= (0..7)
0 120 120 120 120 120 120 120 
##$TP= (0..7)
150 150 150 150 150 150 150 150 
##$TP07= 0
##$TPNAME0= <>
##$TPNAME1= <>
##$TPNAME2= <>
##$TPNAME3= <>
##$TPNAME4= <>
##$TPNAME5= <>
##$TPNAME6= <>
##$TPNAME7= <>
##$TPOAL= (0..7)
0.5 0.5 0.5 0.5 0.5 0.5 0.5 0.5 
##$TPOFFS= (0..7)
0 0 0 0 0 0 0 0 
##$TUNHIN= 0
##$TUNHOUT= 0
##$TUNXOUT= 0
##$USERA1= <user>
##$USERA2= <user>
##$USERA3= <user>
##$USERA4= <user>
##$USERA5= <user>
##$V9= 5
##$VALIST= <valist>
##$VCLIST= <CCCCCCCCCCCCCCC>
##$VD= 0
##$VDLIST= <DDDDDDDDDDDDDDD>
##$VPLIST= <PPPPPPPPPPPPPPP>
##$VTLIST= <TTTTTTTTTTTTTTT>
##$WBST= 1024
##$WBSW= 30
##$XGAIN= (0..3)
0 0 0 0 
##$XL= 0
##$YL= 0
##$YMAX_a= 359803
##$YMIN_a= -610269
##$ZGOPTNS= <>
##$ZL1= 120
##$ZL2= 120
##$ZL3= 120
##$ZL4= 120
##$ABSF1= 0
##$ABSF2= 0
##$ABSG= 0
##$ABSL= 0
##$ALPHA= 0
##$AQORDER= 0
##$ASSFAC= 0
##$ASSFACI= 0
##$ASSFACX= 0
##$ASSWID= 0
##$AUNMP= <proc_1d>
##$AZFE= 0.1
##$AZFW= 0.1
##$BCFW= 0
##$BC_mod= 2
##$BYTORDP= 0
##$COROFFS= 0
##$CY= 18.4799938201904
##$DATMOD= 1
##$DC= 0
##$DFILT= <>
##$DTYPP= 0
##$F1P= 9.9274215381318
##$F2P= -0.165520771350173
##$FCOR= 1
##$FTSIZE= 16384
##$FT_mod= 6
##$GAMMA= 0
##$GB= 0
##$INTBC= 1
##$INTSCL= 4.127829e-11
##$ISEN= 128
##$LB= 0.05
##$LEV0= 0
##$LPBIN= 0
##$MAXI= 10000
##$MC2= 0
##$MEAN= 0
##$ME_mod= 0
##$MI= 50
##$NCOEF= 0
##$NC_proc= -6
##$NLEV= 6
##$NOISF1= 3.799351
##$NOISF2= 2.8
##$NSP= 0
##$NTH_PI= 0
##$NZP= 0
##$OFFSET= 16.48848
##$PC= 4
##$PHC0= -412.19
##$PHC1= 3.101563
##$PH_mod= 1
##$PKNL= yes
##$PPARMOD= 0
##$PSCAL= 4
##$PSIGN= 0
##$REVERSE= no
##$SF= 200.130005582386
##$SI= 16384
##$SIGF1= 3
##$SIGF2= 2
##$SINO= 400
##$SIOLD= 16384
##$SREGLST= <1H.CDCl3>
##$SSB= 0
##$STSI= 16384
##$STSR= 0
##$SW_p= 4139.07284768211
##$SYMM= 0
##$S_DEV= 0
##$TDeff= 32768
##$TDoff= 0
##$TI= <>
##$TILT= no
##$TM1= 0
##$TM2= 0
##$TOPLEV= 0
##$USERP1= <user>
##$USERP2= <user>
##$USERP3= <user>
##$USERP4= <user>
##$USERP5= <user>
##$WDW= 1
##$XDIM= 16384
##$YMAX_p= 531046445
##$YMIN_p= -7075058
$$ End of Bruker specific parameters
$$ ---------------------------------
##NTUPLES= NMR SPECTRUM
##VAR_NAME=  FREQUENCY,     SPECTRUM/REAL,   SPECTRUM/IMAG
##SYMBOL=    X,             R,               I
##VAR_TYPE=  INDEPENDENT,   DEPENDENT,       DEPENDENT
##VAR_FORM=  AFFN,          ASDF,            ASDF
##VAR_DIM=   16384,         16384,           16384
##UNITS=     HZ,            ARBITRARY UNITS, ARBITRARY UNITS
##FACTOR=    0.252644378177508, 1,           1
##FIRST=     3299.83951724647, 0,            0
##LAST=      -839.233330435636, 0,           0
##MIN=       -839.233330435636, -7075058,    0
##MAX=       3299.83951724647, 531046445,    0
$$ Real data points
##PAGE= N=1
##DATA TABLE= (X++(R..R)), XYDATA
$$ [...]
11978d0905j042784N76832j47946L2329O50229j390325J451996o04654L82845
11969a32383n33409N02880r03841M51616k00447O08478r58928M66713j73557k9830
11959i02708J048661l50474o92388L16286l61504J35915N34053m63588M68404
11950b67343r9558m36497M43320K13972K04539o78723n30126J86504O0260k20819
11940a124471j99054J53576J113286k07032l973j02386O968l35987n68394P93608
11930d73859O4192m87205P36991q08127K8144M59811p5194l06943R2412O07772
11920a62006j7436o40987N19786k55511m72295J93270O60964n9972L44801r27340
11910h16726J12744o54818N50772K43067j89021P71078k97572q00384R68819k18262
$$ y = [-40905, -1083689, -506857, -654803, -622474, 27755, -1362570, 89426, -515228, -132383, -665792, -162912, -1066753, -615137, -815584, -207106, -1166034, -699321, -872878, -902708, 145953, -204521, -896909, -580623, -942127, -806212, -272159, -735747, -267343, -366901, -803398, -360078, -146106, 58433, -620290, -1150416, -963912, -903652, -1124471, -1323525, -1169949, -56663, -263695, -267668, -370054, -363086, -699073, -1267467, -473859, -409667, -896872, -159881, -968008, -939864, -480053, -555247, -862190, -769778, -162006, -179442, -820429, -300643, -556154, -1028449, -835179, -174215, -234187, 110614, -816726, -703982, -1358800, -808028, -564961, -753982, 17096, -280476, -1080860, -112041, -330303]
11900c30303j89013j93233j60428O39699k78061Q46991q31982K58630K93066J04411
11890A59777j55155N1282r39719N57406k96893N55109o31746L85614n61664J57409
11880g18580j79117j37347L62674K2433k18770J66094o1614P01006q61652m92431
11870a417304L16898P75302n54301Q47433r70708P67082m2750L32897r26247n1465
11860i23163J276332j070609M40279J14913j47588n9111o6791m23156L06006P6153
11850d76735J94333K399m09004P06100k68463l83880J92828j90951M10836j93728
11840d16265k94354l98147Q17023J10402m98411J16668m92532R85693p20578M77739
11830c12762m54983M10398n38788J030933p90466M26058m82808L49289l91744
$$ y = [-330303, -519316, -712549, -872977, -233278, -511339, 335652, -496330, -237700, 55366, 159777, 4622, 55904, -883815, -326409, -623302, -68193, -699939, -314325, -875989, -718580, -897697, -1035044, -672370, -649937, -868707, -702613, -764227, -63221, -924873, -1417304, -1100406, -325104, -879405, -31972, -1002680, -235598, -278348, 54549, -871698, -923163, 353169, -717440, -277161, -162248, -309836, -368947, -435738, -858894, -552888, -476735, -282402, -280003, -689007, 17093, -251370, -635250, -442422, -633373, -222537, -416265, -710619, -1108766, -291743, -181341, -679752, -563084, -1055616, -69923, -790501, -312762, -767745, -357347, -896135, 134798, -655668, -229610, -712418, -363129, -754873]
11821g54873N57755l66771J125P31090n31236p68o53785L35992m10247R44521
11811a47197J19491k02993p78930q2358N79476L30292m41188k70465Q20946q16373
11801h89299K96276L91507q79528K35825j31198L77598J34645L82919r23489K61744
11791g43000n29208Q85755j28814O28335j174388L74740K62047q5101l8028M34620
11781a13042m11474L98745j27338J70605l93175o04473J0161R76670o01575K64746
11771d30150r89534J078706K584J29474o00293N01757p6387n46194O91805Q2787
11761a55445N45935j232264O14319k10801r4163n69765r628O52759l48116k3867
11751h31036o8626O08589n66607M37277K08583k11153o17506l4748L72448K08829
$$ y = [-754873, -197118, -563889, -562764, 168326, -362910, -363678, -1017463, -681471, -1091718, -147197, -27706, -230699, -1009629, -1091987, -512511, -182219, -623407, -893872, -72926, -889299, -593023, -201516, -1081044, -845219, -976417, -598819, -464174, -81255, -1004744, -743000, -1272208, -386453, -515267, 113068, -1061320, -686580, -424533, -509634, -547662, -113042, -524516, -125771, -253109, -82504, -475679, -1080152, -1069991, -93321, -694896, -430150, -1419684, -340978, -338394, -208920, -809213, -307456, -383843, -930037, -238232, -155445, 390490, -841774, -227455, -438256, -532419, -1102184, -1111812, -459053, -807169, -831036, -899662, -291073, -857680, -420403, -211820, -422973, -1040479, -1075227, -702779, -493950]
11741d93950j92734M06141J0811m45549L63200J01160o42851N3396j63951N70028
11731d34299K30976J0278n27870l07766M91602j93042L09046L96318l97178m36779
11721h58714P95323M53165o10174k7446l58528R41677m84192K91668j167985L67522
11711f57684k14376J096138j338165O27358o53553R0775J00282L45505L49272
11702b54448p52449M56521j54007L77193k77512M2166r6983m01737M40284k4232
11692f45204J051672j244797p5012k2210P38552r53899R57212n16173J39686J20004
11682d50169M64772j197865J117959m37541l26700Q18101l87344L49149p21000
11673g70638K40543p19158M55292J7898n59744Q35928k14968L40355O84152j517488
$$ y = [-493950, -686684, -280543, -269732, -715281, -352081, -250921, -893772, -840376, -1004327, -434299, -203323, -193045, -720915, -1028681, -537079, -730121, -421075, -24757, -421935, -858714, -63391, 389774, -220400, -247846, -606374, 335303, -148889, 142779, -1025206, -657684, -872060, 224078, -1114087, -486729, -1140282, -1049507, -949225, -603720, -254448, -1006897, -550376, -704383, -327190, -604702, -562536, -659519, -1061256, -620972, -645204, 406468, -838329, -913341, -935551, -196999, -1150898, -193686, -709859, -570173, -450169, 14603, -1183262, -65303, -502844, -829544, -11443, -398787, -49638, -770638, -530095, -1249253, -793961, -776063, -1335807, -499879, -714847, -374492, 309660, -1207828]
11663a207828L09956J16613l9880Q82774l92991j42302j55133J0057r03254J055197
11653d66791P9686j74382Q12973L0998j016493R5333k08727M95151m39269Q43412
11643E1891m64730m50048P98560o76389J004698p09733L84252j85972K69293n74302
11633e52480L14377n29899j7601M17178n02282K86772q6373J63565K83086r2585
11623c16242q17481K35563M55875m46363L10601J08259j58593j095778Q27084
11614h97075r2209J058593K10289j109647L35024k57489K42834l11015O11482
11605b09213l13121N67074m63028o71934N48538J0280k57925Q43936m39116N8100
11595c26409n77079M57668q06991J187974m67098o32099O17298o14697J179951
$$ y = [-1207828, -897872, -781259, -821139, 61635, -331356, -473658, -628791, -618734, -1521988, -466791, -387105, -561487, 251486, 282484, -734009, -638676, -847403, -352252, -791521, 51891, -412839, -862887, -64327, -740716, 263982, -445751, -61499, -247471, 21822, -552480, -238103, -768002, -785603, -368425, -870707, -583935, -670308, -506743, -223657, -316242, -1133723, -898160, -442285, -888648, -578047, -469788, -628381, -1724159, -897075, -989284, 69309, 279598, -830049, -495025, -752514, -509680, -820695, -209213, -522334, 44740, -418288, -1090222, -541684, -531404, -789329, 54607, -384509, -326409, -903488, -445820, -1252811, -64837, -531935, -1164034, -546736, -1161433, 18518]
11586A8518q11905L56650k77709Q77760j212397O38636o25522Q83575k85795K52545
11576a85644n55336m75483J269053n40481K4892j38199N08947p19493P84450m52576
11566d79870p8464j36750L91042M2646J69114j70098J92895n48064j283836N32748
11556a368637R14712o78506J228063m32715l61911j9658o28828L05139N632J330619
11546B93910n84254m93331O24063n38505Q4283k4684k11558M61565N45155o36031
11536d79387k32251K75408J79500j52192K82844o74167K41841K65415k68132K18164
11526c42957M0227r8476L80358j49002J43064L71704K1168o39142k19376j52571
11516f45003K85933J60559o62214j1832J97827K03710k26535O63601m86945K81854
$$ y = [18518, -793387, -436737, -714446, 163314, -1049083, -410447, -1035969, -152394, -438189, -185644, -740980, -1216463, 52590, -487891, -462999, -601198, -92251, -811744, -27294, -479870, -558334, -695084, -304042, -261396, -92282, -262380, -69485, -617549, -1901385, -1368637, -453925, -1132431, 95632, -337083, -698994, -718652, -1347480, -1042341, -1036709, 293910, -290344, -783675, -159612, -698117, -613834, -638518, -850076, -388511, 156644, -479387, -711638, -436230, -256730, -408922, -126078, -800245, -558404, -292989, -561121, -342957, -302730, -401206, -20848, -169850, -26786, 344918, 366086, -273056, -492432, -645003, -359070, -198511, -860725, -872557, -674730, -471020, -697555, -33954, -520899, -239045]
11506b39045j5956l36737K21680p76687M10759k31065L80530n41604N63139l85433
11496i50419L08870L44281N31277q36021K64373l66545j02313J93227L0739l00015
11486h82546O56207j91410M60072q89359L09405n44404R88390l45644L09240j000191
11476a130240K38755J89143N2584L0494M9225o05653N01066N49662m3487Q6234
11466h2217l74792o5461J19805K66825k60203j145888J839101j063745J94392
11457e72183J00947k74076P203m05175L85385L56663Q18056j244479L34214k82418
11447g75863j1890r9504J94687k91283N76878K83992q9909j67556L8416m6898
11437c88930J1993O8762n75942J43448m71632M13237m56338J249207n89750M73546
$$ y = [-239045, -255001, -591738, -370058, -1146745, -735986, -967051, -586521, -1128125, -564986, -950419, -641549, -297268, 234009, -602012, -337639, -704184, -806497, -613270, -582531, -882546, -226339, -417749, 42323, -847036, -537631, -1082035, -93645, -439289, -130049, -1130240, -891485, -702342, -649758, -619264, -570039, -1175692, -674626, -124964, -168451, -82217, -457009, -522470, -402665, -135840, -396043, -1541931, 297170, -766575, -572183, -471236, -745312, -738109, -1143284, -757899, -401236, 416820, -827659, -493445, -775863, -787753, -887257, -692570, -983853, -406975, -122983, -212892, -380448, -342032, -388930, -376937, -308175, -884117, -740669, -1212301, -799064, -1255402, -6195, -595945, -122399]
11427a22399l7214q75524P17156O1484o50434J9032q4391Q73009j213859J193787
11417a19353p62045P26382j47593M91445p27693K53254k13146p19428P79186k37295
11407f76286m8185n27834O70880o4586j4833j03307J15119j48486J46719M70005
11397a80794q47657j36516N487M99350N5958j20032k21310R39629p82887Q11799
11387B3027q59162K48460l17767M96233j02885K24755o1614J12613K45235j63238
11377a54343o66129O03347j10558L14727j244732M76018J03736k62421O54618
11368b85737N2502n42951N7653N85295j113547N23111m3528K54886k51027k18311
11358i81654N69225o43435M17200k64313L10326m06252J044962p15324J47464
$$ y = [-122399, -159613, -1035137, -317981, -256497, -906931, -887899, -972290, -99281, -1313140, -119353, -881398, -155016, -302609, 188836, -538857, -285603, -498749, -1218177, -438991, -676286, -724471, -1252305, -581425, -646011, -660844, -764151, -649032, -797518, -650799, -180794, -1028451, -1164967, -1159480, -660130, -604172, -724204, -945514, -5885, -788772, 23027, -836135, -587675, -905442, -409209, -512094, -287339, -348953, -236340, 8895, -154343, -820472, -217125, -327683, -12956, -1257688, -781670, -677934, -940355, -285737, -233235, -776186, -718533, -133238, -1246785, -723674, -767202, -512316, -763343, -981654, -412429, -1055864, -638664, -902977, -592651, -998903, 46059, -669265, -521801]
11349e21801J58510O3774k25043J11873j168038M2223R13106M8430N76699k49696
11339b49963R3309l23728o8475j9354M15215l36930r8081L50346n54260O21215
11329a70706j061839J156185r31883J503287j217727O02569k80381p32692l32100
11320a465287J183197K93237j473468J064471O49091o42511J18909m53316J45045
11311e80632j38329J61599m73320P92667q82054P05818n95540P40000j63872M21202
11301a2461k33155m30786L07815k81116L7466L33822n12520K44394O74671l21969
11291a93839N3065o82232o2180P51693n01318k17887J9390K6833k27290N30419
11281e03346m22394Q78638r21329O43147J13030L80021o94736q4032N9731P21938
$$ y = [-521801, -363291, -299517, -524560, -412687, -1580725, -1538502, -625396, -576966, -267, -249963, -156654, -480382, -548857, -568211, -152996, -489926, -588007, -237661, -791921, -170706, -1232545, -76360, -1008243, 495044, -722683, -120114, -400495, -1133187, -1465287, -282090, 11147, -1462321, -397850, 251241, -391270, -272361, -725677, -580632, -718961, -557362, -1030682, -238015, -1120069, -414251, -1009791, -269791, -433663, -12461, -245616, -676402, -368587, -649703, -612237, -278415, -790935, -546541, 128130, -193839, -140774, -823006, -885186, -133493, -634811, -852698, -833308, -806475, -1033765, -503346, -925740, -47102, -968431, -325284, -212254, 167767, -526969, -611001, -551270, 170668]
11271A70668l67741L40532K5682N35093K63400l22640q2503p76191L76521j061766
11261h98945J054646r92480R76179j87368m87372M76929o54076K88910l4714j18029
11251e76320j11016J42564O24621p97044M25378q40367Q23056r9516n6745m05182
11241h70571N11228m77595Q90689j013959R88068l40003j36626m4533m12982K07164
11231f99120J193758j103938J60412n4938k05507J34982p1637m04863N79334J48907
11221c22610m60317J22945Q23462m60667l46977j85539n0732K08552L98534j18762
11211c92111q2981l63360P34949n61559l36349N61564J47675J68251k24313l57661
11201g05895k53775m56653O28070M41810j65717j54687Q4895l95396O54820o23261
$$ y = [170668, -197073, 143459, 169141, 704234, 967634, 644994, 562491, -213700, 162821, -898945, 155701, -836779, 139400, -47968, -535340, -58411, -712487, -423577, -458291, -576320, -687336, -544772, 79849, -717195, -291817, -1132184, -309128, -408644, -465389, -870571, -359343, -836938, 53751, -960208, 27860, -312143, -448769, -493302, -906284, -699120, 494638, -609300, -448888, -503826, -709333, -574351, -645988, -1050851, -471517, -322610, -782927, -659982, 163480, -297187, -644164, -829703, -880435, -671883, -273349, -392111, -475092, -838452, -103503, -665062, -1001411, -439847, -292172, -123921, -348234, -705895, -959670, -1416323, -788253, -346443, -512160, -666847, -581952, -977348, -322528, -945789]
11191i45789M61861M64989k10252n7714K23058p13236O05909j85063l76316n0088
11181g82641m59120J019143n81257M02507r323K97187n31047k83546N20927M14517
11171G347k68017J78005j59709j029101J214466p43182K9034K41107m57260J156850
11161A69540o62658k267m2724o7163j43740J06289o9233m38038K58469j33927
11151a025452O01935K5254o7792q32890R84333j19952n03963p3536N79295J70849
11141b61919j45955l48744m73236J160221r69061r3802K19570O1437Q9622R63744
11131B01877k67116r06521K61279m96956R86554p2892o58472N41880K25279l46461
11121e31549m34172O64434l4736k02811K61675p52790P32444j050312R86329m291
$$ y = [-945789, -483928, -18939, -229191, -286905, -63847, -777083, -171174, -356237, -732553, -782641, -1241761, -222618, -803875, -401368, -410691, -113504, -644551, -928097, -407170, 7347, -260670, -82665, -242374, -1271475, -57009, -800191, -771157, -530050, -987310, 169540, -493118, -495385, -538109, -605272, -749012, -642723, -711956, -1149994, -891525, -1025452, -423517, -398263, -466055, -1298945, -314612, -434564, -938527, -1012063, -432768, -261919, -407874, -756618, -1229854, -69633, -1038694, -1132496, -912926, -851489, -761867, 201877, -65239, -971760, -710481, -1207437, -220883, -293775, -952247, -410367, -185088, -531549, -965721, -301287, -336023, -538834, -277159, -1029949, -297505, -1347817, -361488, -365779]
11111c65779J18453M29595k86500k94771j23548l05863l06804J171322n27278
11102d91173n6114L73983j319372Q18099j93374p6908K82370P12895r50683m1720
11092i41997J359209q12598m46970N52059n8978o85686Q77736l79963N15257j270440
11082a292371J032355M73762m58188N6761K40599j0866r3876r09908K02536j03362
11072h62558Q88738n62402K37310K36350k26851l60589J71456j79291N4704j12384
11062g15517J30327j65024Q22213j397673N98858K92546Q098j53355m09602L22885
11052f66244j08851P78863r86046N64354m55067M31631O11979p81665r8922o75410
11042a385378O49051j94688L56460k48755K68429Q76841j003345o1295j70649
$$ y = [-365779, -247326, 182269, -104231, -399002, -522550, -828413, -1135217, 36105, -491173, -547287, -173304, -1492676, -674577, -867951, -944859, -662489, 50406, -900277, -941997, 417212, -395386, -842356, -290297, -349275, -1034961, -157225, -537188, -21931, -1292371, -260016, 213746, -244442, -187681, 52918, 42052, -51824, -961732, -759196, -862558, 26180, -536222, -298912, -62562, -289413, -650002, -478546, -657837, -603133, -715517, -585190, -750214, 71999, -1325674, -726816, -434270, -426172, -579527, -989129, -666244, -775095, 3768, -982278, -417924, -872991, -441360, 170619, -611046, -709968, -1385378, -736327, -931015, -574555, -823310, -554881, 321960, -681385, -742680, -913329]
11033i13329P52889n07304P31488J23611m18688o26998L72493l91053K04622K13550
11023d58719N972j37271p9046O43377q07578L53075J26900m48774M65024L74900
11013C7860j468688R56503J82378r98290M43941J48342P0588q50100J523934j028384
11003i81916J002286j52804j74294p9484K20237m7524l79396k07874R09265j200887
10993a092391K99675M18719m5242r9600K3615P64656m75225k72081M0170q11899
10983a249603M65611k60256M20161q37148J186217m5975L0067l19502q1544K58740
10973d33232r70838L62348K17047o4917R0387j6822j60164J067446p82459O30520
10963f0684q02701O76230m09858M36763l54460k20560L15111l4081Q40796j125565
$$ y = [-913329, -160440, -667744, 63744, 187355, -231333, -858331, -485838, -876891, -672269, -458719, -452747, -590018, -669064, -25687, -833265, -480190, -353290, -802064, -337040, 37860, -1430828, -474325, -291947, -1290237, -846296, -697954, -627366, -1477466, 46468, -981916, 20370, -132434, -306728, -386212, -165975, -213499, -592895, -800769, 108496, -1092391, -792716, -373997, -419239, -518839, -495224, 269432, -205793, -477874, -437704, -1249603, -783992, -1044248, -624087, -1461235, -275018, -320993, -290926, -610428, -691972, -433232, -1404070, -1041722, -824675, -889592, -799205, -816027, -976191, 91255, -691204, -60684, -863385, -187155, -597013, -160250, -514710, -735270, -420159, -454240, 386556, -739009]
10953g39009N26997j5878j31431J24361k98983q53007J351195q27089K31717M15347
10943b15780m41453O1266K47453J6461j341688J508906j281531J266924p84406
10934i63848L37524k9928K05616p54471j44684R25685n86037J69178k35568R36672
10924a39861J2669m32493j79123l38948R33472K21571n01666M704n102n17199
10914i41976N54908m22503J90601K06655L61849k23876R0105N00837j065873Q32567
10904H3294k18145m0614k91659K52628k09824o76264O01362o3405K00916j99087
10894e60798L71534N14494n50407L94915o25521o69068N28408M96805m67594j86769
10884g54001N75023l96033J6526l91916Q28060k96767L04433k62688N7063r00960
$$ y = [-739009, -212012, -227890, -359321, -234960, -533943, -1386950, -35755, -862844, -631127, -215780, -657233, -595967, -348514, -332053, -1673741, -164835, -1446366, -179442, -963848, -626324, -656252, -450636, -1205107, -1349791, -424106, -1010143, -840965, -1076533, -139861, -127192, -559685, -738808, -1077756, -144284, 77287, -424379, -419675, -424777, -941976, -387068, -809571, -618970, -412315, -50466, -274342, -184237, 316600, -749273, 83294, -134851, -175465, -467124, -214496, -424320, -1100584, -499222, -562627, -361711, -560798, -189264, 325230, -225177, 169738, -455783, -1124851, -596443, -99638, -567232, -754001, -178978, -575011, -558485, -950401, -122341, -419108, -114675, -377363, -320300, -1221260]
10874a221260P59891q27529R94209j36786m05081K64371m25922N71290m81082
10865i07899Q11000j084858P54580j84288N60483l59583M36079o76317j53453
10856h04256K97719k3361N7083n5266p1297M55330q4242R3276k80646j76630N97071
10845D781j366646R69033l20519J52283m13085k1391M29272L09349o58560J97791
10835g17692m68362M90750p9947K76146J89293N11818n29938j69243O46531q33149
10825f83793K72298M3638n09521O05442p54869N33501R8802L50760l84856K19040
10815b09558l75355M86638n22840n11860O82047L16517K41073k96478r785o46421
10805h46022j07760N24909l44125K61379n28913O01137n05764L38487N836K46036
$$ y = [-1221260, -461369, -1288898, -294689, -431475, -836556, -572185, -998107, -426817, -907899, -96899, -1181757, -427177, -611465, -50982, -410565, 25514, -650803, -804256, -506537, -529898, -472815, -528081, -599378, -144048, -228290, -135014, -415660, -592290, 4781, -1361865, -392832, -713351, -561068, -974153, -995544, -566272, -256923, -915483, -717692, -1186054, -695304, -775251, -499105, -309812, 202006, -327932, -497175, 149356, -683793, -411495, -367857, -877378, -271936, -1026805, -493304, -394502, -43742, -428598, -209558, -584913, -98275, -621115, -1132975, -450928, -134411, 106662, -189816, -199601, -846022, -953782, -428873, -772998, -511619, -1040532, -439395, -945159, -606672, -600836, -354800]
10795c54800O2068M15732r84755R55120j132109M24021r65975O11840l82378J294586
10785e6650j055853Q73079N23418q24417r0253R973J03671k57668j85699K08736
10775g51663P67908K26581l75264o66906K95051J32196O49897r17728M17003m89929
10765g12854P52870o06804j90643r543J73735k20115K53168N58835j99876j011317
10755a212544L48069J91265L07885m65393L68352R5985n30899K02209j80302O86791
10745a88582q09289P39771n50704J049458j065649K79401l20244Q68413o98451
10736f95876k9299L983L91512l156j99867k14481M37266n07191j098275J162664
10726g52720M209k5338O25202j012653R34343n87996N26957q65776R05427q21337
$$ y = [-354800, -292732, 123000, -861755, 93365, -1038744, -614723, -1580698, -968858, -1351236, -56650, -1112503, -239424, 283994, -540423, -630676, -620703, -517032, -774700, -960399, -751663, 16245, 242826, -132438, -799344, -504293, -372097, 277800, -639928, -222925, -712854, 40016, -566788, -757431, -766974, -593239, -813354, -560186, -1351, -201227, -1212544, -864475, -673210, -365325, -830718, -462366, -366381, -897280, -695071, -875373, -188582, -997871, -258100, -808804, 240654, -824995, -545594, -865838, 2575, -695876, -725175, -721192, -329680, -332836, -532703, -747184, -309918, -817109, -1915384, -752720, -748511, -773849, -148647, -1161300, -226957, -814953, -287996, -1153772, -248345, -1069682]
10716a069682Q93945m06381K52737n96267J022673r3938M57180r34299L43831
10707a30201p57960J226588j111686N09770l62648M40562n48317N55998o78281
10698h56175M68490J37774l37612J59911M7375p10703N75874n84447Q82562m47228
10688f64179P86211j235150N55545m39936K95423k17391q789L60916K38792P08022
10678C79464j808779J026547o87806J197522r93189K08518k61109N44669m30912
10669h25075K89756r94691J019945j9616r5549M43207j55507N6977p19265J243611
10659B43793j340045J052105m62282P739o13092Q06257M67706r67086M5739Q25810
10649F6644m65701M08007j108405P71973r41393J036951L05110n20127l81759
$$ y = [-1069682, -175737, -582118, -329381, -925648, 97025, 3087, 460267, -474032, -130201, -888161, 338427, -773259, -263489, -626137, -185575, -733892, -177894, -856175, -387685, -249911, -587523, -427612, -380237, -1090940, -515066, -1099513, -216951, -664179, 122032, -1113118, -557573, -997509, -702086, -919477, -928266, -567350, -328558, 379464, -1429315, -402768, -1090574, 106948, -886241, -677723, -938832, -394163, -825075, -535319, -1530010, -510065, -529681, -625230, -182023, -337530, -280553, -999818, 243793, -1096252, -44147, -506429, -498690, -1111782, -305525, 162181, -804905, -759166, 66644, -399057, 8950, -1099455, -327482, -1268875, -231924, 73186, -446941, -828700]
10640h28700n13528P97903m33622J19316m09253L26750M80000l53169J106637
10631B92334l66322j38699N05474k91181r9080p28223j26277q959L30652M16267
10621b14014n23799Q95388j00666o04643K00978K26939n99413o6212J59788q5209
10611g10863N44448m65426j21411R13208n31235O54417j012056j43123o55419
10602a527460J158672p60196M56737J2614O94659n84077l23563K00445K23122
10593d49047L30584q99148M78784P74904n18858n82373M88124j99372k24873M81533
10583c19742N22109j671747j37050Q93846M23899j86717J009696o46267j8142
10574a30115J90828M60720j166152L1176L06945J18253L09511o65537N37004p06411
$$ y = [-828700, -1342228, -544325, -977947, -858631, -1267884, -941134, -461134, -814303, 292334, -73988, -212687, 292787, 1606, -97474, -825697, -951974, -960933, -630281, -214014, -737813, 157575, 56909, -547734, -346756, -119817, -719230, -785442, -625654, -710863, -166415, -631841, -753252, 159956, -371279, 283138, -728918, -872041, -1527460, -368788, -1128984, -672247, -659633, 35026, -549051, -872614, -672169, -449047, -118463, -1017611, -538827, 236077, -282781, -865154, -377030, -576402, -801275, -319742, 202367, -1469380, -1606430, -712584, -288685, -475402, 534294, -111973, -130115, 60713, 521433, -644719, -613543, -306598, -188345, 121166, -544371, -7367, -713778]
10564g13778r4543P26694k74835l81767J25481p99709N56873K51042L08061j69679
10554d66160j17498k83923j64538O16620n01729L86376J95598o62905j63865j22379
10544a284403Q09355j43365J20702L5685r7852j49402L36667J96726o90543O97965
10534a68465j82530J40630k78646k3613J10713j17869m2517K37242r59510O39358
10524f45207l62537K55811J90453n50807j9675Q75834n72472N44142j43568L20654
10514a07372j79234J64816Q8308K38646q64099O57796j516685J248876k48671
10505e17619N9232n58483R89023j48965q71384J153335q74207j68321J048959
10496A11570m03975N85799n66308o0880o3409k27112N03458o29933J14974m16931
$$ y = [-713778, -808321, -81627, -356462, -738229, -612748, -1412457, -855584, -604542, -296481, -466160, -583658, -867581, -1032119, -415499, -917228, -530852, -335254, -998159, -1162024, -1284403, -475048, -618413, -497711, -462026, -559878, -709280, -372613, -175887, -866430, -168465, -350995, -210365, -489011, -512624, -401911, -519780, -562297, -325055, -1284565, -645207, -1007744, -751933, -561480, -1112287, -1131962, -256128, -828600, -284458, -428026, -107372, -286606, -121790, -33482, 205164, -658935, -1139, -1517824, -268948, -517619, -458387, -1016870, -27847, -176812, -1048196, 105139, -769068, -937389, 111570, -292405, 293394, -272914, -333794, -397203, -624315, -120857, -750790, -635816, -1052747]
10486a052747J086615m49061o81202m7189J10990O61731o0132J20111m35844P64256
10476A7528j76273o33165p06077Q72551L73905k46007L21006o93708O03890k02897
10466d69247j36039L27541m82159K66855l32529N77646N7904J66316r40440O00028
10456c64124k89579R0436K68059J88081o94806K71513O8927k73676l80038O99735
10446d15472m60674N95001M42438j162834O94305r52243J127772j201565J115867
10437b17405p12931P37188o1441l53996P98943l914j176672Q90664k67272j2698
10427c79534m76643N80016o90586L07053K42636q65J18621o79933P84881k83035
10417d77389J74087l88831K95419p23236m54614J642599l74813O20713p00570
$$ y = [-1052747, 33868, -415193, -1096395, -1143584, -1032594, -370863, -430995, -310884, -746728, 17528, -158745, -791910, -1497987, -625436, -251531, -497538, -176532, -870240, -266350, -469247, -605286, -277745, -759904, -493049, -825578, -247932, -190028, -23712, -964152, -364124, -653703, -563267, -295208, -107127, -801933, -530420, -461493, -735169, -1115207, -415472, -876146, -281145, 161293, -1001541, -307236, -1259479, -131707, -1333272, -217405, -930336, -193148, -254589, -608585, 190358, 186444, -990228, -99564, -366836, -379534, -856177, -276161, -966747, -659694, -417058, -417923, -299302, -979235, -194354, -477389, -303302, -692133, -396714, -1119950, -1574564, 68035, -306778, 313935, -386635]
10408c86635K1890o72820J039459o90653n35835N75690N32704q13500M58677l90187
10398h61210P67636j047094M43633J037579j74180p86030j79865K37992R3073
10389d68466k04363j18878O5625P2890j87791N44539j32916J87977p71923p3309
10379a086615L80846J99186J4412k12017J81317j21310L3106j11841L70931p61020
10369a113005P38292k46377j28519J013655r61231K32715J59889K99458q85512
10360h90635N81672q71893J159385p72097N48149k98316n94011N73357n91053
10351a155442J284762L9081l34437o25120P1931j46629M78488r27862P80829o2475
10341e96874Q2798n70427O05953n02631L14959l79908N64474O47989m29865r154
$$ y = [-386635, -364745, -1037565, 1894, -688759, -1224594, -648904, -116200, -929700, -471023, -861210, -93574, -1140668, -697035, 340544, 166364, -619666, -799531, -561539, -468466, -672829, -791707, -726082, -653192, -840983, -296444, -429360, -241383, -1013306, -1086615, -705769, -506583, -492171, -704188, -522871, -644181, -611075, -722916, -351985, -1113005, -374713, -621090, -749609, 264046, -697185, -464470, -304581, -5123, -890635, -308963, -1180856, -21471, -793568, -245419, -543735, -1137746, -564389, -1155442, 129320, 168401, -166036, -791156, -719225, -865854, -387366, -1315228, -534399, -596874, -514076, -1084503, -478550, -981181, -666222, -1046130, -481656, 166333, -263532, -272686]
10331b72686n52900K11017m92478O59654l2965J53431K4018P27776j514951P68023
10321c22061r63002L67272q22592J058942L89106L8309J80336n26662M61164k14144
10311c53332l47395k12516P2675O84750l70516Q3587O95928q57750n60067J25223
10301a039413K82983j39763M7035K43197N43300p91001l99783Q7541R26138j072590
10291a312356J003783K81757n80837q8969J18742l20346N31221l49665L94235
10282c22435r0527l70157R4876K3444M20027k10646k69876k33766j62029J29659
10272i91430L15948O01687p72672N62514n04310Q38926q32939N21858j71371N22002
10262I0213n30887Q3732m08612l82878M01109M30937K11581j66931k98758J18824
$$ y = [-272686, -825586, -614569, -1107047, -447393, -480358, -326927, -302909, 424867, -1090084, -322061, -1285063, -917791, -1740383, -681441, -292335, -254026, -73690, -600352, -139188, -353332, -700727, -913243, -840568, -155818, -526334, -442747, 253181, -604569, -1164636, -1039413, -756430, -896193, -849158, -605961, -62661, -853662, -1253445, -1165904, -239766, -1312356, -308573, -26816, -607653, -696622, -577880, -898226, -367005, -716670, -322435, -412962, -783119, -688243, -664799, -244772, -455418, -725294, -959060, -1121089, -991430, -675482, -73795, -846467, -283953, -788263, 50663, -782276, -260418, -431789, 90213, -440674, -356942, -765554, -1148432, -747323, -316386, -104805, -271736, -570494, -451670]
10252d51670n3836N63324r44196j80714j19801J003343k51109M90322j782958
10243a727295P69971j51117N02096K48574j41767l66368m32670J165514m54040
10234e87102k01007K28013l76953k16894Q11054P1471J56465l80563k13348N23927
10224a84937n423L90460p17994o3321J20085J3564j82670K20953j58028J82972
10214c84339L55300j4664o45132j00907J36402L245r1010O97127n57532O41862
10204D0352j391783P38485M81324n28850m65141N07528K33082k34671k83313L32795
10194e70192l85659R71800q69881j37329M77453K80135j20637j24428n30135m20011
10184a428884P00978K10974j4693M61470k69679m68865J189603m43484o07472
$$ y = [-451670, -505506, 57818, -886378, -1067092, -1186893, -183550, -434659, 55663, -1727295, -957324, -1108441, -606345, -357771, -499538, -865906, -1298576, -133062, -587102, -788109, -560096, -937049, -1153943, -342889, -271418, -114953, -495516, -708864, -184937, -190360, 200100, -517894, -581215, -461130, -447566, -630236, -409283, -567311, -384339, -29039, -43703, -688835, -789742, -653340, -650095, -741105, -43978, -601510, 40352, -1351431, -612946, -131622, -660472, -1125613, -618085, -385003, -619674, -902987, -570192, -955851, 15949, -853932, -991261, -513808, -233673, -354310, -478738, -1008873, -1428884, -727906, -516932, -531625, -70155, -339834, -808699, 380904, -62580, -670052]
10175f70052l54874M49929n8741j23111L75468m1335K57306o61695n4137R1467
10165g89775Q39892m49567K67664k87376j66067L87574r23149N33983J21753J07557
10155c57511j93011M72194m46572l29110r2788O96060m94092K72571L3149l49494
10145g88604m22217J608291j244527J6763K43194K20212n7298K94504n7600O30585
10135D43303j380319J74395K7984L55872m19142M62335N61949r80450J03149J82637
10125d68287j80310l88058K41284K13319J09834O992M4200L02437m93877J86848
10115d25618j66515K75693j31068m26199O20943l64153j40970O43876p11410N03960
10105c21461J93189j72312o90549J033046j185005R39804M290k44786k83629J079914
$$ y = [-670052, -1024926, -574997, -633738, -756849, -381381, -422716, -165410, -827105, -881242, -789775, 50117, -399450, -131786, -419162, -585229, -197655, -1120804, -586821, -465068, -357511, -550522, -78328, -524900, -854010, -946798, -250738, -744830, -472259, -439110, -788604, -1210821, 397470, -847057, -830294, -587100, -366888, -424186, -129682, -187282, 443303, -937016, -762621, -734637, -378765, -797907, -335572, 226377, -754073, -650924, -468287, -648597, -1036655, -795371, -582052, -472218, -465226, -421026, -118589, -612466, -425618, -592133, -316440, -447508, -873707, -252764, -616917, -757887, -114011, -825421, -321461, -128272, -300584, -991133, 41913, -1143092, -203288, -198998, -443784, -727413, 352501]
10095C52501r79362k45016J69137M89485m50168L7072j68747p6551N48353o36075
10085i59371N09017R9465k83668l94736M68404k24688P33477q33838m2866M65556
10075d63248l0980m32945M59268J26955j061378J275207o51738K85920k87564
10066g80503J01668j17747O9415K40556j11825M71267j81817L28596k9474l47242
10056c57106l27908o32721R84586n01009J39015R43931P1222o20504j0186m61499
10046g72179K951N77767p08424J62862J48626j22380M90627n06945M25584j31763
10036d33274L90354l25300j54393j41434k95025K17511L77980j93876L0416o70641
10026a197682L15832o5510L23068K91337j40029K63561p64935O07090k08731l69797
$$ y = [352501, -626861, -871877, -702740, -213255, -663423, -626351, -795098, -871649, -323296, -959371, -450354, -350889, -634557, -1029293, -560889, -785577, -52100, -885938, -928804, -463248, -494228, -927173, -467905, -340950, -1402328, -127121, -778859, -492939, -780503, -678835, -796582, -727167, -486611, -598436, -127169, -308986, 19610, -9864, -357106, -685014, -1317735, -333149, -834158, -695143, 248788, 320010, -300494, -310680, -772179, -769228, -191461, -899885, -737023, -588397, -710777, -220150, -727095, -301511, -433274, -42920, -368220, -522613, -664047, -959072, -741561, -363581, -557457, -527041, -1197682, -881850, -947360, -624292, -332955, -472984, -209423, -974358, -367268, -575999, -945796]
10016i45796R84711j097231J008403q39167K56693o47743M94800m46174L91354
10007h40150M20194k72007J32498R1786P23598n93748L023n19153J128619r22956
9997f48296R66964j82707m02725P9915l44492Q60370p84589P44075j062535M59829
9987c14191j109275Q81084J47642q56508J002618r28056P71660l12637k13865
9978i31528k22653Q43623k21603l02557K26128j12943J41647p501K81662n56690
9968h62415L25936k15077J22209l09750K73596J05206M21676q33317N44168k33359
9958f61127K86597p3328k24027K33959n72603J107041J84436p51278j044967P82801
9948g32496K63454Q1881n96187J85242l52500O88543o45435N59194n99457n80452
$$ y = [-945796, 38915, -1058316, -49913, -889080, -632387, -1280130, -785330, -1231504, -840150, -419956, -691963, -559465, -467679, 255919, -337829, -334806, -853959, 274660, -648296, 318668, 135961, -266764, -186849, -531341, 329029, -455560, 288515, -774020, -314191, -1423466, -542382, -394740, -1251248, -248630, -1176686, -405026, -717663, -931528, -1154181, -310558, -532161, -834718, -608590, -721533, -579886, -587387, -305725, -862415, -536479, -751556, -629347, -939097, -665501, -560295, -138619, -971936, -427768, -661127, -374530, -447858, -671885, -437926, -1010529, 96512, 280948, -470330, -1515297, -732496, -469042, -387161, -983348, -798106, -1150606, -462063, -1107498, -548304, -1147761, -1728213]
9938a728213J283693q1370N42939p63894J97954j81756J35384j41975O15211j444350
9928a566377J185141j97472q1945O4762p1460o99471R17176J89672K01484j99419
9918b57909p02098N25716r4327p9301P94719j035661P09954p20111R74768l76054
9908b60304L25476p07563L39114K22871l94782j37868j27346r10950M34273R45976
9898b71103m77608m5922j64376l8932L36257o6627j7308k66324Q82334p21611
9888h51220P48041j59217m48967q6151m23634P18516j88045J20794J42168m90383
9878i18098J27676j12861J29345P40497p15280N52643P9644o67335J41396R4684
9868e47689j91348K36724N5608l4757n52390Q36790j117131Q72970J054913j468799
$$ y = [-1728213, -444520, -525890, 17049, -746845, -548891, -730647, -595263, -737238, -122027, -1566377, -381236, -578708, -660653, -595891, -667351, -1366822, -449646, -259974, -58490, -257909, -960007, -434291, -528618, -607919, 186800, -848861, -138907, -859018, 115750, -260304, 65172, -642391, -303277, -80406, -475188, -613056, -740402, -1651352, -1217079, -271103, -748711, -794633, -959009, -997941, -661684, -728311, -745619, -1011943, -129609, -851220, -103179, -262396, -711363, -797514, -1221148, -502632, -690677, -569883, -427715, -918098, -790422, -903283, -773938, -33441, -748721, -196078, -116434, -783769, -642373, -547689, -739037, -502313, -446705, -481462, -1033852, -197062, -1314193, -441223, 613690, -855109]
9858h55109l366J75760j07963J99434J31311m87524J02606K55352k65537L16152
9848e38884k16404J020855o05993l13492j99577L19102l12799l35732M02045m36283
9838a217162N66602q65877N97275l2547J019890m73070K34216j67437q2481K70837
9828a49754m92743N50466m56916M52027n93977J11116O55742l91105l93854L13164
9818c95834o77991J37755k93824N90544J13601k38250M74019M35958m03403k46904
9808e04329L7384n77339P97077m23480N36897m14253n88699O72596k19921k42435
9798i26502R4774O55544j36879k82385k97483j07613L40021l43202k31068J289920
9788E5127p53985M72116n64992N50461p59425N53951n98320N37513m44332K81281
$$ y = [-855109, -858475, -682715, -790678, -591244, -459933, -947457, -844851, -589499, -855036, -538884, -755288, 265567, -340426, -653918, -853495, -534393, -847192, -1182924, -780879, -1217162, -650560, -1516437, -919162, -951709, 68181, -404889, -170673, -338110, -420591, -149754, -642497, -92031, -548947, -96920, -690897, -579781, 75961, -315144, -708998, -395834, -1073825, -936070, -1229894, -639350, -525749, -763999, -289980, 145978, -257425, -504329, -466945, -1044284, -247207, -670687, -133790, -548043, -1136742, -464146, -684067, -926502, -831728, -176184, -313063, -595448, -892931, -1000544, -660523, -1003725, -1234793, 55127, -698858, -226742, -791734, -241273, -1000698, -446747, -1045067, -507554, -951886, -670605]
9778f70605j58226J4026l2786L19765N40720m49924j05961m95457J421555r18472
9768e35365N42084j403112Q40478k23177J02850j88249P10940o26360M28989m27562
9758g78484j39675M62929j171250P20327J57211j84041P63418j30996k75976L04549
9748b71988O10122j107986L17285J83016o60085R78159j105649M26631j114826
9739a745321J140480j504974J397215n96053O76060k12485N32093J50465R8550
9730f3970k28780r4576k7094r7055L23676n50829O9182k78497J273156r8976n02930
9719b76693o3983k42090J118214j336685J410680j050862L3374j88259J70327
9710d25977J75046j93491K20502K26881n33502J35670j17981j46129l3565n3316
$$ y = [-670605, -828831, -814805, -847591, -527826, 12894, -437030, -542991, -1038448, 383107, -535365, 6719, -1396393, -555915, -779092, -676242, -864491, -153551, -779911, -350922, -778484, -918159, -455230, -1626480, -906153, -748942, -932983, -169565, -300561, -576537, -271988, 338134, -769852, -452567, -269551, -929636, 48523, -1057126, -630495, -1745321, -604841, -2109815, -712600, -1308653, -632593, -845078, -312985, -162520, -63970, -292750, -387326, -414420, -511475, -187799, -738628, -669446, -947943, 325213, 226237, -276693, -340676, -582766, 535448, -801237, 609443, -441419, -408045, -596304, -425977, -250931, -444422, -223920, 2961, -530541, -394871, -512852, -658981, -692546, -745862]
9700g45862R7292O4810J83381k36614j81305P43718k24763j83614n5181M59250
9690g8888K73183n37345L89327j14361M14471o22163O87299k19629l26850j6013
9680a50969l2038o1188j7121q96549O73793o43150J197137k30541n19795K54274
9670d26147J10952K19095r6205q08725J370030r66431k54205O18632L67973n91385
9660d56416O81233n46836n54492J110267j407602K61385P91891n80720m43494
9651a144784J325712L8324l40693l0825j49978l29924L67678L25170J30111k89160
9641i8369j067392J201356q11708J74916N04968r81967J248790J80687J36203
9632D87484j514291N31701o54325O24527P75761m05612m95929L37975p00769M21849
$$ y = [-745862, -648570, -583760, -400379, -636993, -818298, -74580, -299343, -482957, -538138, -78888, 194295, -343050, 46277, -68084, 346387, -275776, 411523, 191894, -134956, -150969, -183007, -244195, -261316, -1157865, -484072, -1127222, 69915, -160626, -680421, -426147, -315195, -96100, -192305, -1001030, 369000, -597431, -851636, -233004, 134969, -456416, 224817, -322019, -876511, 233756, -1173846, -912461, -120570, -701290, -1144784, 180928, 219252, -121441, -152266, -302244, -632168, -264490, 60680, 190791, -98369, -1165761, 35595, -776113, -601197, -96229, -1078196, 170594, 351281, 487484, -1026807, -495106, -1149431, -524904, 250857, -154755, -650684, -312709, -1013478, -591629]
9622e91629l90931Q25817l7280n54291k09826J08208M98654O1867j92002N6356
9612d25057L59935o57459l32990O24392j09476O19314l48863k8438J9598q7192
9602c66236O65409J63871j014561J67069K29786q00934J229767j024020P56575
9593F726j85725n5650Q4041j40040k97350K06610k3976O42425n04436n9079L01517
9582b4937n40836M74373m05207J160839r14976l05980M80426l50973J283647j809304
9572i52928R6433Q24269L7394n6468j10238N83736J46004m21227o2658l6025K13310
9561B61602n54173J61546R6596m40923L95621K78446q31J04594P5455q97820L32873
9550a87014l79383L27379N25454j264993Q61871j73723J48986K23102j9984j069053
$$ y = [-591629, -982560, -156743, -194023, -748314, -958140, -849932, -351278, -289411, -481413, -425057, -65122, -722581, -1055571, -431179, -540655, 78659, -270204, -298642, -279044, -366236, 299173, 463044, -551517, -384448, -154662, -955596, 274171, -749849, 6726, -178999, -234649, -150608, -290648, -587998, -381388, -405364, 237061, -267375, -326454, -24937, -565773, -91400, -496607, 664232, -250744, -556724, -76298, -427271, 856376, -952928, -856495, -32226, 5168, -51300, -161538, 422198, 568202, 146975, 84317, 48292, 261602, -292571, -131025, -34429, -475352, -79731, 198715, 197884, 302478, 377933, -519887, -187014, -566397, -239018, 286436, -978557, -116686, -290409, -141423, 81679, 61695, -1007358]
9540a007358O63243Q07378m02974n45013j0560l42187J08716J150863j497862
9531a075754Q45206q43366p1670Q39280q31176R13666r56846O48321k29496P50321
9521a1514m05830L90650p21812P16573k91518J68883o82491Q98021o54671N99861
9511F152K6606L75774o62973J67565k51905J16942M44439k76703m35353j01430
9501e90886P14791n73000O89213r26382J055343R146j10796k95284L98351q47535
9491d77039j84877L38354O50135m46341n22902R27945J60866o97332k4819l10779
9481e86789O98656k79349J70167p19431K45573Q85644o48030M96392n73100L74840
9471F4573M346M41642p63508N61239l24692Q0652N97585J65809n71671R13453
$$ y = [-1007358, -344115, 463263, 60289, -484724, -495284, -837471, -728755, 422108, -1075754, -230548, -1073914, -1145584, -306304, -1137480, -223814, -1180660, -532339, -761835, -11514, -417344, -26694, -748506, -31933, -323451, -154568, -837059, 60962, -593709, 6152, 32758, 408532, -254441, -86876, -338781, -221839, 222600, -54103, -489456, -590886, 123905, -449095, 240118, -686264, 369079, 378225, 267429, -27855, 370496, -477039, -661916, -323562, 326573, -119768, -642670, 285275, 446141, -251191, -276010, -586789, 111867, -167482, 2685, -716746, -471173, 414471, -233559, 262833, -310267, 64573, 68919, 510561, -252947, 308292, -16400, 64252, 661837, 827646, 255975, 1169428]
9461A169428m60128n52413O97133n33001O88478r46092Q08556N02386p91656P1153
9451F53844L59392k8105j057831N52735m4116o18831J275317M9501n9264j36470
9441I46172O63912r65968O64814j40652K89745q54602O35650p88886L01354O63940
9431A415479k11611k15540j93716J79249L60305m18658j52762N33410O47115o45122
9421A298149m7517l9157k75256J32053J78876K78823L40817j257472R65667q13263
9411G61720O44332J86435m34948j18201k726m93573M09022p07773N88920O0715
9401H93923P8587k25990L21561J96658o06204O49824r28762Q83130j02082j15309
9391A045336l25704N60370m93920k80920J020569M20726l10172l08820k31273
$$ y = [1169428, 709300, 156887, 854020, 321019, 1009497, 63405, 871961, 1374347, 582691, 653844, 1013236, 985131, -72700, 480035, 435919, -182912, 1092405, 1141906, 1082642, 946172, 1610084, 644116, 1308930, 1168278, 1458023, 603421, 1239071, 450185, 751539, 1415479, 1203868, 988328, 794612, 973861, 1334166, 915508, 762746, 1296156, 1943271, 1298149, 1250632, 1211475, 936219, 1068272, 1247148, 1525971, 1866788, 609316, 1574983, 761720, 1406052, 1592487, 1157539, 1039338, 1036612, 543039, 952061, 244288, 833208, 893923, 972510, 746520, 1068081, 1264739, 658535, 1308359, 379597, 1262727, 1160645, 1045336, 719632, 1280002, 786082, 505162, 1525731, 1946457, 1636285, 1327465, 1096192]
9382A096192K49798m39834n70966k9136L50979N55509O5921r6938k24704p7769
9372H79052N8524j38741p5596J99922n08331N59476o34097M0483O35589L10772
9362A327053j082880p45614J638494m78714M41400l71838R11085m81259k70163
9353H87564n41579M91836M98861n23949P9127J82658k88663K10236r54602N32044
9343E73533l92674J425406j043960K46489l92925J34806j30183j84053P88658
9334A025097Q890o5920k10167J50021M95782J60857p02238j63990O11210K76854
9324A586396n60547J028052n42965J23106K58816r24296l66245O99253q2376o21431
9314E97763M69144L53903l0771P66102n20786r3474O12101n15040J24148L02290
$$ y = [1096192, 1345990, 906156, 335190, 306054, 657033, 1212542, 1278463, 1181525, 956821, 879052, 937576, 798835, 723239, 923161, 414830, 974306, 340209, 380692, 1016281, 1327053, 244173, -501441, 1137053, 658339, 1099739, 727901, 1638986, 1157727, 887564, 345985, 837821, 1336682, 812733, 891860, 1074518, 785855, 996091, 41489, 573533, 180859, 1606265, 562305, 808794, 415869, 550675, 420492, 236439, 1025097, 1033987, 968067, 757900, 907921, 1403703, 1564560, 862322, 698332, 1309542, 1586396, 1025849, 2053901, 1510936, 1634042, 1892858, 968562, 602317, 1301570, 1219194, 597763, 1066907, 1420810, 1390039, 2156141, 1635355, 1541881, 2153982, 1638942, 1763090, 2065380]
9304B065380p48144N16829K24079l45616L12182M31693p34368J224859q19762
9295B127132J65755m59856Q21214o07267m48301P85539K39641k08146J59737J10413
9285B685861m01005N66167m06784M32413k84383P5576K72839j32147K68912n68731
9275B508718J127541j185529J193131l88355m64319K99482K79875m59911L45790
9266C256423m17401K94263O97042l35697R16344j010980O40656N4762n89240j22241
9256C383931J077315p93890m89767J261175j574077J154497L70189K54903k84204
9247D360072J143471r02240N28718l32694m1363J66152k59006o5062n09341P05803
9237D794510o78916J189470o59179O60991p44324M59093j0024M74839k95504k40991
$$ y = [2065380, 1317236, 1834065, 2058144, 1712528, 2024710, 2456403, 1722035, 2946894, 2127132, 2292887, 1833031, 2654245, 2046978, 1598677, 2384216, 2623857, 2415711, 2575448, 2685861, 2284856, 2851023, 2444239, 2876652, 2592269, 2667845, 2940684, 2808537, 3077449, 2508718, 3636259, 2450730, 3643861, 3255506, 2791187, 3090669, 3370544, 2910633, 3256423, 2839022, 3133285, 3830327, 3494630, 4410974, 3399994, 4040650, 4095412, 3506172, 3383931, 4461246, 3667356, 3177589, 4438764, 2864687, 4019184, 4389373, 4644276, 4360072, 5503543, 4601303, 5130021, 4797327, 4755964, 4922116, 4663110, 4598048, 4088707, 4794510, 4115594, 5305064, 4645885, 5306876, 4562552, 5021645, 5011621, 5486460, 5190956, 4949965]
9227D949965Q46316l54358R8533n422K77382O94428J49491J84820l76766P32656
9217G197045p07589K8300J99453J18757R29593l31325P99115o21517R14167k67990
9207H258009K13526p75044R75311K78723K56783M362R52259n17413J88977P32676
9197A0568169j67411J41465K82931p86440J581284K85905P50293J90726J042693
9188A3889615j85896J776421n96289P40471M7558N32059J83384J078571j86688
9179A7279206J044015J036035M44117J119470N81289K47058M09019J325186J278303
9170B4763698P05505J076732O11461L53025P84075R92286N84954J056035M35346
9161C1363117J417379O10882K173190Q79109K087167K113696K012068J988723
$$ y = [4949965, 5796281, 5441923, 5540456, 5535034, 5812416, 6506844, 6656335, 6841155, 6464389, 7197045, 6489456, 6517756, 6717209, 6835966, 7765559, 7434234, 8233349, 7611832, 8525999, 8258009, 8471535, 7696491, 8671802, 8950525, 9207308, 9211670, 10163929, 9646516, 9835493, 10568169, 10400758, 10542223, 10825154, 10038714, 11619998, 11905903, 12656196, 12846922, 13889615, 13703719, 15480140, 14883851, 15624322, 15671880, 16203939, 16387323, 17465894, 17279206, 18323221, 19359256, 19803373, 20922843, 21504132, 21751190, 22160209, 23485395, 24763698, 25469203, 26545935, 27157396, 27510421, 28294496, 29286782, 29871736, 30927771, 31363117, 32780496, 33391378, 35564568, 36443677, 38530844, 40644540, 42656608, 44645331]
9153D4645331K862717M252534K767925M269571N585581O096080P886402Q911731
9145H7277872J1106537J1639737J6178480J7210668J7345961J5030189J1610733
9138A87400177R222692N931223M227002M447806K702374L902295J804153O07097
9130B20244819r25752K203761L957300J1724948K2093204L4876561N0164908O0273073
9122D04612822N9231764M4938006K2263853m648951k5199189l8707181l8754782
9115D23736342l7088706l0105077k7258633k3354358k2973194k1138556j8868238
9108B42949580j7434736j2476144j1349112p107219m763088l536014j784552j166637
9100A83332078j996120m126385l836312l902241l686741l163197j878592Q16425
$$ y = [44645331, 47508048, 51760582, 54528507, 58798078, 64383659, 70479739, 78366141, 87277872, 98384409, 110024146, 126202626, 143413294, 160759255, 175789444, 187400177, 196622869, 202554092, 206781094, 211228900, 213931274, 217833569, 219637722, 220244819, 219319067, 221522828, 225480128, 237205076, 259298280, 294174841, 344339749, 404612822, 463844586, 508782592, 531046445, 526397494, 501198305, 462491124, 423736342, 386647636, 356542559, 329283926, 305929568, 282956374, 261817818, 242949580, 225514844, 213038700, 201689588, 194582369, 189819281, 186283267, 184498715, 183332078, 181335958, 177209573, 173373261, 169471020, 165784279, 162621082, 160742490, 161558915]
9092A61558915M898349P712431J4651144K0764141L0426252L1287126K2397256
9085B93695614Q198500j714987j3547474j6407961j2679308j3406817j5956077
9078B28181490j6447286j5510268j4216660j3628370j3301470j1593491j1181493
9071A32302452q178520n279558l329983j256060j057808l10378k450025k720252
9063A07719868m492731m384814m401287m480192l639869k257367l220627k384934
9055G8458047j624165k232466j716691j499866l069846q87150j898525j260337
9047F4269001j167416k024509k249388k344724j974934k896483k006198k349921
9039D7255428j542414k143903m17677r59464q44627r13707l45331j151350r61775
$$ y = [161558915, 166457264, 174169695, 188820839, 209584980, 240011232, 271298358, 293695614, 301894114, 300179127, 286631653, 270223692, 257544384, 244137567, 228181490, 211734204, 196223936, 182007276, 168378906, 155077436, 143483945, 132302452, 124123932, 118844374, 115514391, 114258331, 113200523, 112890145, 110440120, 107719868, 103227137, 98842323, 94441036, 89960844, 86320975, 84063608, 80842981, 78458047, 76833882, 74601416, 72884725, 71384859, 68315013, 67427863, 65529338, 64269001, 63101585, 61077076, 58827688, 56482964, 54508030, 51611547, 49605349, 47255428, 45713014, 43569111, 43151434, 42191970, 41347343, 40433636, 40088305, 38936955, 37975180]
9030C7975180p91798M99495p32575p62556k34917j16794n80709j365513o01657
9021C3288156j086396m17002r39007j07167j411396j23398k78866L37693q16854
9012B8445763J84236j211515q60869K55843j082219O66486q13729l64623J74935
9003B5394308L93351r83903l95942k7875k72993k91316q76273j567833l43955
8994B1027569p78294n51415j305765J06229j323484K37568j523395m1336o86271
8985A5161406k04415q59371N44934p57845J87484n53388l05976q00382O40509
8976A3052956q35224m72151K79429n00658M07891k07514n40464K38589J74685
8967A1597539r04385J178299j153152P62823p63395N54193j99471O32868J42447
$$ y = [37975180, 37183382, 37682877, 36950302, 36187746, 35952829, 35836035, 35255326, 33889813, 33288156, 32201760, 31784758, 30845751, 30738584, 29327188, 29203790, 28924924, 29262617, 28445763, 28629999, 27418484, 26557615, 26813458, 25731239, 26397725, 25583996, 25219373, 25394308, 25787659, 24803756, 24407814, 24379939, 24106946, 23815630, 22939357, 21371524, 21027569, 20249275, 19697860, 18392095, 18498324, 17174840, 17412408, 15889013, 15847677, 15161406, 14956991, 14097620, 14642554, 13884709, 14072193, 13518805, 13212829, 12412447, 13052956, 12217732, 11745581, 12025010, 11524352, 11932243, 11724729, 11184265, 11422854, 11597539, 10693154, 11871453, 10718301, 11481124, 10717729, 11271922, 11072451, 11705319, 11847766]
8958A1847766j020798K70611L12910J240372j382136J143905j566563L58189N5328
8949A1259584k45217J95583j72908J47130l81470M912l22641q4225J72046o3665
8939A0509129J179662j161310J79338L46306j460429K19375P21875r96862J13907
8930I650991j25838O19569m1905m90001o24545M8691k81970J09008k62551L39828
8920H941277l11764m46641J99124n28555J54060K11959r5154l88129n44433L83782
8910G575526m37422k41522K0501K99819l32326R8346J08517m1798k31062o19888
8900F198691O5998n50153P50063n8693m43645P04130m90121R39529r87500p55245
8890E373054Q08839o02194Q29726n32419N517M35786j8692M47550j141145J078788
$$ y = [11847766, 10826968, 11097579, 11410489, 12650861, 11268725, 12412630, 10846067, 11204256, 11259584, 11014367, 11209950, 11037042, 11184172, 10802702, 10807614, 10484973, 10400748, 10572794, 10509129, 11688791, 10527481, 10706819, 11053125, 9592696, 9812071, 10533946, 9537084, 9650991, 9525153, 10144722, 10102817, 9612816, 8988271, 9036962, 8754992, 8864000, 8601449, 8941277, 8629513, 8182872, 8381996, 7853441, 8007501, 8219460, 8124306, 7736177, 7191744, 7575526, 7138104, 6896582, 6917083, 7216902, 6884576, 6982922, 7091439, 7049641, 6818579, 6198691, 6264689, 5714536, 6464599, 6405906, 5962261, 6666391, 6176270, 7115799, 6128299, 5373054, 6181893, 5579699, 6409425, 5877006, 5882523, 6318309, 6299617, 6747167, 5606022, 6684810]
8880F684810k21136l76725J43120M01241o94686M98291r45490K32008J106914
8871F828347m37038N05622n75822N65162j134946N89036q5686O2625N38697n6472
8861F799525l13729n19372R83688j267493J816799k84747k84979J39049K68442
8852G337183L26899P193K15924j00100j72211O04947n52733Q79854l08683O8187
8842H306460J099344p56941K51364q6807J15371k74072J43389P96758n17171L59808
8832I437503l92988J69244K30234J226215n79257J53531l6267P45648j47776L68993
8822A1175080m32305m72627j2074J059197k91072J48629L90021j09589M4715l18998
8812A1180977J147845n0232K11772K42002j9192K27235o02886K63531P08994l51798
$$ y = [6684810, 6463674, 6086949, 6230069, 6631310, 5936624, 6434915, 5489425, 5721433, 6828347, 6391309, 6896931, 6321109, 6886271, 5751325, 6340361, 6254675, 6317300, 6855997, 6799525, 6485796, 5966424, 6950112, 5682619, 7499418, 7214671, 6929692, 7068741, 7337183, 7664082, 7671275, 7887199, 7787099, 7614888, 8219835, 7667102, 8546956, 8238273, 8306460, 9405804, 8648863, 8900227, 8813420, 8928791, 8654719, 8798108, 9594866, 9077695, 9437503, 9044515, 9213759, 9443993, 10670208, 10090951, 10244482, 10208215, 10953863, 10806087, 11175080, 10742775, 10270148, 10258074, 11317271, 11026199, 11174828, 11564849, 11455260, 11499975, 11180977, 12328822, 12278590, 12490362, 12732364, 12713172, 12940407, 12337521, 12601052, 13310046, 12958248]
8802A2958248j26677O08043o30337P08966l25334k41532R31132O80290n31942
8793A4030857j21003j05595j184J139516n55829M17443k91631Q67666l38812k56825
8783A4784603L08807L59444n56375P72639l21383M5401K06901n47294Q2553n00218
8773A4635078R21976n40136N90299m50577J82808N55588n32109l64378P4353r44578
8763A4128324Q83262k45940l4311r09287R96713l33408o4517k09547j67724K94109
8753A4337674j36106m33403m74006J5324l1093J88658l15563L5378O41708j152500
8743A2676071k72069J24089K17326q53929N7257K39629n00045k28912l44549j22128
8733A0992740q6915O10200l29253j15080n24650P91775j604831M98967k39116
$$ y = [12958248, 12831571, 13439614, 12809277, 13518243, 13192909, 12951377, 13882509, 14562799, 14030857, 13909854, 13804259, 13803075, 14942591, 14386762, 14804205, 14512574, 15380240, 15041428, 14784603, 15093410, 15452854, 14896479, 15669118, 15347735, 15393136, 15600037, 15052743, 15135296, 14635078, 15557054, 15016918, 15607217, 15156640, 15339448, 15895036, 15362927, 14998549, 15072902, 14128324, 15011586, 14765646, 14731335, 13822048, 14818761, 14485353, 14420836, 14211289, 14043565, 14337674, 14201568, 13768165, 13294159, 13309483, 13278390, 13467048, 13151485, 13186863, 13828571, 12676071, 12404002, 12528091, 12745417, 11891488, 11948745, 12188374, 11688329, 11459417, 11114868, 10992740, 10905825, 11516025, 11186772, 11071692, 10547042, 11338817, 9733986, 10232953, 9993837]
8724I993837m7412p36231P6441O36982J46753r57839k11391l81494N79613n00356
8714H598903L5891n71417N15687o1733m15527N9839l34148j48831j89436k75603
8704G213625L62273o4657n98236M82021p19345O21150o572o13297k9942j49159
8694F497861l1166k33955m49716N95956j53472j17414J21510n69568p4661J85609
8684E770984q6843J95972l24447J03685m03283r94697M74558N26891K43912p57331
8674D749401M87118o90807O52657p00454N35994O00849l58244J21840p90308J11307
8664D719353m74393K84739j64272M45052n23736p5701N7836r03638R6652N91134
8654D053026J66006n57700L01334q83722O21271n19582J79367M24119N6114n08072
$$ y = [9993837, 9946425, 9210194, 9286635, 9923617, 10070370, 9112531, 8901140, 8519646, 9099259, 8598903, 8634794, 8063377, 8579064, 8517331, 8101804, 8161643, 7827495, 7678664, 7489228, 7213625, 7575898, 7511241, 6913005, 7395026, 6675681, 7296831, 7290259, 6676962, 6647020, 6497861, 6466695, 6232740, 5783024, 6378980, 6225508, 6108094, 6229604, 5660036, 5585375, 5770984, 5684141, 5880113, 5555666, 5659351, 5256068, 4261371, 4735929, 5262820, 5506732, 4749401, 5236519, 4545712, 5198369, 4497915, 5033909, 5634758, 5276514, 5398354, 4608046, 4719353, 4244960, 4529699, 4365427, 4810479, 4286743, 4211042, 4268878, 3365240, 3461892, 4053026, 4219032, 3661332, 3962666, 3078944, 3700215, 3180633, 3360000, 3784119, 3840233, 3332161]
8644C332161K85412K59002m21705o27507k87283O81515K77631k4830p35518L99203
8634C138081m24573n23823M72849K70914J7057m82866J38538K55354N33618j687166
8624A707983J467384n91643L4556L38152l27141j274168O31271k86988M6258J130626
8614B876290p00835P45417n27571k3592J33423N62821p74629m2776K19184n01414
8604A966318n378k39183K56162p1400O80621j025069M40598j51405j03169k46934
8594A501161L84606m17468K17739k72852O60857o02747P43339j55384k64627P46721
8584B541345q53305N68447o44142j19065M03140n37021K12203K15016k20721J13169
8574A679066L1040j98226o16023R12690p65748J432241q7301n45415q56614Q74755
$$ y = [3332161, 3617573, 3876575, 3454870, 2827363, 2540080, 3221595, 3499226, 3474396, 2738878, 3138081, 2713508, 2189685, 2662534, 2933448, 2950505, 2467639, 2606177, 2861531, 3395149, 1707983, 3175367, 2583724, 2618280, 2956432, 2629291, 1355123, 1986394, 1699406, 1745664, 2876290, 2175455, 2920872, 2393301, 2369709, 2503132, 3065953, 2291324, 2248548, 2467732, 1966318, 1960940, 1721757, 1977919, 1906519, 2587140, 1562071, 2002669, 1851264, 1748095, 1501161, 1885767, 1468299, 1686038, 1413186, 2074043, 1471296, 2214635, 2059251, 1794624, 2541345, 1688040, 2256487, 1612345, 1493280, 1896420, 1359399, 1571602, 1786618, 1565897, 1679066, 1710106, 1511880, 895857, 1808547, 1042799, 2475040, 2387739, 1842324, 985710, 1860465]
8564A860465p72438M24506m49840L27716j54157k70218Q6704P04913l46309j056838
8554C54504J240833k56896K32416n37175j70281K17735M3365J31416L26559q7339
8544A495137J8345m47525J320055j324501J35108r62260r785N02874k66459P06511
8534A167500l64156n44329R02923k79784P31418n52244n23012N58514j44739N7243
8524A009334M28310k23951j14130j10217N04328o00182M6303n44643J36523m4710
8514D86965N24164j67545O89882o87776k72232O00347p38019M52067p44224N02608
8504F46237O5742k99642m78830N86354L18014j06520j70674N013K95311n10416
8494C50589L21007k77160L45215J43371o10324J013471j28845K69080j274173
$$ y = [1860465, 1088027, 1512533, 1062693, 1390409, 1236252, 966034, 1052738, 1757651, 1411342, 354504, 1595337, 1338441, 1570857, 1033682, 863401, 1081136, 1124501, 1255917, 1582476, 1495137, 1513482, 1065957, 2386012, 1061511, 1196619, 234359, 224574, 727448, 460989, 1167500, 803344, 259015, 1161938, 882154, 1613572, 1061328, 538316, 1096830, 952091, 1009334, 1437644, 1213693, 1099563, 989346, 1493674, 893492, 939795, 395152, 531675, 486965, 1011129, 843584, 1533466, 845690, 573458, 1173805, 435786, 887853, 143629, 646237, 711979, 412337, -66493, 519861, 837875, 731355, 560681, 565694, 861005, 350589, 671596, 394436, 739651, 883022, 272698, 1286169, 1157324, 1426404, 152231]
8485A52231J187124r02443M64632J75377l04325k85224l36852L72766J08963j55365
8475D76884m2546L67275l89118P88252r81448P09813L5550k05801j91226j44823
8465D22812K6799k70261j78328K70082R10723n79925L35890p80076m11381N38324
8455B84659P1708K13174p7042L49299o21745R39278j433954M39729m27062P31184
8445D69228l81823Q3982R31717q43946L62471r25455J404407r16360O01366j02042
8435F83545L10375k2606j72275K8578m92005M20700l42471K85518q54577M82949
8425C27731m48158L36479J052187j021672j95466J74188K50647l50114N53400
8416F79222o05217k0317M52356j91509J72464M45764j31864m74592j52494L2844
$$ y = [152231, 1339355, 436912, 901544, 1076921, 772596, 487372, 150520, 523286, 632249, 476884, 434338, 801613, 412495, 1200747, 219299, 929112, 964662, 758861, 567635, 422812, 449611, 179350, 1022, 271104, 1181827, 601902, 937792, 157716, -253665, 284659, 356367, 569541, 492499, 841798, 220053, 1159331, -274623, 165106, -261956, 469228, 87405, 171387, 1103104, 259158, 621629, -303826, 1100581, 184221, 785587, 683545, 993920, 971314, 799039, 827617, 335612, 756312, 413841, 699359, -155218, 327731, -120427, 216052, 1268239, 246567, 51101, 225289, 475936, 125822, 679222, 74005, 53688, 506044, 314535, 486999, 932763, 800899, 326307, 173813, 206657]
8406B06657r8268K70149m33397Q65036l29139L54218o89056J72585m35809N27535
8396D10511j80786k63437R0908O63326m60157m29036N78806J18417m91874O55676
8386F92354o48087L52137m17188n427P1170K60925p9052K94135m8773l10037L12700
8375D74857l39514K60725j48736J73247n74974Q08478p06121Q73965q99949K74807
8365A96785l99495l26825R63120p49980N23254j33261k08146M23464j71276r08849
8355g91209M02778R27584L66236j35578q71232J7670m46745J019799q46134J78533
8345a78298k27539P56373k72947L80893n05237n6941K29046k85074K7506K3530
8335a08688L42676j88211j33554K92929p85458J011157j01344m8081k25339j69250
$$ y = [206657, 108389, 378538, -54859, 810177, 481038, 835256, 146200, 318785, -117024, 410511, 229725, -33712, 57196, 720522, 260365, -168671, 410135, 528552, 36678, 692354, 44267, 396404, -20784, -26211, 44959, 305884, 226832, 520967, 472194, 162157, 474857, 135343, 396068, 247332, 420579, -154395, 654083, -52038, 821927, -78022, 196785, -202710, -529535, 433585, -316395, 206859, 73598, -134548, 288916, 117640, -791209, -388431, 539153, 905389, 769811, -101421, -83751, -530496, 489303, -356831, -178298, -405837, 350536, 77589, 458482, -46755, -103696, 125350, -159724, -132218, -108688, 233988, 45777, -87777, 205152, -580306, 430851, 329507, 281426, 56087, -113163]
8325a13163L65787k68847l16225O46035j69386L17999o77287J230703n90076j95495
8315B30045J35079k65114O7375Q82287j237544L05593q0100O47268o17871M69150
8305E36168m96982O1681O89992n90190Q94393p64267j1391J9636J84077o34916
8295a11799N28246k98147n83167k82451J067804P9245k74859M41229o96288N73130
8285D42943j6295n42129p2631J9595O00851n2793P6094j92631l9909o13960O72728
8274B81863l31242L18977L20211n27874J23603n96906M85882l69436O16961l28863
8264f824K91046k68926K07335l28935M82996r80263J037929j75548j31714l8957
8254H8139n50004l0165J09982M47199J83188j65820k80634j51442K13693Q92205
$$ y = [-113163, 252624, -16223, -332448, 313587, 144201, 462200, -215087, 1015616, 425540, 230045, 365124, 100010, 167385, 1049672, -187872, 117721, 37621, 684889, 67018, 536168, 39186, 100867, 790859, 200669, 1095062, 330795, 319404, 339040, 523117, -111799, 416447, 118300, -464867, -747318, 320486, 399731, 124872, 566101, -130187, 442943, 426648, -115481, -188112, -168517, 432334, 379541, 455635, 263004, 223095, -390865, 281863, -49379, 269598, 589809, 61935, 185538, -411368, 74514, -294922, 322039, -6824, 284222, 15296, 222631, -106304, 376692, -603571, 434358, 258810, 127096, 88139, -461865, -492030, -382048, 65151, 248339, 82519, -198115, -349557, -135864, 756341]
8244G56341j345859R3932Q74525n78714p1469M75182J28073j28136M94586n70332
8234A28129N52607k91078n29697m88518Q94094q30190P17563j92138n61501O49957
8224D9228K20218j62490k22209J08051j55058N04663q315o09822M70549p73480
8214e78665M02986Q00653p28222l21192L18128M15960r94828K95970L8747K56274
8204i4189Q25452n07868j42088Q55084r55940L72954l53388J223763j610539R31330
8194E44571k83531N81729p917827P148347R73038q60882p75001L45242O10444
8185C66130p91867Q64264k35987J69658M911j04142r74823J074704r44978L93765
8175a78365L35251p72749J95277O88602p00227K35801J13714Q6719O25255r97620
$$ y = [756341, -589518, -495586, 378939, -199775, -271244, 203938, 332011, 203875, 698461, 128129, 680736, 389658, -140039, -628557, 265537, -564653, 152910, -39228, -600729, 49228, 269446, 106956, -115253, -7202, -162260, 342403, 334088, -275734, 194815, -578665, -175679, 624974, -103248, -424440, -106312, 309648, -685180, -389210, -350463, -94189, 731263, 223395, 81307, 936391, -19549, 353405, 17, 1223780, -386759, 544571, 261040, 842769, -7075058, 73289, 1046327, 185445, -589556, -244314, 366130, -425737, 438527, 202540, 372198, 377109, 272967, -701856, 372848, -572130, -178365, 156886, -615863, -420586, 268016, -432211, -196410, -82696, 4023, 629278, -368342]
8165c68342L741N21769K43528j413035J049335K20512K03708J85190L016r1494
8155E57928K41276m40792J87448M1254n58316m5339P37068o73635j70544p2005
8145a95657j911K75922j6140M5676K90274M2752q77693M81701N45082j034539
8135d44533L06212j66106K23877J52553N73039m46583K46199P796k32821j66162
8125E3471Q1702R7600K40854n23889K88933o06300R07016p41134N01619n33616
8115b33744N68084P9248j46477j73343P9436o41432r9584P62147Q1967j39561
8105A36741J86846J78097m31564N72386j186632L61976K4507J09128L8263N71467
8095E61215j91459j23067l63860n49667N34565M38171o43851L40716N05971l22666
$$ y = [-368342, -364601, 157168, 400696, -1012339, 36996, 257508, 461216, 646406, 649422, 557928, 799204, 358412, 545860, 587114, 28798, -16541, 720527, 46892, -123652, -195657, -197568, 78354, 62214, 107890, 398164, 440916, -436777, 44924, 590006, -444533, -138321, -304427, -80550, 72003, 645042, 198459, 444658, 452454, 219633, 53471, 135173, 232773, 473627, -50262, 238671, -367629, 539387, -201747, 299872, -233744, 334340, 413588, 267111, 93768, 173204, -468228, -567812, 194335, 276302, 136741, 323587, 501684, 70120, 642506, -544126, -182150, -157643, -48515, -10252, 561215, 369756, 246689, -117171, -666838, -132273, 305898, -337953, 2763, 508734, 186068]
8085A86068q64779J197205p58923Q37218p18666N59396j81609K87552o15177J07910
8075C6195L41255j26347j69359j31501K20556N09343k94781P0264m85900O1462
8065C1187l4300K66338l26961j17897K18849L02613q26952P99055n95478K47495
8055c6051L02722k44809K61690k82446p20774j94671O48957M65390l15388O46315
8045E30935p12824J59401P4359k75611n0420P7944K38118K02077O55335n83462
8035C15852p61083J26718L13320o62936O37565l03339P34428K77410K47394j017401
8025i2072L52026K14207j263891J197479J81776K025n53174J33624l43713Q27844
8015F56131j030529Q56566l06629m3596l85335O34666J56485r38611j2521m1754
$$ y = [186068, -678711, 518494, -240429, 596789, -121877, 437519, 255910, 543462, -71715, 36195, 377450, 251103, 81744, -49757, 170799, 680142, 385361, 455625, -30275, 31187, -3113, 263225, -63736, -181633, 37216, 339829, -487123, 311932, -283546, -36051, 266671, 21862, 283552, 1106, -719668, -914339, -265382, 200008, -115380, 530935, -181889, -22488, 51871, -223740, -274160, -196216, 41902, 243979, 899314, 315852, -445231, -318513, -5193, -668129, -30564, -333903, 400525, 677935, 925329, -92072, 259954, 474161, -789730, 407749, 589525, 591550, 38376, 172000, -171713, 656131, -374398, 482168, 175539, 131943, -253392, 381274, 537759, -400852, -413373, -455127]
8005d55127L77565m49665K95136O32847K35627L15374j163981N97819j193166
7996h07571O42035P06526q18231N58912j69007j01886m31058P87785j244667J224884
7986C47722l09835M33452m02571O05189j003656N05816m00462Q05253q39607N56039
7976B97340j90786J55973n19258J50218K66603j38379O6386P01066k58235N28185
7966A059113r74293j72467O22303M16406n56632m77255O58416n22580P68906o68069
7956A53848L66540o52510K40730M9376J35326L05871k47587p33572O70808J93687
7946D82517k59214m22806L65440j62538J10596J74093q01751N33884N37991j046180
7936d87968J017228l90428l89460k24029N6912Q51748j80747O16923p20485l0424
$$ y = [-455127, -77562, -527227, -232091, 400756, 636383, 951757, -212224, 385595, -807571, -165536, 540990, -277241, 281671, 112664, 10778, -420280, 367505, -877162, 347722, 37887, 471339, 68768, 673957, -329699, 176117, -224345, 580908, -258699, 297340, 106554, 262527, -256731, -106513, 160090, 21711, 88097, 789163, 530928, 1059113, 84820, -87647, 534656, 951062, 394430, -82825, 575591, 53011, 821917, 153848, 520388, -132122, 108608, 157984, 293310, 599181, 351594, -381978, 288830, 482517, 223303, -199503, 165937, 3399, 113995, 288088, -513663, 20221, 558212, -487968, 529260, 138832, -250628, -474657, -417745, 434003, 253256, 870179, 149694, 119270]
7926A19270K40878L14630l7860j1626k25515L6859L42994p13687K24869J35265
7916D26077k91825L88229n52198M58820r7911L54744j451442J191927j29584l62554
7906f5717N80473l3707k80148P60814p02425k48252M95311J82605k11810J7656
7896D94800L59363j049619N27138j23950K04208J17100n92708M26976k52272O02124
7886G13160r23622M64570j10419K41843j50930J62399l92198J013988p11381p77538
7876d70128L38599j02837N6484N28316L04582q41153O87718L19566n58478K68605
7866E31274K07068l17266n46208R51105j180020Q65005m28367L30939J42851o08646
7856e2265J029036o26002J50243j220084J256120p08044K400858j485354l80796
$$ y = [119270, 360148, 674778, 636918, 625292, 399777, 436636, 779630, 65943, 290812, 426077, 134252, 522481, -29717, 429103, 331192, 685936, -765506, 426421, 296837, -65717, 514756, 481049, 200901, 961715, 259290, 11038, 506349, 688954, 477144, 494800, 854163, -195456, 331682, 207732, 411940, 529040, -63668, 363308, 111036, 713160, -210462, 254108, 143689, 385532, 234602, 397001, 4803, 1018791, 307410, -470128, -131529, -234366, -177882, 350434, 655016, -186137, 501581, 821147, 262669, 531274, 738342, 421076, -125132, 825973, -354047, 510958, 82591, 413530, 556381, -52265, 976771, 350769, 501012, -719072, 537048, -170996, 2229862, 744508, 363712]
7847C63712J224102p09448j72876m34625L33998n85178M43330m33581O36151j224356
7837e58771J183741j040830J250138q74377L08075K45966J03L3024k08314m23132
7827h4377N64117J60392m24975j87376Q68768p67571L56997j71673L00268J66461
7817G81031j062946J50560O67418L1284j30008l34209L91891K44087N62066j309954
7807h780J268463q55046R7304K27348k41699M63877q56994R4687K32839J38038
7797E60037M8052J82378o54182R03621j167618R80266o28158N79253M68914k10830
7787A061733O5147o00372M11472p02011L61181m23737R25393m17619k39766l25315
7777A16106N73615l22181m6959O15201O06912o33267o15730J02934K07668J57398
$$ y = [363712, 1587814, 878366, 705490, 270865, 604863, 19685, 463015, 29434, 665585, -558771, 624970, -415860, 834278, -40099, 267976, 513942, 514045, 547069, 338755, -84377, 479740, 640132, 215157, 27781, 896549, 128978, 485975, 314302, 614570, 781031, -281915, -131355, 536063, 567347, 437339, 103130, 495021, 739108, 1301174, -8780, 1259683, 404637, 501941, 729289, 487590, 951467, 94473, 189160, 421999, 560037, 608089, 790467, 136285, 1039906, -127712, 852554, 224396, 803649, 1272563, 1061733, 1126880, 526508, 937980, 235969, 597150, 173413, 1098806, 681187, 441421, 116106, 689721, 367540, 320581, 935782, 1542694, 909427, 293697, 396631, 604299, 761697]
7767G61697M11086m33874O58364l73187k89390o8381o11385k37599J318569q28960
7757C06940P97285p68656j15018n8416P31058O71060j122628J358222j155116
7748F44731Q46106p71562K2745l43378P80413l54151K1211O45283j145561N65228
7738I11065p36697R71348L35284m06527j051362Q41579n6029N17513r25428P08302
7728A109048k04076j64918l80016J127260o22005J76177l40264l47220Q75480
7719A229466o3012j89279o82696J285372k80346M07569r36516L64190L24977p44434
7709G15291L92735k11028O44653r15786P16419m24180P23639p06656p90692J155596
7699A299991J98659r7742n1331k78661M40933n65268P41392n21971N46891q74115
$$ y = [761697, 1172783, 738909, 1397273, 1024086, 734696, 666315, 54930, -182669, 1135900, 306940, 1104225, 335569, 220551, 162135, 893193, 1564253, 441625, 1799847, 644731, 1490837, 719275, 742020, 398642, 1179055, 824904, 846115, 1491398, 345837, 911065, 174368, 1145716, 1481000, 1074473, 23111, 864690, 808661, 1326174, 400746, 1109048, 904972, 740054, 360038, 1487298, 865293, 1041470, 701206, 353986, 1229466, 1166454, 977175, 294479, 1579851, 1299505, 1707074, 770558, 1134748, 1459725, 715291, 1108026, 896998, 1541651, 625865, 1342284, 918104, 1641743, 935087, 144395, 1299991, 1498650, 1400908, 1349577, 1070916, 1511849, 946581, 1687973, 1166002, 1712893, 838778]
7689H38778N34232m28746J14873K39146o01564j1947J340167j28860j38262r38458
7679H19359J297078j591385J393919o90568K82969k4924j17980p95627P24620
7670A297461P19312p98414L83892l20243N87512m02232q3570L28929J00576P3769
7660A886992m31485L93391n21482L02566J42969L01211j10640O12064n73977l6270
7650A965339l26897l63543K20350O20184m77013n80435O5591J53767Q07091J01341
7640B185775k57069j01719N17019p44808K96180m08052R2915J109714m15647o93237
7630A581071k51954O61601l75962j10603k94679J26613P48230r33267J664953
7621B816003r64030J42658l67192R82305j013264Q47960j160899M76994L63330
$$ y = [838778, 1373010, 944264, 1059137, 1298283, 696719, 684772, 2024939, 1896079, 1757817, 819359, 2116437, 525052, 1918971, 1228403, 1511372, 1486448, 1368468, 572841, 1297461, 2016773, 1218359, 1602251, 1282008, 1869520, 1467288, 1383718, 1712647, 1813223, 1886992, 1455507, 1848898, 1327416, 1629982, 1772951, 2074162, 1963522, 2575586, 2001609, 1965339, 1638442, 1274899, 1495249, 2115433, 1638420, 1057985, 1123576, 1277343, 2084434, 2185775, 1928706, 1826987, 2344006, 1599198, 1895378, 1487326, 1580241, 2689955, 2274308, 1581071, 1329117, 1990718, 1614756, 1504153, 1209474, 1336087, 2084317, 1151050, 2816003, 1851973, 1994631, 1627439, 2609744, 1596480, 2444440, 1283541, 1760535, 2123865]
7612B123865Q4531L00618r11349O17586p40112O54357O0682L10421K52923o3201
7602B690321p30276N97828l66508J054214j035655M7035N75372p30388Q12363
7593B914306n17773J55232K63415m01208j88976k48781K48828p10854J654042
7584C168231o50206j91651N78698l0494j159040J313836p85030M48996L14434
7575C007774j88160J14273P39833j190770m4463O61071k12741J31617n80325J44727
7565B582836M50394m50381K56791p31704J378369j066644P15871l2641r62836
7556B140055P89453M4688l91947K39444l31337M05051m3618j68393m4338L12079
7546B951137k30022O3787l5880j05048N47470o32471Q80028q95655M18596j45072
$$ y = [2123865, 2208396, 2509014, 1597665, 2215251, 1475139, 2129496, 2190178, 2500599, 2753522, 2690321, 1960045, 2557873, 2191365, 3245579, 2209924, 2256959, 2832331, 2101943, 2914306, 2396533, 2551765, 2815180, 2413972, 2224996, 1976215, 2225043, 1514189, 3168231, 2518025, 2326374, 2905072, 2874578, 1715538, 3029374, 2244344, 2693340, 3007774, 2819614, 2933887, 3673720, 2482950, 2438487, 3099558, 2886817, 3018434, 2438109, 2582836, 3033230, 2582849, 2839640, 2107936, 3486305, 2419661, 3135532, 3102891, 2140055, 2929508, 2974196, 2582249, 2821693, 2490356, 2895407, 2851789, 2683396, 2639058, 2951137, 2721115, 2784902, 2749022, 2643974, 3191444, 2558973, 3439001, 2543346, 2961942, 2816870]
7536B816870O73204o52268m15462K60390M1613o64843J585427j042992J107831
7527C709770q04137P81774k39326J019587J69219l80030R56129j28720o84836
7518D399430r15080Q295o01047P64725m43962J56473k91933l37713j32429k4520
7508B582239O9362q2317O36754J98172p91957L58828k15382j72350J24336j434
7498B706251l33446J176446n46686m73060K98883Q2320J53194J95971m99605L06868
7488C067136L31122j015906Q85726n60338J18097n88429O48340O34480l39791
7479C180437n25317L54627L36607m56817j019372O53694m17366J013761q09659
7470B310595L32073n0586R9459q636m3487m88746P31233j263209J008406l68935
$$ y = [2816870, 3490074, 2837806, 2422344, 2682734, 2724347, 2059504, 3644931, 2601939, 3709770, 2905633, 3687407, 3448081, 4467668, 4636887, 4256857, 5212986, 5084266, 4399430, 3484350, 3492645, 2891598, 3656323, 3212361, 3368834, 3076901, 2739188, 2606759, 2582239, 2651601, 2569284, 3206038, 3404210, 2612253, 2971081, 2755699, 2583349, 2707685, 2706251, 2372805, 3549251, 3002565, 2529505, 2828388, 2910708, 3063902, 3259873, 2760268, 3067136, 3398258, 2382352, 3268078, 2707740, 2825837, 2237408, 2885748, 3520228, 3180437, 2655120, 3009747, 3346354, 2889537, 1870165, 2523859, 2106493, 3120254, 2310595, 2642668, 2592082, 2691541, 2682905, 2639418, 2150672, 2881905, 1618696, 2627102, 2258167]
7460B258167P84595p08893J36069k94122K40706j77937L07855l00075j72448R0851
7450B164768N2250J02969p44440R91257q18704J025388n6130p07287M16868K82985
7440B709924j78970k0294l01799l06468K47831j99936K2089k38393j84776R42034
7430B491242l48419P42810r10047j60416m93376J137936q1632o46434P13907o20468
7420A825103O75328l02003J64218r4028k16734N17472k31706N97813j202051K76397
7410B009809j99944L79715M4306J38767k56126L13770k91900n0931k14652Q0210
7400A953024n09248Q01480j24332O7143n16224R293N53465n62243m65646M31354
7390A638066k7358M2810l45066Q54357j463510P98667q16880J338804l19300k71386
$$ y = [2258167, 3042762, 2333869, 2469938, 2175816, 2416522, 2238585, 2546440, 2246365, 2073917, 2164768, 2217018, 2319987, 1575547, 2566804, 1748100, 2773488, 2717358, 2010071, 2426939, 2709924, 2530954, 2510660, 2208861, 1902393, 2150224, 1950288, 1972377, 1733984, 1549208, 2491242, 2142823, 2885633, 1975586, 1815170, 1321794, 2459730, 2378098, 1731664, 2445571, 1825103, 2500431, 2198428, 2362646, 2268618, 2051884, 2569356, 2337650, 2935463, 1733412, 2009809, 1809865, 2189580, 2233886, 2372653, 2116527, 2430297, 2138397, 2087466, 1872814, 1953024, 1443776, 2245256, 2120924, 2188067, 1671843, 1681136, 2234601, 1672358, 1206712, 1638066, 1610708, 1653518, 1308452, 2162809, 699299, 1497966, 681086, 2019890, 1700590, 1429204]
7380A429204j74092J041122p37495j22081J52511j92222N7472K05807j3128O4896
7370A711994r3289m4048J56043k4210k27334J0669J05023M19795j264054J412807
7360B163396r11969O42246o0525k12190j95317m2511M35523l97802r9228l23898
7350I97725J72362K5814K00026n61042N69804l56756J022540p40478l67622M6436
7340A008809j2021P30499o74748Q33053k37149L23962M9553m69826p21250R20032
7330A750914n63305k96744o4468J52231Q8954k08020O88778L98129k66410k61175
7320A418884m28423J78148N68812k86224j49192q58085P08426n97206P98366j75928
7310A177578J79493m23099P7685k63904Q88413k74026m56866L08722J27645j83351
$$ y = [1429204, 1255112, 2296234, 1558739, 1436658, 1589169, 1396947, 1454419, 1660226, 1647098, 1711994, 1618705, 1574657, 1730700, 1706490, 1479156, 1489825, 1594848, 2014643, 750589, 2163396, 1251427, 1893673, 1833148, 1620958, 1425641, 1383130, 1818653, 1420851, 1321623, 997725, 1170087, 1195901, 1395927, 834885, 1404689, 1047933, 2070473, 1329995, 962373, 1008809, 996788, 1727287, 1052539, 1885592, 1648443, 1972405, 2021958, 1552132, 830882, 1750914, 1187609, 890865, 826397, 978628, 1067582, 859562, 1548340, 1946469, 1680059, 1418884, 990461, 1168609, 1737421, 1451197, 1302005, 443920, 1152346, 555140, 1353506, 1177578, 1357071, 933972, 1011657, 747753, 1636166, 1362140, 905274, 1213996, 1341641, 1158290]
7300A158290n675k83924l62121P93311k02370K45288j0189l68783N88998l38848
7290A213977j60438j13953L52826n13696K80560N1389K32771m48352K69000o24366
7280E39718N28789K15478J59335l15724J9085n55263Q63116j45557p70857M96864
7270A034984K26828L0968m29413m88215M12958O2656p5314O5620J89121m47785
7260E82408J61780m006L2942n97006J498583p55127j88911M90691k20422Q2732
7250A083664j62200l78529K47418K48676o57338J53505M08790n54596M16016J16424
7240I21830K13641m33656l23912M43567p2279n26883M21369O82698q09315r845
7230E07215R86039j471070J828833j227628J52660k3936K41909r67692M08912
$$ y = [1158290, 1152615, 868691, 506570, 1299881, 1097511, 1342799, 1332610, 963827, 1552825, 1213977, 1053539, 939586, 1292412, 778716, 1059276, 1110665, 1343436, 895084, 1164084, 539718, 1068507, 1283985, 1443320, 1127596, 1146681, 591418, 1454534, 1308977, 538120, 1034984, 1261812, 1292780, 863367, 375152, 788110, 850766, 775452, 841072, 1030193, 582408, 744188, 740182, 773124, 176118, 1674701, 919574, 730663, 1221354, 1000932, 1083664, 921464, 542935, 790353, 1039029, 381691, 535196, 943986, 389390, 805406, 921830, 1135471, 701815, 377903, 821470, 749191, 222308, 643677, 1326375, 517060, 507215, 1493254, 22184, 1851017, 623389, 776049, 752113, 994022, 26330, 435242]
7221D35242N40479m80799N96499m86346J02573J93185Q2903j07261L89827n70208
7211F96094j82891Q52520j109909J302584j59165n06310m72592l04142j88684
7202g2495N81030q40471Q36399P15077l81581k43731J09618K38636n2878k17204
7192F72400r5362M91170j47800o18153M25983r77628Q29210K70231j43448j6707
7182F89896K34441j530875J264197j127o4081l2366L03101o42942L40218P3690
7172F34152M80544r43357M89279j34823K32706k37907J12164l63190K33443J28179
7162F31190N01691o95998k90152O5934K6473J79732M47596M25144m77888M00282
7152A214004j128321L48098R4995p5265L08540j92863n54442N04072P1387o5842
$$ y = [435242, 975721, 494922, 1091421, 605075, 707648, 900833, 983736, 876475, 1266302, 696094, 513203, 1365723, 255814, 1558398, 1399233, 892923, 420331, 116189, -72495, 508535, -331936, 504463, 1219540, 837959, 594228, 703846, 942482, 889604, 672400, 577038, 1068208, 920408, 302255, 728238, -249390, 579820, 850051, 706603, 689896, 924337, -606538, 657659, 656532, 592451, 560085, 863186, 220244, 560462, 634152, 1114696, 171339, 660618, 525795, 758501, 520594, 632758, 269568, 503011, 631190, 1132881, 436883, 146731, 212665, 239138, 418870, 866466, 1291610, 813722, 1214004, 85683, 433781, 528776, 453511, 762051, 569188, 14746, 518818, 590205, 524363]
7142E24363O67263n33296K98112l12594O99809j166645K53888l11102Q34973R01792
7132A856563l61153q05587K64794j095424J299961k83297j40650J63410o53538
7123B45079J45838M93648R2392K19384p60693l1502L48196L39885m54269j90426
7113D47532j55183R65584n03992n38406J58522N50417o6840l53047q1899L00389
7103G23077r50280M84732L17133m0037k60001K86514n43670Q21653P9353K48128
7093A166602n05805R95342j419191Q51561j37637m51141N6756O23545o04356P8214
7083F53890m34287L58533J99154K04978L58760r47264J430284j150878Q00651
7074A473821q07871M11424l51694K38441J4352J1013R80687p12128q99496Q77129
$$ y = [524363, 1191626, 658330, 956442, 643848, 1343657, 177012, 430900, 119798, 954771, 1856563, 1495410, 689823, 954617, -140807, 1159154, 875857, 735207, 898617, 245079, 390917, 884565, 976957, 1196341, 435648, 404146, 752342, 1092227, 637958, 447532, 292349, 1257933, 753941, 215535, 374057, 924474, 857634, 504587, 422688, 723077, -227203, 257529, 574662, 534625, 274624, 561138, 17468, 839121, 918474, 1166602, 660797, 1656139, 236948, 1088509, 950872, 499731, 556487, 1180032, 575676, 653890, 219603, 578136, 777290, 982268, 1341028, 393764, 1824048, 673170, 1473821, 665950, 1077374, 725680, 964121, 978473, 989486, 1970173, 1258045, 358549, 1235678]
7064A235678j081685J394063p1221l22481q7614Q14824j487751R69851K11790
7055A575454K75646o35239Q47764j21047O9991j65895M18780j5900M67178l80810
7045B335922K04511L64461n2415p696j32382o67789P20621j536913Q38106j94961
7035A871465N44629j276033l4653K79747J59654l57804L34689k76068N12520J78870
7025A937016m60250M97199p84117l17400l0580M01843j57285j64053J297263j15829
7015B103807m53348l52028L40831l1118k07913M27572l79142q8699m84931j43582
7005G31449Q31723r0146j59386l88099K16280k07321r1110L40182o6613L42099
6995A459058L00025o40238O94788J61155l34409O12412p07265k35770J19246j96862
$$ y = [1235678, 153993, 1548056, 1476835, 1154354, 1066740, 1881564, 393813, 1363664, 1575454, 1851100, 1215861, 2063625, 1942578, 2012569, 1846674, 2265454, 2249554, 2716732, 2335922, 2540433, 2904894, 2852479, 2844783, 2712401, 2044612, 2765233, 1228320, 2066426, 1871465, 2416094, 1140061, 1105408, 1385155, 1544809, 1187005, 1521694, 1245626, 1758146, 1937016, 1476766, 1973965, 1189848, 872448, 841868, 1243711, 1086426, 922373, 2219636, 2103807, 1650459, 1298431, 1639262, 1608144, 1400231, 1827803, 1448661, 1359962, 875031, 731449, 1563172, 1473026, 1313640, 925541, 1141821, 934500, 843390, 1183572, 1116959, 1459058, 1759083, 1118845, 1813633, 1974788, 1640379, 2252791, 1545526, 1309756, 1429002, 1232140]
6985A232140K71697j47527J31027m16399M96843j98107j998K61037j73123K34673
6975A690263m2977L21802k26958M9673n6578m4157O03888m82519o60271J042264
6965B194430r22406M15247k18479R66204j361731J135973l96763o1344j08117
6956A643014m59765P9211O55834m79409J19084o37380Q09886q08684N86492M83834
6946A992117J19681n80503J26219Q52007m79704j75860L59680k66072R90337q04402
6936B133500K31282M17330k36216K16474k63088j13249l52394P1411l40303R99228
6926B763975K31206k42174r38687r5300O70594m42657O96044j87886O68164k4590
6916C098689N28883r11458K44269j05775O89283j19445j04446O44638o06814m9770
$$ y = [1232140, 1503837, 1356310, 1487337, 1070938, 1567781, 1369674, 1367676, 1628713, 1455590, 1690263, 1647286, 1969088, 1742130, 1791803, 1735225, 1691068, 2294956, 1812437, 1152166, 2194430, 1272024, 1687271, 1468792, 2434996, 1073265, 2209238, 1812475, 1751131, 1643014, 1183249, 1262460, 1918294, 1438885, 1557969, 920589, 1730475, 921791, 1508283, 1992117, 2111798, 1531295, 1657514, 2509521, 2029817, 1853957, 2213637, 1947565, 2937902, 2133500, 2364782, 2782112, 2545896, 2762370, 2499282, 2386033, 2033639, 2105050, 1764747, 2763975, 2995181, 2753007, 1814320, 1719020, 2389614, 1946957, 2643001, 2455115, 3123279, 3098689, 3627572, 2716114, 2960383, 2854608, 3543891, 3424446, 3320000, 3964638, 3357824, 3308054]
6906C308054M95490o06064J699821j556205M84251O845n44917N60961O79567K17166
6896D744969l58887L99515p17256l17865Q40007J2740q3472J65492M11459n94913
6886D501789R58662O8533P56611l98337N73192O33667m02454L81964k47200L86311
6876G212738K20970Q37948m79308J08618L37335M54258k85072N11516K40622j08636
6866I050989L55607P82379Q67224o9854L05713N50633K22335P57211L48722L53408
6856A3524367P05616J56725M50012P54594o303P56503j46448J286074K15841J055099
6846A8752080J92535M67825M04028Q71347q75372J165425J12321l34050L0665
6837B0786804j75313N11833k91667j476738L11212K54513K98210j003935J30393
$$ y = [3308054, 3803544, 3197480, 4897301, 3341096, 3825347, 3832192, 3287275, 3848236, 4527803, 4744969, 4386082, 4785597, 4068341, 3750476, 4590483, 4603223, 4519751, 4685243, 5096702, 4501789, 5460451, 5528984, 6285595, 5887258, 6460450, 7094117, 6691663, 7073627, 6826427, 7212738, 7433708, 8271656, 7792348, 7900966, 8238301, 8692559, 8407487, 8919003, 9159625, 9050989, 9406596, 10188975, 11056199, 10986345, 11292058, 11842691, 12065026, 12822237, 13170959, 13524367, 14229983, 14386708, 14836720, 15591314, 15585011, 16341514, 16195066, 17481140, 17696981, 18752080, 18944615, 19412440, 19816468, 20687815, 19812443, 20977868, 21090189, 20756139, 20786804, 20611491, 21123324, 20831657, 19354919, 19666131, 19920644, 20218854, 19214919, 19345312]
6828A9345312j271309N75915o51349o19211o1532M62272j600221Q65007j010567
6819A6034317M4946j189009m05464m48328l53647j061947K00479m87368p31726
6810A1602253p2012n82288R3815r04463j066418Q74145p68701R5752k48429l48514
6800H675140m94582m34781M30860o65115l89471k60870O0993J507o58706P67477
6790G032452r81946J42330o66598Q68729r96731Q18522j004993K05915l86148
6781E031532M44113K28619n09048n90664N39361n77759K41730p63013j34110M27890
6771D338651j39889n43317K08194M04271l98150l05486L21267K60609n0669m43191
6761C652290M1175L67427o73312M08118o48503n64491L54820O24429n91743M17483
$$ y = [19345312, 18074003, 18649918, 17998569, 17379358, 17317826, 17780098, 16179877, 17044884, 16034317, 16079263, 14890254, 14484790, 14036462, 13682815, 12620868, 12821347, 12333979, 11602253, 11530241, 10947953, 11041768, 10137305, 9070887, 9945032, 9176331, 9272083, 9023654, 8675140, 8180558, 7745777, 8176637, 7511522, 7122051, 6861181, 6922174, 6923681, 6264975, 7032452, 6050506, 6192836, 5526238, 6394967, 5398236, 6216758, 5211765, 5417680, 5031532, 5475645, 5704264, 5195216, 4604552, 5143913, 4566154, 4807884, 4044871, 3910761, 4338651, 4198762, 3655445, 3863639, 4267910, 3869760, 3564274, 3885541, 4146150, 4095481, 3652290, 3693465, 4060892, 3387580, 3795698, 3147195, 2582704, 2937524, 3561953, 2970210, 3387693]
6751C387693o35470o3146P20882l03738j512794O36194N46144K30430k47171K58881
6741C017905m5890q5793l16280O39988J00052m49361j19647M63376j020259J496968
6731C681059j899725P98823o42460J240978p37639R5210J35608l53901j35030
6722B182923O11186K28428p51736K04107K24534L40606k46604o53502M50920Q9130
6712B679992m39061K37228O41610l69439l40031j58788P46867L14397m31313J83362
6702C064824M13881k75805n44454M84370n18285l2409l65657O64678l01379o28876
6692A960888Q93380L81969k29095p48144M55371p1340L80518j123495Q53791m42506
6682B311337n33167L24622O25277l72909K00710k68395J097944j083810j1911
$$ y = [3387693, 2752223, 2689077, 3409959, 3106221, 1593427, 2229621, 2775765, 3006195, 2759024, 3017905, 2972015, 2886222, 2569942, 3209930, 3309982, 2860621, 2740974, 3204350, 2184091, 3681059, 1781334, 2580157, 1937697, 3178675, 2441036, 2536246, 2671854, 2317953, 2182923, 2794109, 3022537, 2270801, 2474908, 2699442, 3040048, 2793444, 2139942, 2590862, 2679992, 2240931, 2478159, 3119769, 2750330, 2410299, 2251511, 2998378, 3312775, 2881462, 3064824, 3478705, 3202900, 2658446, 3142816, 2624531, 2592122, 2226465, 2891143, 2589764, 1960888, 2854268, 3236237, 3007142, 2258998, 2714369, 2643029, 3023547, 1900052, 2753843, 2311337, 1778170, 2102792, 2728069, 2355160, 2555870, 2287475, 3385419, 2301609, 2289698]
6673B289698k36993Q44487q53363P42146m32279P65101j867057J049789m71958
6664A829571J115063k94503r7668O17362p93310N26424J77289k04710O10484k41884
6654C244118K00011l76655M85565p72351j29549P77799m65393J136711j068202
6645C032054n32194M27356j22956O02480n86227j50120N23684j87559k69051M9774
6635B787241O00803n13005K48926M86817n17310k22817m50906O37302n95338O73866
6625C135579j13414m57827J02822q32234J000781l20465L16225l44885Q83178
6616C369760p02662Q1080o38148J41472P90318k40035M93048n33106N93616k06989
6606C148354L09595r02707R08199n89463O99359l52254K5191p4740O1702J95633
$$ y = [2289698, 2052705, 2897192, 2043829, 2785975, 2353696, 3118797, 1251740, 2301529, 1829571, 2944634, 2650131, 2552463, 3169825, 2376515, 2902939, 3080228, 2875518, 3486002, 3244118, 3444129, 3067474, 3553039, 2780688, 2651139, 3428938, 2963545, 4100256, 3032054, 2499860, 2927216, 2804260, 3406740, 2820513, 2670393, 3194077, 3006518, 2737467, 2787241, 3388044, 2875039, 3123965, 3610782, 3093472, 2870655, 2419749, 3057051, 2461713, 3135579, 3022165, 2564338, 2667160, 1834926, 2835707, 2515242, 2831467, 2486582, 3369760, 2667098, 2748178, 2110030, 2251502, 3041820, 2801785, 3294833, 2761727, 3355343, 3148354, 3457949, 2555242, 3463441, 2873978, 3573337, 3221083, 3246274, 3171534, 3233236, 3428869]
6596C428869j255177J272191L59103O30661j133353L00683P76212r07275j56831
6587C315083j85312M11362Q7864K184j15775P29111n2044N2913k46739K82943
6577D281590q25939Q67803j80599j11093Q96991m53245K47819M10479m52544O16457
6567E297719l16408L44703n99848Q57521M25459M0270j89885L42004L30457O6941
6557F598933Q82347n43869P64561K82926N33252O06839n0395l1440O46464J093119
6547A0782737P88143O08604m60335j41545J262669m5120N10654J169829P54366
6538A5230002N2690J120456R03213P90475P88929R72332j93141K499642J48625
6529B2313223L91604N33298J276548K34890J184167K43538N24025n33081Q11212
$$ y = [3428869, 2173692, 3445883, 3804986, 4435647, 3302294, 3602977, 4379189, 3471914, 3315083, 3129771, 3541133, 3628997, 3631181, 3515406, 4244517, 4192473, 4245386, 3998647, 4281590, 3455651, 4323454, 4142855, 4031762, 4928753, 4475508, 4723327, 5133806, 4681262, 5297719, 4981311, 5326014, 4726166, 5583687, 6009146, 6049416, 5859531, 6201535, 6531992, 6598933, 7481280, 6937411, 7701972, 7984898, 8518150, 9124989, 9074594, 9043154, 9689618, 10782737, 11570880, 12179484, 11719149, 11577604, 12840273, 12795153, 13305807, 14475636, 15230002, 15282692, 16403148, 17306361, 18096836, 18885765, 19858097, 19664956, 22164598, 22313223, 22704827, 23238125, 24514673, 24749563, 25933730, 26177268, 26701293, 26168212, 26979424]
6520B6979424j512012R70229q70456j59250N08103r09555o25325m79373l44679
6511B3557106o97960k97399n18879j90533O2822r04702o4974M49794m43463k6971
6501B0924841N05839m21274k81873k04827Q25334j391164J650476k59352Q23481
6492B2171481j76501j1613M57604N58743L86808O10018N19430Q22778j15596J586135
6482B6809287k30380J741624J28113J245113J207612N10570L6379J700764j60549
6473C2988533J044316N6931P93715r49707N51878j627900j9721p13064j90992
6464C1933989j837683j639j540557r64724q32884q43842j025269j160051q44622
6455B2882718o17389j227907k85130q14422o16272j239989j58530o51319j291237
$$ y = [26979424, 25467412, 26437641, 25567185, 25407935, 25916038, 25006483, 24381158, 23901785, 23557106, 22859146, 22561747, 22042868, 21852335, 21915157, 21010455, 20945481, 21395275, 20951812, 20924841, 21430680, 21009406, 20727533, 20522706, 21348040, 19956876, 21607352, 21348000, 22171481, 21994980, 21983367, 22440971, 22999714, 23386522, 23996540, 24515970, 25338748, 25223152, 26809287, 26578907, 28320531, 28448644, 29693757, 30901369, 31411939, 31448318, 33149082, 32988533, 34032849, 34089780, 34883495, 33933788, 34485666, 32857766, 32838045, 32124981, 31933989, 30096306, 30094667, 28554110, 27589386, 26756502, 25912660, 24887391, 23727340, 22882718, 22265329, 21037422, 20752292, 19937870, 19321598, 18081609, 17923079, 17271760, 15980523]
6446A5980523o23787l20729p35310m08226m92726o15962R2650k55224R3456k28261
6436A2486404l85659K99558J22705O80135k17454j89677O23209j439523M76503
6427A2456201l85336q30000j22582k38642J424598k71782M85700n07700O82888
6418A2693345p1025L37165j321287M88884P79029n8596K37474L84962N71377p22522
6408A3318806p73981n04607Q8772o52005j03420K38932K87684N20351M4487l0252
6398A2434767r22769P25156r52150J56430n57836m13143M94071k95875P13052
6389A1381703m85556J29694R0385n04104j84394N67562M78357N33712K44151K76710
6379A2528220k8887J037997n29815j70964N95684q27634R1227L96105n32675M80545
$$ y = [15980523, 15356736, 15036007, 14300697, 13892471, 13399745, 12783783, 12876433, 12621209, 12714665, 12486404, 12100745, 12400303, 12523008, 13203143, 12985689, 12796012, 13419221, 11979698, 12456201, 12070865, 11240865, 11118283, 10879641, 12304239, 12032457, 12518157, 12010457, 12693345, 12622320, 12959485, 11638198, 12127082, 12906111, 12847515, 13084989, 13469951, 14041328, 13318806, 12544825, 12040218, 12128990, 11476985, 11373565, 11612497, 11900181, 12420532, 12465019, 12434767, 11511998, 12237154, 11285004, 11441434, 10883598, 10470455, 10964526, 10668651, 11381703, 10896147, 11025841, 11116226, 10612122, 10427728, 10995290, 11473647, 12007359, 12251510, 12528220, 12499333, 13537330, 13007515, 12836551, 13432235, 12604601, 12695828, 13091933, 12559258, 13039803]
6369A3039803L36614J10091Q6174N27000R94487J190430R97997Q13451R16492
6360A9012539J773724Q12440J988502J018423K587741J932305L621649K833643
6352C5580966M198738M488964K719761K952584Q86206P99100k399462k391393
6344D6835464l419084l066298k617528k996485k580561k058466j539773o04945
6336B7952324Q07240M77317Q42427O62493j49956j608749l6878k295095p82510
6327B5868613k535107p83430k27798j223757J86798n80699N76059J85371P3828
6318B1539878Q59385k37349m05016M94307K38522l77922Q80192J80123J240337
6309B4412457O94375J849023J815639K810373J382860L694309L499345M557870
$$ y = [13039803, 13376417, 13486508, 13572682, 14099682, 15094169, 16284599, 17282596, 18096047, 19012539, 20786263, 21598703, 23587205, 24605628, 27193369, 29125674, 32747323, 35580966, 39779704, 44268668, 46988429, 49941013, 50827219, 51626319, 49226857, 46835464, 43416380, 40350082, 37732554, 34736069, 32155508, 30097042, 28557269, 27952324, 28759564, 29236881, 30079308, 30741801, 30591845, 28983096, 28946218, 26651123, 25868613, 23333506, 22550076, 22322278, 21098521, 21285319, 20704620, 21280679, 21466050, 21539878, 22399263, 22161914, 21756898, 22251205, 22489727, 22111805, 22991997, 23172120, 24412457, 25106832, 26955855, 28771494, 31581867, 32964727, 36659036, 40158381, 44716251]
6301D4716251L634738O686898N659469O061319M395336M646243J100727m7110
6293G6853871l018519l311146n732421n492931m358939n586138l127831l702748
6285D2523198k106610m78306L46892J200845K000223J408332K13802p66715l035349
$$ y = [44716251, 48350989, 55037887, 60697356, 66758675, 71154011, 75800254, 76900981, 76853871, 73835352, 70524206, 64791785, 59298854, 54939915, 49353777, 46225946, 42523198, 40416588, 39938282, 40285174, 41486019, 43486242, 44894574, 45108376, 44341661, 41306312]
$$ [...]
##END NTUPLES=NMR SPECTRUM
##END=
