##TITLE=abcd
##JCAMPDX= 6.0         $$ Bruker NMR JCAMP-DX V2.0
##DATA TYPE= NMR SPECTRUM
##DATA CLASS= NTUPLES
##ORIGIN= UXNMR, Bruker Analytische Messtechnik GmbH
##OWNER= root
$$ XWIN-NMR		Version 3.5
$$ Thu Jun 25 17:54:38 2026 Russian Standard Time (UT+4h)  servis@DPX200
##.OBSERVE FREQUENCY= 200.131235884673
##.OBSERVE NUCLEUS= ^1H
##.ACQUISITION MODE= SIMULTANEOUS
##.ACQUISITION SCHEME= undefined
##.AVERAGES= 32
##.DIGITISER RES= 18
##SPECTROMETER/DATA SYSTEM= spect
##.PULSE SEQUENCE= zg
##.SOLVENT NAME= CDCl3
##.SHIFT REFERENCE= (INTERNAL, CDCl3, 0, 16.4885)
##AUDIT TRAIL= $$ (NUMBER, WHEN, WHO, WHERE, WHAT)
$$ ##TITLE= Audit trail, XWIN-NMR		Version 3.5
$$ ##JCAMPDX= 5.01
$$ ##ORIGIN= Bruker BioSpin GmbH
$$ ##OWNER= servis
$$ F:\spectra/data/av/nmr/H1/1/pdata/1/auditp.txt
$$ ##AUDIT TRAIL=  $$ (NUMBER, WHEN, WHO, WHERE, WHAT)
(   1,<2026-06-25 17:53:58.92 +0400>,<servis>,<DPX200>,
      <created by zg, POWCHK disabled, PULCHK disabled
       configuration hash MD5:
       00 E9 B6 7A A2 85 ED C7 34 08 36 98 17 FE 4E 26
       data hash MD5: 32K
       1B 8B D9 1B 6A 4E 37 D9 AE C0 C4 78 60 B6 2E 28>)
(   2,<2026-06-25 17:54:02.76 +0400>,<servis>,<DPX200>,
      <Start of raw data processing
       efp BC_mod = 2 LB = 0.05 FT_mod = 6 PKNL = 1 PHC0 = -418.39 PHC1 = 3.101563 SI = 16K 
       data hash MD5: 16K
       A1 7E 11 7A 7F D8 97 00 BA BA 7F CB BB B7 F7 88>)
(   3,<2026-06-25 17:54:12.56 +0400>,<servis>,<DPX200>,
      <pk PHC0 = 2.4 PHC1 = 0 
       data hash MD5: 16K
       02 86 CF 0F A5 E8 FE EE 2E 6E BB 57 28 EA DD C4>)
$$ ##END=
$$ 
$$ hash MD5
$$ 57 B2 D7 0E DE 0E 3B 94 7F 29 B3 18 CB 51 C9 78
##$RELAX= 
##$RELAX= 
##$RELAX= 
##$RELAX= 
##$RELAX= 
##$RELAX= 
##$RELAX= 
##$RELAX= 
$$ Bruker specific parameters
$$ --------------------------
##$DU= <F:\spectra>
##$EXPNO= 1
##$NAME= <H1>
##$PROCNO= 1
##$TYPE= <nmr>
##$USER= <av>
##$AMP= (0..31)
100 100 100 100 100 100 100 100 100 100 100 100 100 100 100 100 100 100 
100 100 100 100 100 100 100 100 100 100 100 100 100 100 
##$AQSEQ= 0
##$AQ_mod= 1
##$AUNM= <au_zg>
##$AUTOPOS= <>
##$BF1= 200.13
##$BF2= 200.13
##$BF3= 200.13
##$BF4= 200.13
##$BF5= 500.13
##$BF6= 500.13
##$BF7= 500.13
##$BF8= 500.13
##$BYTORDA= 1
##$CFDGTYP= 0
##$CFRGTYP= 5
##$CHEMSTR= <none>
##$CNST= (0..31)
1 1 145 1 1 1 1 1 1 1 1 1 1 1 1 1 1 1 1 1 1 1 1 1 1 1 1 1 1 1 1 1 
##$CPDPRG= <>
##$CPDPRG1= <>
##$CPDPRG2= <>
##$CPDPRG3= <>
##$CPDPRG4= <mlev>
##$CPDPRG5= <mlev>
##$CPDPRG6= <mlev>
##$CPDPRG7= <mlev>
##$CPDPRG8= <mlev>
##$CPDPRGB= <>
##$CPDPRGT= <>
##$D= (0..31)
0 2 0 0 0 0 0 0 0 0.06 0 0 0 0 0 0 0.0002 0 0 0 0 0 0 0 0 0 0 0 0 0 0 
0 
##$DATE= 1782395638
##$DBL= (0..7)
120 120 120 120 120 120 120 120 
##$DBP= (0..7)
150 150 150 150 150 150 150 150 
##$DBP07= 0
##$DBPNAM0= <>
##$DBPNAM1= <>
##$DBPNAM2= <>
##$DBPNAM3= <>
##$DBPNAM4= <>
##$DBPNAM5= <>
##$DBPNAM6= <>
##$DBPNAM7= <>
##$DBPOAL= (0..7)
0.5 0.5 0.5 0.5 0.5 0.5 0.5 0.5 
##$DBPOFFS= (0..7)
0 0 0 0 0 0 0 0 
##$DE= 6
##$DECBNUC= <off>
##$DECIM= 32
$$ [...]
##$SUBNAM4= <"">
##$SUBNAM5= <"">
##$SUBNAM6= <"">
##$SUBNAM7= <"">
##$SUBNAM8= <"">
##$SUBNAM9= <"">
##$SW= 20.6817932712277
##$SWIBOX= (0..15)
0 0 3 0 0 0 0 0 0 0 0 0 0 0 0 0 
##$SW_h= 4139.07284768212
##$TD= 32768
##$TD0= 1
##$TE= 0
##$TE2= 300
##$TE3= 300
##$TEG= 300
##$TL= (0..7)
0 120 120 120 120 120 120 120 
##$TP= (0..7)
150 150 150 150 150 150 150 150 
##$TP07= 0
##$TPNAME0= <>
##$TPNAME1= <>
##$TPNAME2= <>
##$TPNAME3= <>
##$TPNAME4= <>
##$TPNAME5= <>
##$TPNAME6= <>
##$TPNAME7= <>
##$TPOAL= (0..7)
0.5 0.5 0.5 0.5 0.5 0.5 0.5 0.5 
##$TPOFFS= (0..7)
0 0 0 0 0 0 0 0 
##$TUNHIN= 0
##$TUNHOUT= 0
##$TUNXOUT= 0
##$USERA1= <user>
##$USERA2= <user>
##$USERA3= <user>
##$USERA4= <user>
##$USERA5= <user>
##$V9= 5
##$VALIST= <valist>
##$VCLIST= <CCCCCCCCCCCCCCC>
##$VD= 0
##$VDLIST= <DDDDDDDDDDDDDDD>
##$VPLIST= <PPPPPPPPPPPPPPP>
##$VTLIST= <TTTTTTTTTTTTTTT>
##$WBST= 1024
##$WBSW= 30
##$XGAIN= (0..3)
0 0 0 0 
##$XL= 0
##$YL= 0
##$YMAX_a= 245854
##$YMIN_a= -394148
##$ZGOPTNS= <>
##$ZL1= 120
##$ZL2= 120
##$ZL3= 120
##$ZL4= 120
##$ABSF1= 0
##$ABSF2= 0
##$ABSG= 0
##$ABSL= 0
##$ALPHA= 0
##$AQORDER= 0
##$ASSFAC= 0
##$ASSFACI= 0
##$ASSFACX= 0
##$ASSWID= 0
##$AUNMP= <proc_1d>
##$AZFE= 0.1
##$AZFW= 0.1
##$BCFW= 0
##$BC_mod= 2
##$BYTORDP= 0
##$COROFFS= 0
##$CY= 18.4799938201904
##$DATMOD= 1
##$DC= 0
##$DFILT= <>
##$DTYPP= 0
##$F1P= 9.9274215381318
##$F2P= -0.165520771350173
##$FCOR= 1
##$FTSIZE= 16384
##$FT_mod= 6
##$GAMMA= 0
##$GB= 0
##$INTBC= 1
##$INTSCL= 4.127829e-11
##$ISEN= 128
##$LB= 0.05
##$LEV0= 0
##$LPBIN= 0
##$MAXI= 10000
##$MC2= 0
##$MEAN= 0
##$ME_mod= 0
##$MI= 50
##$NCOEF= 0
##$NC_proc= -8
##$NLEV= 6
##$NOISF1= 3.799351
##$NOISF2= 2.8
##$NSP= 0
##$NTH_PI= 0
##$NZP= 0
##$OFFSET= 16.48848
##$PC= 4
##$PHC0= -415.99
##$PHC1= 3.101563
##$PH_mod= 1
##$PKNL= yes
##$PPARMOD= 0
##$PSCAL= 4
##$PSIGN= 0
##$REVERSE= no
##$SF= 200.130005582386
##$SI= 16384
##$SIGF1= 3
##$SIGF2= 2
##$SINO= 400
##$SIOLD= 16384
##$SREGLST= <1H.CDCl3>
##$SSB= 0
##$STSI= 16384
##$STSR= 0
##$SW_p= 4139.07284768211
##$SYMM= 0
##$S_DEV= 0
##$TDeff= 32768
##$TDoff= 0
##$TI= <>
##$TILT= no
##$TM1= 0
##$TM2= 0
##$TOPLEV= 0
##$USERP1= <user>
##$USERP2= <user>
##$USERP3= <user>
##$USERP4= <user>
##$USERP5= <user>
##$WDW= 1
##$XDIM= 16384
##$YMAX_p= 347750745
##$YMIN_p= -3272269
$$ End of Bruker specific parameters
$$ ---------------------------------
##NTUPLES= NMR SPECTRUM
##VAR_NAME=  FREQUENCY,     SPECTRUM/REAL,   SPECTRUM/IMAG
##SYMBOL=    X,             R,               I
##VAR_TYPE=  INDEPENDENT,   DEPENDENT,       DEPENDENT
##VAR_FORM=  AFFN,          ASDF,            ASDF
##VAR_DIM=   16384,         16384,           16384
##UNITS=     HZ,            ARBITRARY UNITS, ARBITRARY UNITS
##FACTOR=    0.252644378177508, 1,           1
##FIRST=     3299.83951724647, 0,            0
##LAST=      -839.233330435636, 0,           0
##MIN=       -839.233330435636, -3272269,    0
##MAX=       3299.83951724647, 347750745,    0
$$ Real data points
##PAGE= N=1
##DATA TABLE= (X++(R..R)), XYDATA
$$ [...]
9419 875615 1719503 333748 2015158 1025043 2193380 2013903 2152901 1231518 353040
9410 353040 447608 1234228 1074862 727648 1871953 2028410 783733 1235016 590068 1443150
9400 1443150 1498184 124579 849498 1171817 821296 718516 821488 1014912 1512669 1995269
9390 1995269 1255821 2315554 1058502 968804 1360455 967213 1672612 1791869 2476279
9381 2476279 1898367 2986679 2145322 851973 779620 1592123 1330787 1719207 1827476
9372 1827476 1196779 1799041 3110837 1063126 2526750 3360008 3289811 3591390 1669045
9363 1669045 1212377 1537951 3306318 2510769 3243351 3394510 2057166 3876240 2401292
9354 2401292 3295283 2700897 3177662 3002317 3999944 4262655 3875349 4367514 3336410
9345 3336410 6117201 4424317 5426843 4103314 4506790 4907270 3802754 5687428 4310186
9336 4310186 6631647 4879614 4780127 4718301 6095469 4879494 4813753 6310741 5128990
9327 5128990 5956773 5337466 4597724 4096237 5013763 4666714 3356602 4429524 3394992
9318 3394992 5210537 4348403 4524363 3500344 2312863 2186674 3633405 5735158 3491543
9309 3491543 4664867 4887708 5979062 5198243 4114014 3764672 3609124 4028178 3869272
9300 3869272 4127698 3602330 4948777 5277239 5363641 5590609 5679793 5800076 6111537 6194289
9290 6194289 5415734 6154414 5296924 6732943 6201404 6606460 7196959 6242272 6260630 6019676
9280 6019676 5547049 5042658 6779121 5269268 6223243 4623234 5289807 5357658 5119230
9271 5119230 3839116 4059348 4646318 3375244 3306871 3786624 4416054 4017005 3349629
9262 3349629 4343768 2642842 3945095 4162924 4568493 4950601 3891481 2865752 3880692
9253 3880692 3236984 3271930 3414646 3532021 4915458 4457855 5258938 4305886 3587153 3522946
9243 3522946 3357392 4465511 3425244 3332719 1756597 2866602 4046305 3680246 4256733
9234 4256733 2743684 3197401 3024057 2611011 2663079 2864616 3613340 2774353 4109458
9225 4109458 2616729 2548007 2676724 2458617 3023248 2249927 3794203 3288335 3461805
9216 3461805 3230393 2879861 3075106 2719101 2918291 1780992 3261552 1552539 2465311
9207 2465311 3507814 2820870 2680714 1240634 2337621 2294145 2478390 3603731 3099397
9198 3099397 3765367 2948741 3427732 3655567 4547628 2564957 3217518 1826644 2596360
9189 2596360 2837398 3395261 4017548 2024289 4319647 3913872 2993272 3255201 2277897
9180 2277897 3119636 3622412 5385065 5120084 3717031 5662147 4904095 4046670 3863648
9171 3863648 3449487 4628197 4858617 4310355 3430205 4536536 4711109 4748269 5392514
9162 5392514 5004825 4968098 6279663 5852180 4708624 6375496 6106176 6998936 9343778
9153 9343778 8919593 8734449 7453374 8291131 7398157 8508275 9556148 9137980 10262894
9144 10262894 10500662 9787979 8663127 10206640 11571977 12012904 13562244 15464349 17721107
9135 17721107 18067033 18072573 17626706 15408323 15047653 15132678 12395918 13372514 11611213
9126 11611213 11154999 11862618 10217116 10897100 10291924 11818545 9701613 10553131 11896405
9117 11896405 10998596 13312727 12334930 12150968 12401074 11278241 11794940 13089328 12624853
9108 12624853 13165169 13661340 14812567 15864214 17065706 18501706 16909476 19705691
9100 19705691 19633605 21688702 23478438 26044609 28334092 30269202 33289271 36039009
9092 36039009 42048368 49066111 60717300 91481683 153947024 232360831 283591687
9085 283591687 308785821 293620911 244306137 192610369 147855347 116063177 89088312
9078 89088312 68281732 51382530 38798242 31212217 28791289 23632576 22242066 19107712
9070 19107712 17344030 16135448 16136432 15898633 14764640 13817201 12838906 12403358 11485465
9061 11485465 12071545 11437242 11545310 10015808 10562464 9653373 7775627 8163254 7588523
9052 7588523 8797402 8288626 8590300 7936165 7268460 8451234 6260637 6589758 7305294
9043 7305294 7082924 7765961 6126815 5546452 5393312 4897265 5160678 5578920 5100697
9034 5100697 4780860 5175161 5311189 4771422 4672514 3425284 4398068 5400505 4372111
9025 4372111 3977073 3344138 3764844 4092945 4011783 5798695 3822286 4075944 4322660
9016 4322660 4407951 4469759 3545308 2664551 3740965 3152467 3923363 4553413 3683549 2848544
9006 2848544 3637076 3027534 2753064 3703121 3313567 1947789 2308095 2041564 1686922
8997 1686922 3433127 3160208 2795881 1961350 2270853 1951306 1637627 2110046 1626435
8988 1626435 2628523 2774451 3930953 3568887 2082608 816816 403957 1014634 1426159
8979 1426159 1519786 1223261 1249833 693170 343617 1413506 2457224 2182695 2643770 2820558
8969 2820558 731981 429337 1389835 88196 1593796 2328640 1697764 831535 1773003
8960 1773003 1290559 1246166 1679874 48531 2412297 2102920 1712275 156567 690925
8951 690925 307356 878256 1614735 2054728 29766 429779 180138 1376857 1404916 961692
8941 961692 1851457 490741 1094495 -433190 1159170 -299507 137821 2152715 -280373
8932 -280373 1698143 -189469 2432125 928697 1473187 8827 441102 93253 336976
8923 336976 1283599 1023701 -25583 1548759 819481 253064 316746 -973697 -458387
8914 -458387 1000661 314502 2416313 685030 256780 1128645 1132547 1062619 -1033865 991959
8904 991959 421191 -640045 -338716 -135689 578940 737354 1471403 1486341 264286 -67160
8894 -67160 -204452 991784 100261 297123 1067627 1730630 1316051 1719478 370277 -1048639
8884 -1048639 1264276 34048 403442 -252024 -399956 560535 539909 2071631 600171
8875 600171 1141969 181212 890067 962822 467493 563997 866001 1330566 1314520 -107370
8865 -107370 -309160 -1767136 66257 487527 2021027 1060805 1244881 1241969 -579299
8856 -579299 953619 -477242 1187931 891815 1733610 1485798 -183129 -456526 -1025053
8847 -1025053 848161 1514430 1380160 1112130 -434772 -1246602 -350426 311048 -40113
8838 -40113 1321920 1678046 158538 -439631 -876726 391367 304227 927244 129452 -23330
8828 -23330 -585198 125309 1080268 1204104 909764 -505580 1843759 936164 -362478
8819 -362478 -783651 -152291 635784 594370 1343825 -2166 283904 851119 189857 38564
8809 38564 -30582 -342972 337643 -17327 837475 646934 347911 468450 400781 288914
8799 288914 35192 131373 745189 -10160 -374786 -231763 -329844 922815 -373034 353096
8789 353096 678187 66321 1229382 1534169 -430022 241021 45342 610162 415969
8780 415969 316020 1028312 -458986 532811 -1339991 1058921 518317 755024 -418268
8771 -418268 1648385 -275881 241089 1193073 -250126 1392209 -334462 1179483 -414455
8762 -414455 211024 284313 -595312 594336 405274 2826661 -382732 562760 121471
8753 121471 363510 -499251 545882 558901 404458 787051 -1602797 288902 -901599
8744 -901599 36058 1051817 1784318 1332720 -193762 525037 -148382 341200 643095
8735 643095 55582 -324774 851511 -815732 1513664 -185989 393351 1308130 -1858
8726 -1858 173254 672085 774485 -59960 1679728 1619510 -242496 -105786 687262 937007
8716 937007 1472514 591670 174257 443477 -963758 497974 1264962 1237034 340506 299195
8706 299195 704770 84718 1254194 798671 292429 769033 752897 1760404 954243 -299440
8696 -299440 451822 -587416 1605131 871608 918113 -77947 -463723 1864195 1099296
8687 1099296 611074 1543714 1484867 642966 99047 26221 1840942 378418 1704271
8678 1704271 858749 51792 -791649 -339251 422866 -101002 854699 988818 1520860 3956863
8668 3956863 2701277 1202687 2029372 156213 833961 408669 1322201 412896 -187259
8659 -187259 118324 372691 892132 1171346 424706 1593255 318364 80113 349233
8650 349233 -465379 885655 232415 581706 1330921 569407 887436 -24680 39914 752887
8640 752887 505500 1184441 1425707 -429053 1557803 348876 2026851 1276545 35122
8631 35122 1606999 -1505803 1463245 37133 1799416 755420 1910898 543993 88905
8622 88905 1704665 -290398 1584717 777672 647041 -33923 977506 653653 1200639
8613 1200639 2360362 236661 713792 -267365 1147969 -1127757 141432 2602915 942819
8604 942819 1874697 -218828 -769073 -791204 -18829 1326384 1331621 1146974 101044 49117
8594 49117 1353889 334026 670412 1355830 550835 1211197 883011 -242896 610529
8585 610529 -237630 1181739 642803 788008 890330 961071 732898 231848 233727 1017798
8575 1017798 962742 684202 1007297 551988 1057329 1136575 2053741 1033598 1151755 467645
8565 467645 -397962 419420 878361 1972230 771280 824013 1877391 563021 124200
8556 124200 933155 659082 1101837 1353085 559920 269667 564271 564938 240895 1072930
8546 1072930 1837261 1288090 1232441 865917 355672 691140 336425 1222334 802033 2094045
8536 2094045 1060837 1348344 1307435 1067257 3020371 1423841 804857 348530 1114701
8527 1114701 1198532 1875780 1510170 1258426 1051124 578787 1884502 -875314 640576
8518 640576 -119666 1796710 859758 1631650 739587 -267107 1975296 345144 1894411
8509 1894411 236162 335980 538585 1295230 1108912 1757087 1150311 -97796 2531526
8500 2531526 781201 1877610 177817 1335212 2207551 413044 1889832 -66368
8492 -66368 889873 1564220 2420416 1388056 259302 719728 -507748 869320 1241110
8483 1241110 1741565 677297 1904405 1600005 46046 -62272 -898276 818931 206655
8474 206655 1436800 682476 1325760 1920678 1571244 1073186 417067 354092 1351954 1916869
8464 1916869 774087 1192801 370656 2128694 1310859 835576 1625326 488031 1020529
8455 1020529 1613828 1887803 909383 1141838 -510750 892852 1366525 729648 948130
8446 948130 2040118 613054 490676 -33990 -620267 1046044 792970 1059711 1713317
8437 1713317 402625 847140 677196 499137 187207 1586736 1508944 1482439 1290462 -91519
8427 -91519 1297089 259095 1881475 1724477 2120035 708732 727856 407294 358431 997788
8417 997788 -691966 2004704 1642895 1318833 577132 530545 801895 929976 1094597 747723
8407 747723 1270979 1087184 973407 607864 -90915 614219 685592 1500419 1287015 1464668
8397 1464668 861712 2022023 1726056 925948 2715029 808693 1768988 1447000 890211
8388 890211 773002 524165 2373014 978176 1741509 2108555 833868 1549702 1598366
8379 1598366 1125124 1382546 2769525 2657042 2388626 1287568 2214798 2033689 1523458
8370 1523458 1394728 1889520 2296461 2017725 1770960 2396867 3337713 3132717 2295171 4064306
8360 4064306 3159798 3932392 3275403 4276480 5066547 5384354 5285808 5153123 6092308 5570007
8350 5570007 7210251 8438394 7814573 6893173 7119666 6424521 6761591 6905669 5535536
8341 5535536 7115624 5697146 6759852 5582964 4549264 3666912 2989016 4210795 4357248
8332 4357248 4555511 3287582 2153380 2310931 2141647 2552897 2754654 2727306 3583407
8323 3583407 1531884 1551745 2323500 774833 1842511 2255734 2696924 1553639 1064306
8314 1064306 1871347 2323441 615064 1843298 1683142 1588706 2133112 1347203 832448
8305 832448 2306256 1865619 2721810 3237633 1180340 1320597 766167 747117 1634164 2510207
8295 2510207 1999053 2052897 1370945 1854029 1560653 1103670 1949190 1239888 2619262 718492
8285 718492 1424030 1108542 251613 2085947 2753541 2512871 1890952 1366851 1085277 799905
8275 799905 1152085 2377086 964597 2263919 499136 1064805 205171 138141 2502393
8266 2502393 515548 2102612 1148581 1393621 497253 652037 507716 1200381 1772171
8257 1772171 662100 911024 1732088 52245 350007 1906125 830707 1574350 1128638
8248 1128638 895535 562276 1069730 1757125 457842 819759 620167 351550 1012560
8239 1012560 1319183 2550824 1701887 30445 306508 651501 964879 1647973 1567332
8230 1567332 2395074 2026825 1603758 -7451 758221 1585353 -65945 2332374 1143782
8221 1143782 971344 849436 1530957 992429 1933667 324892 209871 1120341 761808
8212 761808 1427583 -308146 1853847 59954 2274306 2020881 -106833 1426350 381927
8203 381927 3344150 1522341 2548159 9676 204493 3177284 579617 2022191 967277
8194 967277 2393589 1190767 -1037792 875639 1264475 -244068 320867 1059535 1620412
8185 1620412 1010596 1269104 3205137 2062203 852599 284163 297195 1019561 508298
8176 508298 834173 307972 928990 2086129 4161434 2112404 1602861 695369 -841034
8167 -841034 422455 2136712 945376 627697 2000383 1613777 1692998 1198164 1655549
8158 1655549 2009665 1496629 1930922 1382997 1995174 367401 1643353 2543147 3148802
8149 3148802 1939699 1314126 1771330 -158659 2120063 798607 2064987 2698801 1645246
8140 1645246 1324341 855526 1305411 1719605 2439405 2013886 2533378 358381 789983
8131 789983 1857570 800886 3677097 1479870 1877659 790991 453333 1634470 976846
8122 976846 3220196 1999207 2392578 1681216 1083264 2455690 1125891 3147898 1434353
8113 1434353 815206 2323566 767154 2812810 2689566 1709000 2586281 1340404 1417320
8104 1417320 479237 42411 902775 1373096 1610760 3133146 2739308 2118578 253382
8095 253382 1007302 1562018 1278048 1135951 1334070 2200152 1822402 2006150 2975343 1648944
8085 1648944 3026126 1323278 866467 2229890 726997 1034428 1631972 1114428 2426215
8076 2426215 2107530 3448030 1153992 2191172 1333693 499768 2593933 1418012 3083487
8067 3083487 1234669 1896711 2474017 2781392 2337979 3707027 1465821 2380229 1906210
8058 1906210 2501166 2798030 1352326 2384740 501588 1951133 2786055 115376 2752436
8049 2752436 1730190 2649319 3084771 1643415 1477823 1541892 3697158 2578500 3272448
8040 3272448 2189845 1251561 2493978 2700723 2436683 3017228 2376546 2340740 1988250
8031 1988250 -182353 1492200 2048325 2590648 4048562 2223559 2032490 1887011 2606386
8022 2606386 2397469 1289726 2215366 1567632 2594185 3273783 2477170 2238296 1950372
8013 1950372 1810562 2386933 2090307 2012248 835622 3015820 2638807 1835397 2573092
8004 2573092 938576 1724564 3555300 2029160 3636475 2731094 1637622 2318850 1906109
7995 1906109 2321883 3003300 2945453 2945790 2866713 3443726 1045662 2294755 2422953 2322246
7985 2322246 3725650 1466536 2461142 2393050 2398353 2611494 1411997 1856124 2970533
7976 2970533 2206138 1967001 2317497 2522012 2368198 2046263 1877606 2203852 2246222 3674661
7966 3674661 1870838 2353697 2040989 1937179 2050545 1981070 3374454 3757160 2996371
7957 2996371 2238079 2083276 3064643 2489777 1768749 2755817 2409666 3159607 1513319
7948 1513319 2865454 2317818 2138198 3559063 2540248 2453742 2137198 2311894 2407858
7939 2407858 2423717 2245828 1745179 1947517 1924895 2179677 2372083 2167571 2563431 2963098
7929 2963098 2471092 2945235 1631272 1608227 1471536 1259481 1349170 630664 1624697 1631760
7919 1631760 2408414 2543316 3346856 2341599 2317526 2751401 1897919 1211576 2408113
7910 2408113 2081847 2915208 934482 3057599 2218532 2091985 3302527 2376032 2003599
7901 2003599 800184 2357029 1445389 2000140 2798734 1073063 2523388 2953226 2101517
7892 2101517 3542606 1386237 2050375 809929 1601454 2606182 2533465 3408261 2452274
7883 2452274 2916461 1857843 1192276 1144885 2408036 2530167 3289201 2726608 2088423
7874 2088423 2862173 2517043 2082240 1751654 2538260 2910794 2375347 2430274 1771256 3040320
7864 3040320 2156746 2436755 2632517 2045737 3360667 2280386 2699882 4110546 3334136
7855 3334136 2699343 3505101 3038194 6148820 1464091 1974985 2762700 3189447 2979002
7846 2979002 2277123 2840043 3230425 3971239 3196689 3160562 2823008 2273971 3177330 2070683
7836 2070683 1057019 3216055 2551273 1712868 2776751 3263519 2765930 2871698 2339391
7827 2339391 2382061 2425982 2606887 2271986 3136746 2908577 2604342 1424237 2200086 3817763
7817 3817763 2383702 1547851 2053294 2367288 2360225 3002971 3238452 3468522 2283823 2464213
7807 2464213 1830698 2359159 2957313 1760939 3560553 3397330 3823916 2560094 3155273
7798 3155273 3602027 4078254 3868067 2530012 3442723 976276 1521266 2030661 2449356
7789 2449356 3225133 2671473 2948688 2617669 3368301 4222948 2575706 3367316 3252362
7780 3252362 2988546 3200931 2644709 3095811 2513733 3546900 3329353 2343801 2622494
7771 2622494 2257136 2554222 4077163 2957300 2730395 3063560 1638141 4032812 2220835
7762 2220835 3975914 2304119 2263210 2388048 3027443 2223417 3344106 4103561 4042631
7753 4042631 2300103 727395 1338817 2820441 3278661 4536863 3589825 3459523 2568066
7744 2568066 3793035 3348802 2417180 2578143 3012969 4456470 4717961 4224829 2663299
7735 2663299 3411275 2662627 3597987 3942929 3493200 4736225 5149784 3970711 5600638
7726 5600638 4354404 4927948 5190235 4251967 4991687 3673543 4576500 3128932 3335102
7717 3335102 3177094 2534256 5927367 5609431 7655079 7271488 6821888 7124216 6490715
7708 6490715 8153454 6270973 6147806 6202861 5680542 5375250 4069260 4248624 4387674
7699 4387674 4270919 4675385 4512833 4393962 4577691 3681487 5602326 7222150 7879502
7690 7879502 7363427 8252777 8109147 6646179 6630771 5619567 4657995 4610837 4689453 4430633
7680 4430633 4524919 4567806 3473551 4168592 3507996 2973576 4734505 4950488 3740898
7671 3740898 5546656 5122100 4500783 5593224 4605049 3981360 4435587 4896018 3307156
7662 3307156 4877830 3452053 3563343 2399120 3798323 3812130 3578145 5384370 3175894
7653 3175894 3169770 2234622 4516662 4039847 4112325 3443081 2920489 3750062 3237245 3377044
7643 3377044 2641659 2730787 4026409 2581184 4069370 4320383 2527310 4189195 3879387
7634 3879387 4582606 4073067 3383324 3117168 4308257 4411268 4703800 4439766 4278697
7625 4278697 3639186 4519665 3690326 3302170 4553586 5487021 6747818 3138857 3524753
7616 3524753 4714979 4425927 4515854 4659301 4322026 4273617 4974591 4970192 4251830 4888640
7606 4888640 3415257 5793412 4974755 4338013 5249847 4078117 5851315 5231580 5440461
7597 5440461 4436680 5762177 5411599 6378018 6651941 6404408 6792838 6260041 7258682
7588 7258682 5365037 4319007 6333273 5681188 6296995 7576766 5404139 7069856 7723087
7579 7723087 6872603 6885736 5590741 6375474 6375794 6738221 7239128 8148894 7471767 7923256
7569 7923256 9936637 7229237 7707677 7185473 7658418 8134298 7556734 7710725 7158147
7560 7158147 8255230 7116130 9031843 8882729 9079592 9154279 9466595 9215945 8011844
7551 8011844 6141000 7103331 6492638 5887282 6402132 5984347 6704449 6890794 6676101
7542 6676101 6203275 6702581 6791995 6729172 7674201 6710623 7114216 6687719 6155573 6998124
7532 6998124 6007594 6292227 5015937 6391629 7748704 6296754 6472693 5961222 5113937
7523 5113937 6831694 6811784 5183607 6057818 5069019 4908712 5217371 5201538 5056396 4610984
7513 4610984 5882533 5893998 5262304 4066233 3890642 5485770 4817043 6011727 4564514
7504 4564514 3701898 5322247 5017004 4418327 4953191 4224907 4606864 5208961 5062052
7495 5062052 5014712 4903081 4906287 5636282 3228474 3831238 2989135 4737944 5085990 4805409
7485 4805409 5172073 5143922 5729425 4177669 4851387 4535691 4815426 6454220 5074641
7476 5074641 6015046 3767081 3322242 4835838 5616325 5656501 4146345 4594271 5304460
7467 5304460 4790863 4667406 3345380 4982981 5767359 6135950 5027204 3971433 3412815
7458 3412815 4531115 4308745 5903667 3942957 3954682 4668559 5118082 6667056 4835987
7449 4835987 4240062 5336430 4459357 5935759 5012958 3505430 4260984 5091479 4272339
7440 4272339 5338446 4944326 5169631 6327145 4845364 4503796 4377226 3966471 4596427
7431 4596427 4876261 3806690 4703243 5224401 4422093 4155915 4611523 4449005 5981582
7422 5981582 4454694 5230181 4899115 4598538 4937778 4566611 6739731 5576156 5074778
7413 5074778 4434003 5412516 4541590 4129343 4241866 4380095 6960051 4912812 4222019
7404 4222019 6201603 3979582 5430979 3255828 3744544 4337091 5602277 4344840 3814149
7395 3814149 5262700 3641926 5760268 4850191 4836572 4557003 3884278 4280392 4746500
7386 4746500 5874666 4986471 5095131 4837094 4833268 4744485 5522085 4505961 5517511 5067107
7376 5067107 3274667 5702355 4632676 7031602 5206708 5515708 5237719 3991871 5774300
7367 5774300 2983030 4726549 4454088 5998756 6374787 4851279 3230815 4650523 5615358
7358 5615358 4685005 5786231 3841676 7376713 6833594 5809753 5489967 4517339 5138955
7349 5138955 4991461 5850605 5064732 5461178 5403448 4477717 5564881 5309275 5751050 5431837
7339 5431837 4956002 5534914 3896547 3364390 4479894 4734793 5550199 5803351 4538460
7330 4538460 6471313 6292607 4667021 3910280 3757465 5526807 4871804 5542696 4907760
7321 4907760 4693090 4781658 4267371 5300745 5123336 4768277 5547496 4057796 6143879
7312 6143879 4619155 4407682 5114868 3281159 4723484 2882499 5393010 5073525 6208943
7303 6208943 4180559 2719715 2373949 3111457 4661928 4818914 5300845 3845310 5530582
7294 5530582 3280601 3865716 4238618 3979221 5425516 4400119 4804796 4115169 4180175
7285 4180175 4676705 5140796 5388007 3847790 4361580 4141522 2974727 4887515 3390449
7276 3390449 4342112 4416387 5135983 4819275 3868594 3885514 3909380 5381182 5946684 6013097
7266 6013097 5113329 5930533 4632542 5026271 4641629 4620655 4900983 4516730 7056193
7257 7056193 5411677 5602789 5359078 2813397 6046132 4347229 6459400 6264259 6337177
7248 6337177 6771933 4920361 5891617 6011541 7646149 7322548 6875908 5925195 5588112
7239 5588112 6261232 6042867 6236588 6587064 8298233 7563975 7207761 6329996 6743267
7230 6743267 6205130 7321169 7018340 8329752 7138281 6835513 7425086 6213722 6204536
7221 6204536 6143185 7623185 7388503 8747127 8277040 8003824 8503555 8669401 11749761
7212 11749761 9724394 10887627 11336556 10946708 11399738 9716042 11000479 9931696 12177620
7203 12177620 11880502 11885671 11867470 11390405 12390272 12153220 13636267 13748928 15465649 15060788
7193 15060788 16406457 15681812 15690366 16540126 16806916 19084492 19532976 19149226 20202198
7184 20202198 21039322 19875584 19882877 19079495 19606075 20934098 19845615 20920525 21171082
7175 21171082 22849671 25031428 27081968 29261483 32241931 34773106 35286933 34894123
7167 34894123 35230054 35112440 35686157 33674262 34690683 34568109 32901824 31491653 31440303
7158 31440303 30520910 31256856 30532791 31006114 31111111 30531589 28806912 28822367 30089659
7149 30089659 31933076 35311144 37014443 41196811 43506221 47754193 50879975 54220239
7141 54220239 55714329 54875906 54862062 52406219 52099148 50317539 48892461 45019483 43949680
7132 43949680 42365318 41885209 37964011 36167535 35769028 33499953 33410493 32239030 32514241
7123 32514241 32556388 35158399 36789207 41412126 46651800 49685589 52878613 52912536 54937085
7114 54937085 53822528 54435601 52458004 50792425 48442939 45194190 43229073 40704087
7106 40704087 38759028 36045280 32672674 30788204 28220256 26425239 26184974 24432202
7098 24432202 25240270 24649082 25693217 25542318 24597802 26479035 27897115 29318015 32122979
7089 32122979 32969231 33997957 33853751 31872377 31488616 28223630 28363506 28147416 25733669
7080 25733669 25135601 22581653 22641840 21408496 20582867 19623216 17605064 17451011 16677860
7071 16677860 16787747 15626779 13924367 13713490 15257876 15722120 15933891 14941815 16743203
7062 16743203 17282312 16119026 16575050 15144578 14887459 15006936 13335288 15714088 14466664
7053 14466664 14536329 12342626 12764373 12862776 11405899 11754974 10955099 11880535 12268449
7044 12268449 11087217 10286013 10933557 11358142 11259240 10772658 11124241 11576572 10987389
7035 10987389 11591767 10007948 10632727 10945414 10795045 11709151 10960569 12297556 9767237
7026 9767237 12274576 11695912 10936491 13169034 10719055 11642322 12255390 12269358 12571563
7017 12571563 11464098 13250085 13116794 12972785 12950398 13084006 14092587 13751076 12538488
7008 12538488 14203171 13521788 13960291 12547895 12264043 12462977 10811751 10856253 10516679
6999 10516679 11590876 13052503 11690473 12870720 13091611 13518604 12462822 11448161
6991 11448161 13073875 11178881 11140854 11673796 10463390 10970775 10763992 9208389 9910204
6982 9910204 10293818 10718628 10508787 10409018 10338316 10285698 10699169 8791884 8805208 9706001
6972 9706001 9401433 10205179 10653660 10662329 10957937 10801518 12290744 12278686 12705899 14728283
6962 14728283 14443500 15120864 17022856 16671065 17461643 15903592 15647955 14956200 15249797
6953 15249797 13992670 14522509 15467771 15244152 16831503 17510330 18462037 18363399 16305457
6944 16305457 16905653 14822482 14881169 13581970 12063149 13510518 12616046 12573991 12340475
6935 12340475 12012820 11792931 11402789 11163804 10244667 11564675 11453917 12047831 11733918
6926 11733918 11982140 13077693 13148991 13659330 13298608 13740370 13219572 14224386 13488352
6917 13488352 13591376 13954173 13679542 14444848 13449097 13283632 13425107 13904784 12847288
6908 12847288 13156073 14816343 14597247 14931538 16174259 15700461 14422859 13995840 14188906
6899 14188906 14958482 14697276 13470051 13286945 14088956 15629534 16087883 15772881 16597828
6890 16597828 16504633 18667845 18613857 19669043 21086739 20913158 21809493 24299114 23370789
6881 23370789 23842029 23993999 25742898 26424597 26375151 25531413 25340026 24880711 23539482
6872 23539482 23197902 20410106 21043985 20678684 20112727 18899364 17389322 17155994 17695012
6863 17695012 18967571 18129534 17336728 17831377 19700116 22357789 23724637 26515645 26107091
6854 26107091 26033283 25964876 26586370 26732938 27235952 26612602 26728326 27019046 24162240 22546788
6844 22546788 20426806 21130260 20417460 18443072 19815500 17878299 19503161 17693579
6836 17693579 17486850 18415136 18444548 20712767 21729542 22306531 23850026 24393198 24687657
6827 24687657 26139368 24573676 22881893 21616451 20618296 20778807 20392026 19279388 19864849
6818 19864849 19258579 19937040 20124989 22017247 22760962 24325143 24489685 22610303 23579904
6809 23579904 24110490 24197114 24445186 23981334 24431298 22740587 21626241 20497857 19523735
6800 19523735 18219321 17361220 17318902 15432053 15870695 15785686 15457846 14742503 15252862
6791 15252862 14819802 15381927 14938695 14366518 15870471 16268522 16873030 16422766 17866410
6782 17866410 17479953 20057627 22362459 23924162 25328959 25359073 26009799 26219171 28043616
6773 28043616 30418585 32097679 32322951 32376526 31065958 30036865 26596221 24959500 22551135
6764 22551135 21412936 21057946 20434932 20683427 20205583 20056762 18766959 18509861 17627126
6755 17627126 19139119 19025337 19540886 21137317 20891530 22350662 22344535 23193006 23571200
6746 23571200 23884808 26048503 26765926 28993179 31756711 34103502 36092089 37093206
6738 37093206 38157069 36701064 35641291 34621110 35942888 37770209 39738630 40853939
6730 40853939 41739470 40886570 37373355 35640356 30820490 29197348 25629057 24965413 22626115
6721 22626115 21345568 20254826 18961389 18296956 17295989 17973340 17604256 19383065 19846577
6712 19846577 20264470 19887120 19382086 21504644 22632506 24838599 24066894 24988092 25668863
6703 25668863 26494755 28814648 30914484 32251695 32849180 35388816 34583774 31671394 29125413
6694 29125413 27193640 24875752 24037335 24039981 22872048 23171856 21386383 22434307 21442655
6685 21442655 22647119 22609579 27632683 30566890 33803885 36900806 38357498 39181759 37114331
6676 37114331 33136738 29942031 26871700 26716663 25818767 22851447 22128126 19496699 19879389
6667 19879389 19930383 18969411 18714741 18758731 19001350 21278002 23016840 22326853 23578075
6658 23578075 22316068 23106990 23175927 22920542 26166943 29841743 34662270 38572805 39404895
6649 39404895 40785969 39540686 37574623 34087238 30879904 27734709 27182107 25645071
6641 25645071 23621262 22890100 21666245 21042512 21559796 22360306 20174722 23907176 24331168
6632 24331168 28176286 29566497 29125246 31277810 28189666 27165432 25784395 27053929
6624 27053929 28191483 29301109 28657623 28768923 27025744 26567261 24691798 24050445 21832897
6615 21832897 20963642 21782443 20747022 20485301 19468214 19969945 19865528 20810639 22992661
6606 22992661 23349664 24706470 25138193 25954110 26738025 27592113 28211204 28557495 28386712
6597 28386712 28089762 24701771 25950878 24989050 24921772 24770264 22490029 22491759 21996809
6588 21996809 22269007 22736499 19697732 21194886 19858230 19759438 19066739 18201068 20844628
6579 20844628 20835791 21786408 20137780 18854144 18695245 18766902 18734117 19950750 18669022
6570 18669022 19776825 17800250 18071479 18080649 17782093 19302369 19884616 20929063 19004613
6561 19004613 18580145 17859846 18949034 18792124 20590484 18802016 20240959 20170268 18747090
6552 18747090 19591626 18129569 19684157 19708874 20548084 18941812 17676325 18273539 17420493
6543 17420493 19553353 18442753 19182621 18944802 18199710 18246502 17646197 17630095 18144702
6534 18144702 19103049 19266459 19920868 18712712 19399457 18316980 19444374 19440502 18759153
6525 18759153 19474800 19507820 19824616 17922728 19136681 17738620 18830586 19190120 18878364
6516 18878364 18570006 16979656 19156102 18581295 18622481 18980388 19627548 17818858 18632333
6507 18632333 17992646 18664459 19223797 19377025 19306559 18359342 19026698 17444813 19222563
6498 19222563 17260954 17513862 17114463 17639429 18480756 16849918 18260263 17314989 18964988
6489 18964988 19731835 19687089 20007587 19203212 20512486 19935190 20590070 19281274 18694331
6480 18694331 19028343 19324272 19339017 17857570 17674025 18920567 18619898 17546309 18717763
6471 18717763 20444006 21454421 23748138 20424716 21879634 20218235 21043327 20567190
6463 20567190 20970660 19611941 19022682 17679929 18249482 18736580 16715222 17550934 17301266
6454 17301266 17973618 17237356 16944999 16515583 15477639 17453924 15616746 16943671 16856851
6445 16856851 17915213 18357857 18551969 19835792 20053533 20602044 20341278 20846005 20002575
6436 20002575 18942052 19103132 20094522 19076040 17482030 17972389 17526730 16066631 15691945
6427 15691945 14675631 14300801 16765354 16223954 15905888 16596968 14631216 15105142 15707117
6418 15707117 16293007 16538645 15977756 17160734 17521662 18576713 17587632 20481741 20195975
6409 20195975 23545091 24441578 24792422 26263559 26069731 27489936 22993047 23569609 20783387
6400 20783387 20016159 18719631 18179431 18504919 16737215 17293922 16882008 17731266 16812905
6391 16812905 18005660 19139871 19247513 17967451 17756214 17569296 16530579 17724339 17074441
6382 17074441 18962909 18345804 17543197 17536658 17132904 17562332 17509684 18390844 17482764 16204453
6372 16204453 15859697 15995166 16735440 15972714 15618783 15912679 15119189 15058633 13718640
6363 13718640 13430362 14652751 15306269 15574828 15331669 16670416 15926841 15240573 15947706
6354 15947706 14891411 17068054 16517386 16642527 16329342 17002735 15813852 16467100 17837036
6345 17837036 19502521 20169044 18051054 20639815 18472781 19073163 19373374 17410473 18776579
6336 18776579 17810870 19215813 17103509 18258291 16716990 16988420 17081063 17537035 18274993
6327 18274993 18373297 17812410 17284012 18972955 19525139 21378421 20825153 21255617 21680741
6318 21680741 22589696 25653583 26844726 33194262 34584981 39008227 40241972 40090363
6310 40090363 39432097 39165431 38225182 37633287 40145032 42389753 46682647 49204447 51829221
6301 51829221 47809028 45175536 41324466 39822908 35851105 34229499 33481124 31105842
6293 31105842 31561543 29677998 29603656 30069772 30870315 32922425 35489571 40181746 41256485
6284 41256485 44275354 44052507 45625271 45881319 45446638 45920911 44706935 48379115 49989509
6275 49989509 57983126 67536919 77268810 84797619 88713178 90698615 86387128 80908053
6267 80908053 69195860 62157542 54104786 47678875 42097548 38439961 34991667 29457078
6259 29457078 29233852 27397832 27504284 26080290 26599491 26721758 25952227 26708468 27204268
6250 27204268 26876291 27890603 29809955 30254916 34097405 36633663 41257025 48303122
6242 48303122 54398584 58657780 61532254 62110398 58498998 53198624 49099521 42520329
6234 42520329 38984092 35481012 32006065 31141816 28333271 26739479 26435868 26179670 26335792
6225 26335792 25237654 25146202 23284131 23845045 24035688 24115820 24493551 24853706 26030648
6216 26030648 24592565 24716898 24455617 24044003 22450782 22065659 22020440 21763196 21206780
6207 21206780 20341917 20340346 18381759 19140744 19536396 21400505 20327188 19785054 19826327
6198 19826327 19367579 18039031 19579587 18075646 18433262 18453584 18231012 17690768 17089096
6189 17089096 16623816 15930196 18716507 19216702 19357857 18972128 20206378 23518802 23823586
6180 23823586 24524779 24476720 24562290 22355091 22512468 19415868 18594263 17411192 16975324
6171 16975324 16914974 16575201 16681011 16848513 18132971 17003737 15389152 15102095 14271675
6162 14271675 16868109 17300276 17391028 17915561 17749240 19228083 21133196 23604228 23287301
6153 23287301 23142700 22386825 21765338 19717890 19940413 17821771 19068179 18999880 16244451
6144 16244451 17325229 16690902 15815665 14483305 16217563 15387872 16130105 15665402 16162994
6135 16162994 17406692 16654811 18398361 19792505 21598240 22089391 21239609 19488188 19453552
6126 19453552 18278077 16477640 17477307 16724139 16724814 16340630 17131971 16990055 15781653
6117 15781653 16184538 15115851 14867895 16617832 16774140 15071432 17155059 17003686 16410038
6108 16410038 18596537 19238860 21118951 21720028 22451871 20535570 22422566 18796082 19156769
6099 19156769 19661058 17936025 18222032 16140487 16522493 15646919 14873392 14627737 14822241
6090 14822241 14785378 14714156 15220283 14294491 13716623 15067665 14154399 15122012 14751835 14819441
6080 14819441 15503830 14938911 15660204 14854474 13449238 13713004 14759232 14829038 14706027
6071 14706027 13671141 12745146 13965089 13941572 14019435 14176384 12859541 14277497 14716064
6062 14716064 13527718 14167074 14628612 15160908 15720554 15898667 14789657 15878215 15183149
6053 15183149 13800967 15047875 14440742 14256383 15927089 15166135 15113002 14246762 15166278
6044 15166278 14507404 15464901 15034353 13087821 13358496 13737623 14618862 13559021 13316601
6035 13316601 13311796 14752782 14073473 14747038 14197483 14836706 14578498 14504912 16392808 15502179
6025 15502179 15560551 14055334 15869464 15524238 14882416 15985610 14366995 13817709 12521329
6016 12521329 12649339 12064672 14193035 14966945 15071403 13940446 12918823 12416517 14484910
6007 14484910 13603822 13075640 13783636 13080915 13978672 13963512 13243531 14407996 13414556
5998 13414556 14373273 13972194 13482210 13523855 13780184 13641834 13223359 13364295 12539654 13490901
5988 13490901 11647349 13343643 12898153 12345322 13494367 14692813 14405063 14240902 14115590
5979 14115590 13249492 13400787 14256296 14517729 13564085 12182505 12782557 14688391 12736762
5970 12736762 13083504 14575970 11740923 13282568 13396107 13098284 13542633 12199614 13102098
5961 13102098 11939190 13418075 12783959 14225764 13248256 13024541 13513577 11379037 13104920
5952 13104920 12811311 15171826 13385150 14267307 13938226 14635578 14845920 13426174 13519238
5943 13519238 12931683 14618565 14418429 16214679 13681347 13141892 14451780 14155914 14850464
5934 14850464 15505007 14753520 14487173 14594353 13311158 14245587 13154563 16871069 17233628
5925 17233628 18061924 17512451 17420399 17463641 17728169 18484834 20439713 20778270 24071593
5916 24071593 27752690 30562171 35696891 41197151 47056546 47249508 46758813 43582482
5908 43582482 38400866 36334445 32805100 29165247 28063477 24975132 23566585 22170340
5900 22170340 21397572 22102587 22415410 22191224 22568593 24529230 23039563 24677380 25145860
5891 25145860 25546220 26032589 27069770 28930689 33310300 39284508 44586129 51605810
5883 51605810 56747741 60064345 62194116 64219488 64934534 63275924 60123738 55585509
5875 55585509 49380629 42212855 39298744 35210805 31580722 30517433 27085999 26145666
5867 26145666 24733181 23400528 24065610 23874368 23473301 23324426 22616805 21775969 22994075
5858 22994075 23431951 24338277 25284772 26388520 27639184 31302501 35432602 39409855 43232687
5849 43232687 44954142 43943496 42913431 38876062 35943542 31525108 29261672 27151258
5841 27151258 23693841 23405170 23650732 22878923 21472998 21279181 20314843 19759792 20215400
5832 20215400 20416361 19367091 19429197 19884034 19913308 20447776 20367476 20050852 19514426 20333732
5822 20333732 21762578 21850631 21310893 21449010 22103770 22719541 25361580 25396381 28043380
5813 28043380 29971874 32106444 32971912 32707412 30708758 29427447 28082903 26337469
5805 26337469 26056359 25358723 22697520 24256360 22307900 22410826 22454556 22682489 23463166
5796 23463166 24883016 23530880 23310275 23982412 24029132 25240913 25249440 24820689 25253267
5787 25253267 25200240 25128257 26291667 27501054 27884077 30081761 29589730 28946703 30850390
5778 30850390 30920951 31197927 32390752 32666272 33651989 34341910 32721105 33545846 34102241
5769 34102241 34349107 36041354 38155882 37301628 36017900 37547142 38002053 37983756 39649253
5760 39649253 38793880 40394143 40651666 41716011 43812165 43392782 44946019 45376585 47395082
5751 47395082 49055780 50344045 52994148 53760427 56450156 57767116 58466532 60891547
5743 60891547 62291485 63696900 64639003 66828498 68977819 71036904 73002904 74080935
5735 74080935 74816083 77756117 78118300 81365592 84100723 87752185 90742747 96308160
5727 96308160 103394360 109181710 115478569 120584516 127480622 131981353 136450213 139101621
5719 139101621 140956161 140626667 140247694 139185428 136723766 139116861 136647975 137315506
5711 137315506 136999118 137278077 137416159 137398881 138900213 139588368 142098274 143726736 149689562
5702 149689562 153699517 158784265 167361706 176259212 188874686 203256336 219324712 232966072
5694 232966072 247890820 261071205 271575175 279930935 283242697 283389179 278127311 272408308
5686 272408308 261386624 253044383 241255193 230192737 221023484 212377578 207500213 202535231
5678 202535231 199942464 197633152 196794397 196433960 198337605 200638944 205013576 211860909
5670 211860909 218003651 226865037 236322175 248659818 260748969 274552321 287678408
5663 287678408 302068023 312406127 319776401 325527924 324671733 320671702 312565308 304907928
5655 304907928 295308643 285356719 274470468 263755460 253906232 247150801 242649701 237717998
5647 237717998 237728439 235899796 237011858 238702525 242136488 246478611 251067062 257878524
5639 257878524 263653496 270346550 278037766 283778684 289043868 294438150 299593322 304335621
5631 304335621 310758536 314671720 318186810 320191884 321905272 322043176 323196069 322204883
5623 322204883 321717742 321497754 320826873 321887889 320092572 320599908 317480278 316996724 315153823
5614 315153823 313196145 312066776 309759256 306804743 301888555 298824075 294937610 291685093
5606 291685093 289224157 283966473 282316824 280713666 280774934 281306689 281692513 282959007 285489485
5597 285489485 285587204 288182267 287181156 286600152 284170354 280411048 276754931 268549277
5589 268549277 262348924 254394246 245362243 236978488 227969255 221361256 213520138 205418506
5581 205418506 200005057 193370237 187874173 183541734 181405156 176744622 174042518 171582895
5573 171582895 168811301 169429973 167036443 163716941 161458694 160191331 158536015 156333069
5565 156333069 152381272 149677414 145967780 142493600 141224355 137701153 135848984 133437735
5557 133437735 131048898 128192533 124755692 122866946 119782181 119039961 116551717 114127641
5549 114127641 111134968 109076507 106252990 104367652 102536563 100815287 100977755 99937924
5541 99937924 102810132 101384060 103222998 103271861 106227714 107526619 108315763 112000223 112375127
5532 112375127 116980662 118654441 121739527 124972813 127588578 131545768 132641272 137607928
5524 137607928 141433988 143490758 145902458 146818815 146662060 145893141 143816422 141564518
5516 141564518 139607870 136714680 135008090 134219967 135129181 135370770 134969231 136327046 136222290
5507 136222290 136554405 137360834 136510766 138332193 141049538 143925141 149013221 152727206
5499 152727206 160066661 168511410 175004168 185238297 191764114 200429519 203506588 207445746
5491 207445746 207064926 204364341 202429636 195652047 190350791 181143281 174007995 165847459
5483 165847459 158591785 152376948 147846659 142403607 137677782 134564478 131736507 128504816
5475 128504816 126367875 125598329 124838512 125379871 124174923 124335074 128339653 129489729 134550851
5466 134550851 138771619 143634475 148560295 150120154 150373961 148963801 147531621 144193892
5458 144193892 138215739 131941173 127492194 120626468 115577367 112438842 110829965 108231919
5450 108231919 104685777 102445965 101105665 100150460 97791794 96227648 97079439 97459077
5442 97459077 97277276 97234533 96050308 94922344 94503123 94761036 95894074 95382883 97901828
5433 97901828 96823689 98042182 98572725 99387487 100798503 102205856 104071543 105305806
5425 105305806 107312802 108313073 110869212 114888446 116121164 118332853 119918172 121332392
5417 121332392 122991091 122700036 122791021 121852168 123345097 123498886 122627924 121592017 119514993
5408 119514993 119290177 119596143 118008482 119125780 120323626 120034872 119881022 120252626 121079709
5399 121079709 120850037 119483393 117648374 116283757 115222572 112818760 114050430 115204314
5391 115204314 114354110 113241354 112239506 112232747 111917067 113103806 113136465 115663651 115528017
5382 115528017 117319297 118304538 118179789 122370340 124545506 127227499 128297112 131214935
5374 131214935 132109522 133104447 134440451 135073041 135452739 135148024 134914169 132290034 131467081
5365 131467081 128579856 128135168 127393280 128084778 127012916 127718994 128502622 130561940 134598378
5356 134598378 139265976 142431514 147150266 153716563 159223954 164862543 168659928 172552270
5348 172552270 175544142 175254345 177205566 173722814 170695782 168591344 161913832 157900303
5340 157900303 152185336 147969054 144328385 139024419 136932639 133939444 131639594 130182894
5332 130182894 130587574 130755364 129860087 129140332 131328990 129397641 129953312 127983923 127950645
5323 127950645 125191070 122038806 119664875 113873987 111577633 106220217 103747983 100145100
5315 100145100 96381580 94025234 91572754 88628018 85788905 85270719 83223523 81312923
5307 81312923 79523900 78779754 76313255 75856074 73951677 72717014 70697033 68094946
5299 68094946 67769954 64675092 64169136 63005908 61196623 61496995 59857655 60864654 58419306
5290 58419306 57125037 56456868 55378863 53410325 53027153 51715772 51645062 51050441 49464685
5281 49464685 49115093 45247781 44065108 42214397 43213402 42039088 40449670 40902053 38188281
5272 38188281 39773158 38238667 38401696 38294380 36200376 37268097 36775613 35888246 34910214
5263 34910214 34577464 33337298 33856673 32427232 32359778 31512395 31244793 31785127 30502262
5254 30502262 30051105 29928092 30898639 30579763 30862811 30685237 29865056 29233805 28949186
5245 28949186 29826423 27885537 28342085 27964004 28302652 27371199 26018150 26217006 24867925
5236 24867925 25673123 24133996 25682487 24984434 23167285 22860586 22416837 21912077 22284695
5227 22284695 22255225 22591245 22600305 21537661 21558861 20659736 21003860 21163756 20938469 19474838
5217 19474838 19676955 19732566 18393347 18429655 18419888 18246805 16723853 15599481 16919375
5208 16919375 17850434 17014305 17892573 17138697 16709083 15960979 16168849 17318519 17516248
5199 17516248 15147836 15594904 15458017 15506039 16116471 15972900 15714807 15322684 14949002
5190 14949002 15118080 14724308 15043100 14615906 15370063 15206012 14363028 15043463 14244561
5181 14244561 15165632 15083428 14664929 14202293 13812356 15230181 13828714 14284005 14997946
5172 14997946 14614853 15636023 15022378 15497021 16849564 16815958 17119672 17150427 17387444
5163 17387444 16421421 15736627 15882847 15632301 15438225 15035867 16040544 15039239 16016918
5154 16016918 16804661 17230685 17377502 16580516 16632324 17566185 17092642 17455713 16614750 17053910
5144 17053910 17016381 17875794 18795074 18864205 20677521 20354287 20642423 21987215 23589891
5135 23589891 24717886 28244118 31103419 34866439 34382558 37502497 37662286 36052517
5127 36052517 33134835 30679641 27738756 25047406 24963486 22252823 23332824 21584863
5119 21584863 22341917 22691575 23952791 22786076 23107735 24046404 22746893 22916270 21845741
5110 21845741 21315880 20161239 20475812 19148322 20552443 20533934 20628237 19938696 20917001
5101 20917001 21307395 19627068 21495312 21049275 21902970 21532232 21364748 22886220 22066003
5092 22066003 24257210 23347305 23802974 24524203 24675044 24832381 26046723 26139233 25043532
5083 25043532 25966890 25967753 27324919 27008075 28044339 29737490 29471134 32042503 31577197
5074 31577197 32462037 32721012 32383542 32333050 33897356 33883049 34613798 35372185 34576193 35704710
5064 35704710 35499590 36596268 36395897 37623726 38471567 39553868 39919402 38023063 39722457
5055 39722457 40581173 43302808 45639744 48500633 50786822 52874123 53593486 57408141
5047 57408141 60894930 63419914 67446090 68800584 72024809 72977563 73135603 73867192 72979159
5038 72979159 71502927 70317938 69301030 70028774 71207043 72217632 73848210 72227599
5030 72227599 73314440 73942165 73768826 75544820 75841899 79076123 79431238 81976342 84289904
5021 84289904 88178202 92726084 97379364 105497045 111899588 120858773 128747477 136275836
5013 136275836 143239364 148009507 153617546 152924160 151202663 145905561 142204195 137951306
5005 137951306 135888760 134133699 131662188 131016456 128030307 127296565 126224051 124722002
4997 124722002 124128026 122602694 121953516 122921542 124437808 126371480 130053022 136114484
4989 136114484 143292967 151167372 161410444 171389078 183576486 192105402 201613253 208493909
4981 208493909 212703962 213547943 212233252 208872189 201191517 193503832 185151182 177582648
4973 177582648 171806724 167048656 163559755 159569002 157803908 155010747 153982435 148995765
4965 148995765 145978469 143088057 139818565 138971205 138248696 139694022 141179118 147416061
4957 147416061 153555263 161835675 170211379 178160971 185641998 190389160 194770809 195757683
4949 195757683 195109831 190355579 184895097 176765529 168992168 161700002 155193530 151385933
4941 151385933 144090206 140047258 134825880 129368132 125991532 120298274 116687311 112373002
4933 112373002 108575709 106078052 104930381 103433402 101241800 101611713 101695937 105498052
4925 105498052 108291080 113326048 117137784 119569640 122356024 121565940 120502394 116376157
4917 116376157 113397657 107107773 101198682 93724505 90052612 85291786 82608357 81795365
4909 81795365 79051828 77117682 72803657 70360419 68133556 65491547 63770589 63440398
4901 63440398 61039559 61666249 60224848 58635336 59271269 59553897 60882269 61504328 60909215
4892 60909215 60539474 62138148 59253344 57740866 56381915 55042519 53293709 51087323
4884 51087323 49725103 48145019 46655142 45452233 45604094 44486908 44418228 43837787 42350994
4875 42350994 42017027 41792655 40760996 40124721 41233137 40779756 41458765 40785192 39685506
4866 39685506 40371334 41243973 41572553 42562251 42281464 41866719 40770373 41978765 41063102
4857 41063102 41197797 42905163 43575409 45207930 44941745 46287447 46784964 48002904 48964778
4848 48964778 50603648 51638400 52092524 52765838 53941639 55850264 55249775 56327867 56123941
4839 56123941 58484025 59514229 60503248 63347233 64503787 66653240 67421564 69116891
4831 69116891 71349442 73947367 75435330 76580289 78953606 81534429 82249031 84373125
4823 84373125 86752520 88785980 91714742 93894855 96652477 97093259 98169760 100751326
4815 100751326 107431301 108060224 113020945 116515914 120190769 123497018 126545965 130709092
4807 130709092 133421476 138036169 140498104 143612399 147230792 149162832 151671913 156287911
4799 156287911 159543215 161479515 165283870 168184402 172006464 174880167 177921463 183712548
4791 183712548 190254146 196395285 203047954 209213689 213011033 218313991 223511098 229887771
4783 229887771 237189775 241725047 248230481 255423597 262876361 269886604 276737005 280796041
4775 280796041 283450874 286788110 287440556 288412040 289000034 291016526 290668766 292781705 296349117
4766 296349117 300718737 304947416 309355957 312044505 315387852 316998132 317139596 319098537
4758 319098537 319738015 322803707 326140419 330041823 332513490 337420211 339615531 342212463
4750 342212463 346117678 345696319 347750745 345837621 343705057 338155228 334253671 328690795
4742 328690795 323566589 319316441 311959195 310234505 306013435 303483843 300187015 295817853
4734 295817853 292231922 288482126 285690432 281774569 279633189 278042984 275854373 276699975
4726 276699975 275699324 275099496 275367422 275775633 272727198 270619056 266319584 260795007
4718 260795007 256695198 249907772 243442337 237345877 230611017 223578250 220631003 215427779
4710 215427779 211548528 207519119 204449325 202649778 199808174 196971352 194762018 193892819
4702 193892819 191938300 189288142 187628028 185596628 183625214 181848507 178278521 176729826
4694 176729826 170990345 166992538 163665905 158981794 155142223 149304360 146674198 141566008
4686 141566008 137427117 133045494 128279090 124387150 120321861 116392658 112022111 109936923
4678 109936923 105332697 102089864 99378233 95816434 93384157 91161273 88045755 84719578
4670 84719578 84200746 80391545 78227687 76048324 73671610 71329621 68195734 66208443
4662 66208443 64097563 62513962 61247692 59219776 57697666 57722176 54200453 53429704 50817775
4653 50817775 51193109 49250152 47309651 46795033 46553307 45558891 42180623 42467833 42390920
4644 42390920 40796593 40122325 38817162 37115272 37494205 36158621 36045305 34609815 35640576
4635 35640576 34546879 33082249 32031766 31530266 31299833 31193417 31028117 29407965 28841133
4626 28841133 28631275 27393119 27974901 28905348 27902710 27188856 27146348 27609499 27068614
4617 27068614 26038015 25990743 26585904 26582911 26630553 25215055 25359401 27035487 26588867 27079075
4607 27079075 26437883 25811058 27144842 27387263 27551871 28570469 28798954 27937349 29145105
4598 29145105 28140821 27797984 28158867 29151882 30157607 30556325 30358864 29731267 31163199
4589 31163199 29939091 32405443 30337011 29748390 30281462 30210223 32619451 32646973 35991070
4580 35991070 38944723 44133012 47984580 49069738 48544557 44914607 42248973 41624521
4572 41624521 38019482 39497813 38341210 38513916 37147390 35402228 34065810 34528315
4564 34528315 35375090 35106856 37873584 38437532 41846406 45874452 51341059 55680286 56468743
4555 56468743 55848229 52245011 51458631 50021334 49027196 48132537 47887382 47686937 47109927
4546 47109927 47843476 48492452 51279272 49751590 51325495 53129651 54399001 56411142
4538 56411142 58432243 60572361 67492750 72236530 81538545 93920407 111600866 135151334
4530 135151334 158482371 176805327 183800276 178670746 165346661 146970373 129825720
4523 129825720 115623679 102277991 93776747 88001521 81735409 78944231 78780776 78577618
4515 78577618 79970375 81524754 81659679 85057435 91821795 98577470 110091071 125046709
4507 125046709 144258179 170488727 193207456 210718041 216367569 212730937 201942633
4500 201942633 194227597 191398552 198720922 221013268 243122917 263507937 272369806 263812498
4492 263812498 242039861 214057893 187819219 162594940 142523001 125886184 113400739
4485 113400739 105139353 98607370 94109359 90389736 89510513 91124851 92771103 94728547
4477 94728547 98920562 104102328 113457663 131405516 155135227 188308766 219932245 245426321
4469 245426321 256840690 251477794 233761480 207264468 182474880 158851365 137407886
4462 137407886 119777869 103943791 92906451 82938251 76086048 68353947 65110893 61945228
4454 61945228 59313021 59228211 56013618 56238685 55563760 56579768 56751438 55516483 56132099
4445 56132099 55841995 57899444 59572013 62742314 63040935 63683424 64690543 63028544 62605046
4436 62605046 58464803 58447588 54994810 54074765 52938416 50161176 50380580 49691518 51361442
4427 51361442 52290520 56066236 59993047 65827822 73872117 80297586 86170354 86250141 82327833
4418 82327833 76253121 68376417 61386004 57176916 52914971 51576516 49203246 49939735
4410 49939735 48632498 49010911 50415006 51482305 53672679 54315225 55863421 55389906 56939732
4401 56939732 58298140 61079403 64852495 70735685 78092803 86139081 94305958 97047519
4393 97047519 98682198 94446769 88891936 82169479 75078512 71239459 65832979 63268840
4385 63268840 59695422 59191785 58738405 59349504 60303658 59633113 59475718 57972660 56221287
4376 56221287 55082290 54701907 54135571 53912211 54987514 53276753 55345235 55885178 61367544
4367 61367544 69551690 79801847 90736618 94596191 96935793 92464559 87290834 82886808
4359 82886808 81215504 80630725 80218332 81316330 82602069 80844145 81956351 86318921
4351 86318921 91760574 97765647 100443745 100043368 96232050 91298197 87320652 84364600
4343 84364600 81768089 80133633 80186559 80920475 83607778 87590883 90911925 94178125 97828312
4334 97828312 98146565 101219082 104141225 109167248 112715966 115229927 119592232 126806887
4326 126806887 140489074 154312980 169052866 183426224 196018549 210633192 228352119
4319 228352119 250514846 269471511 281009110 280917317 270530370 249823097 224561273
4312 224561273 197945283 173779728 155107263 136818242 124128947 111678682 103758585
4305 103758585 96368285 90541574 85956322 81959991 80827102 79652146 78178310 77009348
4297 77009348 78743148 81603691 86544991 91469932 95485711 95931036 95993210 90417223 86217728
4288 86217728 81209616 76466444 72583129 68235975 64048835 61159140 58525557 55814472
4280 55814472 54850432 53431056 51467082 47996962 47992264 46890624 46239670 44848101 44603755
4271 44603755 45185433 44997510 45787993 45814869 45974878 45320758 43373020 42180038 39203266
4262 39203266 35617012 34473003 31290733 31818952 31442501 30150585 28982332 28557850 27175378
4253 27175378 27189765 26397502 25518083 24409377 24575282 24902043 23627762 22740991 21332616
4244 21332616 22258623 21369869 21582810 19980143 19705803 19672237 17995209 18861931 19376557
4235 19376557 19550594 19857108 19251142 19213576 18858479 18112781 18329280 18342781 18201986 16274641
4225 16274641 16212020 15995458 16343821 15579825 15337356 15006925 14686853 14274080 13642123 14766769
4215 14766769 13650201 15491958 13880926 15208376 13721291 13210438 12637299 13028952 13168561
4206 13168561 12527904 13233602 11468637 12558097 11391554 12012078 11411667 12909740 10863416
4197 10863416 11446771 11616185 9364247 11797340 10842523 11507596 10980283 10751906 9971133
4188 9971133 9169384 9416535 8033406 8517592 9247968 8901375 7440680 8719042 7913590
4179 7913590 8252795 7497792 7819669 7676804 7447047 7248735 8143797 8141993 7589368 7303977
4169 7303977 6650371 6500247 5370555 5945425 6223675 7346558 7949299 6284807 5646142
4160 5646142 4900724 5092079 6073837 6658786 6805482 6839008 5666782 5980029 4967682
4151 4967682 5552274 5046001 4399155 5753539 5276477 5478742 5202485 5516811 5173318
4142 5173318 4731987 5018873 4217365 5003101 4925835 4606356 5313729 5864393 5214014 4911323
4132 4911323 5421330 4332592 4325053 5408981 5103287 5307118 5437727 4854379 3696478
4123 3696478 3858651 3909770 3764751 5543131 4448754 4617078 4159100 4324464 4112736
4114 4112736 4759274 5082945 4918842 3553117 4478880 4668710 4469659 4324096 2742635
4105 2742635 4811669 5623259 5491293 3830146 5286362 3999060 4030968 4145163 4347087
4096 4347087 6058190 5218343 6017002 4072897 3976440 5201978 4631133 5105461 4759350
4087 4759350 4887993 5723335 5615070 6554230 5368254 5620860 4460961 4460372 5508670 4386033
4077 4386033 5074500 5167405 4348837 3991522 4973381 5988402 5919642 5854500 5739154 5704594
4067 5704594 5484512 5140884 6071476 6319547 6496251 6613538 7664050 8018127 7535598
4058 7535598 8076688 7174153 8926843 8086739 9221725 10145762 10132271 9185488 10266185
4049 10266185 11368670 11432053 11862123 12752705 13153005 12248754 13148650 12286019 12160133
4040 12160133 12752467 12909107 14116919 13343773 13425805 12131187 14594518 13808607 14309683
4031 14309683 15593832 15190740 18328100 16647386 17521738 18379611 19256709 21324118 21209445
4022 21209445 22777173 22403343 22486665 22204371 22187722 20729128 18606612 17816947 15245298
4013 15245298 14724301 13215149 13846333 14414839 15350863 16170207 14826373 13711248 14575946
4004 14575946 16313875 15765000 17122514 16795658 17603999 17686838 18433298 17968325 18312118
3995 18312118 18318686 17352099 18394715 16017689 15329143 14490619 14953178 13203601 11871113
3986 11871113 11091605 11298525 11552244 11709933 11808225 10228257 10829569 10177690 12192885
3977 12192885 11376931 10802250 10786168 10938384 10507489 9638839 8405359 7398666 8405966
3968 8405966 6133361 7707786 5905653 6383804 6400372 6158796 5220173 4618301 5475152
3959 5475152 4904217 6167123 4607409 4950893 5485695 4188478 4788642 3874416 3326914
3950 3326914 3468240 3861239 5662462 4047579 2581502 2648853 2861227 4721701 3169932
3941 3169932 4078558 2826894 3083160 2382592 3973074 3770044 4110769 3291557 3210918
3932 3210918 1616243 1810404 3155358 3520552 4053852 2792139 1697288 907916 543969
3923 543969 1608717 2963735 4732039 3188795 3724279 3488854 2488086 2684183 2264298
3914 2264298 2576151 3472823 3148420 1455754 2029940 1399298 678295 2205614 2152201
3905 2152201 1882580 1338297 2102839 1498083 1157159 1630280 36452 2559063 405781
3896 405781 2091674 2159197 1932033 2651918 1926766 2321308 1403056 2059044 2789906 4106213
3886 4106213 2783360 2017035 1807730 1887833 2088844 1518274 1956890 -365699 553440
3877 553440 955389 1842691 1426712 1993862 1100881 516308 851044 -464526 458412 -285714
3867 -285714 872170 273926 1295858 136084 642929 907609 207015 131322 50835 1282595
3857 1282595 1596198 1408419 1682095 1253491 49150 -7697 -617965 968137 -255110
3848 -255110 160714 886136 690797 -993304 -90112 -451429 -462276 814453 -292623
3839 -292623 256444 -1005211 -1083177 -1090523 -231020 -281541 333555 -506295 -751406 355573
3829 355573 -70765 519557 -301598 -636276 -434471 126089 -1434428 -93626 -27128 -26719
3819 -26719 -223292 557841 109064 -598736 -1515355 -2414942 -65856 -337186 717487 1331865
3809 1331865 -643481 -705265 -1935115 -1038410 470538 -374084 -103883 352200 1114642
3800 1114642 -417711 -242954 -1480455 -1622542 -879770 -1321362 -250296 80647 41438
3791 41438 -480938 -105862 -986996 -670035 67729 399759 -571297 -975976 -1298877 -816779
3781 -816779 41548 -1633004 -695595 -1693265 582150 -1313660 423399 517559 -1158626
3772 -1158626 -580175 -1342588 8844 -308797 536811 532046 133237 -524320 -1252090 -225565
3762 -225565 -2077736 -1109916 -1376826 -275853 -1187567 131579 -1298125 -874539 -960361
3753 -960361 -1459194 77708 -981818 -387236 -806841 -920508 -973154 540043 -335898
3744 -335898 -952923 -1168234 -18544 -687137 -285171 -15714 -2030698 -889376 -1225984
3735 -1225984 -1094411 -153299 -311469 -455598 -1077434 -102095 152190 -1810475 330105
3726 330105 -1165669 -260927 -417220 -400476 -893958 -1001594 -8187 -1221319 -700378 -453228
3716 -453228 -925182 -915993 -1035134 -975320 199922 -1136882 -187538 437815 -132261 -1623349
3706 -1623349 -1869967 -249548 -376530 164786 108305 -899541 83315 -2318527 -1915226
3697 -1915226 -1853251 -1922063 -857145 204711 -207173 35603 -1446276 -889443 -389378
3688 -389378 -854288 -546189 -1026487 -966494 -490455 -394912 52604 -809150 -1240395 -1608837
3678 -1608837 -763274 -487685 -1642711 -216811 80550 -1241610 -808601 -805756 282958
3669 282958 -246759 -60818 3599 -948130 -1357822 -1898435 -1906431 711437 -727389 -204490
3659 -204490 -897538 852120 -874474 -1833504 -847527 -2198438 92599 -1106609 11389
3650 11389 -379173 -752993 -1196658 -1360494 -483532 -1020101 -1041352 -1250162 -689253 -1712313
3640 -1712313 136677 -1366235 -1225643 -506489 -1155814 -490259 -985335 -750320 -997315
3631 -997315 -307221 -498384 -1357783 614846 -1266638 -1136792 -364076 -1001178 -991361 434536
3621 434536 356448 292730 -382320 -1433848 -1769260 -1630532 437871 -456391 -1320520 -427917
3611 -427917 -498385 -1243821 -503001 -1149313 -362342 -460745 -610799 -918408 -554517 -1522330
3601 -1522330 -1233204 -1057529 -179348 57256 -2345991 -1088839 -581532 -779284 -45403
3592 -45403 -353648 -579201 -468873 -534108 -1317212 47030 -1139649 49196 -579079 362004
3582 362004 -101023 -1663208 -455270 -1743356 899414 -2414484 -1282892 -103218 -454930
3573 -454930 -133123 -1246998 -191164 -1365384 -943113 -558965 -1071422 -917518 -458691
3564 -458691 -817337 -1318757 -194391 -235601 -316047 506148 119398 -1081702 -1221340 -185041
3554 -185041 532288 1269895 -1442547 -112078 -303433 -143014 -792904 -1816867 454936
3545 454936 -478580 980278 288494 -135357 -237173 -1267565 610697 -210010 -1028141
3536 -1028141 -1489503 -591513 121885 943508 399579 -11265 -518934 -2408018 -1052411
3527 -1052411 -667751 51608 -714851 335518 -378830 -1439283 -1792446 -1116066 773046
3518 773046 2327800 -159603 -776273 -1577131 -1254270 -681205 292104 1279557 -1606842
3509 -1606842 -1752720 -1740615 -102869 -594196 -1491121 217602 -280299 110995 338657
3500 338657 -386466 -928907 -933353 -1074079 103374 -721158 -1341267 -1795562 -716623 -1268033
3490 -1268033 -1471962 -652371 -1620453 454455 -574614 -499816 272066 -1120390 1413242
3481 1413242 -847797 -95682 -1535170 -2009061 -536583 -415102 81163 -1433731 -400791
3472 -400791 -379301 -452216 -927878 -1557748 -1892356 -877900 -757212 745539 213513 -618469
3462 -618469 119242 -468455 -1121461 -588636 -799952 520424 -6873 -115516 -886096 -485098
3452 -485098 424312 15579 -304877 -1228846 -1107841 -409751 786511 193096 -111640 -935949
3442 -935949 181649 -406456 604434 474958 -430424 207393 -644425 -1211523 -907662
3433 -907662 -3238 1266551 1236870 198009 -649293 -1012678 1089632 151416 667718
3424 667718 327941 -13910 55049 -163509 1011872 -449314 688012 312360 525570
3415 525570 652300 -1375293 562310 243255 1848915 1336124 830212 2034472 -666133
3406 -666133 809603 -474344 1668925 2253962 1750430 2406400 11595 2469504 2336796
3397 2336796 2651048 3220816 3022968 3237146 2774097 3642158 3494932 4134506 3867053 4334157
3387 4334157 4875363 5921634 7453459 9981374 15063709 17249348 19699684 21348709
3379 21348709 20098952 17009485 12837937 10565854 7378214 6216351 4898614 3631572
3371 3631572 2970931 1938136 3659762 2865815 1983041 2340510 2769230 1143821 3038374
3362 3038374 2395117 1858195 2072365 1760850 2454266 1269624 1937220 337636 2289597
3353 2289597 3301406 2618721 3295250 1581110 3676150 2933189 1861112 2125543 1574853
3344 1574853 4630974 5126980 4583379 3465667 3881223 5252711 6893511 7529449 8785933
3335 8785933 8979703 10063801 9825622 10263329 11989861 13431686 18523401 22634298 36963833
3326 36963833 58286752 81699965 95179628 98942495 89221670 70109186 54873098
3319 54873098 41476106 33116356 23555310 17627450 13364405 11897666 9747776 9781538
3311 9781538 8075707 7008987 6174156 5360836 5320337 3746017 4494708 4272592 3968006
3302 3968006 3435239 2308949 2271408 2010066 1498704 1615436 981002 1364363 2259999 2778769
3292 2778769 2079301 2246186 -259518 1015559 1350992 2622458 2367097 844306 1216020
3283 1216020 453159 1544020 -60921 1248994 209208 1048241 1385618 -137607 1411995
3274 1411995 -265341 -227232 -173737 530408 389091 1540608 1568426 813972 -482697 -606096
3264 -606096 258994 522806 636400 225113 454118 192170 721167 56287 261507 206048
3254 206048 -1490885 711905 337608 864635 915841 263253 737357 -55629 -849499 -1088794
3244 -1088794 -639849 566667 655802 843925 552241 397043 -181912 -1288431 -1970455
3235 -1970455 -82569 -287965 -82329 1718098 -626353 -717119 -368044 -225381 -712373
3226 -712373 -67076 -294796 -1488230 -380108 -176024 731040 -904708 -853142 -814632 -1563796
3216 -1563796 -722972 -1104260 1347301 171826 -155015 24581 -24182 -963427 -1071996
3207 -1071996 -680048 -1108244 78293 -594200 191851 -893714 -1733052 -1720792 -495662
3198 -495662 745733 99796 407170 -511995 -1368040 -1340357 -1070564 -279897 -1099441 -253241
3188 -253241 -1111964 -1390674 -1517544 -819356 -1661793 -995837 -1207053 -101246 -42351 78149
3178 78149 -44118 -1259291 -535790 -310781 -218830 -530878 -684665 -1343874 161690 -1752058
3168 -1752058 -1010474 -915870 -1161722 -382817 -267112 -423098 -1234843 -199743 -617152 140983
3158 140983 -76210 56611 -554583 -853283 -360243 -437181 -1258642 -2339336 -638765 -221742
3148 -221742 -90152 207054 -1438823 -1197793 -1553017 15675 -109712 -393669 14859
3139 14859 -1210418 -67193 -738354 -1112410 -238439 -383948 -288877 -1213798 -838930 -1080819
3129 -1080819 -1557221 -1126396 -719692 -1482651 -619338 141254 68102 -1398833 -181240
3120 -181240 -1489823 -1466585 92016 -229523 -1329172 -1184738 -266774 -667688 -182065
3111 -182065 -906288 -578914 -503947 -1047422 -1462961 -1306742 -220866 -1579275 -752129 -1178226
3101 -1178226 79806 -1204473 -190080 302383 -2145496 29122 -1802755 -649506
3093 -649506 -845812 -383085 -734245 -261989 -806663 -1029131 1991414 -389090 97918
3084 97918 -1295537 -397579 -1562186 -646784 -120520 -654251 -944254 -355997 205565 -524864
3074 -524864 -747531 -1947235 -941061 -1315808 -602423 -1431550 -506188 -65555 -1026316
3065 -1026316 -1108903 -446396 -497394 -1013501 -777643 -489778 -207002 -1017681 -1263205 -383482
3055 -383482 -708031 -903713 -905317 -8645 -1087841 -677850 -1881374 -189507 -913024 -509740
3045 -509740 -198245 -1766715 -1364475 217248 -1363959 -38008 -1519230 -209861 39787
3036 39787 582658 -350020 -860865 -1198412 -1093414 -107202 61655 -601417 -1584094 83918
3026 83918 8111 -878413 -1283233 -313244 -1415956 -1404419 -58580 -1330174 -344086 -900424
3016 -900424 -671871 -1384273 -2987108 -1610885 -2333127 -481053 -109041 -1543501 273029
3007 273029 -874916 -707302 -1471236 -2133403 -968289 -2083547 62888 -1802185 -897086
2998 -897086 -1414741 -1629736 -412348 -463849 -310719 -889272 -1502645 144213 -735946 -546598
2988 -546598 201491 -173852 -407795 -2637476 -2129732 -1964848 127003 -1068041 406914
2979 406914 389600 -920152 -1124628 -834943 -576120 -1137488 -98807 -709718 -64003 -965716
2969 -965716 -568314 -221256 -505543 819155 -1670200 -867884 -996079 -1485665 -653467
2960 -653467 786938 -177476 -1457646 -327157 -1871961 -505866 -1073441 -736944 -257038
2951 -257038 -400184 -1834586 -1540375 -718192 330572 -77071 -299691 -513248 -1190313
2942 -1190313 -783033 -1294938 -878219 -1147826 -720098 -1108448 -951269 -1975263 -971493
2933 -971493 -1781078 -576429 79274 -933829 -27028 -411693 -538859 -951764 -1136966
2924 -1136966 -907308 -1466253 -68831 -743688 -1097977 281397 -771384 -480042 -2210990
2915 -2210990 -727828 -700214 -3345 -436073 -1522620 876694 -1450946 -1145639 -1524988
2906 -1524988 431137 -1307293 -997545 468828 -566128 -494398 -1669344 270158 -1099771
2897 -1099771 -956173 -1847169 -595954 -377479 -112550 -411336 -1137931 -642704 -3021118
2888 -3021118 -452456 -529253 -1284062 -514811 -1085723 503324 -584270 -573589 886368
2879 886368 -1435686 -711263 -1194614 -1258989 -1345832 -1155153 -1294990 -438979 735236 -405498
2869 -405498 -21272 -274600 -118818 -1929901 -1051356 -1441180 -411666 525256 67955
2860 67955 -118833 -950982 -1608964 -1840695 -485680 -558674 -1693029 -444543 -982045 -430572
2850 -430572 212737 -983236 -1565808 -1292117 -2207189 -950081 -1677036 261142 -876196
2841 -876196 -919157 -130370 -407670 -882198 -1275686 -626424 -1136135 -1732286 -1841894 -1550283
2831 -1550283 -834181 -986062 -996749 -598698 -264409 -609944 -650429 -1415982 -1271855 -2755387
2821 -2755387 422641 68358 -199944 -667952 -1499979 -1445898 -1023937 -1296073 -1985677 -585109
2811 -585109 -1192327 -977307 -912957 -558381 -472813 -620941 -901025 -1432900 -627857 -782940
2801 -782940 -1076447 -985538 -621703 -2051687 -1035469 -763247 -784102 -199689 -537779 -574693
2791 -574693 -94797 -1569332 -1647118 -1656963 78268 -661733 -123324 -1059178 -289641 -1258900
2781 -1258900 -1510266 -571908 -969565 -1540825 -1325051 -499289 -983283 -796425 -221861 -1238030
2771 -1238030 149462 -546494 -1959892 48817 803359 -1066065 -215072 -375622 -1150942
2762 -1150942 -1618606 -510665 -1079058 -717893 -884642 -2420938 -559380 -299994 -237785
2753 -237785 -583500 137814 -9691 -401319 -1368441 -1377673 -578616 -1119285 11230 -659160
2743 -659160 -1237467 -1220547 423975 -823664 -262395 -144712 -1446472 -586895 -1044373
2734 -1044373 -86093 321058 -780697 -63616 -739429 -406416 -785998 -1155154 -2700180
2725 -2700180 -1716476 -1088528 -893187 -1060871 -676486 -709149 -1728113 -1933828 -1125680 179994
2715 179994 -260664 -1340328 -1188995 -1399393 93455 -1505678 -848526 139817 -1557915
2706 -1557915 -173588 -289403 -320928 -497411 -1716243 -1373768 -2326346 -426839 426607
2697 426607 -64131 -646601 -1748533 -704310 -1302359 -582299 -1342485 -816369 -1243855
2688 -1243855 -310183 -288333 -876670 -85604 -2096981 -1864868 -2115322 -429193 209543
2679 209543 -421806 268183 -1217241 -896645 -1824396 81309 -999710 -1003325 -1707007 -1196823
2669 -1196823 280535 138940 -530638 -1223110 -755931 -1104423 -415077 -1153286 68728
2660 68728 -1450272 -602678 -1063925 145287 -356701 373795 -868241 -1760886 -1696871 -421605
2650 -421605 -717763 -773010 -1137663 -1189934 -628577 366291 340491 -385777 -1685849 -1793244
2640 -1793244 -2048531 -761834 -142615 -309292 -400652 -609813 -351262 -1109076 -1306116 -2112698
2630 -2112698 -1675893 -799980 -652678 -1264723 -350560 308968 -1729649 -503163 -105436
2621 -105436 223449 -47563 -2151627 -1130271 -2200072 -1158639 -752062 49084 848218
2612 848218 -1716830 -1248625 -2386812 -849231 -721053 -273193 -335268 -820025 -323448
2603 -323448 -1011258 -956627 35237 -54794 -1458310 -1054237 -1780307 -327614 -493128 104966
2593 104966 -537077 363323 -250406 -505684 -1642790 -1068956 -1299108 -551164 418891 -407876
2583 -407876 -1129510 -982534 -842842 -2337974 -88083 660189 -643204 -796041 -2104166
2574 -2104166 -921314 -2072260 -1214368 167410 -15841 562341 -1184784 -1748930 -1422064
2565 -1422064 -1098403 -63455 -854394 -491719 -383440 -1865844 -1065951 -1220638 -712284
2556 -712284 -414021 -1729052 -299646 -1295626 -1140470 -438440 -1130967 1470513 340999
2547 340999 -1104066 -1312723 -1377383 -988565 -1026947 -164654 -545943 -821343 -389224 -1888735
2537 -1888735 -449931 -1754083 -890046 270695 -848634 -1014560 -1653609 -1459952 -1228826
2528 -1228826 -166546 -400468 15216 -1318577 -1641790 -1714150 -903528 -735157 -995464
2519 -995464 -128033 -707029 -940239 -1756472 -1272368 -778027 941731 341918 -884277
2510 -884277 -192533 -1624930 -715621 -1039149 -1128493 758730 -816492 -518241 -848742
2501 -848742 84001 -1563535 -143606 486005 299291 -322016 -719579 -1295540 -2119090
2492 -2119090 -1124841 -1236231 -698587 -1009284 -144021 394223 -1171412 -1286152 -1464087
2483 -1464087 -109460 -330082 -1175651 -1727559 -416797 -829308 -414627 -1422763 -49451
2474 -49451 -147809 -1085450 -1116731 -1420876 -977644 -774832 -1676339 -1325889 638317 -378457
2464 -378457 -1125166 -912830 382737 107347 -1084302 -1915188 -2242057 243613 -704308
2455 -704308 65058 -220335 -571566 -799609 -1516626 -509964 -1382251 -620470 -849772 -372277
2445 -372277 -31884 -975061 -1308371 -2023424 -272652 -522312 168423 -1457065 -632071
2436 -632071 -1056731 41775 -495628 -1701439 -498463 -1047098 -649068 -1116652 29266
2427 29266 -421908 -73527 813003 -393233 -587779 -625648 -2324696 -1761756 -631938 205307
2417 205307 -636177 -454708 -214408 -760821 -795163 -1967439 -883661 -852682 122248 -1162286
2407 -1162286 -1297275 -26789 -737765 -875318 -1899448 -736152 -551706 333674 149227
2398 149227 -1326553 -1108642 -1449891 -739973 -963804 -396035 -854606 -1295665 -1203164 -1160847
2388 -1160847 152036 -1236550 -819201 -1125410 -237910 -797311 -230386 -442698 -457326
2379 -457326 118139 -1906051 -809228 -1422664 631636 -1631591 -1112752 -1749242 -1394123
2370 -1394123 -286464 41976 -150200 -963918 110024 -1448020 -846062 108355 -98114
2361 -98114 -1407711 -2171751 -65407 -517031 -1162998 -1663615 -1201681 -2037977 -611489
2352 -611489 -297497 -1123488 -637129 -1585524 -1157975 142480 -97686 -602515 -526911 480824
2342 480824 -253723 -516289 -2027609 -1147708 97712 -151332 134346 -700121 -797458 -31309
2332 -31309 77284 -730764 -1666411 -1756821 625745 297024 641474 -1209592 -986577 196066
2322 196066 -1047114 -733601 -700322 -211303 -699693 -516397 -1308482 -1184526 -1804228 -1041108
2312 -1041108 -216683 206707 -944653 -736456 -375111 -1120669 -524458 -1092887 -1530360
2303 -1530360 -582029 -46501 -553470 -1575718 -1260932 -659879 -264528 -103812 -2348184
2294 -2348184 -1113260 -105767 62669 80224 -903869 -2129347 -1143112 -1293364 353351
2285 353351 -1155039 314697 -975430 114400 -710821 -971434 -711068 -944932 174032
2276 174032 593223 -1767634 -1535307 -450236 -449396 279480 -894719 -853075 -1024738 -881006
2266 -881006 -382829 -1963531 -148743 -1122622 -644268 -738541 -831305 -600746 -5592 -1165536
2256 -1165536 -759380 -639847 -1317806 -1876381 -1206504 352961 -562079 146472 -1275318
2247 -1275318 -1390918 -740403 -1439470 -759221 30484 942206 398065 -1014466 -1215448
2238 -1215448 -1004933 -1142208 242940 -161059 -309895 -89096 -1314338 -2024811 -810042
2229 -810042 -1795790 -1241210 -1459139 -446681 -937174 510388 -193137 -517790 -1420498
2220 -1420498 -799415 -583512 -1213784 -1263659 -985848 -621896 -475188 -259681 -129396 -500503
2210 -500503 -436600 -1528424 -703984 -349295 -92308 -430443 -123398 -66361 -1466607 -1153609
2200 -1153609 -1163356 -407138 -504944 -592632 188684 119455 -747946 -972393 -634139 -2106302
2190 -2106302 -792261 -607605 -1620769 -683582 -1154418 -1052933 -1136871 -1440867 222963
2181 222963 -63341 -240942 -1152639 113383 335933 -1473431 -1376293 -556431 -1265232 -1348203
2171 -1348203 124650 -904569 249565 -1053523 -2130450 -873752 -927691 -292669 12981
2162 12981 -941838 -1309907 -841945 87668 -2394676 -684003 201921 207598 382265 -781791
2152 -781791 -189523 -741525 -399951 -513377 -505522 -1126574 -1437605 -964477 -1859768 -138699
2142 -138699 -1042128 222169 -1668729 174722 -383690 -1619861 -459215 -977536 -669685
2133 -669685 -1212705 -1894324 -451883 -574629 -1140529 -1921234 -370748 -461260 173535 197052
2123 197052 -1184479 -1453947 -293883 -973359 -1366624 222782 -396761 -1100309 -258189
2114 -258189 -408856 -1203188 -1156994 -858698 -15339 -490913 -146013 561662 127204 -1100695
2104 -1100695 -1377240 -1501331 -2348420 -1699810 520368 2047 -1308064 -747385 -866100
2095 -866100 -10090 -853465 -1722146 321003 -520280 -844528 -1284172 -618657 -2178069
2086 -2178069 -908442 -953306 -1143977 -716634 -682257 257498 -774933 -1322514 43526
2077 43526 -89075 169401 -269966 767382 -1448664 -1480668 -357087 -239124 -438371 -657378
2067 -657378 -630894 -440341 180098 -623356 -2086149 -278759 -76442 -668952 126249 -816644
2057 -816644 16343 -15844 -538836 -655497 -1198448 -284380 -799506 439400 -1430565 -428860
2047 -428860 -1196938 -1134607 -1326434 -1886836 -1320718 -2481887 -1453479 1523 392266
2038 392266 -1112221 249125 -45753 -726005 447199 -1223664 -1232692 -771943 -795150 -1493195
2028 -1493195 -1442861 -1012806 -677120 -404393 -929366 -702489 -557800 -189891 -467540 -516486
2018 -516486 -532720 -345965 -1519839 -1146914 -613233 -853572 -1413616 -1000797 -1309949 43128
2008 43128 -800598 99802 590325 -753061 -125413 -1549565 -1212563 -724431 -1091489 -1146447
1998 -1146447 54179 -1714437 -1513852 -196947 -1043362 -51403 -265611 -1126341 95987
1989 95987 -839413 -283819 -1788068 44890 -1555091 -225541 -1061555 -1449177 -574897
1980 -574897 -1564291 -394440 -531946 -382214 -711264 -306878 -1308871 -1312162 -2726483 -607994
1970 -607994 -396378 -60401 343801 -1723381 -888921 -729507 272406 -143927 -199133 -539382
1960 -539382 -1545750 -1041038 -1750784 -406117 -1857916 -1021415 -56187 351943 363632
1951 363632 -965397 629841 -235995 467702 -899906 -489688 -1152790 -746145 -1114754
1942 -1114754 -747266 -180317 -1305852 -171954 -1269532 118889 -1506287 -454663 -134433
1933 -134433 -962986 -111674 -2298585 -696444 -87922 -787917 203995 -732505 -1427807
1924 -1427807 -767264 -516963 -1054413 -23415 -1370561 -1038350 709565 -492707 -461581
1915 -461581 -469159 -607918 -273133 -136864 -1359555 -723033 -244362 -1561904 -1629321 -789849
1905 -789849 -591080 223857 -299754 -751238 -1026959 -1535156 457080 -202074 -116397 -827418
1895 -827418 -1052076 -307120 297632 42838 -11449 337703 -1263558 -831266 -2180621 -1261015
1885 -1261015 -1114574 -792586 556640 630043 -267354 -834804 -901402 -466256 -1751668 -340097
1875 -340097 -512487 -503189 -11948 -2187822 -554825 -1032764 -926712 231976 -516825 -335082
1865 -335082 -1572442 -482787 -452352 -907162 553366 -269064 -1407824 -76247 -1538296
1856 -1538296 -711907 -360419 -970084 -945251 -371056 -961884 -404134 -555036 -1063918 77260
1846 77260 -456713 -505890 -1286977 -22820 -1970862 -2037075 -1416525 -442043 1108593 -442275
1836 -442275 -140424 -401012 -499521 -714873 -1292370 -949605 -121452 -1103496 -156376 -907507
1826 -907507 -1171946 -610553 -1768913 -331150 371231 331350 -158181 -1629830 -979482
1817 -979482 -700871 -446880 -1224701 526034 -720168 -1156893 -233172 -2249144 -1749472
1808 -1749472 -280662 162523 -616112 -269417 -900635 -220462 -226944 -1636241 -2196531 -1075640
1798 -1075640 -579835 -1626456 -19009 -403663 -247629 -843737 -1349878 -1361356 -857500
1789 -857500 -1603734 -772700 -1354235 -1734552 -279749 -601671 87211 -60448 -233201 -1272966
1779 -1272966 -412771 -42907 -2169820 -95411 -1222448 202679 -222658 -164630 373269
1770 373269 -1347299 -402194 -2173986 -175984 -1160939 -2100563 -410693 520209 793455
1761 793455 -46819 336374 -639608 -908264 -1665133 -1131174 -1531959 67396 -672059 -103879
1751 -103879 796130 -869070 509788 -1169819 188735 -245659 -1034523 -1442407 -1265475
1742 -1265475 116805 -1158051 -1292427 -1619130 95750 -293254 -684377 -1303248 -858098
1733 -858098 -1258666 -1002492 530722 -1656644 -10124 -798056 -421616 -938791 -1795657
1724 -1795657 -363429 -617276 -257411 -917165 -459161 -766826 -1207855 649525 -299307
1715 -299307 -995212 -1064529 -386420 -1096661 -266928 -1753729 -582858 18150 824877 -1297860
1705 -1297860 -1935719 -1940679 -1704456 686661 -1124116 -17021 -518008 -767350 -795984 -881733
1695 -881733 -409898 -350673 -221067 243056 184251 -1032653 -1754073 -2200663 -432166 -1383561
1685 -1383561 -1729590 -1126058 -714676 -232341 -2049986 -981964 -1940844 -1089590 1584778
1676 1584778 -1087240 465933 -666395 -470589 -140531 -1043391 -894541 -2519662 -873245
1667 -873245 -508074 1326395 893119 -976344 -941273 -1125498 -1741196 -674683 -554055
1658 -554055 -586542 -1078669 -817278 -443234 -1007272 -1204418 218895 -274294 32113 -868108
1648 -868108 -190981 -264102 -1974487 -1355243 -1034977 1120051 -541331 -988191 31281
1639 31281 -1124650 -1358590 -1367354 -121150 -952282 -180679 -558229 -812665 -927841 -1095163
1629 -1095163 -596250 -909781 -639257 -781426 -808920 -1157633 153001 -464760 -458556 1007423
1619 1007423 -1231579 772752 -435565 -1372097 -199511 -535287 -1109528 -1352322 -207201
1610 -207201 -1113804 -1133076 69957 -791139 141594 524873 -1281655 167297 -605819
1601 -605819 -611532 -1302713 -841965 -1160651 -1383577 413620 -1117403 -1528798 -419202 -707750
1591 -707750 -1289580 -232804 -598240 -1846464 -452006 -988357 -397933 -1610 -367620
1582 -367620 -843904 -875506 -535941 -320212 119950 -935873 -905114 -1188739 -1210443 -617405
1572 -617405 -1062539 -1132329 -15132 -992318 -381783 -201751 -838269 -794629 -445338 -145963
1562 -145963 -1391321 337978 -1075845 -845205 203479 -1775494 -895262 -1169443 -413191
1553 -413191 -1676485 -798843 -2106641 -2066661 -13405 -598278 -401053 251590 -458506
1544 -458506 -1756272 380032 -419600 108233 -540215 -1252162 -1073527 -1337222 -248320
1535 -248320 -1535141 -1296419 -989588 224103 591334 -1290816 -527988 -2210634 -1207941
1526 -1207941 -1405742 -2335805 -708976 -255205 -826384 -771019 476454 -821298 -1048803
1517 -1048803 -1251188 -2129697 -1439430 -649533 -920395 -240905 699023 -1296823 -2240171
1508 -2240171 -83409 -396553 838734 603989 -1044718 -1302360 -900597 175276 -1968919
1499 -1968919 -321058 -380092 -1813775 -791235 -1797709 -812003 -404488 560401 164830
1490 164830 -182178 -1302015 -1799417 -463574 -1296851 -11788 -1120190 -181267 392270
1481 392270 109079 -1424903 -2849957 -1569239 -658784 309071 -696931 159706 -759739
1472 -759739 -1108746 291729 -1910529 -587715 -1673923 160523 -575614 -1210668 77598
1463 77598 -1416741 -248606 -1819985 -950520 -1001971 -271674 12681 -440869 -912471 -2181136
1453 -2181136 -869693 -433640 -760299 431040 -141171 -431959 280142 -311048 -1900084
1444 -1900084 -1854181 -2334337 -422782 468598 -659319 -710831 -402569 -379995 -1309603 -830326
1434 -830326 255505 22117 307602 -1517065 -1141923 -901946 -1063008 -800710 -926806
1425 -926806 601291 -1228408 -1492437 -1299182 -517217 -335773 -913876 -89183 -108877 -330584
1415 -330584 -1145626 140158 -989319 -333862 464814 -512591 -675086 -1244966 -976538
1406 -976538 -672431 527200 -997210 -551032 266860 -1852842 -140079 -1135697 -1080616
1397 -1080616 -646729 -1643275 -535236 -741737 -523922 -893827 -863736 55221 -832878 -984848
1387 -984848 -806948 -878456 366472 -135704 -1587009 -1531162 -570378 -1854324 -1214016 -379419
1377 -379419 -727264 216539 -707304 75146 -1188336 -1002565 -2230077 -697261 163317
1368 163317 -1811989 -934371 -1220635 -89711 22477 -218421 -492347 -777704 -1133433
1359 -1133433 -721526 -562399 -829141 -585898 -1965408 -911662 458075 209483 -994063
1350 -994063 -556840 -504385 -662796 -644082 -548336 1661080 -505413 48748 -1623879 -1288973
1340 -1288973 -567411 -360960 -139797 -698911 -747969 -1605843 -323647 169994 -1886836
1331 -1886836 -255332 -339835 -572976 -956554 -1163476 -1127137 -699231 -56335 -871607 -1004714
1321 -1004714 -737262 -338608 -1402400 -794835 -696602 44318 -1144566 34670 -1045536
1312 -1045536 -2045165 -1097900 -751343 402921 -1132348 -1877830 -1786133 -181714 353363
1303 353363 -925829 125273 -1369302 -292294 -1149740 -568000 -358617 -2179654 -512167
1294 -512167 -1265691 -941789 -552458 -1008681 -390633 385613 -669280 -1567451 -879953 -1129203
1284 -1129203 -567783 -1754027 11040 -320343 -226086 864892 -1875198 -162316 -974342
1275 -974342 -984486 -362542 -812177 -1664859 -292714 -620274 59083 -56812 -1341368 -1330651
1265 -1330651 -1410302 -679042 -1337904 -654497 338708 -1001645 -369537 -191128 1674173
1256 1674173 -430580 98168 -118505 -2038598 -1156605 -2287591 -912804 -15473 -124986
1247 -124986 -1139024 -670060 91061 110794 -1986322 -711741 -617455 -598933 -9493 -1245331
1237 -1245331 -875552 -696843 427414 -29417 -518132 -821967 -1941766 -1378631 -938524
1228 -938524 -1196562 -1279707 -676621 260910 -329353 25779 -1029164 -1366749 -1148432 -1615684
1218 -1615684 -1031053 -590689 -194859 -739781 435692 -599403 -46008 -1087776 -976523
1209 -976523 -311278 -387105 103586 -135887 -805239 -1101263 -2637529 -1016302 -799335 -1330432
1199 -1330432 -298663 -399108 604134 -666492 177024 -162693 -653960 -323156 -1285538
1190 -1285538 -1272013 -1118364 -583584 -979475 119611 -778890 -610165 -648192 -281656 -633298
1180 -633298 -1031391 -675595 -1571506 -527583 -1437182 -793319 -856099 -682468 691200 -2065464
1170 -2065464 -364147 -478803 -1205063 -1435617 -598326 -391841 -579587 -862718 -1341199
1161 -1341199 -785353 -425556 -547859 -633818 -1055755 -1282467 -903841 -496649 -2086132 -1187814
1151 -1187814 539760 -987030 -543993 -631172 -240753 770696 -716695 -563901 -1025228
1142 -1025228 -900261 -1840972 417981 -329577 -881902 -177931 -126295 246813 -1591129
1133 -1591129 -1621797 -2086997 -333074 310025 -721607 -204142 -129881 619920 -744164
1124 -744164 -496375 -1364062 -1311549 -854228 55335 352169 268202 -160168 -1464043 -444402
1114 -444402 -2465885 -1672090 104997 -1464929 260069 -1142908 -74019 -1071997 -443350
1105 -443350 -902299 150954 262174 -1037471 472047 -1087256 -1375021 -1287056 -1299616
1096 -1299616 -1812503 -1774897 -76516 -307219 -730202 -1077501 -929029 -457590 -409529 535593
1086 535593 -755780 -798733 -409704 -2977895 -954341 -537250 -763143 79327 -947854
1077 -947854 -878660 -1366341 -411488 -445617 547987 -405000 -980207 -822186 -569192 20577
1067 20577 -1659184 323912 -520462 659278 -233541 -1671745 -712616 -1626133 -831453
1058 -831453 -188248 365327 -412213 -204676 -1033537 -331193 -99262 -867768 -1454445 -1232191
1048 -1232191 -994430 224704 -574386 -2505755 -514747 -286842 -832037 -824035 -1523262
1039 -1523262 -627965 476596 -139589 -618235 -1200344 -1706569 -2544206 -350195 -103575
1030 -103575 774263 -611833 -171615 -308334 -1647925 -1150545 -2044370 -1717318 -941131
1021 -941131 -845422 -1811913 159770 -543538 -194372 30709 -1382525 -582097 147142 -264005
1011 -264005 -821930 258735 -1736643 -1611635 -774068 -586166 -1531288 -646023 -1215591
1002 -1215591 -631029 -1413739 -1914388 -1630698 -1544965 8408 513810 279302 -958087
993 -958087 -1253213 -1149638 -1159460 -633901 -383212 -172443 -1517500 -1993796 -484069 186641
983 186641 -176645 -465339 1038363 358364 -510209 274465 -973458 -95802 -653206 -758905
973 -758905 -1045256 851921 -1236467 38724 -567935 -969267 -1222702 -413647 -183788
964 -183788 -1346069 877578 -1950052 -1217182 -1358758 305282 -1025684 -325177 -360372
955 -360372 -1053564 1094289 -556767 -1447152 -1431254 -929227 -312487 307418 -780801 -1685375
945 -1685375 -730742 -2439303 -1454081 -506758 -236393 -608050 157505 703668 -238168 -1076433
935 -1076433 -2022994 -702777 -774141 -753775 -330378 -625706 -567188 -484836 -1569784 -1502996
925 -1502996 -271732 -787656 -572102 303433 -686001 -902206 393671 -612669 -848859
916 -848859 -893743 -1751046 -906557 -1467591 -1413911 -1547340 -813843 -415123 -16144 -288159
906 -288159 481077 -1689177 -337790 -1144657 -1188150 -654612 -1592447 273388 -142389 309806
896 309806 -531666 -1032853 104495 -629889 -1125413 -1803180 -1957183 -1467774 -10010 -591503
886 -591503 -872675 -104546 -432737 -393560 -747467 -618612 -1504460 -2151942 -130000 -660836
876 -660836 -784503 -1286230 500726 -671045 57644 -1180235 -2004375 -477126 -97411
867 -97411 528442 -803887 -281543 -2018641 -342935 -686991 -870755 -1195830 -1285235 -468702
857 -468702 -492822 -365268 -1613472 -199108 -897105 378330 -663533 -605711 -958005 -1047487
847 -1047487 -42335 -1081499 -281941 -1266017 -155898 -428992 -1774115 -193491 -783036
838 -783036 -511703 -34293 -1101848 -2009977 -1519331 35282 145442 -961270 -439389
829 -439389 -786691 -1537999 -161415 -632293 -113530 -89089 -1432290 -288568 253995 -1582142
819 -1582142 -2237378 -1287077 -1154241 -364108 -1419237 -1228968 -176307 50878 -654246
810 -654246 -1066682 -803663 -348198 -998797 -1115838 -1249059 -1271076 -1273806 -1165119 865260
800 865260 -620422 569633 -1384787 485007 -768649 -162785 -1810985 -945416 -410535
791 -410535 -1249120 65326 -492091 -848353 -867765 1777662 -826537 -701165 -1524420 -949530
781 -949530 -789869 693097 98933 322717 714798 -749211 -693032 -1545607 -359089 -854741
771 -854741 379762 -1672973 -1529086 -2240540 -1043991 629350 -875324 877500 -1053434
762 -1053434 57392 -1264326 -1149134 -1616586 -622702 -265618 -587308 -869333 -1446741
753 -1446741 -1499905 -1345903 -505351 -281405 454831 -284081 -600106 -869409 -1227977 -603539
743 -603539 -2340559 374627 -657081 -847979 -258284 -817900 -284617 -45901 227613
734 227613 -1393473 -1098236 -1500418 -2155968 -1030463 -870063 434806 671153 405703
725 405703 -898698 -1672117 -772150 -1379671 -150915 -720183 -492511 -445491 -511891 -1089897
715 -1089897 -1030750 -825261 -1472463 -622331 -1235527 -198428 -994665 -1076684 -158323 83852
705 83852 -870511 -387843 -470981 -1275255 1315403 -300587 -905209 -286143 -279516 -1215388
695 -1215388 -598526 -1246988 -1394804 495630 -595002 -359866 -2384712 -1586960 -1436255
686 -1436255 -416766 -573615 -1322446 -497448 -921835 -842058 -105537 560042 25934 -897657
676 -897657 197692 -515054 -1831117 -688289 -370799 -362378 -158605 194100 -243330 -594840
666 -594840 -588793 -1922546 -2503187 -1108727 434677 -1437232 1017243 -1556811 -1258055
657 -1258055 -549776 -1627272 -66986 -461419 1545857 -1711716 -1074754 685631 -1272323
648 -1272323 -384745 -1065320 214487 -1309925 -739714 -560922 -385294 -114023 -1293367
639 -1293367 -408994 188223 18452 -274482 -1414307 -949934 -418092 -950326 -1019540 -350126
629 -350126 -716584 516748 -812201 -902628 -709792 -1759470 -1339018 -627269 -863232 -712811
619 -712811 -1100814 627819 -46318 681419 -680578 -2252253 -842312 -1978659 -1535832
610 -1535832 -617600 -695046 575741 548895 -15331 -604815 -2067467 -560769 -493408 -1961561
600 -1961561 -473470 -1121050 186245 499654 37319 -193774 207432 562699 -959213
591 -959213 169699 -517973 -1705694 -952599 -566402 156596 -194457 -1573399 -1789291
582 -1789291 -361025 173235 -459239 221412 -590113 -81803 -1004163 -354070 208060 -65021
572 -65021 -423735 -1403989 -1181751 -2799764 -985550 -967875 -1111993 112539 -135390 -319020
562 -319020 -781279 -436009 -563442 347673 -95338 -1064174 -1496291 -488789 -1248331 -1035423
552 -1035423 -1435698 -1641892 -582312 -791902 -266833 -1310367 -1077499 -4270 -771915
543 -771915 52792 -1053278 -1528450 -781748 265367 -29118 -951592 -2103452 -2429367
534 -2429367 305112 531796 -765986 35534 -416895 -248913 -947064 -1519597 -1808595
525 -1808595 -281569 -409756 -957922 -408619 -274848 -135787 -1297916 -40417 -252472
516 -252472 -1739531 -1621831 -1034087 -718818 -1130039 -689990 -1332496 -467768 -424490 -834908
506 -834908 -829610 -776164 -518924 -256507 -468933 -1806203 -817201 -89891 146831 -761118
496 -761118 -1431677 -959305 -2137718 -466666 -353009 -1406704 958872 285423 930745
487 930745 701122 847019 -542237 -716429 -1554288 -481892 -1116982 -1110968 -724167 -985480
477 -985480 50086 -1236670 -1451295 525913 898333 -343277 -291303 328205 -1381217
468 -1381217 -714650 -803253 -813790 -974018 -1139589 -2118192 -1843452 -1623163 -628823 -824103
458 -824103 339627 -165124 -1221689 -1127316 -2383858 -1028873 -713263 -432839 -421349 -460197
448 -460197 -131974 -46726 -921287 -562277 -1133186 342386 -242008 -403737 -190666 -2130708
438 -2130708 -466919 -83153 -234891 1085498 -471134 -600852 159972 36870 -162905
429 -162905 -794153 -1217046 -1629709 -674929 -875847 -767620 -1103152 -624726 -338359 -1236296
419 -1236296 -1282020 -1278972 -595541 -333706 -254802 -323396 122380 -877514 -729046 -1475787 -973349
408 -973349 -1435806 -1935580 -166793 -717565 -46651 -1994512 -907368 -193452 398132
399 398132 -468393 -1127925 -1258285 -1916234 -938324 -491294 742494 -321465 388514 -703075
389 -703075 -508829 738571 -566879 -468214 -939981 71780 -789668 -361502 -437418 215365
379 215365 -312989 -396350 232392 -835507 49264 167647 -233791 -525889 -904587 415564
369 415564 -596647 -368544 -930855 -1900782 377862 -1102424 -688054 -348111 -1433366
360 -1433366 -927503 -1045037 -275439 878977 -1170354 -367419 -1221006 -2082663 -458152
351 -458152 -299869 -3202 -842216 -1511100 -137532 -517018 -1351884 -346951 -794811 -317272
341 -317272 -343216 265603 -1622162 -1493392 -260993 -1312764 30152 -1068676 -947898
332 -947898 -625963 -1808799 -698954 -1233168 -34478 -17006 -840141 -577862 -1000359 -1961232
322 -1961232 -1249375 -108879 -1250803 331545 -284771 398361 -1558148 32309 -1540683
313 -1540683 -1307847 -764641 -1948420 630017 -295430 -116308 -1694032 -772066 -106931
304 -106931 -913725 804433 -1055476 -905741 -320173 702870 -1307940 -1080460 -1907809
295 -1907809 -1175316 -1205981 -1674780 -180090 -2297876 -56580 -1048802 -40214 -453374
286 -453374 -434534 -425122 -646052 290371 385052 -619312 -1195758 -1618704 -667767 -872866
276 -872866 -464495 -691713 -863913 -885432 -369161 -569231 22714 372313 489086 -35922
266 -35922 -3272269 -1025819 -697272 -692447 -1191534 -1078362 -36491 -1699450 660661 -1459487
256 -1459487 -127076 -1057832 -1744092 -342154 -364674 -1456054 -1561089 -646398 -759503
247 -759503 -243955 -503213 -407138 -93496 -651105 -112186 -1645120 -926833 515841 176213
237 176213 -535592 -1518183 -1715962 -1833886 -411863 -1046838 -861622 -131167 -1081952 605985
227 605985 -512052 -350933 -2218737 -1380510 56661 -670417 -1225422 -1748450 -226019
218 -226019 -1221118 -35131 -149579 -2045617 -312235 -370249 -654173 -664587 -1284476 -672107
208 -672107 -405769 -668294 -1193977 -3491 -1643796 121039 -1310835 -1150156 -1860007
199 -1860007 -1283572 48394 -147182 66438 -1125484 -640277 -1340201 -422046 -943571
190 -943571 -1061483 -668055 -650851 168190 -372945 -733402 -546127 -761327 -366103 -641952
180 -641952 -1213444 433219 -774025 -1047990 -1018278 -1045168 -582732 -269497 -107178 -973877
170 -973877 -450992 -375740 -731105 -1138931 -1080602 -326064 126340 -898029 -209213 -1351755
160 -1351755 -2058828 -752925 -1282392 -636234 -768400 -720750 249183 -402602 294045 -443362
150 -443362 -568077 -1524298 -750941 -247779 -1199641 -1307535 -716475 -262003 -1218716 -739470
140 -739470 -1053927 -1092004 -761616 230192 -329840 -151275 -514551 -525224 -637168 -1201657
130 -1201657 -1027828 -1442395 -1125515 -1141257 -416914 -791622 -1596681 -1144277 -671534 -1532249
120 -1532249 -1480556 -682819 -666268 -59638 -518446 -639365 -239858 -2114353 -1056485 -1128169
110 -1128169 -1287679 -1451494 -732459 -913162 -1525544 -1221957 -1020389 -367671 -751012 -653810
100 -653810 -625242 -603506 -836596 -599471 -486874 -1297132 -805246 -1414356 -709495 -1494073
90 -1494073 -814745 -451551 -552389 -1151645 -1068414 -1164465 -1859053 -1185916 -348599 2250
80 2250 -1342906 -1160360 -468717 -883910 -1026128 -1174186 -696222 -953400 -971412 -935357 -854975
69 -854975 -1219420 -1011800 197224 -1146382 -1827127 -1577539 -1373010 -704337 -154735 -234818
59 -234818 -1115267 -1802772 -1524717 -1805086 -1822415 -1173683 -1344277 145820 -1133306 -177214
49 -177214 -1026910 -1911914 -1848674 -1180907 -1092644 -1400784 203042 -212307 -276406 -669088
39 -669088 -1519999 -1258437 -199704 -921787 -1060167 -1162529 -1055362 -1848343 -1118678 -282087
29 -282087 -670261 -366602 -1039098 127382 -1475843 -834921 -1313517 -1969033 -694055 -1148367
19 -1148367 -1143654 -973049 -673649 -1031852 -1337781 -499092 -301534 -1098710 -2239152 -1721541
9 -1721541 -1362985 -800426 -970986 -679624 -742472 -2085747 -1216522 -1521951 -1031361
0 -1031361
$$ Imaginary data points
##PAGE= N=2
##DATA TABLE= (X++(I..I)), XYDATA
16383 -2873404 -2891173 -3233017 -3057340 -3083247 -2631652 -2581838 -1700883 -3271134 -2370354 -2501381
16373 -2501381 -2042619 -1595885 -3097695 -2475806 -1891212 -1534756 -1796993 -1528500 -1895354
16364 -1895354 -1951933 -1028169 -926587 -898595 -1694761 -1124561 -1495652 -1402481 -1816960 -475815
16354 -475815 -1187015 -1570305 -195998 -1399105 -1105204 -308391 -434455 534267 -1622452
16345 -1622452 -577921 -832226 -618424 -1191055 -569841 15053 -770799 -275724 228148
16336 228148 -144289 -1200193 64288 -621632 230541 1178613 722889 1038951 -292514
16327 -292514 95134 620262 1188626 -517854 896037 466182 45576 197518 1273345
16318 1273345 1622918 840018 1127911 774362 1039086 1493551 1458171 2042357 1279607 1055512
16308 1055512 1147840 1651130 2291311 2247394 1936142 2327893 1480877 2304764 2228981 1872316
16298 1872316 2484018 1819497 1606585 1631937 2431580 2577436 1473893 1824092 2688159
$$ [...]
##END NTUPLES=NMR SPECTRUM
##END=
