##TITLE=abcd
##JCAMPDX= 6.0         $$ Bruker NMR JCAMP-DX V2.0
##DATA TYPE= NMR SPECTRUM
##DATA CLASS= NTUPLES
##ORIGIN= UXNMR, Bruker Analytische Messtechnik GmbH
##OWNER= root
$$ XWIN-NMR		Version 3.5
$$ Thu Jul  2 15:52:46 2026 Russian Standard Time (UT+4h)  servis@DPX200
##.OBSERVE FREQUENCY= 200.131235884673
##.OBSERVE NUCLEUS= ^1H
##.ACQUISITION MODE= SIMULTANEOUS
##.ACQUISITION SCHEME= undefined
##.AVERAGES= 32
##.DIGITISER RES= 18
##SPECTROMETER/DATA SYSTEM= spect
##.PULSE SEQUENCE= zg
##.SOLVENT NAME= CDCl3
##.SHIFT REFERENCE= (INTERNAL, CDCl3, 0, 16.4885)
##AUDIT TRAIL= $$ (NUMBER, WHEN, WHO, WHERE, WHAT)
$$ ##TITLE= Audit trail, XWIN-NMR		Version 3.5
$$ ##JCAMPDX= 5.01
$$ ##ORIGIN= Bruker BioSpin GmbH
$$ ##OWNER= servis
$$ F:\spectra/data/av/nmr/H1/1/pdata/1/auditp.txt
$$ ##AUDIT TRAIL=  $$ (NUMBER, WHEN, WHO, WHERE, WHAT)
(   1,<2026-07-02 15:49:52.45 +0400>,<servis>,<DPX200>,
      <created by zg, POWCHK disabled, PULCHK disabled
       configuration hash MD5:
       00 E9 B6 7A A2 85 ED C7 34 08 36 98 17 FE 4E 26
       data hash MD5: 32K
       F8 5C 14 0B AE E8 11 91 90 A7 D7 9D 63 4A 6D 99>)
(   2,<2026-07-02 15:52:10.04 +0400>,<servis>,<DPX200>,
      <Start of raw data processing
       efp BC_mod = 2 LB = 0.05 FT_mod = 6 PKNL = 1 PHC0 = -415.99 PHC1 = 3.101563 SI = 16K 
       data hash MD5: 16K
       C4 D6 3C 52 67 F2 84 BE 46 F5 43 21 F3 2D 0A B4>)
(   3,<2026-07-02 15:52:18.26 +0400>,<servis>,<DPX200>,
      <abs ABSG = 5 
       data hash MD5: 16K
       B2 DB D3 12 18 D4 7F 16 5E 25 4F 0C 2D 96 D3 65>)
$$ ##END=
$$ 
$$ hash MD5
$$ 2A EA B5 DA 1C 0E 94 0B 94 91 42 EE D4 6E 64 F9
##$RELAX= 
##$RELAX= 
##$RELAX= 
##$RELAX= 
##$RELAX= 
##$RELAX= 
##$RELAX= 
##$RELAX= 
$$ Bruker specific parameters
$$ --------------------------
##$DU= <F:\spectra>
##$EXPNO= 1
##$NAME= <H1>
##$PROCNO= 1
##$TYPE= <nmr>
##$USER= <av>
##$AMP= (0..31)
100 100 100 100 100 100 100 100 100 100 100 100 100 100 100 100 100 100 
100 100 100 100 100 100 100 100 100 100 100 100 100 100 
##$AQSEQ= 0
##$AQ_mod= 1
##$AUNM= <au_zg>
##$AUTOPOS= <>
##$BF1= 200.13
##$BF2= 200.13
##$BF3= 200.13
##$BF4= 200.13
##$BF5= 500.13
##$BF6= 500.13
##$BF7= 500.13
##$BF8= 500.13
##$BYTORDA= 1
##$CFDGTYP= 0
##$CFRGTYP= 5
##$CHEMSTR= <none>
##$CNST= (0..31)
1 1 145 1 1 1 1 1 1 1 1 1 1 1 1 1 1 1 1 1 1 1 1 1 1 1 1 1 1 1 1 1 
##$CPDPRG= <>
##$CPDPRG1= <>
##$CPDPRG2= <>
##$CPDPRG3= <>
##$CPDPRG4= <mlev>
##$CPDPRG5= <mlev>
##$CPDPRG6= <mlev>
##$CPDPRG7= <mlev>
##$CPDPRG8= <mlev>
##$CPDPRGB= <>
##$CPDPRGT= <>
##$D= (0..31)
0 2 0 0 0 0 0 0 0 0.06 0 0 0 0 0 0 0.0002 0 0 0 0 0 0 0 0 0 0 0 0 0 0 
0 
##$DATE= 1782992992
##$DBL= (0..7)
120 120 120 120 120 120 120 120 
##$DBP= (0..7)
150 150 150 150 150 150 150 150 
##$DBP07= 0
##$DBPNAM0= <>
##$DBPNAM1= <>
##$DBPNAM2= <>
##$DBPNAM3= <>
##$DBPNAM4= <>
##$DBPNAM5= <>
##$DBPNAM6= <>
##$DBPNAM7= <>
##$DBPOAL= (0..7)
0.5 0.5 0.5 0.5 0.5 0.5 0.5 0.5 
##$DBPOFFS= (0..7)
0 0 0 0 0 0 0 0 
##$DE= 6
##$DECBNUC= <off>
##$DECIM= 32
##$DECNUC= <off>
$$ [...]
##$SUBNAM5= <"">
##$SUBNAM6= <"">
##$SUBNAM7= <"">
##$SUBNAM8= <"">
##$SUBNAM9= <"">
##$SW= 20.6817932712277
##$SWIBOX= (0..15)
0 0 3 0 0 0 0 0 0 0 0 0 0 0 0 0 
##$SW_h= 4139.07284768212
##$TD= 32768
##$TD0= 1
##$TE= 0
##$TE2= 300
##$TE3= 300
##$TEG= 300
##$TL= (0..7)
0 120 120 120 120 120 120 120 
##$TP= (0..7)
150 150 150 150 150 150 150 150 
##$TP07= 0
##$TPNAME0= <>
##$TPNAME1= <>
##$TPNAME2= <>
##$TPNAME3= <>
##$TPNAME4= <>
##$TPNAME5= <>
##$TPNAME6= <>
##$TPNAME7= <>
##$TPOAL= (0..7)
0.5 0.5 0.5 0.5 0.5 0.5 0.5 0.5 
##$TPOFFS= (0..7)
0 0 0 0 0 0 0 0 
##$TUNHIN= 0
##$TUNHOUT= 0
##$TUNXOUT= 0
##$USERA1= <user>
##$USERA2= <user>
##$USERA3= <user>
##$USERA4= <user>
##$USERA5= <user>
##$V9= 5
##$VALIST= <valist>
##$VCLIST= <CCCCCCCCCCCCCCC>
##$VD= 0
##$VDLIST= <DDDDDDDDDDDDDDD>
##$VPLIST= <PPPPPPPPPPPPPPP>
##$VTLIST= <TTTTTTTTTTTTTTT>
##$WBST= 1024
##$WBSW= 30
##$XGAIN= (0..3)
0 0 0 0 
##$XL= 0
##$YL= 0
##$YMAX_a= 407636
##$YMIN_a= -747435
##$ZGOPTNS= <>
##$ZL1= 120
##$ZL2= 120
##$ZL3= 120
##$ZL4= 120
##$ABSF1= 16.48848
##$ABSF2= -4.193441
##$ABSG= 5
##$ABSL= 3
##$ALPHA= 0
##$AQORDER= 0
##$ASSFAC= 0
##$ASSFACI= 0
##$ASSFACX= 0
##$ASSWID= 0
##$AUNMP= <proc_1d>
##$AZFE= 0.1
##$AZFW= 0.1
##$BCFW= 0
##$BC_mod= 2
##$BYTORDP= 0
##$COROFFS= 0
##$CY= 18.4799938201904
##$DATMOD= 1
##$DC= 0
##$DFILT= <>
##$DTYPP= 0
##$F1P= 9.9274215381318
##$F2P= -0.165520771350173
##$FCOR= 1
##$FTSIZE= 16384
##$FT_mod= 6
##$GAMMA= 0
##$GB= 0
##$INTBC= 1
##$INTSCL= 4.127829e-11
##$ISEN= 128
##$LB= 0.05
##$LEV0= 0
##$LPBIN= 0
##$MAXI= 10000
##$MC2= 0
##$MEAN= 0
##$ME_mod= 0
##$MI= 50
##$NCOEF= 0
##$NC_proc= -7
##$NLEV= 6
##$NOISF1= 3.799351
##$NOISF2= 2.8
##$NSP= 0
##$NTH_PI= 0
##$NZP= 0
##$OFFSET= 16.48848
##$PC= 4
##$PHC0= -415.99
##$PHC1= 3.101563
##$PH_mod= 1
##$PKNL= yes
##$PPARMOD= 0
##$PSCAL= 4
##$PSIGN= 0
##$REVERSE= no
##$SF= 200.130005582386
##$SI= 16384
##$SIGF1= 3
##$SIGF2= 2
##$SINO= 400
##$SIOLD= 16384
##$SREGLST= <1H.CDCl3>
##$SSB= 0
##$STSI= 16384
##$STSR= 0
##$SW_p= 4139.07284768211
##$SYMM= 0
##$S_DEV= 0
##$TDeff= 32768
##$TDoff= 0
##$TI= <>
##$TILT= no
##$TM1= 0
##$TM2= 0
##$TOPLEV= 0
##$USERP1= <user>
##$USERP2= <user>
##$USERP3= <user>
##$USERP4= <user>
##$USERP5= <user>
##$WDW= 1
##$XDIM= 16384
##$YMAX_p= 326691248
##$YMIN_p= -1680926
$$ End of Bruker specific parameters
$$ ---------------------------------
##NTUPLES= NMR SPECTRUM
##VAR_NAME=  FREQUENCY,     SPECTRUM/REAL,   SPECTRUM/IMAG
##SYMBOL=    X,             R,               I
##VAR_TYPE=  INDEPENDENT,   DEPENDENT,       DEPENDENT
##VAR_FORM=  AFFN,          ASDF,            ASDF
##VAR_DIM=   16384,         16384,           16384
##UNITS=     HZ,            ARBITRARY UNITS, ARBITRARY UNITS
##FACTOR=    0.252644378177508, 1,           1
##FIRST=     3299.83951724647, 0,            0
##LAST=      -839.233330435636, 0,           0
##MIN=       -839.233330435636, -1680926,    0
##MAX=       3299.83951724647, 326691248,    0
$$ Real data points
##PAGE= N=1
##DATA TABLE= (X++(R..R)), XYDATA
$$ [...]
9607 762073 480174 207243 637674 410306 346002 520725 476371 910487 941825 983266
9597 983266 743194 1134494 1120279 1003028 1337140 893635 1065235 1176868 1081704 999643
9587 999643 614973 911459 667633 814487 807211 464042 721856 404709 417782 484815
9577 484815 634460 526449 351165 159719 260237 286047 449253 268104 423565 -20381
9567 -20381 156119 78856 589882 673868 -92962 205892 396740 -229021 278778 -167887
9557 -167887 58150 436828 200064 637886 369542 -244966 415922 516116 479621 473285
9547 473285 566324 375755 475652 143103 2801 369944 -93056 -50560 -16187 -40944 207499
9536 207499 89086 -212895 720634 71589 57594 -37750 323627 308551 510276 222044
9526 222044 599672 445263 506904 302996 56936 231136 -10085 617721 530911 823
9516 823 422737 552409 34878 323191 362177 513655 290326 408168 486204 688983 493674
9505 493674 879505 820694 713142 733504 932760 1277897 1583526 2009673 1845508 1624675
9495 1624675 1710297 1818160 1795277 1617489 1422202 1375452 1134457 1186646 833794 817422
9485 817422 800004 689657 1055906 473041 997717 723589 378052 260683 39875 741198
9475 741198 551938 349075 1046444 460737 303447 329265 857703 600294 583290 1085236
9465 1085236 1223578 1105695 1244175 1177985 1454355 1545448 1369757 1983921 1656597 1413106
9455 1413106 1735412 1634488 1638655 1068714 1176829 1239173 1088268 888802 873245 760435
9445 760435 920127 1309241 607978 1065642 1081604 1142727 1169688 1388528 2034835 1703077
9435 1703077 1584853 1808786 1845891 1993413 2644759 3321933 3226282 3155832 3309378 3325865
9425 3325865 3248933 2909981 2399312 2391011 2130425 2253265 2271563 2026927 2457308 2095154
9415 2095154 1923657 1828333 2100950 2356805 1966997 2010707 2540342 2206869 2565697 2981090
9405 2981090 3159897 3122057 3237887 3801547 3851187 3817423 4304428 4514494 4799732 4497124
9395 4497124 4490283 4317580 4097251 4221462 4008779 4147849 3711173 3842324 4302205 3745147
9385 3745147 3724847 4211969 3629928 4321403 4139827 4393939 4285437 4105624 4260590 4539986
9375 4539986 4479167 4358502 4251462 4467944 4378760 4390625 4320368 4740120 4605533 4723035
9365 4723035 4463362 4476279 4899367 4862107 5098291 5236737 5069685 5015092 5703784 5584171
9355 5584171 6173104 5996032 6039631 6328155 6455830 6543964 6519358 7038608 7099183 7040702
9345 7040702 7040831 7475920 7182317 7185582 7292073 7761247 7475362 7790153 8207493 8556215
9335 8556215 9427712 9892681 9319645 9664136 9619464 9462683 9100364 8679398 8375485 7804845
9325 7804845 7813646 7357821 6782638 6177897 6198215 6040567 5959801 5659171 5799441 5739436
9315 5739436 5591335 5185953 5505488 5703246 5491625 6168238 6579078 6756852 6943902 7479872
9305 7479872 7522524 7933164 8536350 9226010 9439857 8957046 9602187 9186077 8674137 8249846
9295 8249846 8306057 8016280 8171187 7879081 8233875 8049681 7770013 7799536 7967076 8296120
9285 8296120 8458076 8519369 8320699 8594362 8328992 8311677 7876479 8290807 8430687 8147121
9275 8147121 8393141 8877511 8694982 8471239 8936354 8681822 8714574 8406025 8529967 8526445
9265 8526445 7931178 8084888 7649955 7723607 7373046 7175207 7260429 6741520 6743509 6409229
9255 6409229 6329636 6455750 6009032 5969119 5336723 5560987 5182253 4648038 4644643 4712182
9245 4712182 4692709 4087130 4422682 4369546 4138393 4129564 3927673 3986634 3460736 3695608
9235 3695608 3674749 3685391 3244890 3580490 3491526 3307166 2780481 3101303 3284975 2598044
9225 2598044 2709813 2724976 2468126 2627649 2797879 2867746 2194257 2889009 2580074 2288481
9215 2288481 2472015 2360136 2553865 2769492 2048333 2421445 2072641 2490809 2629390 3238349
9205 3238349 2678170 2089578 2210246 2196363 1754240 2348284 2590782 2175114 2340214 2324054
9195 2324054 2238311 1884475 2860436 2919470 2943679 2738250 2331915 2908888 3019436 2812346
9185 2812346 3256297 2527004 2426361 3321049 2647805 2194451 2003506 2407944 2200385 2254146
9175 2254146 2339614 2503170 2543862 2408157 2579837 2249023 2321291 2768215 2296730 2617449
9165 2617449 2578980 2785908 2788836 2385946 2662060 3233178 2183535 2277237 2917481 3133020
9155 3133020 3239059 3205255 3569120 3403954 3754733 4290740 4632244 4382912 4451902 4575281
9145 4575281 4369008 3830574 3906517 4198203 4058467 4237795 4208079 4341833 4127369 4919526
9135 4919526 4376361 4839865 4665340 4348218 4291563 4433506 4682378 5029776 4595758 5330690
9125 5330690 4896576 5076736 5070822 5144503 6080618 5357530 5317624 5490547 5897002 6222527
9115 6222527 5895875 6308147 6279951 6283871 6738418 6949822 7385520 7460860 7453229 8727869
9105 8727869 9281279 10361634 11476446 11379847 12362376 13918447 14902267 16462749 17988197
9096 17988197 20015457 22123040 25415283 29488943 34233696 41992511 56946786 86683224
9088 86683224 127801217 169228698 193284191 196346813 184621924 166526560 143766433
9081 143766433 114341999 87993471 68106537 50865846 39009929 31592580 26248273
9074 26248273 22577636 19036695 16878216 15045532 12910988 12128262 10869525 10257614
9066 10257614 9395695 9135795 8930742 8100205 7618257 7112573 7030124 6198625 5922796 6259351
9056 6259351 5326445 5720680 5884272 4855069 4999234 5447953 5202465 4723046 4393455
9047 4393455 5291322 4954274 4458836 4310478 4034865 4021756 3458621 3557251 3720091 3465442
9037 3465442 3830846 3214173 3375203 3204144 2895788 3382679 2080122 2731994 2213379
9028 2213379 2385970 2377369 2444941 2324975 2925403 2119796 2586759 1956266 2168567 2635778
9018 2635778 2534898 2313770 1875219 2427941 2027814 2075193 2402088 2259399 2692548 2089202
9008 2089202 2208426 2199316 906175 2142656 1591865 1784372 2025417 1554450 1777025 1314332
8998 1314332 1432474 1387070 1103024 1073007 915784 1321708 1115429 780626 1073666 587931
8988 587931 678703 941049 593277 877160 311816 1044912 787527 844952 994075 824450
8978 824450 1098714 746974 988452 977903 468676 544450 385388 498430 588539 505591
8968 505591 472239 660191 684944 557369 234623 735849 250294 359869 619478 335127
8958 335127 920477 558813 332960 400047 118236 638091 799814 902028 762146 159386
8948 159386 975288 250558 219554 627527 102604 508278 -43576 -128382 466957 -503479
8938 -503479 426925 272156 -279172 185036 -700419 191704 256613 435552 769155 338851
8928 338851 209539 233365 193485 563332 -30382 136366 232131 240383 114697 192063 199990
8917 199990 197 10727 274455 76733 -207998 -92991 -19496 -19216 313756 -169943 282883
8906 282883 500660 427181 514752 -126239 522509 305297 297350 219892 209911 -88110 84743
8895 84743 62952 -8426 -66698 567743 286318 47719 94653 318381 616356 467675 526558
8884 526558 834696 158453 595037 605154 666582 977024 620418 630460 515500 509119 1042337
8873 1042337 664812 1147062 1258222 957810 1019021 839530 1143190 852200 980059 1147711
8863 1147711 823147 1250543 1135874 717162 643484 1180488 995228 979598 954385 679319
8853 679319 538240 481600 583375 343520 225315 372310 526817 223469 -93987 1080813
8843 1080813 231605 588088 679972 306127 427364 51182 924997 807382 153443 571971
8833 571971 244090 -83683 -194730 -80760 439155 205022 -84873 442413 324615 -121214
8823 -121214 382152 686584 864456 573307 976292 905713 1028099 711257 1117380 965298
8813 965298 747645 729928 948437 676636 670051 479292 146125 -181075 396192 336663
8803 336663 687142 431848 382140 366893 290527 251795 416914 455028 391889 22117 141627
8792 141627 39771 155799 424420 145622 214663 201088 431296 616798 386837 -45160
8782 -45160 405267 -6698 -21302 318088 155205 440526 194242 124973 216069 -64616
8772 -64616 359083 433712 -10611 272211 708862 11252 -23205 -79685 350745 278566 487754
8761 487754 -123189 -62645 30418 254366 349397 100278 765917 395711 412619 261012
8751 261012 253846 489820 655674 270705 808540 116699 479151 578923 573608 449396 400323
8740 400323 54018 550671 389622 315705 507001 -244987 855450 282154 190465 856090
8730 856090 715791 335538 532142 678124 633090 242385 668040 647038 832538 207872
8720 207872 229952 458053 361193 616917 911601 749789 716896 547774 1095665 641594
8710 641594 502669 1197592 427126 726288 805672 356768 816017 825240 1180880 1028536
8700 1028536 824188 966846 527389 562551 850872 933529 877410 126110 39185 607163
8690 607163 781099 658866 919837 562261 671183 856119 1018013 758460 964349 1057183
8680 1057183 536680 745959 1119011 1651714 1254980 1165054 1242139 1069223 996719 1283927
8670 1283927 1906542 1821619 1507870 1498126 1566385 1363359 1063728 1052891 876216 877634 1141044
8659 1141044 1343860 1100632 985258 1166007 1420854 729308 974570 703593 1039610 1205799
8649 1205799 550883 1238910 607200 1085039 1042012 1033668 1244203 1304792 651924 832181
8639 832181 836446 1097395 1250399 577494 793573 709747 813260 614180 693519 1018337
8629 1018337 792935 507472 1287832 607921 684329 574273 767142 819901 715362 606731
8619 606731 528778 523234 987439 874826 635727 521600 988627 385971 600810 687672
8609 687672 560993 880009 866474 534288 304884 379428 268901 897990 413253 337266
8599 337266 1116839 298772 525846 417600 409642 235885 97470 1249812 680289 400499
8589 400499 1365249 1081129 1277097 635067 1094458 968498 793965 885062 1421061 1330368
8579 1330368 1082270 1068490 434400 249785 841965 744254 667794 693509 470762 936495
8569 936495 562446 843236 1092942 494881 1034278 1327433 805394 1150170 852675 1419390
8559 1419390 839948 1145741 910175 1147771 606202 647272 997495 424460 587062 1031543
8549 1031543 893221 1289690 951994 1367609 1377915 670306 1414510 1017910 1212852 1207125
8539 1207125 1388139 987363 1071925 1206936 1392021 977535 1663278 -1680926 2142343
8530 2142343 1774851 1212887 1574719 1494923 1623324 1917490 1373270 1655364 2008317 2062069
8520 2062069 2334066 2034380 2144820 1760379 1926906 1789048 1550505 1679751 1656054 1742537
8510 1742537 1584641 1233913 2023168 1942437 1719395 1852442 1372631 2045189 1847712 1748690
8500 1748690 1980588 1930972 1467025 1648146 1314675 1509809 1468440 1751405 2002538 1790509
8490 1790509 1401887 1710072 1665909 1600913 1505069 1022095 1458664 788137 1079845 1344370
8480 1344370 1322231 1142650 1625950 1001687 1023747 989479 1300603 668703 640696 1241955
8470 1241955 1568946 1445693 1230492 1061497 610915 616030 1072778 973452 1427674 927445
8460 927445 843828 1084033 458350 1037353 988997 862661 1136723 600808 884152 609095
8450 609095 907383 1009232 981464 1559915 1361407 1352590 1058986 1150047 884317 948015 1181455
8439 1181455 883248 973335 1192576 914531 1221652 1055565 1154960 1252651 537992 947921
8429 947921 730068 1042156 979722 729874 1415011 461065 711628 1310036 914297 1066396
8419 1066396 1312889 851324 954199 1123053 1410591 1246364 1194936 1376100 1063881 1012326
8409 1012326 972235 1545057 1176227 1047877 923739 920171 1110655 1034360 1117028 1355451
8399 1355451 1035979 1358801 1400109 1281063 1137722 764410 1362833 1291471 873969 2211817
8389 2211817 1030279 1228290 817081 1005973 1262488 972549 1283657 1154847 1052286
8380 1052286 1164839 746616 1195387 1333939 1411809 1648614 1736750 1826743 1031535 1362588
8370 1362588 1636392 1210370 1816796 1306857 1367958 1293694 993144 1153053 947297 1188705
8360 1188705 1428690 1095528 1291034 700719 844866 1280347 756148 984251 1360459 1237246
8350 1237246 1105319 1676772 1734281 1402448 1302139 1493739 1298334 1403878 1270981 1349969
8340 1349969 993009 1571086 1284553 1233976 1118470 1150292 1478153 1175494 1824299 1887168
8330 1887168 1562788 1490578 1740833 1512829 1206075 1114996 1307396 1834489 1323422 1644418
8320 1644418 1159781 1305804 1239581 2055385 1366218 1635966 1882885 1422923 1551136 1218464
8310 1218464 1863407 1713698 915524 1692425 1579832 1492220 2060247 1656363 1765779 1568434
8300 1568434 1828584 2330795 1787390 1531840 1781072 1418323 1480842 1821763 1610405 1939518
8290 1939518 1565231 1654884 1939178 1827379 1917611 1843393 1482848 1472569 1893140 1986896
8280 1986896 1569481 1933391 1765661 1925208 1947133 1680097 2196904 2307190 2576136 2324894
8270 2324894 1985499 2416875 1993015 2715161 2531771 2534091 2616536 2382266 1737992 2515450
8260 2515450 2344763 2605239 2523638 2397097 2408026 2112906 1605237 1885265 1783763 1903932
8250 1903932 1700687 1693935 1848926 1948618 1854024 1967981 1884791 1718024 1978575 1499617
8240 1499617 1540301 1615319 1374573 1212751 1366370 1527511 1297039 1369444 1047761 1062724
8230 1062724 1313782 948683 1710654 1382841 1854655 1335626 819405 1375629 1367561 1206869
8220 1206869 1206697 735052 1786843 1393590 1017393 1283755 1265335 1522517 1677189 1253942
8210 1253942 1936746 1350104 1361946 1104503 1036540 935487 1348951 1101906 1102228 1494108
8200 1494108 1555743 1310620 1192125 1183901 1464805 1337522 784388 854837 1908414 2286970
8190 2286970 531232 1943357 1905770 1597577 1530574 1486325 1973249 1661028 1393763 2020845
8180 2020845 1992377 1165010 1888356 1401926 1144698 1374135 1358548 1260819 1656181 932544
8170 932544 1359364 1114244 1057142 1296003 1157749 1512480 1340257 1584607 1556732 1591242
8160 1591242 830980 1335855 1548465 1360038 1942116 1472633 1816163 1489643 1363963 1724524
8150 1724524 1462055 1330927 1604812 1779787 1680146 1755902 1216087 1610639 1473322 1960418
8140 1960418 2084087 1678105 1292210 1765663 1769193 1948077 1487177 1350988 1685068 2031632
8130 2031632 1539117 1820447 1542295 1657637 1961839 1790082 1697691 1980636 1799596 1496905
8120 1496905 1612035 2182930 2012505 2280111 2392761 2098900 2140167 1741105 1828384 1920762
8110 1920762 2184117 2099937 2351544 1808829 2182080 2314184 2356548 1868204 2549334 2008632
8100 2008632 2342095 2089177 2142766 2453352 2110389 2455031 2277430 2303839 2336593 2178839
8090 2178839 2662981 2322994 2559402 2138658 2362303 2291457 2674274 2504627 2317003 2187158
8080 2187158 2501458 1812074 2481934 3101532 2625834 3034657 2334018 2636951 3188544 2787632
8070 2787632 3130161 3046534 2416383 2952953 2691602 2622980 2822034 2848330 2979267 2983836
8060 2983836 3184348 3085870 2460488 2750472 3012397 2705437 2896408 2947637 2978560 3099622
8050 3099622 2840297 2966994 2847208 3088246 3348424 3205174 3328422 3554445 3431967 3502377
8040 3502377 3709659 3128969 3121520 3484783 3501648 3683489 3329240 3167214 3186484 3164362
8030 3164362 3856638 3763238 3468278 3751873 3654481 3925834 3832500 3490240 3604134 4076247
8020 4076247 3740808 3950410 3866629 4020201 4291905 4004954 4323004 4112309 3951019 4395027
8010 4395027 4133715 4006087 4363963 4039587 4191317 4525278 4011056 3768191 3960225 4084727
8000 4084727 4514414 4589845 4709824 4320986 4658075 4822078 4322239 4300691 4048137 4330697
7990 4330697 4117500 4711620 4371367 4345370 4096707 4243810 4539734 4160254 4143331 4822693
7980 4822693 3878058 4032888 4206243 4175938 4313927 4202784 4323063 4497986 4553417 4048589
7970 4048589 4196689 4257389 4139402 4372415 4087668 4022218 4219681 4180280 4047941 4029236
7960 4029236 4096158 4520338 4102707 3992066 4223876 4110744 4489315 3976565 4296724 3898081
7950 3898081 4241135 4542209 4140494 4182652 4296799 3554459 3841316 4128787 4162532 3892440
7940 3892440 3994981 3448822 3900045 4198572 3500632 4459405 3477178 3782658 3804360 3698793
7930 3698793 3984544 4030453 3752588 4139996 3853590 3817761 3504379 3800874 3595467 3568785
7920 3568785 3393134 3161602 2896044 3127991 2820492 2924603 3128637 2801441 2761084 2898027
7910 2898027 2819967 2838142 2918159 2925904 2794903 2671825 2571604 2396111 2560449 1897183
7900 1897183 2273528 2364272 1850847 2384935 2288941 2468929 2212436 2033918 2119837 2159040
7890 2159040 1896511 2307213 1825367 2147735 2121486 2050340 1862111 1703248 1780762 1856845
7880 1856845 2271083 2270647 1966294 1962387 1485949 1671270 1665027 1817331 2135544 1940556 1927067
7869 1927067 1359164 1571342 2084755 1734750 2110351 2379974 1935874 2217565 2100030 1581327
7859 1581327 1786869 1796631 1840285 1639895 1693129 2072258 667230 2688968 2761235 2281740
7849 2281740 2297139 2117225 2338770 2328674 1956095 1730846 1601176 2053192 2097662 1905863
7839 1905863 2041040 1764029 1880311 2161824 1922071 1768198 2035934 1959050 1946158 1910375
7829 1910375 2130101 1960595 2060534 2130332 2122865 1952186 1744677 1974346 2005677 1931975 2084128
7818 2084128 1672283 1414245 1920227 1935153 2149180 1980807 1535464 1900529 1759248 2123524
7808 2123524 2229790 2166557 2174016 2089174 1588582 1859005 1889618 2157764 2226503 2101941 1953655
7797 1953655 2113243 1960133 2302190 2059329 2200884 2358055 1837573 1973519 2315810 2024832
7787 2024832 1928374 2409983 2140973 1851336 2137109 2350538 2462826 2098880 2539479 2476321
7777 2476321 2325513 2679440 2791097 2790986 2692893 2955165 2363402 3078509 2673717 3200168
7767 3200168 2745272 3217971 3027955 2891501 2812682 3721472 2947546 3339771 2596037 3340328
7757 3340328 3433255 3170395 2868715 3360191 3108845 3436157 2959275 3163217 3779826 3235525
7747 3235525 3164801 2710876 3451061 3520157 3469632 3538398 2929302 3623112 3336206 3242197
7737 3242197 3429859 3196992 3359115 3210040 3296185 3058683 2673510 3525900 3398386 3449200
7727 3449200 3264202 3069522 3471595 3575663 3647647 3628582 3382268 3614506 4098847 3792144
7717 3792144 3961537 3890381 3685793 3804100 3819407 3862761 3991037 3746007 4351754 4433318
7707 4433318 4455656 4085070 4380163 4332458 4412509 4002353 4319640 4546160 4509256 4630649
7697 4630649 4573068 4969989 4367947 4660223 5092837 4793356 4997183 5072721 5029227 5123982
7687 5123982 5073114 5128579 5349557 5084173 5409597 5286096 5760702 5278870 5405598 5333078
7677 5333078 4942793 5045275 5671357 5889677 6108127 5797657 5386773 5545437 5184971 4974736
7667 4974736 5314752 5620173 5391749 5468068 5877096 5713743 5192459 5870918 5365748 5703906
7657 5703906 5643612 5716767 5580103 5048596 5884987 5977175 5839613 5652816 5623220 5653022
7647 5653022 6015182 5951668 5587539 5811786 6114018 6379942 6241733 6292275 5848411 5971661
7637 5971661 5638712 5877395 5977172 5936987 6409296 6439425 6083076 6341740 6153585 6665755
7627 6665755 6487048 6395925 6407710 6232007 6493419 6773490 6789313 7171062 7046160 7061590
7617 7061590 6959712 7052572 7449313 7459589 7386487 7659949 7506816 7860309 7528550 7110467
7607 7110467 8284987 7457230 7704450 7643046 7590128 7545800 7786704 7608375 7532340 8024261
7597 8024261 7388819 7733984 7596586 7259219 7550485 7193806 7104692 6788279 6936816 7079790
7587 7079790 6988441 6713399 6986944 6965022 6919877 6601794 6864550 6821307 6811156 6205738
7577 6205738 6219390 6766589 6560682 6891173 6664735 6376236 7017526 6729036 6803340 7014823
7567 7014823 6370997 6836650 6312546 6260328 6142811 5912439 6127629 6072234 6323280 6680330
7557 6680330 5906946 6304337 6439098 6296045 6535730 6499843 6202409 6120587 6445238 6561124
7547 6561124 6714047 6487514 6127373 6481005 6241520 6232294 5854078 6035421 5986948 5449084
7537 5449084 5297236 5702452 5536244 5899159 5717507 5837256 5728524 5806469 5792129 5778543
7527 5778543 5565994 5600483 6276025 6024263 6116430 5778773 5685599 6010490 5459232 5474180
7517 5474180 5699074 5295490 5737825 5285701 5733422 5623204 5390132 5438312 5159148 5186505
7507 5186505 5229989 5349960 5472459 5356301 5195490 5570606 5819760 5425224 5611161 4902972
7497 4902972 5359235 5564139 5745339 5716165 5585246 5248231 4921613 5126984 5403282 5934280
7487 5934280 5193834 5542477 5923364 5943988 5681250 5402023 5133773 5518557 5677273 5612374
7477 5612374 5525338 5419211 5251182 5529961 5268860 5689521 5530555 5306795 5683970 5740002
7467 5740002 5797079 5364807 5918770 6082003 5717692 5925720 6346168 6103899 5834187 5889408
7457 5889408 6040275 5454502 5557521 6118096 6163302 6223565 6207967 5664048 5860420 5712731
7447 5712731 6215261 6051749 5612339 5646719 5864117 5838653 6200960 6400240 6473714 6218491
7437 6218491 6361769 5706643 5699637 6558382 6393516 6153895 6350586 6029458 6778649 6379535
7427 6379535 6934643 6484899 6244137 6546210 6500540 5944838 6189765 6261021 6699432 6377428
7417 6377428 6693244 6461756 6211801 6302881 6700064 6966786 6467071 6286193 6457995 6833619
7407 6833619 7051969 6523653 6624967 6607774 6444891 6053487 6840342 6690489 6293787 6316897
7397 6316897 6360443 5860495 6294280 6219592 6278714 6110638 6286550 6110419 5724247 5730804
7387 5730804 6076776 5766623 5891384 5562972 5602011 5445069 5455481 5612512 5617762 5191154
7377 5191154 5816739 5624559 5242840 5659276 5347018 5327600 5445813 5079044 5266633 5488167
7367 5488167 5105026 5176756 5691015 5476910 5428521 5400920 5193160 5366205 4959880 5733770
7357 5733770 5543733 4956724 5233719 4454205 5381246 5280125 4986888 5467595 5023699 5028548
7347 5028548 5057566 5293711 5362146 5171059 5265907 4860252 4935503 4879946 5198870 5299921
7337 5299921 5122280 4489422 4905155 4634672 5036581 4834044 5058528 5245409 4647921 4940064
7327 4940064 5315197 4985778 5342628 5170761 5132760 5421425 5026139 5426610 5534052 5322170
7317 5322170 5444383 5432256 5216444 5300625 5140792 5054412 5030496 5103060 4993243 5133302
7307 5133302 4965551 5485261 5158124 4955234 5108825 5160244 5279192 5747590 5282534 5783624
7297 5783624 5417264 4989030 5441686 5607686 5294407 5738382 5641401 5040977 5347489 5535355
7287 5535355 5664212 5473471 5601306 5407174 5155515 4954480 5628108 5818113 5927518 5833286
7277 5833286 5837035 5530577 5623240 5995573 6445823 6024033 6035323 6502412 5619603 5572974
7267 5572974 5866685 6222021 5912975 5874428 6079300 5926236 6286523 6403517 6478054 6627998
7257 6627998 6240076 6461004 6230824 6569769 6864078 6808188 7078504 6329995 7036318 6942941
7247 6942941 6599755 6673047 6725233 6900646 6869980 7345585 7355054 7378449 7246871 7826764 7643521
7236 7643521 7531317 7980579 8576535 8537454 8500138 9020951 8975064 8795725 8568275 8846384
7226 8846384 8843349 8641125 8274783 8673915 8819360 8920959 9084900 9022789 9570252 9421287
7216 9421287 9528294 9643818 10248470 10832473 10282981 11130081 12085300 12426315 13011938 13605534
7206 13605534 13933250 13780543 13981495 13635483 12837575 12743401 12773783 13284761 13066031 13351919
7196 13351919 13329167 13927992 14544209 15069817 15593528 16579784 17202436 17667758 18679377
7187 18679377 19417214 19861038 20626365 21685243 21515699 22152194 22269506 22500218 22733296
7178 22733296 23006064 23134594 22831693 22509888 22439808 22799796 23428370 24715024 25768346
7169 25768346 28122090 29715110 32423009 35068376 37423013 39159612 40104471 40448798
7161 40448798 40542742 40846131 39785488 39514737 38660869 37874076 36673617 35921871 35794101
7152 35794101 35055811 34510545 33690976 33433557 32465355 32707886 33348834 35086650 36915419
7143 36915419 39183019 42150020 45879762 48934463 52824783 56810209 59511569 60630490
7135 60630490 60478604 59432736 57659045 55420800 53331827 50972157 48094516 45281583
7127 45281583 43418963 41979831 40457980 37923805 36460716 35645325 35155736 35682994 36168074
7118 36168074 37907854 39790475 42106616 45562508 49789110 53548111 56643694 58774852
7110 58774852 59556892 59841859 59309794 57814196 55761094 52923487 49474661 46154163 42669166
7101 42669166 39888787 37695453 35170421 33007592 31287811 29944778 28981079 27851810
7093 27851810 28482383 28237518 28298949 29865190 30664919 31801226 33608172 34410485 36519273
7084 36519273 37131692 37655462 38152007 36503939 35511527 33787398 32191565 29824834 28543173
7075 28543173 27176231 25255434 24424175 22720755 21460813 20698096 19262269 19538919 18815832
7066 18815832 17900482 18246629 17401267 17974727 18677870 18379636 18987248 18975849 18812760 18667768
7056 18667768 18321370 18052979 17540078 17478445 16689576 16494499 16069435 16026025 15447022 15165778
7046 15165778 14744582 14512226 14255834 14171332 13869814 13865789 13872819 13136227 12774147 13114860
7036 13114860 13143171 13153007 13143142 12802040 13100369 12527850 12952659 12942330 12831072 12614703
7026 12614703 12666422 13206521 13487336 13556809 13773246 13329355 13519120 13653111 13633244 13147311
7016 13147311 13254246 12897054 13001230 13115288 13150233 13327628 13606521 13631714 14179673 14124952
7006 14124952 13531226 14408045 14398518 14094307 14141665 13505495 13604054 13579665 13737399 13675454
6996 13675454 14265689 13464790 13253801 13389517 13628560 13291069 13629868 13503290 13543277 13430688
6986 13430688 13463404 13775974 13454216 13858623 13276639 13182813 13143065 13210986 13582718 13471769
6976 13471769 13221571 13674570 13289648 13428636 13747991 13321863 13807433 13638993 14194040
6967 14194040 14892250 14880445 15721089 15910019 16047792 16042357 15632493 15134176 14699995 14838961
6957 14838961 14623148 14275906 14826367 14587686 15275176 15083223 14982869 15185776 14720970
6948 14720970 14943140 14961891 15139516 15798976 15207839 16165970 16573684 17162624 19039557
6939 19039557 20709181 22192502 23301720 23558977 23054922 22814326 21760480 20770069 20135514
6930 20135514 19380620 19185804 18018331 17237217 17151754 16876525 16682995 16468252 16736481
6921 16736481 16678467 17235729 16924758 17233110 17364697 17710280 18419029 19000845 19785291 21094293
6911 21094293 22658326 24996476 25712767 26313421 26172463 25512138 24807906 23677594 22482691
6902 22482691 22256275 21283586 21380410 20918113 20546818 20667735 20306252 19866526 20103197 20204512
6892 20204512 19243525 19469290 19959536 19935817 20083918 20635476 21362003 21809425 22255690 23666076
6882 23666076 24350286 24431598 25063314 25335412 24768061 24634969 24449372 24623148 24653622 24755771
6872 24755771 25544415 26044053 26239192 26813977 26654638 26194185 25936221 25157206 24931848
6863 24931848 24145079 23578140 23522104 22933418 23103271 23430418 22448796 23100185 23486025 23060399
6853 23060399 23388721 23183604 23571997 23678590 23897092 24660060 24881664 25205304 26185128
6844 26185128 27251815 28329390 28540128 28766605 28802029 28551955 28232749 27367753 26855238
6835 26855238 25774900 25488594 24631253 24210766 24014298 23420740 23746408 23163126 23000291
6826 23000291 23119064 22772781 22924419 23262109 23283243 24087501 24099202 24383798 24573084 24990798
6816 24990798 25738457 25958967 26022452 26184600 26321201 26413798 25792668 25888935 25422860 24796451
6806 24796451 24827380 24663594 24375712 24316334 24358789 24771726 24390760 24673186 25261247 25895923
6796 25895923 25963917 25995487 26292615 26523377 26422176 26447178 26570278 26019978 26057860 26518368
6786 26518368 26164504 26296345 25968834 26492682 25901020 25834102 26348407 26206990 25788309 26418178
6776 26418178 26824664 26912013 27600896 27361104 28488916 28604386 29323028 29829655 30200189
6767 30200189 31174095 32384704 33037099 33818979 33918307 34221563 33067748 33218150 31842359
6758 31842359 31746735 31257642 30448867 30097795 30226659 29819157 30211486 29929259 30593518 30392538
6748 30392538 30722682 31099546 31192170 31254641 32040820 32149118 32419136 33299867 34193050 34286475
6738 34286475 35041733 36620947 37901702 39404414 41586044 42779249 44103772 44584474
6730 44584474 44860332 45239646 45221131 45530617 46047946 46265599 46437444 46351279 46319454 45313900
6720 45313900 44321627 43421683 41281887 40359749 39346721 37859694 36911169 36342024 35605772
6711 35605772 35666271 35328573 35493024 34793704 35167350 34791149 35187760 35085550 35499130 35944651
6701 35944651 35900732 36297307 36992192 37378640 38595690 39100958 39818404 41236387 41380008
6692 41380008 42518465 43042728 42265965 41743653 41266646 40833420 39950353 39077339 39059033
6683 39059033 38501022 37925351 38539890 38683719 38928337 39794967 40940900 42842936 43935070
6674 43935070 44291280 44897225 44521357 45124040 45890813 45416539 45258294 44531791 43935134
6665 43935134 43147208 41991788 40780742 40124475 39349554 39002922 38712446 38486067 38421111
6656 38421111 38896141 38996016 39236353 39391942 39535371 39307293 39808283 40436757 40856630 41613384
6646 41613384 43115345 44282071 46148425 47651957 48380536 49611269 49337494 48267977
6638 48267977 48198203 46681526 45149057 44623499 43440047 43182541 43035627 42646094 43320936
6629 43320936 42986363 43879352 45446819 47247946 47794117 48486537 48004696 47662392 46918774
6620 46918774 45705330 44980335 44400407 43505001 43327823 42884589 43008523 42623086 42844532
6611 42844532 42625163 42370080 41831255 41663195 40219264 41166216 40854087 40737039 40552175
6602 40552175 40653843 40240743 40460625 40838064 41621207 42668582 43953566 45192512 46246203
6593 46246203 46241585 46485399 45387669 45434362 44569713 43724797 42920558 41943673 41708421 41589655
6583 41589655 41580347 41345893 41018648 40909086 40816455 40369064 40017706 39799385 39858840 39804346
6573 39804346 39779371 39563404 38963968 38990748 39122897 39159972 39600598 39122553 39318688 39375922
6563 39375922 39287028 39101495 39435387 39953977 39976013 40117158 40258487 39410868 39888154 40286460
6553 40286460 40090253 39809234 40147720 39942815 39973694 40081980 40461393 39808616 40243020 40234624
6543 40234624 40018229 39634016 39577194 39367672 38699900 38974604 37872935 37771699 37851228 37922927
6533 37922927 38010716 37334698 37269282 37306445 37318976 37885212 37400454 37414632 37162767 37089066
6523 37089066 37277186 37180932 36576775 36751620 36255774 36045491 35939706 35681369 36083014 35371949
6513 35371949 35409200 35801716 35231750 35598798 35038131 34790982 34628743 34409898 34592593 34540392
6503 34540392 34860730 34581001 34538903 34183371 34292606 33670172 33560561 33724654 33520027 33164313
6493 33164313 33045926 32515535 32431022 32469286 32300582 31997225 32017681 31930815 32356095 31803580
6483 31803580 32240315 32556163 32823856 32389092 32292441 31969114 31941322 30788830 30598824 30578454
6473 30578454 29832898 29415603 29633697 29533071 28827121 28245818 28460567 28449525 28170580 27640501
6463 27640501 28179132 27797955 27995985 28010036 27546304 27866239 27710930 28092315 28300357 27189876
6453 27189876 27351248 27210219 27235305 27025297 26055672 26081235 25434486 25093710 25203206 24743487
6443 24743487 25080333 25012221 24314928 24663442 24202319 24668134 24310080 24594892 24492809 24693655
6433 24693655 24580103 24686581 24849385 25087239 24721976 25151389 24583220 24534294 24265552 23917644
6423 23917644 23740834 23433237 23280298 22896545 22554433 22443633 22279810 22864710 23135729
6414 23135729 22742334 22361719 22504194 22466566 22393239 22633349 22698353 22512459 22546755 22428480
6404 22428480 22382816 22417931 22199825 22226481 22357894 22326457 21960931 21890577 22350316 21880057
6394 21880057 21916730 22525013 22233789 22229234 21903892 21518061 21643182 21605566 20951037 21811518
6384 21811518 21689959 21402164 21194694 20868209 20836802 20878840 21134419 21097610 20636224 20688742
6374 20688742 20877668 20696228 20439181 20815643 20928827 20599098 20625315 20572141 20655516 20487456
6364 20487456 20925991 20694425 21139732 20763368 20669919 21374232 20962868 20814164 21159544 20830985
6354 20830985 20669448 21013357 20742192 20882168 21097358 20951407 21102241 20583462 20860852
6345 20860852 21114437 20906184 21417273 21384321 21188789 20958771 21047244 21250321 20931999 21045560
6335 21045560 21385412 21206532 21168613 21301428 21456949 21493047 21598208 21269891 21474568 21248580
6325 21248580 21159366 21796433 22357471 22203875 22325246 22454160 22685958 22843471 23296869 23866588
6315 23866588 24520227 25107630 25364881 26633767 27384841 29194515 30878326 32205301 35700575
6306 35700575 38569025 42700737 46490861 50696464 55193728 58031444 59550737 59463381
6298 59463381 58558819 55569434 52108908 48310183 43991571 41145867 38948297 36466428
6290 36466428 35095653 34082416 33226951 32406336 32191695 32263094 32544284 33167448 34238164
6281 34238164 35239765 36461729 38582653 41411190 44629076 48370491 52857412 57409154
6273 57409154 63153076 69196965 75901976 82561439 88027948 92225980 94493493 94413269
6265 94413269 92083086 87419430 80892056 74222917 66912894 60109948 53814553 48850062
6257 48850062 44391929 41308623 38547029 36330615 34470746 33204813 31458897 31432096
6249 31432096 30517349 30840726 31419397 31221028 32501222 33186479 35362044 37729221 40681603
6240 40681603 44792215 49392018 54531358 58943150 61811827 62786699 61516206 58909124
6232 58909124 55210771 50339265 45374128 40490481 36801973 33557344 30824765 28710160
6224 28710160 26681019 25572273 24376364 23322150 22806586 21638697 21257064 21008894 20426010
6215 20426010 20155927 19510572 19415927 19302025 18769698 18941825 18675205 18840427 18702909 18518825
6205 18518825 18706695 18428232 18341286 18616047 17910964 17484853 17199508 17224328 16822459 17019801
6195 17019801 16857395 16840947 16204160 16281161 16522568 16309653 16307037 16580194 16312213 16215021
6185 16215021 16317011 16522919 16237175 16874255 17004473 17124980 17422800 18076472 19023425
6176 19023425 20480885 21915198 23435334 23407163 24067100 23797217 22949402 21775209 20945682
6167 20945682 20027664 19021594 18455025 17872314 18250901 17957117 17328489 16865878 17236855
6158 17236855 17223846 17384897 17277737 17360454 17547152 18055816 18346525 19784275 20771297 22329397
6148 22329397 23306624 23680674 24178279 23808476 22950755 22172781 20884910 20201311 19274743
6139 19274743 18851106 17896619 17964087 17450027 17397865 17445613 16929495 17044086 17457179 17567706
6129 17567706 17696801 18276383 19085708 20448231 21415510 22413936 22794255 22840849 22937024 22476304
6119 22476304 21362747 21289103 20130840 20154436 19568527 19104684 18987852 19025349 18565749 19166963
6109 19166963 19016250 19199989 18974667 19535074 19319603 19987400 20352466 21245430 21229592 22808581
6099 22808581 24036837 24954642 24897852 25327833 23854176 22997771 22694578 21503620 20743909
6090 20743909 19912212 19091339 19122575 18329609 18477197 18314463 17742932 17921656 17383865 17666630
6080 17666630 17200547 17093604 17602334 16951638 17091009 17097813 16973252 17070179 17374425 17005227
6070 17005227 17174671 16554700 17157934 16959851 16983394 17340738 16896006 17077137 16247581 16717931
6060 16717931 16539398 16316377 16397767 16522072 16438090 16756412 16661441 17563199 17010161 17018159
6050 17018159 17045119 17321680 17050095 17053835 17204129 17435874 17304820 17520982 17150986 17343063
6040 17343063 17227583 17452785 17260016 17653249 17261576 17633723 17573877 17773501 17583418 17129848
6030 17129848 16969244 17386699 17237804 16985726 17005115 17543543 17439270 17912892 17688418 17812338
6020 17812338 17582076 17778888 17478042 17824609 17814890 18172682 17796833 18219262 18075997 18140223
6010 18140223 18026746 17503520 17882867 17889457 17571091 17068250 17247312 17263786 17265839 17155246
6000 17155246 17582293 17014638 17081741 17280841 16957020 17342848 17168005 17434906 17497412 17214873
5990 17214873 17217636 17683637 17773374 17895874 18344266 18135414 17744576 18253340 18176316 18440149
5980 18440149 18077423 18468806 17878402 17199167 17228434 17673520 17079085 16554788 17012651 16341449
5970 16341449 16740097 17057001 16856375 16737982 16797779 17274366 16967007 17105461 17151800 17498624
5960 17498624 17726662 17556627 17295904 17376139 17832072 17670290 17500519 17822380 17717195 17501868
5950 17501868 17693243 17770434 17593716 17908689 18019761 18220654 18413335 18547912 17817795 18911754
5940 18911754 18664348 18438514 18579386 18479639 19067129 19270051 19322815 19410911 19614691 19524060
5930 19524060 19098325 20015032 19825458 20108790 21076319 20882244 21238764 21683207 22161445
5921 22161445 23049322 23317806 24554810 25652385 26753971 28255912 29740037 31750460
5913 31750460 34493673 38696024 43201835 48021886 53979994 57289064 59128679 59656717
5905 59656717 57048876 54346082 50611735 46325160 42466822 39145950 36243081 34476510
5897 34476510 32528749 31556733 30891891 30741056 30131228 30600769 30620559 31314947 32471874
5888 32471874 33537940 35071140 36452702 39156420 42447340 47021772 52706396 59116598
5880 59116598 65055019 70835995 75061979 78293582 80434643 81210205 80284836 76819764
5872 76819764 72859553 67216311 61495635 56059269 50617600 45563008 41656289 38310450
5864 38310450 35709725 33805657 32091741 30480960 29661802 28829425 28987504 28800516 28692525
5855 28692525 28796005 29150687 30545646 31684662 32999336 35553795 38560756 41954388
5847 41954388 47142063 50111109 52694909 53092183 51783006 49500904 46086779 41949318
5839 41949318 38761762 35315181 32619316 30684621 28494577 26835355 26149806 24699321
5831 24699321 24473819 23651237 23375683 22568356 22132404 22184640 22207884 21391173 21615829 21298743
5821 21298743 21441472 20945643 20801016 20854125 21268816 20913565 21024348 21025050 21105398 21721508
5811 21721508 21562946 21806648 21735749 22209120 22660322 23032061 23659946 23968517 24274259 24288248
5801 24288248 24288430 24520652 23986412 24347408 24108987 23974005 23917596 23876812 23503810 24315032
5791 24315032 23899837 23971523 23993526 24598327 24909775 24634306 25163120 25573250 25066620 25610021
5781 25610021 25785644 26341259 26734556 27354671 27253668 27593698 28262862 28366124 28570980
5772 28570980 28901768 29253617 29512324 29644759 30339362 30174531 30542015 31001170 31007778 31688928
5762 31688928 32269139 32773021 33525165 33581225 33930899 35028255 34782101 36189204 36898270
5753 36898270 37190554 38014118 38018683 38773574 39388382 39994275 41041499 41304506 41933066 42685745
5743 42685745 43777229 44317994 45079374 45286258 46840558 47359544 47946790 49322848 50256217
5734 50256217 51231407 52626795 53410514 54899999 56057451 57394429 58894729 60213679
5726 60213679 60950156 62421915 63798360 65049716 66833430 68206777 70030685 72709461
5718 72709461 75309964 78471745 81908176 85365782 89370299 93397496 96962231 100573922
5710 100573922 103403838 106337429 108233445 109495317 111361054 112491650 113595525 115328553
5702 115328553 117077901 119211827 121449204 124859987 128466293 132079539 136519506 141070758
5694 141070758 146014189 151134144 155709228 161041790 165557113 170033232 174691067 179206530
5686 179206530 184144391 188702981 193613193 198465520 202334630 205561115 207247192 208318548
5678 208318548 208716544 207235212 205711818 203143276 201179406 199549082 198946926 198954985 200053304
5669 200053304 202113440 206357707 210807467 217072749 223343112 230166984 237762112 243450720
5661 243450720 249135103 253723191 256755138 259278395 259979462 259985213 259444738 257334848 255964223
5652 255964223 253203053 250926329 247614306 243471556 239690172 234396432 230434386 225450402
5644 225450402 221614705 218636124 215506670 214051564 213330401 213242733 214902641 216534983
5636 216534983 219726082 223363819 227212661 231998113 235888581 239806707 243254399 245595630
5628 245595630 247117429 247810792 247573586 247345392 245599185 245151200 243551112 242537522 241925319
5619 241925319 241752332 241806035 242838938 243553043 245032628 246130230 248447254 249709006 251075845
5610 251075845 252047441 253061618 253993862 254262685 254900354 254958598 255102674 255682119 255018434
5601 255018434 256129506 255914075 255680724 256358437 256458776 256714882 257954633 258821037 260754875
5592 260754875 262864021 265149022 267066192 268935640 270090652 270517231 270068019 268835253
5584 268835253 266147369 262731242 258174580 253178461 246550105 240720596 234449475 227739054
5576 227739054 221033014 214963002 208926607 203404112 198873263 194809696 191338214 188097542
5568 188097542 186417491 184090552 183246599 181784485 180260794 178767179 177065238 175000524
5560 175000524 172027628 168999234 166501701 162831973 159491706 155873127 152909768 149644337
5552 149644337 146031389 143231883 139485814 136151121 133353415 129820949 126757357 123079079
5544 123079079 120392204 117401287 114966069 112731108 111212695 109090191 108440709 107795559
5536 107795559 107598015 107639330 107893405 108522528 108548452 109906746 110997978 112759596 114788310
5527 114788310 116509024 119224678 122105380 124979796 128129369 131477524 135513925 138706365
5519 138706365 142992788 146643253 149923295 152844252 155151507 156707976 157023770 156406825
5511 156406825 155115529 151764881 149587556 146146747 143345672 140327454 138045756 137146196
5503 137146196 135879637 136075198 135991663 136360610 137771803 138361808 140354216 141711165 144531799
5494 144531799 147927622 152444162 157942980 164107171 171067086 178735543 186122024 192726333
5486 192726333 198802373 202962493 205015980 205804566 204219154 199849951 193932151 186946481
5478 186946481 179896338 170531312 162271771 154722056 147185470 141023873 135768561 130862843
5470 130862843 127686444 124039649 121778976 119802216 118267746 117140735 117592986 117927352
5462 117927352 119754267 121848105 124855291 128731490 132406543 136314086 139740031 141813304
5454 141813304 142359403 141183819 138702125 135657888 131082194 125292413 119939105 114167795
5446 114167795 107873561 102819644 98195050 93839547 90385766 86691842 84817325 82399705
5438 82399705 79963914 78558512 76750084 75467799 74176304 73349440 72886342 71991002 71551953
5429 71551953 71834755 71442935 71881503 71960724 72788843 73580197 74747171 74683030 76555075
5420 76555075 77239580 77636484 78693215 78877736 79524733 80022686 80174814 81253508 81783532
5411 81783532 83309426 84252197 85146028 85593377 86283382 85627346 85741632 84875076 83684563
5402 83684563 82870234 81878607 81467647 81163075 81501088 82230676 82799748 83595152 84398115
5393 84398115 85459910 86861653 88285153 88850816 89178329 89831634 89745375 89383192 88865168
5384 88865168 88609497 88702992 88341541 88659773 89595275 90004773 91359107 92462920 94656161
5375 94656161 97511814 100035695 102715213 106084214 109821564 113535260 117423170 121421619
5367 121421619 124801999 127636212 130105520 132654730 133829027 135247839 135895435 135428537
5359 135428537 135493697 134635261 133777773 133828800 133932854 134269545 134877126 136695847 138360818
5350 138360818 140838914 143839675 148385581 152925779 158468299 163571157 169623283 174246330
5342 174246330 178971239 183302275 186396267 187979545 188052657 186508300 184416439 179903600
5334 179903600 175825732 170514969 165574771 160049057 155218602 151370659 147407050 144181829
5326 144181829 140994110 138469076 137102606 136316894 134972492 134513367 133321859 132630244
5318 132630244 131385365 129505148 127701871 124114955 120448640 116340685 111820182 107083229
5310 107083229 101702035 97226822 92485873 87946919 83618531 79384008 75758856 72837645
5302 72837645 70030816 67403661 65049711 62823507 61156410 59110599 57557979 56247553
5294 56247553 54586628 53529131 52122350 51091111 49390868 48921337 47880055 46642794
5286 46642794 45975934 44959035 44030221 43280628 42102435 41828131 40708300 39869686 39194230
5277 39194230 38770425 38386213 36828810 36991225 35663814 35184503 34950625 33938685 33850398
5268 33850398 33073436 32451057 31962238 31323170 30668255 30092528 29827790 28723191 28593387
5259 28593387 28779169 27926611 27635707 26929442 26531557 26058633 25709094 25556437 24723690
5250 24723690 24528347 24047299 23396735 23026504 22669503 22581329 22697718 22115038 22106675 21868619
5240 21868619 21604452 21329108 21454346 21258627 21850767 21398448 21311854 20547496 20891010 20553068
5230 20553068 20295193 19847602 19835635 19657913 19179175 18714166 18914853 18415854 18202254 17985166
5220 17985166 17723172 17673875 17366561 16951868 16800201 16453497 16576229 16504397 16175595 16093545
5210 16093545 15689654 15531557 15476859 15497890 15674835 15161411 15101598 14902691 14360796 14322342
5200 14322342 14559045 14742019 14401827 15022811 14464689 14677882 14458087 13587753 14087044
5191 14087044 13230471 13420818 12638150 12366274 12231330 11614493 11943581 11735909 11931600
5182 11931600 11372699 11100678 11361268 11419688 10975877 11136049 10762333 11107133 10541403 11136287
5172 11136287 11007738 10784919 10559743 10500829 10513182 10582053 10351509 10900590 10773515 10827582
5162 10827582 10501812 10634065 10821488 10826216 10882690 11332532 11531789 11327277 10813649 11024208
5152 11024208 11611831 11183042 11513649 11107264 11352833 11441347 11345340 11184445 11494456 11527215
5142 11527215 11588751 11358968 11886206 12058200 12337943 12211178 12707221 13140567 13060901 13533962
5132 13533962 14199799 14123592 14782470 15118042 16212811 16940952 17944946 19645003 21337325
5123 21337325 24254945 27440274 30915058 34463160 35826574 36516978 35566483 34187439
5115 34187439 32271717 29753687 27337096 25339997 24231456 22858434 22088546 21153869
5107 21153869 20505209 19280409 18647270 17664947 17395032 16711880 16823600 16107969 16377721
5098 16377721 16065750 16308216 16607925 16444506 16797045 16654947 16453900 17402862 16749771
5089 16749771 17351528 18200811 18430234 18513323 18983517 19213599 19699316 19813575 20163027 20028565
5079 20028565 20673341 21155714 21386927 21225803 21618546 22077058 22376712 22967694 23702600
5070 23702600 23645912 24306674 24562724 25222806 25921528 26321241 26536820 27258941 27469260 27744941
5060 27744941 27569401 28464102 28948347 29401804 30019661 30880572 31915150 33641168 34816641
5051 34816641 36677061 39214847 41912217 44289458 46292441 47833061 47965725 48447175
5043 48447175 48913578 48637504 49193415 49405387 49600753 49742769 49901596 50599107 51248386
5034 51248386 51749649 52252216 52838212 53717564 54198855 54420813 55010306 54816700 55491727
5025 55491727 55697530 56328307 57739725 58217067 58763300 59267504 60491486 62263069 63540438
5016 63540438 65531962 67476448 69668609 71557335 74868395 77959564 81840179 86141204
5008 86141204 90847235 94685171 99292678 102693176 106272079 109063135 109909366 110628234
5000 110628234 109600750 108336712 107015376 104856309 103964214 102803998 101935619 101638251
4992 101638251 101955597 102356630 102912625 103496661 105312025 106861828 109302234 112613454 115510739
4983 115510739 120261234 125346604 130678566 137825347 144875767 152282940 159780578 165931930
4975 165931930 170788081 174467352 175962807 175542516 173033183 169193938 164251325 158915099
4967 158915099 153657592 149255905 144778540 141693998 139023671 137157618 136528819 135193887
4959 135193887 135551549 135944484 136755942 138455895 139848024 142268553 145655632 149821273
4951 149821273 154094489 159214857 165364354 170152707 175634358 179879407 182531559 183175064
4943 183175064 181415456 178038619 172593335 165821132 158917261 151713115 145307440 139104484
4935 139104484 134511495 130098968 126548259 123942743 121851594 120417935 119056514 118059663
4927 118059663 117069107 116682946 115559080 115405235 115267830 115864436 116716864 118271211 119734013
4918 119734013 121283265 121827303 122528239 121474876 119595104 116734442 113211326 108623957
4910 108623957 104956748 101368856 97864040 94638867 91771130 88511724 86235096 83191546
4902 83191546 80949673 78359473 76192417 73908383 72325646 70447349 68791162 66492083
4894 66492083 65729013 64176264 63266142 62479251 62157307 61729807 61844168 61218625 61091529
4885 61091529 60388312 59410960 58822004 57240947 56138793 54109680 52797992 51386926 49397586
4876 49397586 48737775 47521010 46730724 46050550 45059657 44649594 44076297 43640149 42750442
4867 42750442 42557618 42016837 41616661 41056741 40663308 39999503 40761950 39577852 39669692
4858 39669692 39466205 39660798 39792861 39353731 39150645 39231865 38824363 39631342 39799941 39621366
4848 39621366 40033059 40211767 39926789 40580064 40671838 41477494 42136517 42800228 43482210 43919339
4838 43919339 44083918 45229728 45398215 46518261 47437030 47879807 48452508 48623762 49443422
4829 49443422 50110985 50514111 51868924 52648276 53443660 55107543 56145309 57051111 57969808
4820 57969808 59467989 60569341 61860015 63313196 64943674 66178261 68080440 69463784
4812 69463784 71658283 73226636 75144902 77021069 79254902 81237248 83017568 85768576
4804 85768576 88670147 90818447 93468816 95712040 98730278 100750214 103301114 105606136
4796 105606136 107781963 109304239 111210599 113246146 115339716 118126375 120486135 123396205
4788 123396205 124973676 127600319 130424152 133148331 135778373 138309947 142041582 145587193
4780 145587193 148724139 152864783 157204497 161931566 166098022 170547373 174759303 179651933
4772 179651933 183879541 188686453 193502473 198169590 202606490 207774865 211546788 216043163
4764 216043163 219539875 223322811 226410288 229680217 231793122 235293211 237848305 241215531
4756 241215531 244495556 247442646 250099847 253129678 255902543 258343355 260689264 263543081
4748 263543081 266809370 271030851 275445330 280693469 286539235 292640871 298542129 305093841
4740 305093841 310778027 315535379 319778127 322618530 325356667 326350425 326691248 326122051
4732 326122051 324097644 322023337 318698828 314775462 311258526 307577641 304370903 300771997
4724 300771997 297330747 294312655 291854738 289183858 287888844 286601306 286195130 285546679
4716 285546679 285337000 284863807 284217697 283462994 281314420 278535358 274923370 270561050 264782180
4707 264782180 257323367 249632202 240771912 232964904 224371103 216050419 208838851 201612674
4699 201612674 195730746 189974891 185621118 181337578 177641867 174425910 171143348 168478122
4691 168478122 165743736 163131292 161163611 158877288 156515109 154262822 152047964 149429635
4683 149429635 147262625 143491936 140266227 135463326 131901900 127835167 123874315 120601077
4675 120601077 116587701 113039265 109647851 106101290 102923513 99575789 96708803 93194885
4667 93194885 90688505 87452099 85220032 82906153 80209011 78310620 75980345 73825144
4659 73825144 72025753 70102099 68023381 65646982 63622365 61621807 59788258 58706836
4651 58706836 56610870 54556718 53151057 51489235 49819006 48153367 46885604 45473950
4643 45473950 43635702 43186666 40967350 40057377 38509341 37606937 36064734 34624024 33660346
4634 33660346 32825508 31649910 30736810 29844333 29304527 28641711 27624418 27193831 26926265
4625 26926265 26297364 26089621 25336135 24913152 24159423 24325743 23231419 22960609 22691062
4616 22691062 22484581 21630443 21672922 21310033 21323793 20673120 20256387 20285471 20234054 20084491
4606 20084491 19586217 19100641 19580758 19277053 18788420 18867620 19020630 18235033 18464142 18221236
4596 18221236 18213154 18222335 17774495 17604016 17877050 17774015 18157170 18296134 18568120 18415266
4586 18415266 18249849 18170480 18236348 17931241 17978486 18448510 18421320 18159593 18238219 18337140
4576 18337140 18165727 18392875 18523156 18585545 18637698 18737345 18699168 18770650 19227975 19351357
4566 19351357 19212099 19149615 19480556 18788236 19810423 19609088 19760919 19910504 20321907
4557 20321907 20679989 20815186 21264283 21658544 21535943 22112535 22524607 22938547 23121142
4548 23121142 23330676 23506591 24061170 24119380 24215484 24984083 25704321 26608501 26873790 28397847
4538 28397847 29163979 30110318 31729772 32875233 34048058 35328523 36406076 38040861
4530 38040861 40397841 43352898 46395827 50407786 55281904 62594213 72391468 84429017
4522 84429017 97611119 108598607 115458723 116575169 113092138 107618558 99071433 90577626
4514 90577626 82075833 75063676 69390646 65522225 62666432 61633702 61300953 61776628
4506 61776628 63022775 65359578 68177410 72101566 76649080 83789584 92357693 103349704
4498 103349704 117202405 131553925 144088511 152938650 156879280 158756016 159202381 160153669
4490 160153669 163949940 173440829 192077486 219837898 252981373 283321101 303318998
4483 303318998 307673872 299202490 281458803 257446674 229577131 202033497 177537236
4476 177537236 157964118 142266853 131212142 123919719 118716547 115969893 114651983 115072776
4468 115072776 118674789 123151291 131915789 145172081 164790598 193701039 230218762
4461 230218762 268566670 299983900 317326933 319287663 308180622 288005939 260553577
4454 260553577 230052773 200623221 174123590 152048714 133938722 119217537 107105240
4447 107105240 97239941 89535343 83123530 77892639 73534125 69826345 68138484 66398152
4439 66398152 65724530 65136331 65368269 66239282 67484806 69307061 71994359 73368617 74044169
4430 74044169 74064960 72902092 71438418 68434120 66015147 62872805 59678499 57547443
4422 57547443 55681507 54369429 53429573 53708259 53466373 53167360 52724211 52077822 50978932
4413 50978932 50342416 49052492 47718980 46092392 45078613 44789985 44660974 44829589 44383224
4404 44383224 44277581 43630324 43344866 43016055 42643107 43177489 43901144 44595988 45437433
4395 45437433 46067243 47256744 48177784 48239528 47844403 47091061 46646097 46065897 44472221
4386 44472221 44148751 43608338 43687656 43896384 44616822 44754743 43984307 43382007 42597772 40760332
4376 40760332 39628993 38146788 37818467 37662113 38291853 39779815 42049006 44315488 45464163
4367 45464163 46147895 44977508 43888851 41910551 40094693 38606446 36716306 36449386
4359 36449386 36253049 36403952 37987103 40225350 43169157 44776648 45638803 46488120 45877870
4350 45877870 44757067 44439771 42395036 41091098 39908359 39311694 38705914 39091772 39603099
4341 39603099 39957262 40277307 39999241 39645398 40133282 39422795 39653094 39967579 40819243
4332 40819243 41280483 41273251 42422958 43600298 44767320 46529645 47611612 48535999 48843089
4323 48843089 48732110 48494454 47951003 48146512 48464341 48828160 50433092 52389216 56407894
4314 56407894 61717517 69283975 76840421 83054027 86886260 88339104 88533261 86468438
4306 86468438 84081835 81130388 77979244 75576009 73508010 71620636 70152969 67052214
4298 67052214 64623498 61587455 58820366 55776393 53763658 50682358 48579872 46615586
4290 46615586 45009895 44021081 42773975 42178882 41881783 41778246 42243511 43411328 44330255
4281 44330255 46972295 49335893 51369630 53753533 55078484 56337294 56307697 55890033 53818666
4272 53818666 51295964 48742121 45666541 43127113 40639887 38506470 36387606 34423125
4264 34423125 33221739 32078017 30767976 29717154 27943571 27773876 27319463 26447555 26661446
4255 26661446 26317877 25831364 25510916 24633794 24133654 22934771 23145789 22877637 21823395
4246 21823395 21607020 21033330 20471086 19860658 18933515 18688642 18551283 18209759 17745709
4237 17745709 17010193 16291481 16171813 15518496 15412668 15023548 14770824 14098774 14255968
4228 14255968 13939945 13679483 13766662 12617233 12816626 12003088 11621512 11316133 10712487
4219 10712487 10670149 10536407 10136332 9925026 9076188 9456578 9186479 9152308 9337575 9280025
4209 9280025 8782381 8488651 8529961 8248142 8532691 8225107 7766423 7603306 7485001 7227263
4199 7227263 7350283 6345526 6446953 6697129 6582827 6356892 6382863 6110188 5832013 5531874
4189 5531874 6384397 5508226 5634658 5412620 5063880 5585370 5166976 4944209 5206219 4805123
4179 4805123 4937702 4305174 4354012 4476377 4279191 4002980 3751314 4272828 4030661 3910761
4169 3910761 3982897 3756477 4259861 3484739 3436875 3717579 3277363 3502302 3111751 3264521
4159 3264521 3660093 3011881 3548897 3322765 3165472 3661578 3659667 4007097 4213953 4274829
4149 4274829 4455054 4245892 4928584 4779997 4433378 4666444 4043264 4056139 3396454 3121294
4139 3121294 3169319 3024484 3050531 2498638 2503671 2590431 2130767 2994747 2325628 2583938
4129 2583938 2282232 2470034 3201922 3364549 3717021 3601366 3263406 3437557 3523418 3708093
4119 3708093 3138619 2982824 3125683 2152608 1900324 1740295 1690686 1805492 1557609 1229927
4109 1229927 1020939 982786 1563709 1172839 1305963 915605 543636 987902 1107349 1067966
4099 1067966 965826 284137 801999 634482 540595 143344 537048 633751 600756 539021
4089 539021 585496 334116 685224 989221 473162 556404 351167 936724 748940 802799
4079 802799 332357 664409 714151 749560 459202 811746 672514 589780 796279 675032
4069 675032 269373 358023 342676 186799 359232 607522 667281 730735 745312 1022944 590025
4058 590025 753518 959593 1487218 931805 1186245 1525276 837584 1248220 1768407 972181
4048 972181 1050284 1416933 969463 827325 1383613 894962 1135003 1062928 1188484 1357667
4038 1357667 1121123 1833465 1831564 1616954 1867220 1697303 1814210 1772822 1538529 1870409
4028 1870409 1845030 2127106 2241637 2279278 2518671 2634989 2448323 2792933 2479117 2809559
4018 2809559 2983785 3325913 3325575 3931389 3790208 4002513 4069959 4292190 3840576 3881575
4008 3881575 3447281 3440332 3213827 3112523 3066402 2220472 1964182 2540974 2438823 2247662
3998 2247662 2435391 2743095 2756631 2557760 2940682 3222298 3438532 3639011 3608399 3483187
3988 3483187 3338070 3204362 3204963 3255321 3259254 3471189 2685045 2253457 2304606 2028785 1849422
3977 1849422 2118438 1873606 1699264 2225662 1390293 1575049 1503274 1836754 1956242 1793933
3967 1793933 1746222 1263871 1651877 1599644 1466163 1177967 957257 1103399 478531 751060
3957 751060 562811 246531 642053 103635 -10538 166331 68705 169104 -74378 201320
3947 201320 288348 -161800 -68623 192890 93871 99632 -307786 -165680 -33696 -629469 -225901
3936 -225901 -410379 -448293 100611 71427 -570374 -347949 -544049 -410494 -783889 -514054
3926 -514054 -667173 -486645 -736298 -722581 -452689 -387658 -524125 -370232 -727231 -523285
3916 -523285 -720311 -848093 -515517 -613139 -180726 -439317 -852461 -512046 -221939 -549887
3906 -549887 -138585 -732914 -826295 -803121 -582046 -920411 -761362 -1056013 -645861 -535110
3896 -535110 -561982 -1030110 -642471 -981616 -935886 -700049 -916683 -798661 -703821 -483719
3886 -483719 -934115 -823650 -1069156 -923808 -472575 -770553 -628551 -998673 -1328864 -592724
3876 -592724 -744458 -728120 -959008 -941398 -999135 -1028770 -786571 -690894 -891959 -1081374 -718519
3865 -718519 -916953 -988121 -806970 -1265337 -1216758 -1071501 -932549 -996722 -992400 -814045 -815847
3854 -815847 -524707 -852433 -891587 -965753 -950098 -738051 -759017 -566624 -957323 -748230
3844 -748230 -1091766 -1002578 -1041121 -1012239 -510108 -1062987 -1142822 -882381 -1023267 -891442
3834 -891442 -674383 -1130442 -1035582 -618501 -736434 -998390 -948085 -1070774 -1224220 -1050157
3824 -1050157 -1102721 -971469 -670196 -832099 -673696 -1238873 -702887 -1093141 -1088731 -889732
3814 -889732 -817049 -1275691 -1139352 -976250 -983359 -1104232 -843176 -1200475 -1104677 -806463
3804 -806463 -1068598 -560204 -839970 -221285 -1275269 -1008237 -917598 -836007 -752585 -1062780
3794 -1062780 -1001371 -1011859 -1018948 -697000 -1112402 -1367370 -1017983 -1218179 -1287587 -1236066 -1228148
3783 -1228148 -1091855 -908626 -1230790 -631801 -915847 -959126 -967701 -717625 -1330401 -830137
3773 -830137 -650234 -649934 -942201 -567144 -623940 -827248 -561798 -840840 -309569 -611175
3763 -611175 -795882 -1265129 -708132 -1274625 -1556361 -534091 -1163284 -844857 -1074055 -1080200
3753 -1080200 -746695 -1162337 -836144 -743559 -532643 -830170 -1353589 -1103616 -705253 -957475
3743 -957475 -327500 -839171 -1113624 -555869 -524774 -515286 -756472 -505995 -792997 -801422 -561880
3732 -561880 -718384 -907139 -722336 -1486219 -879836 -989575 -881638 -1204392 -687271 -1201837
3722 -1201837 -1176111 -981166 -1122418 -1023761 -725420 -545781 -985826 -1212552 -1289711 -853789
3712 -853789 -956892 -772398 -549859 -646633 -732195 -954361 -896656 -464105 -900235 -522308
3702 -522308 -1102217 -1123593 -1006887 -808626 -1128495 -1197349 -754685 -1196607 -711625 -923784
3692 -923784 -785267 -842366 -979654 -1091687 -982670 -1078074 -929203 -1139660 -929004 -881950
3682 -881950 -935980 -668645 -1047293 -986976 -632069 -1005411 -387827 -1303400 -741151 -575285
3672 -575285 -899239 -789127 -1033989 -1024890 -1011932 -774756 -1115950 -281328 -875744 -1514998
3662 -1514998 -724515 -1108364 -752708 -646467 -885744 -1062200 -1134415 -1143132 -836506 -885085
3652 -885085 -364367 -666153 -1320314 -462819 -902980 -206691 -645406 -888265 -361987 -683617
3642 -683617 -786227 -830290 -720963 -730110 -741106 -443309 -1044524 -730438 -1064063 -920005
3632 -920005 -895893 -1460918 -1000982 -1121218 -1373821 -845040 -1171463 -1111204 -1048814 -1176754
3622 -1176754 -1121087 -542344 -766919 55561 -846350 -564928 -413569 -837355 -308989 -709758
3612 -709758 -321635 -947532 -1267938 -678474 -864141 -231517 -1046704 -660438 -820319 -849092
3602 -849092 -321484 -834242 -488472 -960730 -997377 -264879 -862960 -471976 -782165 -1099153
3592 -1099153 -420114 -1010911 -930999 -303327 -540390 -366130 -575580 -935133 -264205 -636760
3582 -636760 -492910 -1000321 -773186 -519107 -680140 -464471 -315904 -207196 -607978 -402904
3572 -402904 -657571 -485378 -428467 -1094484 -636557 -637442 -975497 -978688 -711650 -879733 -923680
3561 -923680 -825885 -597155 -689000 -1053101 -983085 -907677 -756091 -816707 -730998 -657257 -439106
3550 -439106 -259950 -186703 -502633 -305196 -631871 -252144 -316800 132678 -398949 -507953
3540 -507953 -913565 -551214 -267617 -1135188 -716255 -877003 -999333 -789296 -637168 -573359
3530 -573359 -497298 -1098211 -751883 -618878 -1249410 -584991 -722255 -925266 -802916 -525715
3520 -525715 -975712 -583469 -230343 -483424 -371647 -706956 -718632 -621068 -723281 -709783
3510 -709783 -450787 -675481 -732487 -797208 -550658 -812785 -942308 -703937 -876651 -641598
3500 -641598 -382888 -465879 -423258 -392923 -527840 -402621 -551484 69576 22342 -148662
3490 -148662 -528578 -645926 -353891 -455592 -373366 -558387 -832698 -654064 -554097 -651867
3480 -651867 -685580 -705640 -220497 -470189 -697994 -587367 -530894 -467707 -159622 -108760 -487898
3469 -487898 -326066 -183870 -161821 -513925 -526134 -170757 -285243 -612336 -165071 -846531
3459 -846531 -225649 -702295 -760514 -717018 -520059 -540706 -647744 -206413 -556523 -295943
3449 -295943 -595110 -850830 -351942 -497402 -679259 -283827 -374353 -14020 -245694 -173028
3439 -173028 194254 -573259 -264448 -161435 -430520 -213233 -280704 -64026 -178987 -401947
3429 -401947 -270171 46724 -119705 -57784 -285578 -627278 -263081 30537 -233242 -398463
3419 -398463 -138601 50720 121662 53560 125227 23290 -142600 197944 32229 95821
3409 95821 211788 -125411 151421 44840 -278393 280787 141387 34525 326120 52374
3399 52374 340250 65034 590915 659455 305534 656507 351634 558907 884417 1082311
3389 1082311 918250 1030158 899302 1380449 1544269 1768470 2689338 2911070 2923558 3448719
3379 3448719 4033206 4453939 5181604 4979145 5751330 5512822 4975400 4515461 4539843 3446659
3369 3446659 2638370 2153387 1525283 1870270 1367232 1024681 1532347 704559 639580 280303
3359 280303 538745 988107 475353 863473 299295 -329757 634849 250395 1034826 940392
3349 940392 606181 851125 1002623 1299411 1129020 1161959 1081503 1200818 1015654 1195512
3339 1195512 1625992 1459801 1041320 1582310 1008842 1347373 1516335 1899872 2509371 3020378
3329 3020378 3391243 3384805 3656260 4256795 4500683 5309716 5693204 6420522 7937840 11138630
3319 11138630 16426738 25187824 32449978 37230881 38173049 35602060 32036936 28434205
3311 28434205 22635483 17600986 13333485 9393910 7503858 6498143 5711702 4721204
3303 4721204 4288318 4095696 3472513 3152297 2853665 2368271 1937981 1610165 1752289 1400405
3293 1400405 1130698 1231631 1116097 861046 887733 1197572 1220800 1198764 1004191 840893
3283 840893 107273 1091770 370684 621657 582723 372201 772674 465758 390262 697941
3273 697941 530555 146845 476311 185661 136993 1214 103057 54434 -91742 -60770
3263 -60770 202261 -118283 -240146 552184 -66976 -139403 302399 -277283 -306807 240972
3253 240972 59332 329460 160228 168232 198081 -141514 -57009 -137282 -236527 -299819 -10304
3242 -10304 -258763 -98150 -809917 -479325 -65400 -999227 -51024 -342006 -623711 47946
3232 47946 -402523 -212071 -153970 24462 -31611 108842 -336171 -345309 668695 64610
3222 64610 33257 386831 -39085 -76279 -235268 319847 14910 -79406 -204039 -644447
3212 -644447 -618220 -849269 -477891 -599614 -438392 -131089 -508195 -893537 -424300 -32643
3202 -32643 -504955 152651 -434912 -613299 -270395 -580470 -84120 -51259 -153619 -119268
3192 -119268 10330 -131760 -111219 -120887 -289969 -244047 -468430 -435367 -586796 -608339 -844458
3181 -844458 -704890 -734838 -971361 -627611 -490578 -348480 -619107 -819151 -384838 -501276
3171 -501276 -11524 -543561 -308597 18050 -596988 -101275 -190498 -61342 151308 -370666
3161 -370666 130660 207245 128514 -50599 -265598 -639814 -440560 -249134 -469925 -267930
3151 -267930 -457460 -311789 -298710 -469538 -565121 -215217 -390761 -341754 -241506 -428455
3141 -428455 -395487 -279757 -699757 70316 -372465 -292311 -193930 -448351 -604044 -309595
3131 -309595 -417299 -50012 -302992 -549949 -327179 -609610 -441757 -330075 -466390 -417685
3121 -417685 -654574 39428 -540178 -278069 -10794 -343284 -492622 -148190 -145433 -544233
3111 -544233 -251527 -432249 -446768 -483330 -482034 -549617 -125084 -83798 -569676 -240010 -388364
3100 -388364 -521208 285659 -267557 -43138 -339981 -234605 -172289 -95495 -82423 -518053
3090 -518053 -284548 -508142 -33602 -11815 -121999 112920 -195087 -375666 -351521 -343254
3080 -343254 -198585 -372137 -82154 -185632 -430705 -279773 -313073 -711410 -166883 92222
3070 92222 -574189 -65353 -175308 -516911 -397685 -343002 461168 -311938 44059 -456670
3060 -456670 -195458 -65286 -454008 18811 -845302 -113918 -196209 -570942 -163979 -385640
3050 -385640 -60990 -380408 -666793 -210246 -471521 -173595 -134332 -498786 -471132 -806271
3040 -806271 -174992 61962 -839292 -626119 -621403 -638086 -83607 -403898 -348205 -113547
3030 -113547 -549101 -124822 -440665 13610 34208 -343756 2650 -139176 15004 -205733
3020 -205733 108889 -135653 -456084 -164417 -618424 -391024 -316671 -712816 -230109 -470958
3010 -470958 -67561 -557804 -418075 -425425 -284973 -280401 207449 -142604 -348271 -217556
3000 -217556 -31634 20530 -80427 -57227 -35530 -473430 -81432 -286352 -306268 -525132
2990 -525132 -187671 -536509 -165194 -422795 -420387 -407498 -714531 -173300 -72032 -341953
2980 -341953 -168685 -501393 -215202 -489572 -491117 -29560 -658991 -548304 -441019 -474703
2970 -474703 -535428 -118283 -195734 -435322 33700 151878 -135054 268944 16498 227207
2960 227207 -173201 -341070 -178092 -821131 -279902 -85534 -39784 -300567 -396581 -455345
2950 -455345 -349317 -537929 429837 -358290 -220580 -391110 -521336 -325131 -573723 -199071
2940 -199071 318137 128460 194203 -30293 121182 -277972 -221014 -187379 -368851 211871
2930 211871 -9424 -120688 -783223 -565132 214750 -380110 -594905 -129854 -393416 -225439
2920 -225439 -46693 -255366 -131174 -722552 33359 -177038 97438 -281969 2082 -137710
2910 -137710 1411 -187593 -392619 -468126 -73395 -720693 -278520 -247237 -458114 -376940
2900 -376940 -274608 -252489 -167431 -177502 -333456 17155 101433 -74382 317027 -58596
2890 -58596 15716 -29253 -647025 -307348 -384201 -222685 -170447 -215175 29980 -345983 -358888
2879 -358888 -165331 -589277 -49435 -218843 -214670 5947 -181454 -965 -158645 -6662
2869 -6662 -132021 -66330 -43956 51747 -228247 -235534 -263787 -61742 -834010 -705032 -175512
2858 -175512 -371779 74433 -96476 -310593 -620497 -457736 179408 -156357 321816 -79142
2848 -79142 -23872 -457741 -250993 -37648 21269 -365676 -370088 -165721 -397747 -237690 -187386
2837 -187386 -309332 -12295 -245843 -56707 -529487 21460 116891 -51642 -459466 -321340
2827 -321340 -76752 -423482 90779 -31348 141215 -355900 46966 109408 -68919 -242048
2817 -242048 18509 -265550 -593712 -184299 496170 104684 -79196 -312713 -54959 119423
2807 119423 -308520 62215 100023 -415571 -211514 -404323 -535788 114365 -317426 33585
2797 33585 -403452 -297000 198737 127018 -335224 -226254 127069 -37327 71209 24026
2787 24026 -215866 148301 400892 -128154 -12984 -127244 85120 80128 -231651 56161
2777 56161 112077 -114469 89194 -106234 -370534 -358384 -376095 -543669 -363319 -48127
2767 -48127 4724 -3113 126423 -56727 129619 204730 -164407 284215 96153 275313 -419882
2756 -419882 -199513 -347494 -387786 -194718 -6898 295461 118820 17392 14557 -348709
2746 -348709 -77696 -217675 -237584 -11178 -216264 -42441 -190379 -351217 25256 -1746
2736 -1746 98783 624260 384332 -141171 153255 286915 -261335 -399741 -98225 235582
2726 235582 -2439 114764 -386309 62775 -121825 -395126 113781 69300 -48504 -406138
2716 -406138 130382 297616 -178675 -103239 -249589 -291768 -117398 -19626 -116366 -307543
2706 -307543 -342714 -319269 67915 215701 -376007 -86149 -182507 4657 -191609 310562
2696 310562 182266 207157 -93922 -245005 200499 160462 535785 186052 464339 355206
2686 355206 -124410 155785 -270193 -2076 -313485 -212559 -628681 -402954 172683 -465944
2676 -465944 -193456 -339909 -431590 -272306 -332169 156711 -24792 232822 21158 325580
2666 325580 -84681 132975 204662 159323 185996 -81489 -105023 236815 171230 -212024 181107
2655 181107 -153174 -372816 179867 -179871 -26084 -62220 48288 -545594 178278 327218
2645 327218 66281 -118008 68239 70324 -155076 -145820 61119 -120053 326531 90791
2635 90791 -1707 71524 -131277 108339 493621 89526 62241 -263681 262019 27893
2625 27893 -260295 103545 -251590 304830 212819 -321619 32485 -11013 -94447 383179
2615 383179 -269946 246093 -637162 -477991 -25382 -364172 28719 -78956 299979 196031
2605 196031 -420896 89586 -245419 158451 153910 -389051 -285301 102758 -204533 -108652
2595 -108652 -145347 155462 -110290 129860 147517 20456 -67740 91033 -177226 -132944
2585 -132944 -97503 91008 336791 -269555 304612 154337 53112 -177473 -283131 530647
2575 530647 20914 -371139 108371 -104944 -195565 -48729 172050 80803 202918 143407
2565 143407 -105403 20085 37176 175628 92802 -134632 140360 -189329 140512 -95158
2555 -95158 206760 -109017 171826 -176637 -439006 -291416 -22195 326060 -621830 -151067
2545 -151067 211426 -85239 180674 103570 267443 149830 167366 88572 608223 282788
2535 282788 477405 101928 -175789 667424 -158381 193058 -264164 348061 -116264 -401883
2525 -401883 -154261 -65397 -36554 219318 930 264096 178848 112139 360781 266485 -49261
2514 -49261 208721 252437 38134 -268827 231221 226776 139072 26777 230871 -89734 272723
2503 272723 -67207 179745 -70475 -218024 179848 68788 50493 442897 -8279 467615
2493 467615 145413 -147322 195071 -133984 272375 -219791 199998 65913 -74567 -255
2483 -255 -384952 -233049 24926 -19359 -171727 28707 480204 -188851 403003 65067
2473 65067 154602 37741 125779 -248398 335433 259987 53513 154466 459235 364312 357339
2462 357339 -266327 196960 367983 -91685 -420020 -47625 265752 -17130 331097 -301555
2452 -301555 217618 -486569 238998 -232341 -69879 4106 430883 36649 -113280 273907
2442 273907 -12807 -406249 109723 -137155 -165483 -143370 348975 454541 218279 402837
2432 402837 94549 -228307 183367 407139 412179 107327 424758 20539 45167 -30667
2422 -30667 152245 414786 268766 264362 -16538 66856 260617 -207163 349938 229714
2412 229714 -164604 47748 182076 -82954 357328 214348 193607 -212496 -50289 487009
2402 487009 234813 247163 344100 37761 408451 323471 262382 612118 119015 345807
2392 345807 -6093 98372 78775 410869 255576 -465034 81650 79221 91467 -335070
2382 -335070 320771 52963 -165303 83758 215240 62324 227567 204631 -109242 -11985
2372 -11985 -345936 25819 381021 312314 552812 -444392 -227660 214978 6488 275478
2362 275478 205585 207909 -125077 500573 271832 231849 202537 -550487 502199 -156452
2352 -156452 300396 8818 -135842 177039 291310 -48595 -64940 55911 159890 -25127
2342 -25127 18530 257512 463798 573229 178868 -209162 348094 143029 187561 580431
2332 580431 67922 397943 -29568 152488 287351 -18011 270878 -124201 61955 92806
2322 92806 -105020 46817 -119278 -82010 385105 169250 158749 366636 -107193 388991
2312 388991 534478 299075 332068 -264854 -115963 12884 635680 255822 134014 26833
2302 26833 -179170 606016 546133 582259 502763 -117902 308279 174071 388537 402545 269081
2291 269081 52317 565 -98959 -287860 169767 232194 -115156 -371699 4864 175846
2281 175846 -18864 541551 -91338 -519136 -300398 26468 316947 349384 132416 464664
2271 464664 206151 374412 503604 421820 123202 253903 110687 319137 499723 -149768
2261 -149768 396758 325348 -42507 8683 -189338 -141566 402159 423896 559977 99825
2251 99825 6171 -51867 159301 301607 400660 -59216 26484 -262995 -225358 211034 -8101
2240 -8101 66756 -108051 97876 49930 135161 288445 -44018 112367 -202288 490622 -86787
2229 -86787 -113287 273582 117216 -209714 7978 15837 79610 207772 221668 180728 -148992
2218 -148992 -374946 303338 57077 481759 293046 -202774 268118 29697 -38213 382798
2208 382798 23984 306403 -250395 157752 -63455 23010 -77656 109702 -134003 -395896
2198 -395896 135691 180131 588017 416641 22735 168381 -340677 87049 -111385 355699
2188 355699 268977 -60789 53138 365292 297175 472406 150582 175042 443848 176027
2178 176027 280697 11331 388471 270003 502329 36184 146346 673629 -24859 239756
2168 239756 288151 -23087 226700 -349020 309287 335125 447109 147621 203277 515112
2158 515112 243810 340413 411496 2170 -220001 -287870 108405 503672 176502 -201110
2148 -201110 255971 -509914 433017 562059 836212 579423 -110776 618475 -182065 719393
2138 719393 483506 466904 215552 -470706 85858 514089 -130200 -67531 147039 215755
2128 215755 -24806 2241 279592 33715 505171 116928 -262974 412952 311228 337145
2118 337145 595749 265748 600829 196806 174673 623153 495955 478427 102333 191574
2108 191574 299365 185347 291902 228075 225493 9145 228400 165123 -98544 -113713 296088
2097 296088 603490 -75669 278349 519126 240042 268760 324868 -50861 425341 190360
2087 190360 258036 303712 569320 578855 200997 -234493 44250 379462 139667 762688
2077 762688 120041 206769 324750 -26157 591231 409607 375431 452541 -62020 379259
2067 379259 121649 -53229 447609 -326802 -66443 30583 232997 -85955 341914 -156785
2057 -156785 -59374 34626 127269 339189 320794 714258 696915 5646 266491 335347 157691
2046 157691 129356 355540 417632 118710 321920 232996 481089 -329753 289992 327124
2036 327124 -107979 267507 121862 -163997 224260 367402 168747 -2713 361113 106135
2026 106135 149774 498818 300908 522291 316765 171279 589569 354562 450605 20705
2016 20705 153369 237249 311382 348869 105748 169527 66691 108083 219974 -45415 161587
2005 161587 342460 309667 -14657 -126148 557150 215744 457996 -14112 197588 499354
1995 499354 75469 39728 231295 442523 -145976 79251 -82429 698619 -176804 252522
1985 252522 379683 414978 515663 313178 172435 73238 60523 96520 486815 767997
1975 767997 214244 22982 20187 228913 188302 228696 136393 326865 -7205 -22590 245981
1964 245981 316839 -12260 342326 187711 -141395 17260 -283606 400393 20426 417606
1954 417606 157437 239989 415527 9615 508575 439768 815707 231296 2855 384586
1944 384586 254194 311863 -428991 403525 353554 -98829 423719 150702 54398 -212964
1934 -212964 129171 38111 69819 262246 646149 103254 39622 -78283 276011 712228
1924 712228 565914 -47766 462007 406464 154946 147501 446185 275195 74848 -135126
1914 -135126 111456 321620 523269 -37766 174669 268015 109837 82828 63274 -81302
1904 -81302 449188 -141344 671630 241417 131880 507590 334335 818244 223901 324621
1894 324621 636047 402539 698183 -96936 283097 187717 385801 -233654 -14882 66895
1884 66895 205575 -149221 125431 45979 -88000 456773 48948 405066 406657 163167
1874 163167 28816 86398 -24194 221859 -51157 321945 685139 274769 248356 -58926
1864 -58926 323021 100018 397686 438961 41997 11239 693745 173801 -17385 406415
1854 406415 148469 310854 353941 418292 -24933 239376 269228 -176190 141446 224322
1844 224322 209438 -26837 -170364 788900 96217 434271 888181 -35839 270924 -192087
1834 -192087 197444 532141 108838 594682 393400 324234 31213 337172 345434 181494
1824 181494 259746 152097 -248710 47990 20239 126248 -152126 -278404 476453 82811
1814 82811 258208 303427 237049 688669 200229 253113 604308 397843 789825 84767
1804 84767 823362 747417 595347 242534 45850 295945 116305 -319193 -8196 148220
1794 148220 145404 52969 379082 -24864 339111 545444 131010 274150 49179 -211888
1784 -211888 334239 217344 468401 462863 203076 -100478 -67947 224078 521242 205719
1774 205719 430746 665783 -49767 -89080 -145291 76914 106490 -157632 -82355 306913
1764 306913 -197673 110682 7763 86606 474585 210709 293244 -50374 595279 155278
1754 155278 458503 198350 103966 371040 302526 875000 664078 399803 266785 489721
1744 489721 640616 445012 276273 443820 83551 -112131 240012 310912 400191 -61323
1734 -61323 33212 -6058 358095 -40286 91926 145190 276342 -47395 195766 14432
1724 14432 360710 93291 354726 753948 634634 338589 503032 178732 902903 -43882
1714 -43882 71396 220242 281270 99976 5163 297562 -273283 -244309 393652 293222
1704 293222 -138465 148551 172860 76528 180784 338528 -32642 478659 144181 466025
1694 466025 227990 214384 131155 101133 238095 -136883 630878 304513 181778 304597
1684 304597 -47682 56383 279739 407138 257227 -75299 201796 40429 -4731 367879
1674 367879 442697 -74492 63485 188263 399896 31578 162223 511447 330770 -49934
1664 -49934 -397036 281631 335909 6268 -111596 -209658 -14772 47513 303524 250519 214020
1653 214020 163672 135771 200995 174727 -63805 -174256 -75351 74699 117149 -48243 -124273
1642 -124273 772442 289862 410376 337025 -121244 422442 430567 417162 348475 240854 26018
1631 26018 206113 -18976 -186965 698000 24964 -18783 292536 276554 273628 341669 641649
1620 641649 -15521 33615 88165 402863 -270038 516975 217419 7202 604216 366991
1610 366991 789672 106429 -142494 431672 -20321 26739 461569 -18570 230659 245495
1600 245495 328517 254269 86760 4833 312821 -127179 771394 331330 2005 68392
1590 68392 12789 231596 -66013 39461 72663 486118 271593 57849 -25690 -64463 137726
1579 137726 62279 115822 528736 29357 106008 200433 64294 305213 193235 369084
1569 369084 308007 251490 400518 10898 -174899 116594 497378 145832 -93270 37210
1559 37210 -238054 149689 67569 76047 365699 96817 333261 5081 420799 148468
1549 148468 32136 560972 152130 323153 115180 187598 372749 660433 447011 -22136
1539 -22136 513937 250092 264013 339139 144221 247716 263627 -62820 178645 92269 -144551
1528 -144551 82209 -98067 105864 -379095 54846 438575 140377 239700 241646 -33234
1518 -33234 454442 351004 133302 108051 418411 514948 302843 518759 -120394 324712
1508 324712 201543 334321 412390 672293 607279 149076 -12437 186444 928367 -127583
1498 -127583 286430 111092 -49264 146716 312462 128842 497543 432225 299858 170261
1488 170261 237553 271550 171729 228900 -153532 131159 215357 532548 421186 267184 96550
1477 96550 328322 99426 415655 352932 321777 185267 225051 291887 42405 551867 159453
1466 159453 610019 246663 -63677 48533 -28762 129812 243866 -131919 291157 -111003
1456 -111003 135771 -196249 52719 513943 -94699 201097 192799 389353 344287 366866
1446 366866 392257 364852 357883 73197 438160 415714 376344 223469 81601 62433 28785
1435 28785 428518 43417 -77008 -368957 -162783 202321 -155725 59902 -137630 215915
1425 215915 56497 -99184 596381 425834 365636 421473 120032 750276 242265 21357
1415 21357 372488 407921 310101 -319395 275627 673430 -33813 35985 -245331 290236
1405 290236 -38590 3306 417894 -44817 237315 32520 294223 211619 268161 362482
1395 362482 100093 62575 160406 -349819 456803 32050 239657 483934 42597 387366
1385 387366 39106 -28824 248933 -371401 92251 -26785 308290 398146 74708 202224
1375 202224 267433 -54982 369765 140909 159352 150552 171713 -78769 58532 382974 213958
1364 213958 -396 101595 -217474 -95376 56395 352144 594634 11548 185209 -188003
1354 -188003 461346 468066 89972 528068 718331 292094 -1181 -57499 822492 -91432
1344 -91432 376864 217318 111407 -16309 32627 69168 502902 176083 53449 -120916
1334 -120916 103456 198098 199214 379158 333460 397904 989 27304 216638 25387 341337
1323 341337 -366289 533045 271348 302202 562000 462151 541419 465039 274456 35819
1313 35819 364002 44367 -33822 80890 197480 335570 238175 -33389 314334 37560
1303 37560 -336097 230405 732235 682644 132120 -329440 483299 532406 156824 593575
1293 593575 418485 239527 929945 397914 413503 115959 544643 258902 38311 -36561
1283 -36561 331446 -492485 111273 417846 -106510 449859 -447416 -159477 -230100 -205248
1273 -205248 116205 308250 -209716 277964 286194 610772 658722 654007 442354 586421 200515
1262 200515 685432 222339 118118 199432 35735 100258 305065 166508 346247 46305
1252 46305 -224663 46108 64523 24915 266035 9656 74624 279894 404560 586862
1242 586862 295464 239151 337873 140861 235014 39554 74573 288198 488767 269575
1232 269575 18428 387298 -39387 151156 -107856 -248337 -34699 128667 228646 603070
1222 603070 417058 466267 529117 -90862 -83888 188286 36272 326679 43058 295491
1212 295491 -52750 -125313 164203 -215721 -116543 -94897 30529 -132991 -46005 170273
1202 170273 320172 -91518 409070 493692 277255 131946 340944 284857 633281 -67885
1192 -67885 -249821 153010 376973 -87863 -26890 -376504 -121131 -225959 25284 211564
1182 211564 62470 -262882 -124622 47685 384800 143079 468590 -113166 80616 -167001
1172 -167001 -19278 436719 231023 354694 273056 196139 221065 -37244 328448 88006
1162 88006 -98179 129535 -148248 -78624 62380 428937 -330674 424166 61438 137905
1152 137905 -190658 -202027 283132 497735 -191466 239768 151972 489523 -281153 62149
1142 62149 465339 496196 253555 -277067 253279 390937 223767 145557 -119278 -146533
1132 -146533 -2608 -57341 63175 -287288 -337649 -71015 -443761 181039 -40001 -351833
1122 -351833 -109333 311126 707275 149015 574374 265653 -166904 96536 192510 224422
1112 224422 85264 626927 -37677 127007 227566 -135051 430448 245306 192600 236270
1102 236270 203501 -456434 -211601 134972 70141 -32622 230955 128261 99303 212402
1092 212402 323674 145432 450458 192674 -180938 23619 318188 549545 74470 281463
1082 281463 128977 -166082 67329 488346 -142905 -287801 77941 54621 84756 211384
1072 211384 134216 102036 17823 119028 319920 295877 29484 373838 -186648 348430
1062 348430 60310 8396 120646 -4684 -29089 62857 -408106 -337640 -371697 -240146 -39210
1051 -39210 -89155 -209863 -101010 330380 466809 60420 234380 276814 -2730 -91461
1041 -91461 -234955 317225 91246 -3176 -364690 -146750 -51769 121266 -85188 -75898 9682
1030 9682 180203 160378 70640 87270 -65526 385379 138158 207594 -131798 -33197 243656
1019 243656 7163 461375 240541 193958 438523 350091 411053 40477 23850 -218886
1009 -218886 -73979 -43206 642572 -366375 -138315 67963 182989 -67293 412440 139781
999 139781 -103442 -7174 -42364 87405 -105484 -17117 -82507 -121729 621568 -420070 275897
988 275897 78409 283077 67063 -357059 -320377 170123 -317870 371285 -380319 40827
978 40827 -463415 -379597 176973 149692 65221 -51320 -21197 -69367 -486970 -201488 -97425
967 -97425 79849 331519 -188938 202308 -430953 139875 638511 -268341 6766 -24126
957 -24126 -316286 249950 -183834 153628 -56647 -59073 362780 -289061 155750 90558 -129088
946 -129088 302464 -100706 401448 425977 -102281 277432 158013 115402 7544 3557 254820
935 254820 -250555 -142075 -118567 -113179 102157 -387842 354175 -139551 -35343 27558 -92273
924 -92273 370063 310749 482611 -193428 -206176 455732 -159674 -177521 89865 -3094 -68576
913 -68576 -568092 -89748 189731 -77149 36554 -335073 -271396 -230713 -159350 80551 -230842
902 -230842 -114855 -107399 60115 285213 808368 246019 -42703 153698 -229550 374841
892 374841 -161788 -17782 -128347 -547265 -307262 -321995 -326403 -67785 -308054 -25617
882 -25617 -387417 -102936 -354221 -188848 151617 173499 -277303 125953 -317541 65572
872 65572 370882 345259 233459 395192 -23924 285103 331660 86440 434914 8473
862 8473 7951 -261126 72258 -548183 -192510 -512687 -157229 -94937 -185447 -5334 -44420
851 -44420 486814 58082 -32308 245959 29491 516769 128083 593281 -212569 276788
841 276788 300925 -176415 338373 81536 117012 116488 14231 125556 -146341 -179301 -604487
830 -604487 3363 -260242 -290318 -105132 -421363 -281402 -135881 -578574 -190293 -336986
820 -336986 31485 380683 61376 63645 -540 -39727 28883 -86280 149999 -12143 63590
809 63590 438453 377311 -259191 -364335 -378119 -120716 -428559 -211565 -92317 148327
799 148327 -643022 -183376 190178 -483149 -115608 -45391 -120769 51750 -146570 -197030
789 -197030 275792 -97875 -227126 -336861 71957 122470 70856 2016 -244245 -211677 21857
778 21857 -209562 156430 169857 -82716 58910 -308148 -16999 -64344 55867 -99598
768 -99598 -308368 -176402 -199820 -313506 -397268 -129706 -53238 -98347 48797 -43980 -208839
757 -208839 -257085 -148180 -191440 66028 174820 465490 72867 -124627 352641 270627
747 270627 359785 375614 -203207 170918 -406429 133822 103775 -430872 -656567 -98164
737 -98164 -122633 -141442 -66792 -222224 -186446 -85236 -359161 -218553 -412272 112466 -262110
726 -262110 -183757 -112372 6246 135128 -346103 -17496 -221122 -121964 53727 91516 178146
715 178146 -453464 88583 207506 144068 -189334 -474697 -230865 -554826 -202699 -312779
705 -312779 -312201 -201648 -190550 20693 -127547 -520426 -598025 21322 -170029 -201611 59101
694 59101 -166913 -178093 -280132 3553 189391 152268 -175246 -89575 230127 -439357 85324
683 85324 -356014 -245391 -134354 -42811 -77828 -531788 -160394 -656279 -198541 -10901
673 -10901 -290797 -272978 -286163 -241151 -259031 -422836 -473985 -430815 -60770 -687055 -246266
662 -246266 -252608 -77090 -93152 -32131 -334805 -44557 11395 -512157 -5031 -246711 -555337
651 -555337 -381728 -250120 -260737 -222522 60074 -80128 100038 -17904 257859 -41057
641 -41057 -57589 66514 -243704 154840 -244611 -105756 144077 -396421 -451262 90538
631 90538 -438546 174431 118199 -195070 -29924 -549911 87154 -268822 -220331 -107049
621 -107049 -266353 -113987 -94160 -86579 307078 -12802 270990 86964 -103953 27131
611 27131 -401425 -151971 -140288 -146107 -273966 -462314 -184539 -555164 892 -204038 -204513
600 -204513 320199 -90304 -407263 244863 115372 -133272 -529866 -425375 -226074 -412205
590 -412205 -367817 -540754 -398140 -529939 -500123 178511 -225503 -358848 -184267 -313122
580 -313122 -508486 -353931 -80008 -285088 -517041 -301805 -292177 -309893 -203571 -275616 207300
569 207300 -438031 -46521 -631037 -27784 -351448 -260555 -297263 -405686 30209 -610656
559 -610656 75966 -181375 -182735 -254134 -653166 -3095 -195304 -253714 -198872 -375569 -422278
548 -422278 -40849 -410106 -178448 -691229 -122864 -86330 -350449 -394317 -513073 95649
538 95649 39072 -197779 -254996 -130464 -379166 -348371 -720692 -126162 -215363 -176066 -456727
527 -456727 -413348 24496 -399795 -478011 -229739 -334787 -161197 -608641 -205475 -502474
517 -502474 -73787 -267203 -274640 -483945 -245172 -236466 -187806 -114690 -208168 -7167 207542
506 207542 -381070 -733657 -308114 -462249 -289113 -299308 65201 -545828 -539761 -386436
496 -386436 -328185 -585252 -220307 19293 -269541 41811 -8549 -528428 -159413 -399431
486 -399431 -305350 -128289 -56017 -416481 -317971 -503460 -463044 -218171 -364549 209431 -190275
475 -190275 -834142 -123645 -431677 -431256 -3675 -260014 -134919 75683 -513894 -315955
465 -315955 -340030 -320847 -155221 -471031 198139 -156803 -714889 -371581 93930 -453788
455 -453788 -469460 -595137 -424362 -509087 -599601 -379135 -655805 -924769 -261595 -622677
445 -622677 -535542 -205145 -386538 -208230 21032 -559143 -9691 -452582 -611923 14122
435 14122 -393789 -198975 -321774 -232929 60015 -300446 -337535 -304375 -571861 -475767 -769138
424 -769138 -459100 -296230 -549182 -316105 -263539 -34359 -566955 -518278 -598769 -842398
414 -842398 -317908 -336501 -625574 -28450 -605454 -603217 -447424 -529334 -218274 -407609 -206596
403 -206596 -621445 -634341 -796361 -325034 -426646 -52258 -320438 -375004 -369080 -95038 -148584
392 -148584 -342239 -377698 -127960 -408566 -135612 -531196 -289628 -658443 -464660 -321422
382 -321422 -363948 -321096 -497416 -628913 -891332 -596526 -365003 -637041 -466773 -431046
372 -431046 -306498 -481838 -581349 -583402 191799 -716739 -292512 -92436 -513152 -106694
362 -106694 -351957 -299325 -288191 -389614 -564885 -396719 -731931 -404952 -99172 -520074
352 -520074 -748913 -638150 -608029 -403617 -459921 -179384 -1063072 -837073 -543196 -537022 -411425
341 -411425 -113767 -249483 -440491 -464327 -363211 -220543 -529104 -471312 -388168 -258958
331 -258958 -566063 -398367 -471457 -628107 -359097 -585478 -624489 -196043 -419315 -222908
321 -222908 -657544 -593410 -489850 -488306 -71791 -368496 -817696 -674045 -468775 -316797
311 -316797 -584429 -643721 -259885 -355152 -466237 -1040421 -794946 -349519 -513825 26604
301 26604 -546400 -729104 -690468 -751906 -299686 -275112 -460233 -304140 -740822 -30367 13744
290 13744 -305218 -688580 -660421 -309150 -755705 -777505 -168112 -574994 -683946 -488716
280 -488716 -843803 -966262 -284940 -86208 -516435 -700635 -1033935 -453740 -912899 -687971
270 -687971 -77909 -374274 -699021 -381136 -753359 -574348 -207673 -341052 -51244 -180414
260 -180414 -652833 -775060 -479916 -296035 -767495 -302439 -640398 -735577 -665505 -689135
250 -689135 -610824 -873068 -321160 -483647 -314049 -18330 -575834 -271422 -127338 -423485
240 -423485 -726699 -209043 -24422 -567777 -410512 -588525 -794216 -390959 -873374 -559751
230 -559751 -374696 -1096234 -606690 -769811 -486474 -820980 -872678 -408341 -549204 -703855
220 -703855 -571411 -535831 111933 -1000683 -211417 -430137 -630507 -167780 -807503 -60832
210 -60832 -615941 -401039 -228751 -502788 -645543 -502784 -805850 -537815 -779913 -399097
200 -399097 -574715 -696782 -605525 -674769 -239857 -509642 -667108 -157784 -607893 -463342
190 -463342 -668657 -522284 -669477 -1028433 -598463 -361602 -675348 -932466 -642012 -639640
180 -639640 -446343 -1028258 -643149 -941284 -644926 -785403 -687645 -537841 -898525 -815084
170 -815084 -779964 -690637 -472051 -311710 -378093 -878368 -212450 -693683 -658837 -470648 -267202
159 -267202 -659008 -462809 -641303 -674330 -233882 -383651 -689145 -651226 -821198 -478555
149 -478555 -419652 -870213 -968473 -940832 -496283 -775602 -748440 -186691 -332921 -510994 -701665
138 -701665 -961339 -848951 -579724 -209500 -96860 -778597 -849205 -751741 -836109 -360782
128 -360782 -511237 -439340 -290476 -642197 -447639 -671744 -489464 -380853 -950095 -884204
118 -884204 -649057 -1041425 -931596 -429701 -1117873 -552538 -890980 -288668 -628210 -17958
108 -17958 -428909 -553917 -644401 -536187 -252642 -597985 -409304 -603620 -988293 -366278
98 -366278 -889360 -172172 -833209 -506785 -863084 -997437 -465364 -941596 -777223 -885090
88 -885090 -807053 -876243 -813603 -772381 -604168 -743004 -283469 -931257 -571340 -536417 -382167
77 -382167 -669659 -602739 -663193 -448025 -607951 -673387 -661927 -923402 -486801 -883865 -772332
66 -772332 -710298 -603309 -777054 -619484 -782087 -897821 -921355 -710454 -500235 -532399 -732096
55 -732096 -738146 -699690 -605990 -547133 -478193 -672084 -769414 -744582 -754318 -846623 -932031 -742770
43 -742770 -776826 -468499 -789863 -793142 -470551 -692014 -437593 -567115 -890060 -506413 -449153
32 -449153 -667038 -797486 -1163351 -989394 -695353 -973486 -618155 -766448 -551475 -515280
22 -515280 -850374 -817649 -607315 -779607 -693819 -558693 -663666 -685358 -710846 -801439 -844587
11 -844587 -315506 -806163 -606888 -854262 -610267 -746165 -846585 -777158 -810278 -848445 -607272
0 -607272
$$ Imaginary data points
##PAGE= N=2
##DATA TABLE= (X++(I..I)), XYDATA
16383 -2972139 -2770954 -2860684 -2358797 -2714844 -2737789 -2496023 -2523331 -2360087 -2067641 -2152467
16373 -2152467 -1931088 -2029482 -1964747 -2059776 -1798533 -1701794 -1979931 -1716702 -1745329 -1802533
16363 -1802533 -1536549 -1874120 -1530939 -1865193 -1379276 -1370967 -1661603 -1504182 -1024686 -1278112
16353 -1278112 -1006103 -926363 -968314 -986909 -593521 -673398 -862106 -540603 -731632 -820811
16343 -820811 -371569 -505589 -417600 -379695 -245488 -313723 -717597 -79488 -124029 -100737
16333 -100737 1983 -88276 17761 208601 444070 266317 361670 280088 406247 566331
16323 566331 718016 705719 613038 444462 1055467 847390 962189 1265129 816342 987575
16313 987575 1323489 1001994 1233856 1147691 1566638 1752803 1235327 1435847 1217528 1730453
16303 1730453 1474431 1548573 1674669 1861847 2031319 1891760 1834462 1794961 1959603 2041438
16293 2041438 1666698 2134066 1945418 2010284 2046738 2079656 2522423 2561661 2416345 2776588
16283 2776588 2731622 2891689 2450216 2636019 2927337 2999839 2913955 3005824 2553540 2901867
16273 2901867 2866762 3046215 3397883 2785428 2976089 2896894 2856240 2931763 3356540 3407700
16263 3407700 3269705 3580416 3127955 3766493 3448629 3462333 3365424 3051425 3577285 3259621
16253 3259621 3491272 3891919 3770357 3501880 3517983 3108575 3531057 3936433 3933948 3825685
16243 3825685 4079270 3917765 3754947 3801560 4129088 4096719 4517154 3742676 4420565 4367520
16233 4367520 4439254 4499968 3814648 4369480 4437328 4248363 4314986 4291971 4491017 4228784
16223 4228784 4426703 4513825 4715013 4712198 4851593 4685782 4744567 4280055 4919583 4999325
16213 4999325 4767829 5357784 4495037 4551184 4450860 4836148 4875164 5179408 5200187 5146614
16203 5146614 4622713 5080513 4970735 5662509 5470837 4779987 4961376 5012658 5050769 5346747
16193 5346747 5243957 5267647 5078157 5297632 5373791 5638762 5416052 5334072 5621031 5425128
16183 5425128 5135973 5571866 5389951 5635630 5164254 5578770 5355983 5583376 5464537
16174 5464537 5332308 5460432 5618176 5280239 5800795 5891233 5645952 5749005 6109505 5770006
16164 5770006 6037431 5428051 5834025 6057734 6065565 5494175 5326318 6069333 5593352 6003919
16154 6003919 5787677 5571249 5761047 5862234 5935560 6121325 5720923 5886527 5920321 5781338
16144 5781338 5939581 5953990 5850414 5841758 6277177 5851576 6145614 5840407 6131595 6414485
16134 6414485 6020494 6434793 6204416 6070052 6297662 6100046 6090840 6318008 6253407 6285207
16124 6285207 6252017 6399673 5967900 5897166 6231777 5887429 6705641 5940189 6364920 6426664
16114 6426664 6099364 6179433 6175663 6191003 6562294 6185208 6507118 6206546 5805602 6158553
16104 6158553 6436275 6596711 6345715 6083976 6691968 6310963 6337473 6381174 6598319 6218313
16094 6218313 6554712 6909722 6319876 6548073 6687450 6224860 6523190 6469133 6669414 6421419
16084 6421419 6244210 6400037 6156778 6109034 6442408 6216751 6458763 6064749 6336379 6286938
16074 6286938 6223970 6284482 6705996 6323547 6594424 6424956 6435863 6336262 6331066 6977881
16064 6977881 6666852 6818279 6305975 6982892 6271049 6631854 6674891 6380843 6489577 6470515
16054 6470515 6768219 6347973 5763259 6395476 6296170 6250624 6597445 6824600 6147852 6797482
16044 6797482 6350332 6215965 6286011 6052283 6441183 6729436 6402536 6903874 6246984 6653890
16034 6653890 6583772 6819908 6439883 6631486 6781862 6686304 6245648 6406591 6708677 6349201
16024 6349201 6702342 6402422 6306502 6801240 6101831 6430833 6228934 6509220 6649065 6503249
16014 6503249 6708020 5955653 6639030 6362068 6743798 6662515 6391528 6512744 6612393 6958203
$$ [...]
##END NTUPLES=NMR SPECTRUM
##END=
