##TITLE=abcd
##JCAMPDX= 6.0         $$ Bruker NMR JCAMP-DX V2.0
##DATA TYPE= NMR SPECTRUM
##DATA CLASS= NTUPLES
##ORIGIN= UXNMR, Bruker Analytische Messtechnik GmbH
##OWNER= root
$$ XWIN-NMR		Version 3.5
$$ Fri Jun 26 18:31:11 2026 Russian Standard Time (UT+4h)  servis@DPX200
##.OBSERVE FREQUENCY= 200.131235884673
##.OBSERVE NUCLEUS= ^1H
##.ACQUISITION MODE= SIMULTANEOUS
##.ACQUISITION SCHEME= undefined
##.AVERAGES= 32
##.DIGITISER RES= 18
##SPECTROMETER/DATA SYSTEM= spect
##.PULSE SEQUENCE= zg
##.SOLVENT NAME= CDCl3
##.SHIFT REFERENCE= (INTERNAL, CDCl3, 0, 16.4885)
##AUDIT TRAIL= $$ (NUMBER, WHEN, WHO, WHERE, WHAT)
$$ ##TITLE= Audit trail, XWIN-NMR		Version 3.5
$$ ##JCAMPDX= 5.01
$$ ##ORIGIN= Bruker BioSpin GmbH
$$ ##OWNER= servis
$$ F:\spectra/data/av/nmr/H1/1/pdata/1/auditp.txt
$$ ##AUDIT TRAIL=  $$ (NUMBER, WHEN, WHO, WHERE, WHAT)
(   1,<2026-06-26 18:28:50.01 +0400>,<servis>,<DPX200>,
      <created by zg, POWCHK disabled, PULCHK disabled
       configuration hash MD5:
       00 E9 B6 7A A2 85 ED C7 34 08 36 98 17 FE 4E 26
       data hash MD5: 32K
       EF F7 65 FE DF B2 42 38 99 0F 90 12 48 9E A1 78>)
(   2,<2026-06-26 18:30:38.07 +0400>,<servis>,<DPX200>,
      <Start of raw data processing
       efp BC_mod = 2 LB = 0.05 FT_mod = 6 PKNL = 1 PHC0 = -415.99 PHC1 = 3.101563 SI = 16K 
       data hash MD5: 16K
       A8 A0 66 DB 0B BC 21 D8 D8 86 70 49 AB BC 24 CA>)
$$ ##END=
$$ 
$$ hash MD5
$$ 87 4F 3F E6 5B C0 11 66 9A 5B 10 A4 07 F4 E3 68
##$RELAX= 
##$RELAX= 
##$RELAX= 
##$RELAX= 
##$RELAX= 
##$RELAX= 
##$RELAX= 
##$RELAX= 
$$ Bruker specific parameters
$$ --------------------------
##$DU= <F:\spectra>
##$EXPNO= 1
##$NAME= <H1>
##$PROCNO= 1
##$TYPE= <nmr>
##$USER= <av>
##$AMP= (0..31)
100 100 100 100 100 100 100 100 100 100 100 100 100 100 100 100 100 100 
100 100 100 100 100 100 100 100 100 100 100 100 100 100 
##$AQSEQ= 0
##$AQ_mod= 1
##$AUNM= <au_zg>
##$AUTOPOS= <>
##$BF1= 200.13
##$BF2= 200.13
##$BF3= 200.13
##$BF4= 200.13
##$BF5= 500.13
##$BF6= 500.13
##$BF7= 500.13
##$BF8= 500.13
##$BYTORDA= 1
##$CFDGTYP= 0
##$CFRGTYP= 5
##$CHEMSTR= <none>
##$CNST= (0..31)
1 1 145 1 1 1 1 1 1 1 1 1 1 1 1 1 1 1 1 1 1 1 1 1 1 1 1 1 1 1 1 1 
##$CPDPRG= <>
##$CPDPRG1= <>
##$CPDPRG2= <>
##$CPDPRG3= <>
##$CPDPRG4= <mlev>
##$CPDPRG5= <mlev>
##$CPDPRG6= <mlev>
##$CPDPRG7= <mlev>
##$CPDPRG8= <mlev>
##$CPDPRGB= <>
##$CPDPRGT= <>
##$D= (0..31)
0 2 0 0 0 0 0 0 0 0.06 0 0 0 0 0 0 0.0002 0 0 0 0 0 0 0 0 0 0 0 0 0 0 
0 
##$DATE= 1782484129
##$DBL= (0..7)
120 120 120 120 120 120 120 120 
##$DBP= (0..7)
150 150 150 150 150 150 150 150 
##$DBP07= 0
##$DBPNAM0= <>
##$DBPNAM1= <>
##$DBPNAM2= <>
##$DBPNAM3= <>
##$DBPNAM4= <>
##$DBPNAM5= <>
##$DBPNAM6= <>
##$DBPNAM7= <>
##$DBPOAL= (0..7)
0.5 0.5 0.5 0.5 0.5 0.5 0.5 0.5 
##$DBPOFFS= (0..7)
0 0 0 0 0 0 0 0 
##$DE= 6
##$DECBNUC= <off>
##$DECIM= 32
##$DECNUC= <off>
##$DECSTAT= 4
##$DIGMOD= 1
##$DIGTYP= 9
##$DL= (0..7)
0 120 120 120 120 120 120 120 
##$DP= (0..7)
150 150 150 150 150 150 150 150 
##$DP07= 0
##$DPNAME0= <>
$$ [...]
##$SUBNAM4= <"">
##$SUBNAM5= <"">
##$SUBNAM6= <"">
##$SUBNAM7= <"">
##$SUBNAM8= <"">
##$SUBNAM9= <"">
##$SW= 20.6817932712277
##$SWIBOX= (0..15)
0 0 3 0 0 0 0 0 0 0 0 0 0 0 0 0 
##$SW_h= 4139.07284768212
##$TD= 32768
##$TD0= 1
##$TE= 0
##$TE2= 300
##$TE3= 300
##$TEG= 300
##$TL= (0..7)
0 120 120 120 120 120 120 120 
##$TP= (0..7)
150 150 150 150 150 150 150 150 
##$TP07= 0
##$TPNAME0= <>
##$TPNAME1= <>
##$TPNAME2= <>
##$TPNAME3= <>
##$TPNAME4= <>
##$TPNAME5= <>
##$TPNAME6= <>
##$TPNAME7= <>
##$TPOAL= (0..7)
0.5 0.5 0.5 0.5 0.5 0.5 0.5 0.5 
##$TPOFFS= (0..7)
0 0 0 0 0 0 0 0 
##$TUNHIN= 0
##$TUNHOUT= 0
##$TUNXOUT= 0
##$USERA1= <user>
##$USERA2= <user>
##$USERA3= <user>
##$USERA4= <user>
##$USERA5= <user>
##$V9= 5
##$VALIST= <valist>
##$VCLIST= <CCCCCCCCCCCCCCC>
##$VD= 0
##$VDLIST= <DDDDDDDDDDDDDDD>
##$VPLIST= <PPPPPPPPPPPPPPP>
##$VTLIST= <TTTTTTTTTTTTTTT>
##$WBST= 1024
##$WBSW= 30
##$XGAIN= (0..3)
0 0 0 0 
##$XL= 0
##$YL= 0
##$YMAX_a= 351607
##$YMIN_a= -521892
##$ZGOPTNS= <>
##$ZL1= 120
##$ZL2= 120
##$ZL3= 120
##$ZL4= 120
##$ABSF1= 0
##$ABSF2= 0
##$ABSG= 0
##$ABSL= 0
##$ALPHA= 0
##$AQORDER= 0
##$ASSFAC= 0
##$ASSFACI= 0
##$ASSFACX= 0
##$ASSWID= 0
##$AUNMP= <proc_1d>
##$AZFE= 0.1
##$AZFW= 0.1
##$BCFW= 0
##$BC_mod= 2
##$BYTORDP= 0
##$COROFFS= 0
##$CY= 18.4799938201904
##$DATMOD= 1
##$DC= 0
##$DFILT= <>
##$DTYPP= 0
##$F1P= 9.9274215381318
##$F2P= -0.165520771350173
##$FCOR= 1
##$FTSIZE= 16384
##$FT_mod= 6
##$GAMMA= 0
##$GB= 0
##$INTBC= 1
##$INTSCL= 4.127829e-11
##$ISEN= 128
##$LB= 0.05
##$LEV0= 0
##$LPBIN= 0
##$MAXI= 10000
##$MC2= 0
##$MEAN= 0
##$ME_mod= 0
##$MI= 50
##$NCOEF= 0
##$NC_proc= -6
##$NLEV= 6
##$NOISF1= 3.799351
##$NOISF2= 2.8
##$NSP= 0
##$NTH_PI= 0
##$NZP= 0
##$OFFSET= 16.48848
##$PC= 4
##$PHC0= -415.99
##$PHC1= 3.101563
##$PH_mod= 1
##$PKNL= yes
##$PPARMOD= 0
##$PSCAL= 4
##$PSIGN= 0
##$REVERSE= no
##$SF= 200.130005582386
##$SI= 16384
##$SIGF1= 3
##$SIGF2= 2
##$SINO= 400
##$SIOLD= 16384
##$SREGLST= <1H.CDCl3>
##$SSB= 0
##$STSI= 16384
##$STSR= 0
##$SW_p= 4139.07284768211
##$SYMM= 0
##$S_DEV= 0
##$TDeff= 32768
##$TDoff= 0
##$TI= <>
##$TILT= no
##$TM1= 0
##$TM2= 0
##$TOPLEV= 0
##$USERP1= <user>
##$USERP2= <user>
##$USERP3= <user>
##$USERP4= <user>
##$USERP5= <user>
##$WDW= 1
##$XDIM= 16384
##$YMAX_p= 407176250
##$YMIN_p= -948291
$$ End of Bruker specific parameters
$$ ---------------------------------
##NTUPLES= NMR SPECTRUM
##VAR_NAME=  FREQUENCY,     SPECTRUM/REAL,   SPECTRUM/IMAG
##SYMBOL=    X,             R,               I
##VAR_TYPE=  INDEPENDENT,   DEPENDENT,       DEPENDENT
##VAR_FORM=  AFFN,          ASDF,            ASDF
##VAR_DIM=   16384,         16384,           16384
##UNITS=     HZ,            ARBITRARY UNITS, ARBITRARY UNITS
##FACTOR=    0.252644378177508, 1,           1
##FIRST=     3299.83951724647, 0,            0
##LAST=      -839.233330435636, 0,           0
##MIN=       -839.233330435636, -948291,     0
##MAX=       3299.83951724647, 407176250,    0
$$ Real data points
##PAGE= N=1
##DATA TABLE= (X++(R..R)), XYDATA
$$ [...]
7046C482555K61832l8335N42724J99408M61281J46725N01733j87810k38352r9490
$$ 3482555 3744387 3706052 4248776 4448184 4909465 5056190 5557923 5370113 5131761 5032271
7036E032271p55754L73m02969j2716m40968l389m90725K5982K405l1523K73252
$$ 5032271 4276517 4276890 3873921 3861205 3420237 3416848 2926123 2952105 2954510 2922987 3196239
7025C196239l31898M12047n29615K06135q9568j72363J89131J34062M3184r9586
$$ 3196239 2864341 3276388 2746773 2952908 2863340 2690977 2880108 3014170 3057354 2957768
7015B957768L20967l78813M12852l76922L49172k69098K56209k44293J49140m61025
$$ 2957768 3278735 2899922 3312774 2935852 3285024 3015926 3272135 3027842 3176982 2715957
7005B715957L43761l49375Q6615m79933Q5419j53178K74696l0077k01202K03677
$$ 2715957 3059718 2710343 2796958 2317025 2402444 2249266 2523962 2493885 2292683 2496360
6995B496360J03620L84365k82731J11069k10407k0795J4601M8375k7485m29387
$$ 2496360 2599980 2984345 2701614 2812683 2602276 2581481 2596082 2644457 2616972 2187585
6985B187585J75620J15715r1595J36835m0004p2222k50957K89055j86168k9766
$$ 2187585 2363205 2478920 2387325 2524160 2484156 2411934 2160977 2450032 2263864 2234098
6975B234098n7823K0817r3568O2575m948j05621K04609O792J78381l5286R0592
$$ 2234098 2176275 2197092 2103524 2166099 2161151 2055530 2260139 2266931 2445312 2410026 2500618
6964B500618K17719J44703J66915L52844L43197j84319K06971m42157K70098J20719
$$ 2500618 2718337 2863040 3029955 3382799 3725996 3541677 3748648 3306491 3576589 3697308
6954C697308l16371o2040J14911J49979p2278J66033J2161M54604l18550r134
$$ 3697308 3380937 3318897 3433808 3583787 3511509 3677542 3689703 4144307 3825757 3816623
6944C816623n1859l48256K8633o13034L80881l55639l6401J64238l95964K06984
$$ 3816623 3764764 3416508 3445141 2832107 3212988 2857349 2820948 2985186 2589222 2796206
6934B796206m08435K53942j674j29134M3119j38764K24767j79218J01703K17565
$$ 2796206 2387771 2641713 2640039 2510905 2554024 2415260 2640027 2460809 2562512 2780077
6924B780077L2041K97955k09650L42269j17389R7591j73333l7046j74396K8086
$$ 2780077 2812118 3110073 2900423 3242692 3125303 3222894 3049561 3012515 2838119 2866205
6914B866205j62053K05437K6423J03500k5106j06647L48271l612K52861K14991
$$ 2866205 2704152 2909589 2936012 3039512 3014406 2907759 3256030 3252418 3505279 3720270
6904C720270J17133J02919k05428J08022k69758K78821l95976L08033r1335J4271
$$ 3720270 3837403 3940322 3734894 3842916 3573158 3851979 3456003 3764036 3672701 3686972
6894C686972l22078K70631q5358n3955M29821j05802J77378q8839O53934K52288
$$ 3686972 3364894 3635525 3550167 3496212 3926033 3820231 3997609 3908770 4562704 4814992
6884D814992N82812M19894k1385n2812L19578Q4461J91343L71994J2109l487k65594
$$ 4814992 5397804 5817698 5796313 5743501 6063079 6147540 6338883 6710877 6722986 6719499 6453905
6873F453905j35547n3103n66872k27380m24944n1447l47291m11437Q6751K69165
$$ 6453905 6318358 6265255 5698383 5471003 5046059 4994612 4647321 4235884 4322635 4591800
6863D591800J36188O8083q9794J21605K23267P18314J26398L87086K93669n004
$$ 4591800 4727988 4796071 4706277 4827882 5051149 5769463 5895861 6282947 6576616 6571612
6853F571612K26384r627q8239N7613J28975m4356j39185n29125j22975l60773
$$ 6571612 6797996 6788369 6700130 6757743 6886718 6842362 6703177 6174052 6051077 5690304
6843E690304p6395k80392k59106k17902j16601Q1026R6217J88842Q5796Q1284
$$ 5690304 5613909 5333517 5074411 4856509 4739908 4820934 4917151 5105993 5191789 5273073
6833E273073L70698M51710L45476M08244J4930K39756k94582m84783j56248j96898
$$ 5273073 5643771 6095481 6440957 6849201 6864131 7103887 6809305 6324522 6168274 5971376
6823E971376l18065O839k15790K30678k44387J06947N56790k60540J069372m80684
$$ 5971376 5653311 5660150 5444360 5675038 5430651 5537598 6094388 5833848 6903220 6422536
6813F422536L45004p15007R2870n73756j63158J2033L6918M39686j44263L81450
$$ 6422536 6767540 6052533 6145403 5571647 5408489 5420522 5457440 5897126 5752863 6134313
6803F134313Q0435M47900l85124n54019q7720m88068j66685k06139m75132O2394
$$ 6134313 6214748 6662648 6277524 5723505 5635785 5147717 4981032 4774893 4299761 4362155
6793D362155k19596j847m5600k32631L14224k46815L51091o8276J56522K40956
$$ 4362155 4142559 4140712 4095112 3862481 4176705 3929890 4280981 4212705 4369227 4610183
6783D610183L1014J57093P4483N87515l8617O26746M52515J094305R24300J002780
$$ 4610183 4641197 4798290 4872773 5460288 5421671 6048417 6500932 7595237 8519537 9522317
6773I522317O89185N38678J3675l45751n12394p24432o95416r24501m94306q07522
$$ 9522317 10211502 10750180 10763855 10418104 9905710 9181278 8485862 7561361 7067055 6259533
6763F259533o3504k77329L3770k28275J30390k50108j16134P334q8228K1221j81848
$$ 6259533 6196029 5918700 5952470 5724195 5854585 5604477 5488343 5495677 5407449 5428670 5246822
6752E246822M04474k52428M00726k28471M66112J03778M36664K22375L90779P52958
$$ 5246822 5651296 5398868 5799594 5571123 6037235 6141013 6577677 6800052 7190831 7943789
6742G943789Q21180J226392K21802O46727l52209J55687o76507N93674P830O79467
$$ 7943789 8764969 9991361 10213163 10859890 10507681 10663368 9986861 10580535 10588365 11267832
6732A1267832O31711J068866J87999j67840m04199j452019p21753j288662o92370
$$ 11267832 11899543 12968409 13156408 12988568 12584369 11132350 10410597 9121935 8429565
6723H429565q63440p28803k50994o52029j03156k54513J65474m63999L38608j72856
$$ 8429565 7566125 6837322 6586328 5934299 5831143 5576630 5742104 5278105 5616713 5443857
6713E443857J7790J10108M46432L38523K71684M75780L34919K23130M61253J84963
$$ 5443857 5461647 5571755 6018187 6356710 6628394 7104174 7439093 7662223 8123476 8308439
6703H308439M66442N66247P47365O50962M22397j37976j15067r49520l70132p48577
$$ 8308439 8774881 9341128 10088493 10739455 11161852 11023876 10908809 9959289 9589157 8840580
6693H840580n57292p09045m61215p2520k54972k6626k07425P6998R6059N27832
$$ 8840580 8283288 7574243 7113028 7040508 6785536 6758910 6551485 6628483 6724542 7252374
6683G252374L98198J025066J626075J265664Q85145q3229j00694j329874r70704
$$ 7252374 7650572 8675638 10301713 11567377 12452522 12369293 12268599 10938725 9968021
6674I968021r54622p89358o60357k99102k89929l18061l69548j48468P6019j41041
$$ 9968021 9013399 8224041 7563684 7264582 6974653 6656592 6287044 6138576 6214595 6073554
6664F073554k26337K16559J28170N06188o3406J93722K90663K95827J97935J01213
$$ 6073554 5847217 6063776 6191946 6698134 6634728 6828450 7119113 7414940 7612875 7714088
6654G714088O18329J088700J100164J413040P10574R8772K3269q77835r32212
$$ 7714088 8332417 9421117 10521281 11934321 12644895 12743667 12766936 11889101 10956889
6645A0956889o55500n98477r35886o45639m66120m86720l94422r4656N2254j15466
$$ 10956889 10301389 9702912 8767026 8121387 7655267 7168547 6774125 6679469 6731723 6616257
6635F616257P0342K52331N28431O83516M14352N95180J48876J24232l16008l13357
$$ 6616257 6686599 6938930 7467361 8150877 8565229 9160409 9309285 9433517 9117509 8804152
6625H804152m77355M33413p8101J80523q4780l87666m80563r7513k50777m17667
$$ 8804152 8326797 8760210 8682109 8862632 8777852 8390186 7909623 7812110 7561333 7143666
6615G143666j75300j89246k45340l63405K36440N3982R8426o7362K78034M30116
$$ 7143666 6968366 6779120 6533780 6170375 6406815 6460797 6559223 6491861 6769895 7200011
6605G200011K16499M65311j12166M48620L90835L12145J28913l29692p5351l51120
$$ 7200011 7416510 7881821 7769655 8218275 8609110 8921255 9050168 8720476 8645125 8294005
6595H294005l5838l33878k19393K8102n94085N6381m57043Q8947j92199o05533
$$ 8294005 8258167 7924289 7704896 7732998 7138913 7195294 6738251 6827198 6634999 6029466
6585F029466J66802l50746N7494j66913K16575J4618j75442J79537l45131M63001
$$ 6029466 6196268 5845522 5903016 5736103 5952678 5967296 5791854 5971391 5626260 6089261
6575F089261l95356M82784o12700J71096P6498j96850p5608J22863K87134N3769
$$ 6089261 5693905 6176689 5563989 5735085 5811583 5614733 5539125 5661988 5949122 6002891
6565F002891j59614k6962M7244o6204j44950p2533M1936l009M6176k73037J18066
$$ 6002891 5843277 5816315 5863559 5797355 5652405 5579872 5621808 5618799 5664975 5391938 5510004
6554E510004K00886K79546k07916J39058k5255K40687k57079J94287n52364K54343
$$ 5510004 5710890 5990436 5782520 5921578 5896323 6137010 5879931 6074218 5521854 5776197
6544E776197M8669O4652n19637J71648R2622N580J10135n7453J45436l33110K31558
$$ 5776197 5824866 5889518 5369881 5541529 5634151 5639731 5749866 5692413 5837849 5504739 5736297
6533E736297k40937L31121k13355N9950j00285J97243r8854J04241j42498K74720
$$ 5736297 5495360 5826481 5613126 5673076 5572791 5770034 5671180 5775421 5632923 5907643
6523E907643J12076L14057m09555L98152l84946J57063L51186m17791K10310j22785
$$ 5907643 6019719 6333776 5924221 6322373 5937427 6094490 6445676 6027885 6238195 6115410
6513F115410J38783k57075L83403j49186K15936k9641J0067r872J9093K639L32705
$$ 6115410 6254193 5997118 6380521 6231335 6447271 6417630 6427697 6417825 6436918 6439557 6772262
6502F772262k28040J96515q056O5032r4506K36963j95160j11483j75897N2340
$$ 6772262 6544222 6740737 6732681 6797713 6703207 6940170 6745010 6633527 6457630 6509970
6492F509970j02986J05119k8518J32102L42950j8499J13236l64411N32474l31387
$$ 6509970 6406984 6512103 6483585 6615687 6958637 6940138 7053374 6688963 7221437 6890050
6482F890050K83145j40490J49718j05922K03645M31811J93214r5803M89260J89155
$$ 6890050 7173195 7032705 7182423 7076501 7280146 7711957 7905171 7809368 8298628 8487783
6472H487783q3651K05540l68219L84426l05470J53531j69570l84944k34328k6373
$$ 8487783 8404132 8609672 8241453 8625879 8320409 8473940 8304370 7919426 7685098 7658725
6462G658725l03602q273L5595j1564n77181N08879j03804K31296l26254J08258
$$ 7658725 7355123 7346850 7382445 7370881 6793700 7302579 7198775 7430071 7103817 7212075
6452G212075p4903j7368K31205k38142N2077J66201K82543m54531L96355N4173
$$ 7212075 7137172 7119804 7351009 7112867 7164944 7331145 7613688 7159157 7555512 7609685
6442G609685M82493m3678M90172j42098K92521K6278j20174l77802J15335j60594
$$ 7609685 8092178 8048500 8538672 8396574 8689095 8715373 8595199 8217397 8332732 8172138
6432H172138l25251j39015l12119M52597m43030m2589O6588Q4272p8264j31146
$$ 8172138 7846887 7707872 7395753 7848350 7405320 7362731 7429319 7513591 7435327 7304181
6422G304181K06306l1001O109j48512j36051K43830J0003M36264n5958L20204
$$ 7304181 7510487 7479486 7485595 7337083 7201032 7444862 7454865 7891129 7835171 8155375
6412H155375M29172L48098N16839K6863N12927O21520M72235o5291N72639k95775
$$ 8155375 8584547 8932645 9449484 9476347 9989274 10610794 11083029 11017738 11590377 11294602
6402A1294602j06198p80436l32664k77641n40052l49899o46880K6221j76084n1888
$$ 11294602 11188404 10407968 10075304 9797663 9257611 8907712 8260832 8287053 8110969 8059081
6392H059081j87557J92104K71420j60753K17134N1430K71061J3691J37422l24511
$$ 8059081 7871524 8063628 8335048 8174295 8391429 8442859 8713920 8727611 8865033 8540522
6382H540522K87701N2344J06744J63290n0585J78539k92009J16267m12959q3083
$$ 8540522 8828223 8880567 8987311 9150601 9100016 9278555 8986546 9102813 8689854 8606771
6372H606771m72725J60902l55723N7946l84685j86066J37267J8525K44941p5756
$$ 8606771 8134046 8294948 7939225 7997171 7612486 7426420 7563687 7582212 7827153 7751397
6362G751397J3169J68856k8323Q0506n01532M29221k40849K8510J27274k70255
$$ 7751397 7764566 7933422 7905099 7985605 7484073 7913294 7672445 7700955 7828229 7557974
6352G557974O33407l98261N1171P2907k07344L78727j74219j5517j65200L44919
$$ 7557974 8191381 7793120 7844291 7917198 7709854 8088581 7914362 7898845 7733645 8078564
6342H078564O6086k13697J26427K63885o8352j7375j69493O9301J50819K41584
$$ 8078564 8144650 7930953 8057380 8321265 8252913 8235538 8066045 8135346 8286165 8527749
6332H527749j82180K97393j37406P25952k91258O45784M81501P80290L83996M97254
$$ 8527749 8345569 8642962 8505556 9231508 8940250 9586034 10067535 10847825 11231821 11729075
6322A1729075o784k00715j42418j11795j96560N57086M78727P85383Q36138O27326
$$ 11729075 11722291 11521576 11379158 11267363 11070803 11627889 12106616 12891999 13728137 14355463
6312A4355463O78202l16818j37443j093650l98355j152716m17408o05729n91248
$$ 14355463 15033665 14716847 14579404 13485754 13087399 11934683 11517275 10911546 10320298
6303A0320298j24444k29246J19288R140K50329N0034P68834O47676R42231P80817
$$ 10320298 10195854 9966608 10085896 10095036 10345365 10395399 11164233 11811909 12754140 13534957
6293A3534957P71782P39035L44152P62750K0420L62609K17292L16161K69378J08404
$$ 13534957 14306739 15045774 15389926 16152676 16173096 16535705 16752997 17069158 17338536 17446940
6283A7446940j48396n81841o84667r02595p80548j021527l29978m90366L34439
$$ 17446940 17298544 16716703 16032036 15129441 14348893 13327366 12997388 12507022 12841461
6274A2841461N62557N30537O26964M04219m82314n84126r38767n45596o11936
$$ 12841461 13404018 13934555 14561519 14965738 14483424 13899298 12960531 12414935 11802999
6265A1802999j42424l95282J43682K02739L94308L36548N5259J25539l48477m44415
$$ 11802999 11660575 11265293 11408975 11611714 12006022 12342570 12397829 12523368 12174891 11730476
6255A1730476o19305n09959n71076j64935m54232J84990l29461J71303Q9176L46402
$$ 11730476 11111171 10601212 10030136 9865201 9410969 9595959 9266498 9437801 9526977 9873379
6245I873379J006810N97444P13774K43576J93277k40148j077930n36637n42448
$$ 9873379 10880189 11477633 12191407 12434983 12628260 12388112 11310182 10773545 10231097
6236A0231097l54303n93654n09699j69295j97627k53386J78527N6198R7521k37614
$$ 10231097 9876794 9283140 8773441 8604146 8406519 8153133 8331660 8387858 8485379 8247765
6226H247765m52381J94359Q2138j40105K46412l28007L93846m21753q6390k3894
$$ 8247765 7795384 7989743 8071881 7931776 8178188 7850181 8244027 7822274 7735884 7711990
6216G711990N0047J54782l55323k18971l91432N0474j00011r0443k19360L7965
$$ 7711990 7762037 7916819 7561496 7342525 6951093 7001567 6901556 6811113 6591753 6629718
6206F629718J62213k57791k34199K01147k12687R3902J14513o435m61685K09437
$$ 6629718 6791931 6534140 6299941 6501088 6288401 6382303 6496816 6490381 6028696 6238133
6196F238133q9702m1563l5791J41125p4388l19811M70822k18550L71827J04858
$$ 6238133 6148431 6106868 6071077 6212202 6137814 5818003 6288825 6070275 6442102 6546960
6186F546960O3351R9988L80697L87509L16040M82821K34543L86290r74408J78946
$$ 6546960 6610311 6710299 7090996 7478505 7794545 8277366 8511909 8898199 7923791 8102737
6176H102737o50144M7917r13585J58917m21362l55111j45412j30271j69000K72104
$$ 8102737 7452593 7500510 6586925 6745842 6324480 5969369 5823957 5693686 5524686 5796790
6166E796790l24318O3466J15228j99896J10546j0279J00772J60937O021L51846
$$ 5796790 5472472 5535938 5651166 5451270 5561816 5551537 5652309 5813246 5819267 6171113
6156F171113L62182O05284M44672j03856l885m94872k42885l99949k11265l47933
$$ 6171113 6533295 7138579 7583251 7479395 7475510 6980638 6737753 6337804 6126539 5778606
6146E778606J06783k15586n53667m976j45256k5805M94477l86339K94688m17246
$$ 5778606 5885389 5669803 5116136 5111160 4965904 4940099 5434576 5048237 5342925 4925679
6136D925679J94530Q1507L20010M90814N38155K97594o5036K42351m77460K11688
$$ 4925679 5120209 5201716 5521726 6012540 6550695 6848289 6783253 7025604 6548144 6759832
6126F759832p02023n1509m58319O6231m13485r6596n6677j28762J43110l40000
$$ 6759832 6057809 6006300 5547981 5614212 5200727 5104131 5047454 4918692 5061802 4721802
6116D721802J79850l17952J87098k09939K77950o3046J79135k41309L37521N85388
$$ 4721802 4901652 4583700 4770798 4560859 4838809 4775763 4954898 4713589 5051110 5636498
6106E636498L99167J03447L72853j49212m9188n14011j28715j69681K25718n13168
$$ 5636498 6035665 6139112 6511965 6362753 6313565 5799554 5670839 5501158 5726876 5213708
6096E213708J03476n74604N3982r9226j82706K08499j21700j84649l3451J06691
$$ 5213708 5317184 4742580 4796562 4697336 4514630 4723129 4601429 4416780 4383329 4490020
6086D490020l06428K45356q2355J73325P0379k88521J12334P0628J96039k27484
$$ 4490020 4183592 4428948 4346593 4519918 4590297 4301776 4414110 4484738 4680777 4453293
6076D453293P0101j67976j6402m4354k93847R6175n4405n1822q1627O2828P0709
$$ 4453293 4523394 4355418 4339016 4294662 4000815 4096990 4042585 3990763 3909136 3971964 4042673
6065D042673M9442p9575L25637o1473J07634l79013K51497j58000L70618l57218
$$ 4042673 4092115 4012540 4338177 4276704 4384338 4005325 4256822 4098822 4469440 4112222
6055D112222L53163l40561K50422k16252J21744j68822K9428Q2929k77643J87730
$$ 4112222 4465385 4124824 4375246 4158994 4280738 4111916 4141344 4224273 3946630 4134360
6045D134360k62254J6330K7045Q299K80843j96065J15847k61863J20171J5053
$$ 4134360 3872106 3888436 3915481 3923780 4204623 4008558 4124405 3862542 3982713 3997766
6035C997766J99958j88185K16299k75164J08272r4123M8645J91036l58629M13838
$$ 3997766 4197724 4009539 4225838 3950674 4058946 3964823 4013468 4204504 3845875 4259713
6025D259713m27090K29525K0152m3221j20864Q5222J9349j20365k98324n3680
$$ 4259713 3832623 4062148 4082300 4039079 3918215 4003437 4022786 3902421 3604097 3550417
6015C550417O5464L90367o4840k36715J58818k1229Q1976j84104K41565l46605
$$ 3550417 3615881 4006248 3941408 3704693 3863511 3842282 3924258 3740154 3981719 3635114
6005C635114L4959l3299o5376q0837J83277J32870O2033j05380j43040L95738
$$ 3635114 3670073 3636774 3571398 3490561 3673838 3806708 3868741 3763361 3620321 4016059
5995D016059o67139K04794l18473N78006l72934j1763M7077J95001N5668j61030
$$ 4016059 3348920 3553714 3235241 3813247 3440313 3428550 3475627 3670628 3726296 3565266
5985C565266J38170N0000O176J17168J91993k49837l39307L75162j60288K79884
$$ 3565266 3703436 3753436 3759612 3876780 4068773 3818936 3479629 3854791 3694503 3974387
5975C974387k84986J48007k50569n057R2239k10888K76333k70857L11689j95845
$$ 3974387 3689401 3837408 3586839 3581782 3674021 3463133 3739466 3468609 3780298 3584453
5965C584453R1015k67201K17524l14618O47816j13053j02680o442n5903l8991
$$ 3584453 3675468 3408267 3625791 3311173 3958989 3845936 3743256 3736814 3680911 3641920
5955C641920J55345j61605K9171R8566q0158N27470l87770L80388l94597L10135
$$ 3641920 3797265 3635660 3664831 3763397 3683239 4210709 3822939 4203327 3808730 4118865
5945D118865k54013J6497P2055p1858o7941O6505M61058M0912J19455K99093J28794
$$ 4118865 3864852 3881349 3953404 3881546 3813605 3880110 4341168 4382080 4501535 4800628 4929422
5934D929422R04169N23631O18647K69526P3145J0467n61102k59176o74069k2903
$$ 4929422 5833591 6357222 6975869 7245395 7318540 7329007 6767905 6508729 5834660 5811757
5924E811757m74424k28874k30184J43763m03896j12181o4912Q41N2292j58984
$$ 5811757 5337333 5108459 4878275 5022038 4618142 4505961 4441049 4441890 4494182 4335198
5914D335198K04721N2173O949p2873Q8442P5238L21625J28845Q32070K83795R35709
$$ 4335198 4539919 4592092 4599041 4526168 4614610 4689848 5011473 5140318 5972388 6256183 7191892
5903G191892P54420M43089O76554K60028M16682m13137M06414q50227l27902n02811
$$ 7191892 7946312 8389401 9065955 9325983 9742665 9329528 9735942 8885715 8557813 8055002
5893H055002j147012k25076n29089j43714l86685k85795n734k28701K21320l55260
$$ 8055002 6907990 6682914 6153825 6010111 5623426 5337631 5331897 5103196 5324516 4969256
5883D969256j03910j29019R6813j4449Q8674k75226M04819j65270K42759J57673
$$ 4969256 4865346 4736327 4833140 4818691 4907365 4632139 5036958 4871688 5114447 5272120
5873E272120N50540P1655N03175N80176M41268J78320o3983m12003q6759m35522
$$ 5272120 5822660 5894315 6397490 6977666 7418934 7597254 7533271 7121268 7034509 6598987
5863F598987m82498m94082j18551j07911m05297j45543k00772K02756p5855k01778
$$ 6598987 6116489 5622407 5503856 5395945 4990648 4845105 4644333 4847089 4771234 4569456
5853D569456R3510q9192K89019k86716K27324p8349J27754j21231k77444J95270
$$ 4569456 4662966 4573774 4862793 4576077 4803401 4725052 4852806 4731575 4454131 4649401
5843D649401j1106J95366k04227P3013j71767K73699K0569j75189j15292L35530
$$ 4649401 4638295 4833661 4629434 4702447 4530680 4804379 4824948 4649759 4534467 4869997
5833D869997J34294l9652K35925l27082J60889k15994K93700k09903J15156M77382
$$ 4869997 5004291 4964639 5200564 4873482 5034371 4818377 5112077 4902174 5017330 5494712
5823E494712k28096M06448j63623L75683m1884K87302K9747N84525M95173O92792
$$ 5494712 5266616 5673064 5509441 5885124 5843240 6130542 6160289 6744814 7239987 7932779
5813G932779M60571M27178R1129m23952l82193k87120m30940n19212j76852k6999
$$ 7932779 8393350 8820528 8911657 8487705 8105512 7818392 7387452 6868240 6691388 6664389
5803F664389j58390J53634O7280k22625P6304o8746J88897L9318K78371k75120
$$ 6664389 6505999 6659633 6726913 6504288 6580592 6511846 6700743 6740061 7018432 6743312
5793F743312K76971k13785K39814o9835J86740J11790L40618j3225Q2193K80959
$$ 6743312 7020283 6806498 7046312 6976477 7163217 7275007 7615625 7602400 7684593 7965552
5783G965552J67915J37857J21576K86592r7324M38295J60660O6663J65660N18221
$$ 7965552 8133467 8271324 8392900 8679492 8582168 9020463 9181123 9247786 9413446 9931667
5773I931667p3442K69323L67998l27895J33784N0096K83463j31726K10482j75706
$$ 9931667 9858225 10127548 10495546 10167651 10301435 10351531 10634994 10503268 10713750 10538044
5763A0538044K99640q7384K83476J03950L83670j92404O11408K82971N58911L5071
$$ 10538044 10837684 10750300 11033776 11137726 11521396 11328992 11940400 12223371 12782282 12817353
5753A2817353P44514M66846N47756P03458P39010M11039O90990K16262Q54192
$$ 12817353 13561867 14028713 14576469 15279927 16018937 16429976 17120966 17337228 18191420
5744A8191420K70703N70786J60801O19524L63381L43422O17803L01765Q81951
$$ 18191420 18462123 19032909 19193710 19813234 20176615 20520037 21137840 21439605 22321556
5735B2321556O19031R34579J013982J284013J438394K239555J947816K443215
$$ 22321556 22940587 23875166 24889148 26173161 27611555 29851110 31798926 34242141
5727C4242141K367448K576606K204189J931227J285568J101908J2469J80942q04113
$$ 34242141 36609589 39186195 41390384 43321611 44607179 45709087 45721556 45902498 45098385
5718D5098385o39328q80284j148217n77939n54017j56640m54361L29368k09203
$$ 45098385 44459057 43578773 42430556 41852617 41298600 41141960 40687599 41016967 40807764
5709D0807764M21825J78085O83193K03884J208203J417130J590386K229403K779207
$$ 40807764 41229589 41407674 42090867 42294751 43502954 44920084 46510470 48739873 51519080
5700E1519080L326496L975832M697886M336780M163824L623372L066508J647764
$$ 51519080 54845576 58821408 63519294 67856074 72019898 75643270 78709778 80357542
5692H0357542N63202m97735j120349k741312l075700l453101l243231k896197
$$ 80357542 80920744 80423009 79302660 76561348 73485648 70032547 66789316 63893119
5684F3893119k660842k251792j885891j110686j159483o76251n41289J75717K09282
$$ 63893119 61232277 58980485 57094594 55983908 54824425 54148174 53606885 53782602 53991884
5675E3991884K95996Q6961J139715P89585J574712J357599K121926K615633K334130
$$ 53991884 54287880 54374841 55514556 56304141 57878853 59236452 61358378 63974011 66308141
5666F6308141K404363K076631K033762J133963O18633l81880q85502j526180j962182
$$ 66308141 68712504 70789135 72822897 73956860 74575493 74193613 73308111 71781931 69819749
5657F9819749j889343k010078j535911j530014q30093p28632l22721Q5278J61199
$$ 69819749 67930406 65920328 64384417 62854403 62024310 61295678 60972957 61058235 61219434
5648F1219434j19243R10885N13278Q42794J016643J397589J705615J722081K177868
$$ 61219434 61100191 62011076 62524354 63367148 64383791 65781380 67486995 69209076 71386944
5639G1386944J431709J700473J792188J815974O95833J055848N29653j06068K6062
$$ 71386944 72818653 74519126 76311314 78127288 78823121 79878969 80408622 80302554 80328616
5630H0328616j30368j31722o11687j64241j60210j68827n9168N7221o4260L70475
$$ 80328616 80198248 80066526 79454839 79290598 79130388 78961561 78902393 78959614 78895354 79265829
5620G9265829R437q5377j05406K87933n15266K42989l89549r7573k82523o99374
$$ 79265829 79275266 79189889 79084483 79372416 78857150 79100139 78710590 78613017 78330494 77631120
5610G7631120n86815j117308j446989j407609j706953j849914j679105j755939
$$ 77631120 77044305 75926997 74480008 73072399 71365446 69515532 67836427 66080488
5602F6080488j881407j852239j546330j467484j248663j228119o59684m91486
$$ 66080488 64199081 62346842 60800512 59333028 58084365 56856246 56196562 55705076
5594E5705076m93909q09367o71236p92518j067009q90548j428803j242661k151387
$$ 55705076 55211167 54401800 53730564 52938046 51871037 50980489 49551686 48309025 46157638
5585D6157638j585207k026272j571466k189830j550357j691099j612312j272474
$$ 46157638 44572431 42546159 40974693 38784863 37234506 35543407 33931095 32658621
5577C2658621j446889q31790r61805p40272p05545l83240m75040K3227l21346
$$ 32658621 31211732 30379942 29418137 28677865 27972320 27589080 27114040 27137267 26815921
5568B6815921M03375j09846m647K50901l6871j22074R7465K6413J33613j83370
$$ 26815921 27219296 27109450 27104803 27355704 27318833 27196759 27294224 27320637 27454250 27270880
5558B7270880j43333m78381j72266o74389l63294k96951r77907n73120n61138
$$ 27270880 27127547 26649166 26476900 25802511 25439217 25142266 24164359 23591239 23030101
5549B3030101j55579o46197J53061p75818O15660m24427M69973k06601O15180
$$ 23030101 22874522 22228325 22381386 21605568 22221228 21796801 22266774 22060173 22675353
5540B2675353J52032N77161J72788K59847M52610K76732P78239L73091R01255
$$ 22675353 22827385 23404546 23577334 23837181 24289791 24566523 25344762 25717853 26619108
5531B6619108K99206J101577M37537Q96515O84855R24941L01696O52793K04582
$$ 26619108 26918314 28019891 28457428 29353943 30038798 30963739 31265435 31918228 32122810
5522C2122810j32700j87534k74879p48265q36828l40222o81686n99072p68437
$$ 32122810 31990110 31802576 31527697 30779432 29942604 29602382 28920696 28321624 27553187
5513B7553187J21610q8393L23462J44795J52316J35347p6754M42551j38222O44391
$$ 27553187 27674797 27586404 27909866 28054661 28206977 28342324 28265570 28708121 28569899 29214290
5503B9214290M50843J099359Q28229J661646J329455J988543J484277J634021
$$ 29214290 29665133 30764492 31592721 33254367 34583822 36572365 38056642 39690663
5495C9690663J235804Q96804M15454J52433r69516n74542j109878j854102j562337
$$ 39690663 40926467 41823271 42238725 42391158 41421642 40847100 39737222 37883120 36320783
5486C6320783j915884j699186j773521j087653j722881p86592j049645o82971
$$ 36320783 34404899 32705713 30932192 29844539 28121658 27335066 26285421 25602450
5478B5602450n16112l74085m6874k45845L96569J19530N29288K72983Q91731O45876
$$ 25602450 25086338 24712253 24665379 24419534 24816103 24935633 25464921 25737904 26629635 27275511
5468B7275511Q05816O51429O10504N90535L49250L76564l63656k59559q61477
$$ 27275511 28081327 28732756 29343260 29933795 30283045 30659609 30295953 30036394 29174917
5459B9174917j019042j279722j046837j175598q96573r90430q98344r74159J5671
$$ 29174917 28155875 26876153 25829316 24653718 23757145 22766715 21868371 20894212 20909883
5450B0909883n73474q3337j26105N6079J06173L93015J84875N06579M80245K80535
$$ 20909883 20336409 20253072 20126967 20183046 20289219 20682234 20867109 21373688 21853933 22134468
5440B2134468L37083o4362N66511J07633N78458K7170K97199K38979O17283P69597
$$ 22134468 22471551 22407189 22973700 23081333 23659791 23686961 23984160 24223139 24840422 25610019
5430B5610019M63220Q68134P73522J188662P21923J259377J412199K176644K650024
$$ 25610019 26073239 26941373 27714895 28903557 29625480 30884857 32297056 34473700 37123724
5421C7123724L767896N500192P744983R274710R585672R136143O127849K930872
$$ 37123724 40891620 46391812 54136795 63411505 72997177 82133320 88261169 91192041
5413I1192041j263629m580027o827795p707914p238605o769101n451978m147271
$$ 91192041 89928412 85348385 78520590 70812676 63574071 56804970 51352992 47205721
5405D7205721l227873k313694j538083j201985j047205q04211r18686n87533j91666
$$ 47205721 43977848 41664154 40126071 38924086 37876881 37072670 36153984 35566451 35374785
5396C5374785r5350o15861n58300q1032m70061Q2845l53705j39085k84242J17158
$$ 35374785 35279435 34663574 34105274 34024242 33554181 33637026 33283321 33144236 32859994 32977152
5386C2977152o8481k89419r5541K05604J35333j69215K60259K20206j53279M92084
$$ 32977152 32908671 32619252 32523711 32729315 32864648 32695433 32955692 33175898 33022619 33514703
5376C3514703L03420j14312M8542N6157K49540k40622j82560j56860m85839j72905
$$ 33514703 33818123 33703811 33752353 33808510 34058050 33817428 33634868 33478008 32992169 32819264
5366C2819264n33174j56317o87561k9167m97223N8390j41493J47109N8574J74502
$$ 32819264 32286090 32129773 31442212 31413045 30915822 30974212 30832719 30979828 31038402 31212904
5356C1212904N15807L40501P16013L02436J227064K76347J041386J67814N60638
$$ 31212904 31728711 32069212 32785225 33087661 34314725 34591072 35632458 35800272 36360910
5347C6360910L65140K98442m7496n23238j32919j542603k05804j223825p09695
$$ 36360910 36726050 37024492 36976996 36453758 36320839 34778236 34572432 33348607 32638912
5338C2638912j478367m71807r04980p61295q65131o03915r8622l12753j9657j58649
$$ 32638912 31160545 30688738 29783758 29022463 28157332 27553417 27454795 27142042 27122385 26963736
5328B6963736j97767j45192k1668m01745k55402K449l97064m68783o73330o65687
$$ 26963736 26765969 26620777 26599109 26197364 25941962 25944411 25547347 25078564 24405234 23739547
5318B3739547q70011q20864o83276o74930r11774p54935j026625o15998l50577
$$ 23739547 22869536 22048672 21365396 20690466 19778692 19023757 17997132 17381134 17030557
5309A7030557n51655n20441l25542j0342l82776j92653m11776k22202J86555l98602
$$ 17030557 16478902 15958461 15632919 15622577 15239801 15047148 14635372 14413170 14599725 14201123
5299A4201123N9881m47220l45911P7045n30327J35571o20196O0009o74621J14669
$$ 14201123 14261004 13813784 13467873 13544918 13014591 13150162 12529966 12589975 11915354 12030023
5289A2030023l79495j36900k06865k45153o9794m95139J3419n38018n1794k41813
$$ 12030023 11650528 11513628 11306763 11061610 10991816 10496677 10510096 9972078 9920284 9678471
5279I678471j16322m13758K24542n31463L39164k57816J9713n2048J66090j29690
$$ 9678471 9562149 9148391 9372933 8841470 9180634 8922818 8942531 8890483 9056573 8926883
5269H926883j89400J02367n52001L56640m66282J58961l38387j80923l40612J11891
$$ 8926883 8737483 8839850 8287849 8644489 8178207 8337168 7998781 7817858 7477246 7589137
5259G589137j80914k30561N9868P6447j18803k171k23487j46517M5526q6070p5269
$$ 7589137 7408223 7177662 7237530 7313977 7195174 7193003 6969516 6822999 6868525 6782455 6707186
5248F707186r7491J68894m25505L61680l29370M35930o58328L47922k57450J95194
$$ 6707186 6609695 6778589 6353084 6714764 6385394 6821324 6162996 6510918 6253468 6448662
5238F448662l09065J11180j44818q9922L11704J44382n59908L50862l59006N5140
$$ 6448662 6139597 6250777 6105959 6016037 6327741 6472123 5912215 6263077 5904071 5959211
5228E959211l6840L3796r3806j46498j93224J8961R5352l15819J02227J12028
$$ 5959211 5922371 5956167 5862361 5715863 5522639 5541600 5636952 5321133 5423360 5535388
5218E535388k1991k5737j78166n5075p6837l3730L84807l24505R4296j41457J47702
$$ 5535388 5513397 5487660 5309494 5254419 5177582 5143852 5528659 5204154 5298450 5156993 5304695
5207E304695K06258n2947j00499k1613J88711j01935o1235n6051M56181J8965
$$ 5304695 5510953 5458006 5357507 5335894 5524605 5422670 5361435 5305384 5761565 5780530
5197E780530O64188L36127P19564Q24098R39647O54431J020087K03993J1071m91594
$$ 5780530 6444718 6780845 7500409 8324507 9264154 9918585 10938672 11142665 11153736 10662142
5187A0662142n08563m52176p77139p99731l97285l81478j15401l43934j4300j81172
$$ 10662142 10153579 9701403 8924264 8124533 7727248 7345770 7230369 6886435 6872135 6690963
5177F690963L76398Q8383j56573N8882L45957L75427j43715O40004J29127M71297
$$ 6690963 7067361 7155744 6999171 7058053 7404010 7779437 7635722 8275726 8404853 8876150
5167H876150M2947P0802j6143k5040P7451j53865J69699N6746Q4836k6693m5553
$$ 8876150 8919097 8989899 8973756 8948716 9026167 8872302 9042001 9098747 9183583 9156890 9111337
5156I111337J5465k37645J30962J97504M5043K13725K4624L48376Q3708J41504
$$ 9111337 9126802 8889157 9020119 9217623 9262666 9476391 9501015 9849391 9933099 10074603
5146A0074603J4749k99917N16392j7844K85450o5724K52682K50696L85570O05861
$$ 10074603 10089352 9789435 10305827 10287983 10573433 10507709 10760391 11011087 11396657 12002518
5136A2002518O69249Q79348M59350N78635N02687L58639J1284j10573o38659n89526
$$ 12002518 12671767 13551115 14010465 14589100 15091787 15450426 15461710 15351137 14712478 14122952
5126A4122952o36447o83165m89160m82340k24626K76240K36211K43391J26687
$$ 14122952 13486505 12803340 12314180 11831840 11607214 11883454 12119665 12363056 12489743
5117A2489743R17860J03048J02292m28482p9475n74140L5587n56055J84140j24239
$$ 12489743 13407603 13510651 13612943 13184461 13104986 12530846 12566433 12010378 12194518 12070279
5107A2070279k0703R9185k84557M18840m86773N83851n34212M27567j93689J22510
$$ 12070279 12049576 12148761 11864204 12283044 11796271 12380122 11845910 12273477 12079788 12202298
5097A2202298k55740M9093K30835L03211L36220J35673L25415K15369N06320N55552
$$ 12202298 11946558 11995651 12226486 12529697 12865917 13001590 13327005 13542374 14048694 14604246
5087A4604246M50449L03148Q0516L35432J46739K02167K40142N8734N38240J69011
$$ 14604246 15054695 15357843 15438359 15773791 15920530 16122697 16362839 16421573 16959813 17128824
5077A7128824R45787l82707R56648N4503P71207M25730L53016M31565O37582R56947
$$ 17128824 18074611 17691904 18648552 18703055 19474262 19899992 20253008 20684573 21322155 22279102
5067B2279102J332905J448428J750929K496716K470138K900196K609425L771353
$$ 22279102 23612007 25060435 26811364 29308080 31778218 34678414 37287839 41059192
5059D1059192N919292R880079J3648897J9267460J8950484J8185764J5606363
$$ 41059192 46978484 56858563 70507460 89774920 108725404 126911168 142517531
5052A42517531K1661202L2480554K2449895J5455526q8209k3417268k8590541
$$ 142517531 164178733 196659287 219109182 234564708 234476499 211059231 182468690
5045A82468690k9983981k9204267j6134156j3381604j2937886q980357o771800
$$ 182468690 152484709 123280442 107146286 93764682 80826796 71846439 65074639
5038F5074639n899563n006296m734440l906510l029196k153157j793769j377362
$$ 65074639 59175076 54168780 49434340 45527830 42498634 40345477 38551708 37174346
5030C7174346j263027l83626j231856N2276n51822M50038O34774J271103J888960
$$ 37174346 35911319 35527693 34295837 34348113 33796291 34246329 34881103 36152206 38041166
5021C8041166K209901K798102K432703K516651K337795K507993J886303J732241
$$ 38041166 40251067 43049169 45481872 47998523 50336318 52844311 54730614 56462855
5013E6462855O62159j85507j176364j694936j934997k229922k085534j730820
$$ 56462855 57125014 56939507 55763143 54068207 52133210 49903288 47817754 46086934
5005D6086934j737031p90571q72844j90743o38157p71548p46236p56030j49851
$$ 46086934 44349903 43559332 42686488 42495745 41857588 41086040 40339804 39583774 39433923
4996C9433923o22326r9489K27192Q05792J298445J359705K000234J792618K378611
$$ 39433923 38811597 38712108 38939300 39745092 41043537 42403242 44403476 46196094 48574705
4987D8574705K120071J765165K366924J411595J310944J10681o29453o74584k011373
$$ 48574705 50694776 52459941 54826865 56238460 57549404 57660085 57030632 56356048 54344675
4978E4344675k005366k115991k013383j574138j313601q21205j056952n47952
$$ 54344675 52339309 50223318 48209935 46635797 45322196 44500991 43444039 42896087
4970D2896087p38526m91606n91547q65992n88630r32889m46567j97358M85708
$$ 42896087 42157561 41665955 41074408 40208416 39619786 38686897 38240330 38042972 38528680
4961C8528680K22927O85332R19399P18327J261817M60993R05894K25513j47193
$$ 38528680 38751607 39436939 40356338 41074665 42336482 42797475 43703369 43928882 43781689
4952D3781689n58210r39604j201171j502594j490108k185905j404349j489554
$$ 43781689 43223479 42283875 41082704 39580110 38090002 35904097 34499748 33010194
4944C3010194j288494n24543r46991n32902q85117m44463j547620k97511r90136
$$ 33010194 31721700 31197157 30250166 29717264 28832147 28387684 26840064 26542553 25552417
4935B5552417m65530m43712j94115J73468l58429J95663j56999o5268l30129l28669
$$ 25552417 25086887 24643175 24449060 24622528 24264099 24459762 24302763 24237495 23907366 23578697
4925B3578697l71169p87975n38802o23586o46020k63848o59129o01636p99331
$$ 23578697 23207528 22419553 21880751 21257165 20611145 20347297 19688168 19086532 18287201
4916A8287201m37790n89421o63103l36534l81095m83374Q9435n68456l49584k83406
$$ 18287201 17849411 17259990 16596887 16260353 15879258 15395884 15485319 14916863 14567279 14283873
4906A4283873k92276K7295k99237l43437j22723k80248j11562k12209L18863p83038
$$ 14283873 13991597 14018892 13719655 13376218 13253495 12973247 12861685 12649476 12968339 12185301
4896A2185301J49712m92797J27620j78822M915n33131j22402j22961K0498k67281
$$ 12185301 12335013 11842216 11969836 11791014 11795929 11262798 11140396 11017435 11037933 10770652
4886A0770652k55699n4223k1704K5728j83584P6009L7943K29468j36032p5225
$$ 10770652 10514953 10460730 10439026 10464754 10281170 10357179 10395122 10624590 10488558 10413333
4876A0413333J8761J20331l73147M04809k10526J23363j37374K98067j20499K6800
$$ 10413333 10432094 10552425 10179278 10584087 10373561 10496924 10359550 10657617 10537118 10563918
4866A0563918L56940m39288j0363K27243M35863k25007K03616J3832K41824J83962
$$ 10563918 10920858 10481570 10471207 10698450 11134313 10909306 11112922 11126754 11368578 11552540
4856A1552540M45619K33493L40987R7799K26013N31423m4402Q51598j84696Q30805
$$ 11552540 11998159 12231652 12572639 12670438 12896451 13427874 13383472 14235070 14050374 14881179
4846A4881179l06P33610j88079N32035L1950O17917L09380J79471J02630N01327
$$ 14881179 14880873 15614483 15426404 15958439 15990389 16608306 16917686 17097157 17199787 17701114
4836A7701114P53286O08495O93486N35809M08200P72627O84413O21474P55055
$$ 17701114 18454400 19062895 19756381 20292190 20700390 21473017 22157430 22778904 23533959
4827B3533959N71292R31252J129940J619801J936050K071629J916811J618193
$$ 23533959 24105251 25036503 26166443 27786244 29722294 31793923 33710734 35328927
4819C5328927J385837J146552P26125O55740O02473k5690l79060k63168m11768
$$ 35328927 36714764 37861316 38587441 39243181 39845654 39819964 39440904 39177736 38765968
4810C8765968K09444J35081L86817J26197N15964P40469N32522Q59047P28202
$$ 38765968 38975412 39110493 39497310 39623507 40139471 40879940 41412462 42271509 42999711
4801D2999711Q61608P87170P98039N96877O67553P72820N58762O93258J007142
$$ 42999711 43861319 44648489 45446528 46043405 46710958 47483778 48042540 48735798 49742940
4792D9742940P05898N81379J239592J291911J755814J150645J952928J267793
$$ 49742940 50448838 51030217 52269809 53561720 55317534 56468179 58421107 59688900
4784E9688900K146349J805271J886035J970002J523850J988967J137881J184439
$$ 59688900 61835249 63640520 65526555 67496557 69020407 71009374 72147255 73331694
4776G3331694O50913J071791M29821N64778K63590N5728L28763M36210M99629
$$ 73331694 73982607 75054398 75484219 76048997 76312587 76368315 76697078 77133288 77632917
4767G7632917O85491R86474Q81272J055709P37544Q30544P25998J55873N0083
$$ 77632917 78318408 79304882 80186154 81241863 81979407 82809951 83535949 83691822 83741905
4758H3741905R8277j13475J71736Q0127K47764M94969K38016Q1727n36346j76771
$$ 83741905 83840182 83726707 83898443 83978570 84226334 84721303 84959319 85041046 84504700 84327929
4748H4327929n06112q58708p37295r24688j143125r42772j333535j535325j388655
$$ 84327929 83821817 82963109 82225814 81301126 80158001 79215229 77881694 76346369 74957714
4739G4957714j099653j197238j265102r74091q31437j311036j541085r40780j560242
$$ 74957714 73858061 72660823 71395721 70421630 69590193 68279157 66738072 65797292 64237050
4730F4237050j042791j461157p11429j156749o23210n04845r70955m06465o87795
$$ 64237050 63194259 61733102 61021673 59864924 59241714 58736869 57765914 57359449 56671654
4721E6671654m93403q78763q53479j003451j287050j097632j564595j178385j150816
$$ 56671654 56178251 55299488 54446009 53442558 52155508 51057876 49493281 48314896 47164080
4712D7164080j437409j163921j365158o99470j060225n94710j185494o93961r50273
$$ 47164080 45726671 44562750 43197592 42498122 41437897 40843187 39657693 38963732 38013459
4703C8013459n97758r74289q11572o38891o86300m34669o40278n05744n96729
$$ 38013459 37415701 36441412 35629840 34990949 34304649 33869980 33229702 32723958 32127229
4694C2127229l09822o81574k16202o88006p68725p65586q00937q04094n30434
$$ 32127229 31817407 31135833 30919631 30231625 29462900 28697314 27896377 27092283 26561849
4685B6561849o64534n73241o39592o56356l64911q30870k59912o11402l88294
$$ 26561849 25897315 25324074 24684482 24028126 23663215 22832345 22572433 21961031 21572737
4676B1572737r07854l30535p51162j90758o06102l77124n78434R5104p69987p229
$$ 21572737 20664883 20334348 19583186 19392428 18786326 18409202 17830768 17925872 17155885 17148656
4666A7148656k96500j9211l31734m91415J98495l10357j81546l1411l05579j00893
$$ 17148656 16852156 16832945 16501211 16009796 16208291 15897934 15716388 15684977 15379398 15278505
4656A5278505l83644K02121o78116k21274m2656l97976l3297n06051O9276m35994
$$ 15278505 14894861 15096982 14418866 14197592 14154936 13756960 13723663 13217612 13286888 12850894
4646A2850894J71511k96244j79331J49749j7217n9007J92227o49373K51642m32364
$$ 12850894 13022405 12726161 12546830 12696579 12679362 12620355 12812582 12163209 12414851 11982487
4636A1982487J89715j84215K02819k3030j63158K2322l65026O2043j24665K5858
$$ 11982487 12172202 11987987 12190806 12167776 12004618 12026940 11661914 11723957 11599292 11625150
4626A1625150r2749q3235j06955k06373j86169O57551l39160P8612j92440M3682
$$ 11625150 11532401 11449166 11342211 11135838 10949669 11607220 11268060 11346672 11154232 11197914
4616A1197914K8924m7382R5034k04453J54129j59721j76271J35116J22232j40370
$$ 11197914 11226838 11179456 11274490 11070037 11224166 11064445 10888174 11023290 11145522 11005152
4606A1005152L29900l8858N38217q1801N44401M33J46111K42544J22441N0084
$$ 11005152 11335052 11296194 11834411 11752610 12297011 12297444 12443555 12686099 12808540 12858624
4596A2858624k7123J53012L73431j72520L56197L02330J09203J19802l06608p4687
$$ 12858624 12831501 12984513 13357944 13185424 13541621 13843951 13953154 14072956 13766348 13691661
4586A3691661k33638J04611M7473p8894O53731O89052Q67664J399089J357738
$$ 13691661 13458023 13562634 13610107 13531213 14184944 14873996 15741660 17140749 18498487
4577A8498487J058535k92745k0400j192942n55686q16161n71494j69947l25343
$$ 18498487 19557022 19264277 19243877 18050935 17495249 16679088 16107594 15937647 15612304
4568A5612304K64972n15595J7165j66577p9228O4526J38693N30494O07614J383721
$$ 15612304 15877276 15361681 15378846 15212269 15133041 15197567 15336260 15866754 16474368 17858089
4558A7858089J730985J138062P30674M22670l47394l34863q67018j01254m99039
$$ 17858089 19589074 20727136 21457810 21880480 21533086 21198223 20331205 20229951 19730912
4549A9730912k45404l25410l0686j36033l03556L48283j20743M21882K09122N01436
$$ 19730912 19485508 19160098 19129412 18993379 18689823 19038106 18917363 19339245 19548367 20049803
4539B0049803M61868J224056N42464J275232J324601K549426L717201N281260
$$ 20049803 20511671 21735727 22278191 23553423 24878024 27427450 31144651 36425911
4531C6425911P153622P211657O709555L835059O35071k717444m536988n563454
$$ 36425911 43579533 50791190 57500745 61335804 61970875 59253431 54716443 49152989
4523D9152989n041991n036497l618198l204296k124060j332250j146413n05431
$$ 49152989 44110998 39074501 35456303 32252007 30127947 28795697 27649284 27143853
4515B7143853j49934N91241J36446J204384J457152K126641K620055L835637O052483
$$ 27143853 26993919 27585160 27721606 28925990 30383142 32509783 35129838 38965475 45017958
4506D5017958P575709Q588146P258088N755271L050575n56039l009951n191518
$$ 45017958 52593667 61181813 68439901 74195172 77245747 76689708 73679757 68488239
4498F8488239n717132n967277o044909m656267m401894l152954l052804k492912
$$ 68488239 62771107 56803830 50758921 46102654 41700760 38547806 35495002 33002090
4490C3002090j405473j785676r47342j483077k98519n05942l68138J67618j53178
$$ 33002090 31596617 29810941 28863599 27380522 27082003 26576061 26207923 26375541 26222363
4481B6222363Q76514J095721K228459K821566L575900L006469J916492q8640j594391
$$ 26222363 27098877 28194598 30423057 33244623 36820523 39826992 41743484 41654844 40060453
4472D0060453j913571j823147j360661q61700l13222m62858l96103q47238j603056
$$ 40060453 38146882 36323735 34963074 34101374 33788152 33325294 32929191 32081953 30478897
4463C0478897j267550j748933j304009j430443j252969j192841r56326l97702
$$ 30478897 29211347 27462414 26158405 24727962 23474993 22282152 21325826 20928124
4455B0928124m94234j32757j21832l9860k20114n3985L54282L28020n0598O24144
$$ 20928124 20433890 20301133 20179301 20139441 19919327 19865342 20219624 20547644 20497046 21121190
4445B1121190L7822J084662J96696Q64356P27008N89098K72119k0589j03071o41948
$$ 21121190 21159012 22243674 22440370 23304726 24031734 24620832 24892951 24872362 24769291 24127343
4435B4127343m47170o08595p06214k28712m74632o79196j8935j34066O78632M19333
$$ 24127343 23680173 23071578 22365364 22136652 21662020 20982824 20963889 20829823 21508455 21927788
4425B1927788P60191J551452J662149J818523J406528O79895m2045p83661j333192
$$ 21927788 22687979 24239431 25901580 27720103 29126631 29806526 29764481 28980820 27647628
4416B7647628j234518j042467r16919k75135l92129k26220J97341j41481O85468
$$ 27647628 26413110 25370643 24453724 24178589 23786460 23560240 23757581 23616100 24301568
4407B4301568L9900P54960K17455K60994K71824L19404K37710N71114N94145J370582
$$ 24301568 24341468 25096428 25313883 25574877 25846701 26166105 26403815 26974929 27569074 28939656
4397B8939656J733864J938941K457686J780395J321641J44778p46969j090949
$$ 28939656 30673520 32612461 35070147 36850542 38172183 38316961 37569992 36479043
4389C6479043j136544j440770r82219l64238o69438k02478j7393l40181k1842
$$ 36479043 35342499 33901729 32919510 32555272 31885834 31683356 31665963 31325782 31303940
4380C1303940L56076L4238J14698R5501r5556L19966R9486M46249P417M11658
$$ 31303940 31660016 31694254 31808952 31904453 31808897 32128863 32228349 32674598 32682015 33093673
4370C3093673J91702R17924J553623J867378L023513K705439K716154J325399
$$ 33093673 33285375 34203299 35756922 37624300 40647813 43353252 46069406 47394805
4362D7394805j71937j56864j075230j14484j20360R06696M86996P82674J204988
$$ 47394805 47222868 47066004 45990774 45876290 45755930 46662626 47149622 47932296 49137284
4353D9137284J786237K796092K140661J891888K55438l15407r04085p97959n47199
$$ 49137284 50923521 53719613 55860274 57752162 58007600 57692193 56788108 55990149 55442950
4344E5442950m29097L02581Q43581Q41510J586336K229209K396806L265784K792409
$$ 55442950 55013853 55316434 56160015 57001525 58587861 60817070 63213876 66479660 69272069
4335F9272069L350195L157551M165445M674015N749098O844153P294259Q281054
$$ 69272069 72622264 75779815 79945260 84619275 90368373 97212526 104506785 112787839
4327A12787839J0499923J2115708J6242646K3429137L8456949N3707603N7820051
$$ 112787839 123287762 135403470 151646116 175075253 213532202 267239805 325059856
4320C25059856M9529812K9372809L213773k0148249l3311803m0613462l8634852
$$ 325059856 374589668 403962477 407176250 387028001 353716198 313102736 274467884
4313B74467884l6196327l3883413k9585839k3438847j8475002j4724019j1527385
$$ 274467884 238271557 204388144 174802305 151363458 132888456 118164437 106637052
4306A06637052r849633p496504o202374m435881m186085l161211k685193k230000
$$ 106637052 96787419 89290915 83088541 78652660 74466575 71305364 68620171 66390171
4298F6390171k266260j230297j198146p01669n52882k17783p57969o38380j284179
$$ 66390171 64123911 62893614 61695468 60993799 60440917 60223134 59465165 58826785 57542606
4289E7542606j664923j211546k002365j312254k019085j190082j346907p44108
$$ 57542606 55877683 54666137 52663772 51351518 49332433 48142351 46795444 46051336
4281D6051336j176025p13479j128044j352762r99289j338647o82304j393957o42501
$$ 46051336 44875311 44161832 43033788 41681026 40681737 39343090 38660786 37266829 36624328
4272C6624328j041640J3512j1261r6390j63035p79294l41627j513381p59767j421566
$$ 36624328 35582688 35596200 35584939 35488549 35325514 34546220 34204593 32691212 31931445 30509879
4262C0509879r75561r43199n21719j279594p9972r43374l96061m25431k05702
$$ 30509879 29534318 28591119 28069400 26789806 26709834 25766460 25370399 24944968 24739266
4253B4739266j76914m77032j9068q86199m07912o50008o98100p68030m8321r09949
$$ 24739266 24562352 24085320 24066252 23180053 22772141 22122133 21424033 20656003 20607682 19697733
4243A9697733j60821m47555k98790k27484l55105m00331J63146j42980j0979j3535
$$ 19697733 19536912 19089357 18790567 18563083 18207978 17807647 17970793 17827813 17816834 17803299
4233A7803299J18565l64790k96985j68912l75211l03254k61870l12602n94755
$$ 17803299 17921864 17557074 17260089 17091177 16715966 16412712 16150842 15838240 15243485
4224A5243485K09227m82053r8669n04233m9501m90815K06526n93229j32449J39551
$$ 15243485 15452712 14970659 14871990 14367757 14318256 13827441 14033967 13440738 13308289 13447840
4214A3447840P12l04290l9135l71115N6845N2506J42418j54238l45165n739k46238
$$ 13447840 13448552 13144262 13105127 12734012 12790857 12843363 12985781 12831543 12486378 12480639 12234401
4203A2234401n3493o7995L31131m21793p4872m2043j1965k98841o7705M2160P9860
$$ 12234401 12180908 12112913 12444044 12022251 11947379 11905336 11893371 11594530 11526825 11568985 11648845
4192A1648845j37909n38078m6684l28687P5467J23068l09808j41180j30066j94344
$$ 11648845 11510936 10972858 10926174 10597487 10672954 10796022 10486214 10345034 10214968 10020624
4182A0020624k55056j69381J49415j77757J17899j89125J6048m73478J94208j77730
$$ 10020624 9765568 9596187 9745602 9567845 9685744 9496619 9512667 9039189 9233397 9055667
4172I055667J50016N2288l90992n0037k19843J99203l75J3781P8437r488l59767
$$ 9055667 9205683 9257971 8866979 8816942 8597099 8796302 8795927 8809708 8888145 8878657 8518890
4161H518890J84596j73263k18808k22602l1155k53434J39453K6691p2623l48428
$$ 8518890 8703486 8530223 8311415 8088813 8057658 7804224 7943677 7970368 7897745 7549317
4151G549317K50900k45760R1983r8858p9097N6770k39449K82775m27975M94668
$$ 7549317 7800217 7554457 7646440 7547582 7468485 7525255 7285806 7568581 7140606 7635274
4141G635274m79048J65247l59748K82961k55300K61944j89665J84657K56651j46115
$$ 7635274 7156226 7321473 6961725 7244686 6989386 7251330 7061665 7246322 7502973 7356858
4131G356858R1978k47464J96032k63738L6500k56807M58493m11056L53211k13403
$$ 7356858 7448836 7201372 7397404 7133666 7170166 6913359 7371852 6960796 7314007 7100604
4121G100604k28679M90271j08580L45994j13812M26938l99190K71574J66872O6403
$$ 7100604 6871925 7362196 7253616 7599610 7485798 7912736 7513546 7785120 7951992 8018395
4111H018395J17864n3601J90697j21636J48639n1770L32345L10676J70920K21654
$$ 8018395 8136259 8082658 8273355 8151719 8300358 8248588 8580933 8891609 9062529 9284183
4101I284183J03958L37639n8087L3650M71422j24889J69147m31084J54376k16463
$$ 9284183 9388141 9725780 9667693 9701343 10172765 10047876 10217023 9785939 9940315 9723852
4091I723852L21423L2491J0834M82247L33261j32743M92982K83855K95712k02078
$$ 9723852 10045275 10077766 10088600 10570847 10904108 10771365 11264347 11548202 11843914 11641836
4081A1641836L79084l32644L7890J49401J4363K16390J70328M29447J47171N49659
$$ 11641836 12020920 11688276 11726166 11875567 11889930 12106320 12276648 12706095 12853266 13402925
4071A3402925K83126Q05726M29829M22043J30859j01784l77879J66858l10346
$$ 13402925 13686051 14491777 14921606 15343649 15474508 15372724 14994845 15161703 14851357
4062A4851357K09582J49626L82877j61809K71700O82759K2559P50636J79270O94511
$$ 14851357 15060939 15210565 15593442 15431633 15703333 16386092 16408651 17159287 17338557 18033068
4052A8033068O17139N91829N83154Q35317P87833P32746O24326M65187N47330
$$ 18033068 18650207 19242036 19825190 20660507 21448340 22181086 22805412 23270599 23817929
4043B3817929M65414Q0490R4841N31171k02661L63594o8529M2j21926O70987l1476
$$ 23817929 24283343 24363833 24458674 24989845 24787184 25150778 25082249 25082291 24960365 25631352 25599876
4032B5599876O55405O61065Q74544J081023Q98330J550763J726714K295843K467754
$$ 25599876 26255281 26916346 27790890 28871913 29770243 31321006 33047720 35343563 37811317
4023C7811317K946067K873735K199263Q88736n57742j465820k438441j874245
$$ 37811317 40757384 43631119 45830382 46719118 46161376 44695556 42257115 40382870
4015D0382870l094840k070870j878765j408267j334857n31304m34554J39565J86488
$$ 40382870 37288030 35217160 33338395 31930128 30595271 30063967 29629413 29768978 29955466
4006B9955466N98506P70220Q02175J114506O59100J096083Q00808J268713Q63495
$$ 29955466 30553972 31324192 32126367 33240873 33899973 34996056 35796864 37065577 37929072
3997C7929072O04160N36082M160l66304r45212j336580j936982j905433k020118
$$ 37929072 38533232 39069314 39073474 38707170 37761958 36425378 34488396 32582963 30562845
3988C0562845k251484j242479j076149j196513o30793m60394j13458L8789L3306
$$ 30562845 28311361 27068882 25992733 24796220 24165427 23705033 23591575 23630364 23663670
3979B3663670J70527p2455K68959m55943k50935j054086m73715q62141q81112
$$ 23663670 23834197 23761742 24030701 23574758 23323823 22269737 21796022 20933881 20052769
3970B0052769r84786j057993q81208j100440q55104q24285l76355n88630m90559
$$ 20052769 19067983 18009990 17128782 16028342 15173238 14348953 13972598 13383968 12893409
3961A2893409n28374l46496n31856m1170l45206k64819k91672j89874m63871k94472
$$ 12893409 12365035 12018539 11486683 11445513 11100307 10835488 10543816 10353942 9890071 9595599
3951I595599J03485l20910k64204k50462j53533k42026j36782l65640j96179k20170
$$ 9595599 9699084 9378174 9113970 8863508 8709975 8467949 8331167 7965527 7769348 7549178
3941G549178j40712l05751q4593n2598l03083k95657L07841k26562R0607j51323
$$ 7549178 7408466 7102715 7018122 6965524 6662441 6366784 6674625 6448063 6538670 6387347
3931F387347j43999k14852J4942k56860L3822m51512J57840j88939L01143m14334
$$ 6387347 6243348 6028496 6043438 5786578 5820400 5368888 5526728 5337789 5638932 5224598
3921E224598J84010k55826J17838o2655o9803J99615k31015k7053k50613p8636
$$ 5224598 5408608 5152782 5270620 5207965 5138162 5337777 5106762 5079709 4829096 4750460
3911D750460n56302M0905k18453o5381j53506L4877l79001n8963K1487o2165r0063
$$ 4750460 4194158 4235063 4016610 3951229 3797723 3832600 3453599 3394636 3416123 3353958 3263895
3900C263895L0241j95328Q2124l00232J14262j52075J47784K10774j97863o2275
$$ 3263895 3294136 3098808 3180932 2880700 2994962 2842887 2990671 3201445 3003582 2941307
3890B941307Q7610K17703k7633L48291l82442J29941o49096J74354k74790l59983
$$ 2941307 3028917 3246620 3218987 3567278 3184836 3314777 2665681 2840035 2565245 2205262
3880B205262K15658j66348j47956m06831L13365o17949L62708l04301K61915l28712
$$ 2205262 2420920 2254572 2106616 1699785 2013150 1395201 1757909 1453608 1715523 1386811
3870A386811Q6041q2626M3211l03295L22527l39938L89500l35216K13859l66679
$$ 1386811 1472852 1390226 1433437 1130142 1452669 1112731 1502231 1167015 1380874 1014195
3860A014195K86844l430R5329L4104j61850r5459j10256o1866j79716J22449k90198
$$ 1014195 1301039 1297609 1392938 1427042 1265192 1169733 1059477 997611 817895 940344 650146
3849F50146J81559l07116m9387J5529J85570l19663K46683m59116K87857k20910
$$ 650146 831705 524589 475202 490731 676301 356638 603321 144205 432062 211152
3839B11152K94972k22440K20409j11985j54222o1269P5317k46857K65016k83654
$$ 211152 506124 283684 504093 392108 237886 176617 251934 5077 270093 -13561
3829a3561M64357l04699J00650q0993K33158k73247O4939M2257Q260m06315K79643
$$ -13561 450796 146097 246747 165754 398912 125665 190604 232861 241121 -165194 114449
3818A14449p1713k5326L2965M0007m7388j47447J56014J09067n6035J86495n4464
$$ 114449 42736 17410 50375 90382 42994 -104453 51561 160628 104593 291088 236624
3807B36624k53893J00345J3213J55618n7473n5282j33398l7790o7325K97133m18534
$$ 236624 -17269 83076 96289 251907 194434 139152 5754 -32036 -99361 197772 -220762
3796b20762L40500l83719N98101n05359J69333j40702m9104K55365l26307L37525
$$ -220762 119738 -263981 334120 -171239 -1906 -142608 -191712 63653 -262654 74871
3786G4871j81835R4808l91990L93890r3200L4365M3465J16577j58909J02643o236
$$ 74871 -106964 -12156 -404146 -10256 -103456 -69091 -25626 90951 -67958 34685 28449
3775B8449o7007J85955q1651M9597k25084K52778j35840j29611O4661j08398L89813
$$ 28449 -38558 147397 65746 115343 -109741 143037 7197 -122414 -57753 -166151 223662
3764B23662k51777J94675j56777M4461j43502j57276J70499q5155K31587j73130
$$ 223662 -28115 166560 9783 54244 -89258 -246534 -76035 -161190 70397 -102733
3754a02733r816J02001j83271J17508l5456J3161k4879N4756j46762K71552j54771
$$ -102733 -112549 -10548 -193819 -76311 -111767 -98606 -123485 -68729 -215491 56061 -98710
3743i8710m0927K47093r5818r8053N0158j26459l8256J02583j19263N0789p8367
$$ -98710 -139637 107456 11638 -86415 -36257 -162716 -200972 -98389 -217652 -166863 -245230
3732b45230J66299k80361K81575j23483K59559k34235M1955j46863R4376M6332
$$ -245230 -78931 -359292 -77717 -201200 58359 -175876 -133921 -280784 -186408 -140076
3722a40076l18390K86758j54286L02522m35306K03585l68026K32417K20458m07355
$$ -140076 -458466 -171708 -325994 -23472 -458778 -255193 -623219 -390802 -170344 -577699
3712e77699N78095m27968K05984j04423k1802J21809J01053l33692O1834k1107
$$ -577699 396 -427572 -221588 -326011 -347813 -226004 -124951 -458643 -396809 -417916
3702d17916K71880R09j82799K26591m43581L96495j11450k0512J27249k45904
$$ -417916 -146036 -145127 -327926 -101335 -544916 -148421 -259871 -280383 -153134 -399038
3692c99038L40921m80057L87028k71826L09326l8300m26869K76582j24646J93924
$$ -399038 -58117 -538174 -151146 -422972 -113646 -151946 -578815 -302233 -426879 -232955
3682b32955l82263L96645n45057M12598k58925K64723j8498j03235J0430l4376
$$ -232955 -615218 -218573 -763630 -351032 -609957 -345234 -363732 -466967 -456537 -490913
3672d90913P1586R6150R3889k95845J45111K0315N8796p7970l4085J46042r2871
$$ -490913 -419327 -323177 -229288 -525133 -380022 -359707 -300911 -378881 -412966 -266924 -359795
3661c59795l75867M60954k90916L77787k52612j71710M5331K31996m291l16494
$$ -359795 -735662 -274708 -565624 -187837 -440449 -612159 -566828 -334832 -339123 -655617
3651f55617K16506j87055J92462j20524j73823J26031q3504J98688J63293q1885
$$ -655617 -439111 -626166 -433704 -554228 -728051 -602020 -685524 -486836 -323543 -405428
3641d05428N1257j65335Q6893J52582j84888J07984j81030k3513P535L33980m04633
$$ -405428 -354171 -519506 -432613 -280031 -464919 -356935 -537965 -561478 -553943 -219963 -624596
3630f24596l5500Q8294K86179k41269n2856J77169k00525J68102k25781K27581
$$ -624596 -660096 -571802 -285623 -526892 -579748 -402579 -603104 -435002 -660783 -433202
3620d33202l7289j64218K20401k27358L55448k86296J73033l19762L41465m0483
$$ -433202 -470491 -634709 -414308 -641666 -286218 -572514 -399481 -719243 -377778 -418261
3610d18261l8552N5792j13484O7905K1930J7710J16805q293o2035k36102P0831
$$ -418261 -456813 -401021 -514505 -446600 -424670 -406960 -290155 -298448 -360483 -596585 -525754
3599e25754M9618M3473n4681J20024n9607N1243q2429P35J06723j19530k81950
$$ -525754 -476136 -432663 -487344 -367320 -426927 -375684 -458113 -457378 -350655 -470185 -752135
3588g52135R2229p7688J19678j23433L66352l91209J94712r2310R2516J87984
$$ -752135 -659906 -737594 -617916 -741349 -374997 -766206 -571494 -663804 -571288 -383304
3578c83304Q0935q5123J2598j10750J52848k91661L22777l54597K78266j54744
$$ -383304 -302369 -387492 -374894 -485644 -332796 -624457 -301680 -656277 -378011 -532755
3568e32755R6356M3177n55069K19598J25474L50937m75177K90743r8864K4159
$$ -532755 -436399 -393222 -948291 -728693 -603219 -252282 -727459 -436716 -535580 -511421
3558e11421K75420K0917k55646K5101n8006Q4518j72430K32822k37375Q3010q664
$$ -511421 -236001 -215084 -470730 -445629 -503635 -419117 -591547 -358725 -596100 -513090 -521754
3547e21754p2101J66227l316q1701p5986L8330L0526j21340K19049k87802L14473
$$ -521754 -593855 -427628 -430944 -512645 -588631 -550301 -519775 -641115 -422066 -709868 -395395
3536c95395k02794K38302j78690o3299R8897n7890J18038l63773O79153m58719
$$ -395395 -598189 -359887 -538577 -601876 -502979 -560869 -442831 -806604 -127451 -586170
3526e86170N91349o55631L24931l47475K15151k11742K47125k16821J78338N7036
$$ -586170 5179 -650452 -325521 -672996 -457845 -669587 -422462 -639283 -460945 -403909
3516d03909j91114O0725n2756J92237p7216k1717J1997K85761k96745J65316n37552
$$ -403909 -595023 -534298 -587054 -394817 -472033 -493750 -481753 -195992 -492737 -327421 -864973
3505h64973M50943k04952K06321j91222N7918j25364O0013o062P2131O1201K12604
$$ -864973 -414030 -618982 -412661 -603883 -545965 -671329 -611316 -617378 -545247 -484046 -271442
3494b71442j22524q5526O5404j17214K58648o60424P86064o08732L93912j70664
$$ -271442 -393966 -479492 -414088 -531302 -272654 -933078 -147014 -755746 -361834 -532498
3484e32498K14149j90047j11753N2759J53478r5006j16902J69456J54297Q2790
$$ -532498 -318349 -508396 -620149 -567390 -413912 -508918 -625820 -456364 -302067 -219277
3474b19277k02654m187l96981L26064L02893o9880l26146J10186L4830O0911N5748
$$ -219277 -421931 -426118 -823099 -497035 -194142 -264022 -590168 -479982 -445152 -384241 -328493
3463c28493J25471j83751J49127k5974k63116J67362j68502K74445j58919J60561
$$ -328493 -203022 -386773 -237646 -263620 -526736 -359374 -527876 -253431 -412350 -251789
3453b51789k16778J05469j67134r485K23085L01513l86337K13612k93391K02230
$$ -251789 -468567 -363098 -530232 -539717 -316632 -15119 -401456 -187844 -481235 -279005
3443b79005J66594l2317j73357J77391J97668k33300j05644o7966M7903L74585
$$ -279005 -112411 -144728 -318085 -140694 56974 -176326 -281970 -349936 -302033 72552
3433G2552k32622M27734n93646J29143j0785J86576Q659k38297K65334k59591
$$ 72552 -160070 267664 -325982 -196839 -207624 -21048 -12389 -250686 14648 -244943
3423b44943K51152l82170M30174j52579q2554k0191n4680L46980k02972j45118
$$ -244943 6209 -375961 54213 -98366 -180920 -201111 -255791 91189 -111783 -256901
3413b56901j19780N74668j27893q5796r6158N9504p6806J22075K29674k46305
$$ -256901 -376681 197987 70094 -15702 -111860 -52356 -129162 -7087 222587 -23718
3403b3718K54074k77546K58256J46370K20817j91304K68608J60277J14305P4823
$$ -23718 230356 -47190 211066 357436 578253 386949 655557 815834 930139 1004962
3393A004962j04379J94867q023M93724n17925P16220k38299Q68747M56112J788037
$$ 1004962 900583 1095450 1087427 1581151 1063226 1779446 1541147 2409894 2866006 4654043
3383D654043J997145K007209K135334N33158M4237j927135j135430k352752q56892
$$ 4654043 6651188 8658397 10793731 11326889 11371126 9443991 8308561 5955809 5098917
3374E098917j666871l85800r80004m25902l04462K8878k29115k36808J11939j93452
$$ 5098917 3432046 3046246 2066242 1640340 1335878 1364756 1135641 898833 1010772 817320
3364H17320L62315l43424K08068p99842K12444J16250p2359J01659k24042K21443
$$ 817320 1179635 836211 1044279 244437 456881 573131 500772 602431 378389 599832
3354E99832j12653j39907J97593r7451J92073l45355j01900M85950l38261J83029
$$ 599832 487179 347272 544865 447414 639487 294132 192232 678182 339921 522950
3344E22950j80991K24804R877R5035K24048Q7570J89234K69218J75242J10636
$$ 522950 341959 566763 576640 671675 895723 983293 1172527 1441745 1616987 1727623
3334A727623K53645K22345k82797L06962M53865P21555N96410K861074M943955
$$ 1727623 1981268 2203613 1920816 2227778 2681643 3403198 3999608 6860682 11804637
3325A1804637M849661M236111J851196q37111l014546k630533m408045k248398
$$ 11804637 16654298 20890409 22741605 21904494 18889948 16259415 11851370 9602972
3317I602972k018522j988269k037279n77353n56885k1069n07232o6483k11638
$$ 9602972 7584450 5596181 3558902 2981549 2424664 2403595 1896363 1829880 1618242
3308A618242j49792j35470j04338j42319l40923J18207j94905j42356Q9877j50219
$$ 1618242 1468450 1332980 1228642 1086323 745400 863607 668702 526346 616223 466004
3298D66004P5843k93688K32634l07889j26279K61342o8684K01011l26625K34288
$$ 466004 541847 248159 480793 172904 46625 307967 239283 440294 113669 347957
3288C47957l49886J69000M9877j47565N0074j82478N26782n82629L60457l18866
$$ 347957 -1929 167071 216948 69383 119457 -63021 463761 -118868 241589 -77277
3278g7277N154K9570p8830J75475n3209r9385K0464p7038o3759L0142K92219l63488
$$ -77277 -72123 -42553 -121383 54092 883 -98502 -78038 -155076 -218835 -188693 103526 -259962
3266b59962K48206k72661L92229n14405K88214k12361K58780k38939Q0111Q2845
$$ -259962 -11756 -284417 107812 -406593 -118379 -330740 -71960 -310899 -230788 -147943
3256a47943j69583L05015l67642L84877k41274l0494o7045n7456n6830j19012
$$ -147943 -317526 -12511 -380153 4724 -236550 -267044 -334089 -391545 -448375 -567387
3246e67387J45739n7334J48095J02893n2419n4334n7952R0587j28568L08012j92998
$$ -567387 -421648 -478982 -330887 -227994 -280413 -334747 -392699 -302112 -430680 -122668 -315666
3235c15666J69040k43050j27508L1924J54871m871p0523Q0011l11612L3015J68436
$$ -315666 -146626 -389676 -517184 -485260 -330389 -335260 -405783 -325772 -637384 -604369 -435933
3224d35933r0276K87148k19777L02710m64188K11450n5894K68405k1525r6794
$$ -435933 -526209 -239061 -458838 -156128 -620316 -408866 -464760 -196355 -217880 -314674
3214c14674l43163L14775r8909N918N1885k54584L24744k09080J24666J87766
$$ -314674 -657837 -343062 -441971 -436053 -384168 -638752 -314008 -523088 -398422 -210656
3204b10656n253l62215M0812J32358j46989K50670j80581j0845j63641J54089
$$ -210656 -215909 -578124 -537312 -404954 -551943 -301273 -481854 -492699 -656340 -502251
3194e02251j8087k4766J66735j28279L94633j33854j10803r2746o2881J38954
$$ -502251 -520338 -545104 -378369 -506648 -112015 -245869 -356672 -449418 -512299 -373345
3184c73345k33316J31839k05536K08877k41217J23364L41435j29455R1270l11294
$$ -373345 -606661 -474822 -680358 -471481 -712698 -589334 -247899 -377354 -286084 -597378
3174e97378M00750k41640M3577j86739J26401r9766K27260O8813k34461o8922
$$ -597378 -196628 -438268 -394691 -581430 -455029 -554795 -327535 -258722 -493183 -562105
3164e62105O1889M0427J63118j50379l3068l2456J0566K51405m40193M82540k40510
$$ -562105 -500216 -459789 -296671 -447050 -480118 -512574 -502008 -250603 -690796 -208256 -448766
3153d48766N4128k77435K05795L0809l8907N01647m28580K73435j60297m6858
$$ -448766 -394638 -672073 -466278 -435469 -474376 27271 -401309 -127874 -288171 -335029
3143c35029l84557L37560M1297J67397j52476p170k77094K1934J9149K6275K03107
$$ -335029 -719586 -382026 -340729 -173332 -325808 -332978 -610072 -588138 -568989 -542714 -339607
3132c39607j70543J77446m15971J85753K4313N1864K25226r5394K57821k22844
$$ -339607 -510150 -332704 -748675 -562922 -538609 -486745 -261519 -356913 -99092 -321936
3122c21936k84718L9485r4185J24083K68972k04624L0940J19274l05466K86308
$$ -321936 -606654 -567169 -661354 -537271 -268299 -472923 -441983 -322709 -628175 -341867
3112c41867k09357L97168k36630j37539J1143p0847J24018j99970K63532j04728
$$ -341867 -551224 -154056 -390686 -528225 -517082 -587929 -463911 -663881 -400349 -505077
3102e05077J10048l1194j36918q9737O4906K98468j15324o6630l16988M64316
$$ -505077 -395029 -426223 -563141 -652878 -587972 -289504 -404828 -471458 -788446 -324130
3092c24130l82824L98790k14441L70971n11153M74561j02806l8686k20106j17013
$$ -324130 -706954 -308164 -522605 -151634 -662787 -188226 -291032 -329718 -549824 -666837
3082f66837J10926K58316n9046j91322O7917r2842M25760m97139L27520m01134
$$ -666837 -555911 -297595 -356641 -547963 -480046 -572888 -147128 -644267 -316747 -717881
3072g17881K47868k01339O3370J55053o8518o481q0597K42095n7583K15955k80688
$$ -717881 -470013 -671352 -607982 -452929 -521447 -527928 -608525 -366430 -424013 -208058 -488746
3061d88746J48933m404J2085k34161k17974K73750M6001R1227j77474k18502L33544
$$ -488746 -339813 -344217 -332132 -566293 -784267 -510517 -464516 -373289 -550763 -769265 -435721
3050d35721m47463N21969k70484K23587R995M5051l2991K6141J43942l69446K76724
$$ -435721 -883184 -361215 -631699 -408112 -398117 -353066 -386057 -359916 -215974 -585420 -308696
3039c08696r9159r4104j18113K9435K42294k40311J75604j24807K19307j01677
$$ -308696 -407855 -501959 -620072 -590637 -348343 -588654 -413050 -537857 -318550 -420227
3029d20227L155Q4548k6797J38610l83032J89639m65639M93726O5761l87014L77718
$$ -420227 -417072 -332524 -359321 -220711 -603743 -414104 -879743 -386017 -320256 -707270 -329552
3018c29552j88464J52983r4380O8134m2867K18677l75492M53413l84429O0962
$$ -329552 -518016 -365033 -459413 -391279 -434146 -215469 -590961 -137548 -521977 -461015
3008d61015j55293P3625L4068P8986K81918n23143K62719k82372L61305j03323
$$ -461015 -616308 -542683 -508615 -429629 -147711 -670854 -408135 -690507 -329202 -432525
2998d32525O6220l11535K42918q8776L17582k86809K12269j48168p4885O672J6403
$$ -432525 -366305 -677840 -434922 -523698 -206116 -492925 -280656 -428824 -503709 -497037 -480634
2987d80634m2206K37461l43382L35856j71089K3034l3411o707R3479P847j79653
$$ -480634 -522840 -285379 -628761 -292905 -463994 -440960 -474371 -481078 -387599 -379752 -559405
2976e59405K07928l55716N15970m02539O1129n1080p0586L65323j76208J27017
$$ -559405 -351477 -707193 -191223 -593762 -532633 -583713 -654299 -288976 -465184 -338167
2966c38167L0425k60972M6663J57451N6793J2419K1194j62238J48810k15096P9604
$$ -338167 -307742 -568714 -522051 -364600 -307807 -295388 -274194 -436432 -287622 -502718 -423114
2955d23114j75964L72634j19614j57780k7171K8554J70314k21195J85981p2678
$$ -423114 -599078 -226444 -346058 -503838 -531009 -502455 -332141 -553336 -367355 -440033
2945d40033n3896L4768R6694k07049K31376p4544K39619l13212J22208j2217j45750
$$ -440033 -493929 -459161 -362467 -569516 -338140 -412684 -173065 -486277 -364069 -376286 -522036
2934e22036J90446j72834K21048q7561J27258l09781J73321R3831l85013L76100
$$ -522036 -331590 -504424 -283376 -370937 -243679 -553460 -380139 -286308 -671321 -295221
2924b95221k53567R6495k4006k15691J46958r1513J32806j26186J38878j40657
$$ -295221 -548788 -452293 -476299 -691990 -545032 -636545 -503739 -629925 -491047 -631704
2914f31704L15391k17655N5281M7095J02818Q7769m90707M44746l97130M54535
$$ -631704 -316313 -533968 -478687 -431592 -328774 -241005 -731712 -286966 -684096 -229561
2904b29561n97930O00644k20723K9221j73983J83825j373l3417l5954K3064J9144
$$ -229561 -827491 -226847 -447570 -418349 -592332 -408507 -409880 -443297 -479251 -456187 -437043
2893d37043k4361O3815l55152J51307J79663o7081J27485k16285j70145R3524
$$ -437043 -461404 -397589 -752741 -601434 -421771 -488852 -361367 -577652 -747797 -654273
2883f54273K03707R1622k33622K04271l17840L16591j22863K12120k94803K5978
$$ -654273 -450566 -358944 -592566 -388295 -706135 -389544 -512407 -300287 -595090 -569112
2873e69112R2051J0213M888j42432K07811R8j03538K51089k16656o6978J81154
$$ -569112 -477061 -466848 -461960 -604392 -396581 -396483 -500021 -248932 -465588 -532566 -351412
2862c51412j01128K06715m567o1501q7184R2381j84386j13165J13084O5331K90550
$$ -351412 -452540 -245825 -250392 -311893 -399077 -306696 -491082 -604247 -491163 -425832 -135282
2851a35282l27762J03970j65173n2170l8451M4317j0669K6986n9101r4660L42894
$$ -135282 -463044 -359074 -524247 -576417 -614868 -570551 -581220 -554234 -613335 -707995 -365101
2840c65101j49586J61326l19700J09084L46190k76153L7745k77916M46325l75100
$$ -365101 -514687 -353361 -673061 -563977 -217787 -493940 -456195 -734111 -287786 -662886
2830f62886L75560o5093N8219k81133L08001l25852L33833k51422M0795j28630
$$ -662886 -287326 -352419 -294200 -575333 -267332 -593184 -259351 -510773 -469978 -598608
2820e98608J89476Q5128k05701J89197k10447L03561j18658J00641m38818L65688
$$ -598608 -409132 -324004 -529705 -340508 -550955 -247394 -366052 -265411 -704229 -338541
2810c38541j5046k4036k68841K19277o5416J5067N0830m3167K33049n3137Q8198
$$ -338541 -353587 -377623 -646464 -427187 -492603 -477536 -426706 -469873 -236824 -289961 -201763
2799b01763l30101K15968l17161L04627k45400J99235o2938N2352j13208j36634
$$ -201763 -531864 -315896 -633057 -328430 -573830 -374595 -437533 -385181 -498389 -635023
2789f35023J99319O2303m4969N7306m4729j28891J76294j20639m3419n8077Q6949
$$ -635023 -435704 -373401 -418370 -361064 -405793 -534684 -358390 -479029 -522448 -580525 -493576
2778d93576O9160J06510j06279J31024j25718j4512j30413l0761K92551j07510
$$ -493576 -424416 -317906 -424185 -293161 -418879 -433391 -563804 -594565 -302014 -409524
2768d09524Q5634k97408J27572n7196K47572j85229J07008J66675k35536K34463
$$ -409524 -323890 -621298 -493726 -550922 -303350 -488579 -381571 -214896 -450432 -215969
2758b15969n56953K63905L09L27647j95150k1289j62035P1858N0142j40891L06979
$$ -215969 -772922 -509017 -508708 -181061 -376211 -397500 -559535 -487677 -437535 -578426 -271447
2747b71447p5415l8414j61348K07997k40563M2230l6069R3277J54265j34934J36318
$$ -271447 -346862 -385276 -546624 -338627 -579190 -536960 -573029 -479752 -325487 -460421 -324103
2736c24103k17011J4622P9181k1307j34285J28027K21407l3346k06288N6188J07252
$$ -324103 -541114 -526492 -447311 -468618 -602903 -474876 -253469 -286815 -493103 -436915 -329663
2725c29663J65550j50549l22830J10534J25735j64469Q6551R2987J78551m5818
$$ -329663 -164113 -314662 -637492 -526958 -401223 -565692 -479141 -386154 -207603 -253421
2715b53421p8481q3954j45508J79565k9045Q1153O313P502j78751k32454L12619
$$ -253421 -331902 -415856 -561364 -381799 -410844 -329691 -323378 -315876 -494627 -727081 -414462
2704d14462j7161o3638J48165j4705L0512j86480j8641o028M3100K06946P3022
$$ -414462 -431623 -495261 -347096 -361801 -331289 -517769 -536410 -542438 -499338 -292392 -219370
2693b19370k49228k0954Q3079k31498M02887r3979k22842K54157k02771o1044
$$ -219370 -468598 -489552 -406473 -637971 -235084 -329063 -551905 -297748 -500519 -561563
2683e61563K44183k10600J83227k47080M40539k73271J55540m15504M14249k61672
$$ -561563 -317380 -527980 -344753 -591833 -151294 -424565 -269025 -684529 -270280 -531952
2673e31952J10246P9828j82789K05968l11214N66657l92611J94840k52508L05841
$$ -531952 -421706 -341878 -524667 -318699 -629913 -63256 -455867 -261027 -513535 -207694
2663b07694l36530L46107l38662J15993J23108m7935O859j31651o2856M7627O3087
$$ -207694 -544224 -198117 -536779 -420786 -297678 -345613 -338754 -470405 -533261 -485634 -422547
2652d22547L57867m44714J43836k49189M56274m55323J84122k05234K51817M9599
$$ -422547 -64680 -509394 -365558 -614747 -158473 -613796 -429674 -634908 -383091 -333492
2642c33492j73875J48283l71236M67481j39181N1416k13908J26509J28234k10265
$$ -333492 -507367 -359084 -730320 -262839 -402020 -350604 -564512 -438003 -309769 -520034
2632e20034J36374j5628K674J2552P2999j74406k2809k8281j8671L0679k3852
$$ -520034 -383660 -399288 -396614 -384062 -311063 -485469 -508278 -536559 -555230 -524551 -548403
2621e48403L14949j02875R5010j78495J17155k49341J10729m5933O5877m3533
$$ -548403 -233454 -336329 -241319 -419814 -302659 -552000 -441271 -487204 -421327 -464860
2611d64860m4203O1408j03744J43249J23100q6947J9070j5174L2357n734j25606
$$ -464860 -509063 -447655 -551399 -408150 -285050 -371997 -352927 -368101 -335744 -341478 -467084
2600d67084j7983j2678J31075m4982j15084J1481J33090k0259j09137J92876j29233
$$ -467084 -485067 -497745 -366670 -411652 -526736 -515255 -382165 -402424 -511561 -318685 -447918
2589d47918R6908j8609L1452L9877j14773j81515q5975J93402K32712j42380o7433
$$ -447918 -351010 -369619 -338167 -298290 -413063 -594578 -680553 -487151 -254439 -396819 -464252
2578d64252J46260l8611j0112j25745p1570Q6009J80713k6832q8591N8566m2927
$$ -464252 -317992 -356603 -366715 -492460 -564030 -478021 -297308 -324140 -412731 -354165 -397092
2567c97092j17926K12211k65243J52219j19975L36788l71852k8489J3365K98757
$$ -397092 -515018 -302807 -568050 -415831 -535806 -199018 -570870 -599359 -585994 -287237
2557b87237p0058K26590k42508J15704k13023K74782k78890J35527j99853N7838
$$ -287237 -357295 -130705 -373213 -257509 -470532 -195750 -474640 -339113 -538966 -481128
2547d81128M4189j09687J29917l69913N33440j24457J92650l61432L21350j66426
$$ -481128 -436939 -546626 -416709 -786622 -253182 -377639 -184989 -546421 -225071 -391497
2537c91497J03511k8872k14762J16774J11769j36299N4706K37510j73510k36013
$$ -391497 -287986 -316858 -531620 -414846 -303077 -439376 -384670 -147160 -320670 -556683
2527e56683J46646J01084J97792l40369L08810l30930K14866P566j66065j84939
$$ -556683 -410037 -308953 -111161 -451530 -142720 -473650 -258784 -251218 -417283 -602222
2517f02222r1409L05568j41841K13803j19942k32046O1793M95741j53130j40186
$$ -602222 -693631 -388063 -529904 -316101 -436043 -668089 -606296 -110555 -263685 -403871
2507d03871q2414L16436l57379J87690j44395M6267j8341j28431p1015L30132
$$ -403871 -486285 -169849 -527228 -339538 -483933 -437666 -456007 -584438 -655453 -325321
2497c25321q9829J5271K45677m46284N72855m00451L22382l43844K34228l39486
$$ -325321 -415150 -399879 -154202 -600486 -27631 -428082 -105700 -449544 -215316 -554802
2487e54802K63172l63201K42037j73792K25094j489o8339P8505k77510K8653J63116
$$ -554802 -291630 -654831 -412794 -586586 -361492 -362981 -431320 -352815 -630325 -601672 -438556
2476d38556K33392k72687l6756j24601L83359j82326j0958j32238J72823j46710
$$ -438556 -205164 -477851 -514607 -639208 -255849 -438175 -449133 -581371 -408548 -555258
2466e55258J71116j43932K79035l02727J97442j62484K11128l2729j00332l0628
$$ -555258 -384142 -528074 -249039 -551766 -354324 -516808 -305680 -338409 -438741 -469369
2456d69369J06301p6663K54255k32559j63597k7289K43176q8213o3310j70704
$$ -469369 -363068 -439731 -185476 -418035 -581632 -608921 -365745 -453958 -517268 -687972
2446f87972K41262J63300j82892R5065l34002N27506m58728L85678j39626m3045
$$ -687972 -446710 -283410 -466302 -371237 -705239 -177733 -636461 -250783 -390409 -433454
2436d33454j96627J26079q894J92891k07572r9163K58044m0397K93136k50088
$$ -433454 -630081 -504002 -512896 -320005 -527577 -626740 -368696 -409093 -115957 -366045
2426c66045o6140l7635L1541j13983j38645M40472l17223l9967P8277K2917J68832
$$ -366045 -432185 -469820 -438279 -552262 -690907 -250435 -567658 -607625 -529348 -506431 -337599
2415c37599j92775J84081j95461M5514Q7964j08569K53277j15686K40604j54756
$$ -337599 -530374 -346293 -541754 -496240 -408276 -516845 -263568 -379254 -138650 -293406
2405b93406r3459j65244j28330o814M78288j47430q3257P1581j97663J70773l24549
$$ -293406 -386865 -552109 -680439 -687253 -208965 -356395 -439652 -368071 -565734 -394961 -719510
2394g19510M85290m9140q0437p9962J90717q3286L718k12433L15923l83401K76079
$$ -719510 -234220 -283360 -363797 -443759 -253042 -336328 -332610 -545043 -229120 -612521 -336442
2383c36442j63289j8845k7701L41945k75505K45135m17150K53525k59136L56586
$$ -336442 -499731 -518576 -546277 -204332 -479837 -234702 -651852 -398327 -657463 -300877
2373c00877r1482n82l49507J79679J33436M3763j66665J04620Q8158J51371j43531
$$ -300877 -392359 -392941 -742448 -562769 -429333 -385570 -552235 -447615 -359457 -208086 -351617
2362c51617j27876J22749q7795J28806p495N0850l31337K44083l4422P9217j43663
$$ -351617 -479493 -356744 -444539 -315733 -323228 -272378 -603715 -359632 -394054 -314837 -458500
2351d58500J35827j68991L73983k59615R1443M0653k93195L43274m34139M10997
$$ -458500 -322673 -491664 -117681 -377296 -285853 -245200 -538395 -195121 -629260 -218263
2341b18263k17147k72449L57856j44464K27666k21333J21012K8215k2892r2789
$$ -218263 -435410 -707859 -350003 -494467 -266801 -488134 -367122 -338907 -361799 -454588
2331d54588K53092j66813j46184k5541K10671l28186K43994j21226K25527j55196
$$ -454588 -201496 -368309 -514493 -540034 -329363 -657549 -413555 -534781 -309254 -464450
2321d64450N2556k82555K14838O7351p248J74593l55306K33511j40707J37776
$$ -464450 -411894 -694449 -479611 -412260 -419508 -244915 -600221 -366710 -507417 -369641
2311c69641J41414n35369M12173j36341J20039j56621j23208K62321j59385J29687
$$ -369641 -228227 -763596 -351423 -487764 -367725 -524346 -647554 -385233 -544618 -414931
2301d14931O4772j97389J50002L1771L3976m7433j25550M4399k4161L15971k57770
$$ -414931 -350159 -547548 -397546 -365775 -331799 -379232 -504782 -460383 -484544 -168573 -426343
2290d26343K05922m54412M00134k83311K18643l9313j24937M29923k97789J71665
$$ -426343 -220421 -674833 -274699 -558010 -339367 -378680 -503617 -73694 -371483 -199818
2280a99818m01923M10560l28123O440J75061j43486K3607j04913J71453J80183
$$ -199818 -601741 -191181 -519304 -512864 -337803 -481289 -457682 -562595 -391142 -210959
2270b10959k00263J10775k49675M17432j27332l39896K12936r0025K39955J760
$$ -210959 -411222 -300447 -550122 -132690 -260022 -599918 -386982 -477007 -237052 -235292
2260b35292j05104j85799L3909M4770J97233k81321j85374M19647P4863k52188
$$ -235292 -340396 -526195 -492286 -447516 -250283 -531604 -716978 -297331 -222468 -474656
2250d74656j12486J12042K42727k8256m5698J1738j80006O6576o578L10419k73111
$$ -474656 -587142 -475100 -232373 -260629 -306327 -294589 -474595 -408019 -414597 -104178 -377289
2239c77289P7216l11660J48030p8831J52186J43175j77113J49570J9041m08317
$$ -377289 -300073 -611733 -463703 -542534 -390348 -247173 -424286 -274716 -255675 -663992
2229f63992M67874l62583L23025l34528Q0733j00376l5829L28256l24548M91352
$$ -663992 -196118 -558701 -235676 -570204 -489471 -589847 -625676 -297420 -621968 -130616
2219a30616k71687J54333j49106J74816j00046j35097O4832j77268K28628l8166
$$ -130616 -402303 -247970 -397076 -222260 -322306 -457403 -392571 -569839 -341211 -379377
2209c79377K33466m02363L71531j08206N5967j81140q3813K28063p1132R1135
$$ -379377 -145911 -548274 -176743 -284949 -228982 -410122 -493935 -265872 -337004 -245869
2199b45869m09546J68575Q3154j21648K12403j50015j37146J41437L7805k9504
$$ -245869 -655415 -486840 -403686 -525334 -312931 -462946 -600092 -458655 -420850 -450354
2189d50354N2949j49460K94452q5171J9005J16897m57716L92020k4822J82641
$$ -450354 -397405 -546865 -252413 -337584 -318579 -201682 -659398 -267378 -292200 -109559
2179a09559l38143K16384k15031Q8670k24053L09292k60236N06886n52825L45163
$$ -109559 -447702 -231318 -446349 -357679 -581732 -272440 -532676 -25790 -578615 -233452
2169b33452j18194J99750m80028N13149j03478j06645r0365o4829J697j99524
$$ -233452 -351646 -151896 -631924 -118775 -222253 -328898 -419263 -484092 -482395 -681919
2159f81919M05036j67969K70319k79131J68385k67652J41139J13233J07097r8331
$$ -681919 -276883 -444852 -174533 -453664 -285279 -552931 -411792 -298559 -191462 -289793
2149b89793j42079j58049K22333j89802M15109j0882o1029J71682l71771l455
$$ -289793 -431872 -589921 -367588 -557390 -142281 -153163 -214192 -42510 -414281 -417736
2139d17736J26692j35948l8922R9683N8229P8279J00391j30212n8831k65178K05550
$$ -417736 -291044 -426992 -465914 -366231 -308002 -229723 -129332 -259544 -318375 -583553 -378003
2128c78003p6701O9963j92610J40326p6440Q0007n9902J89747O3606l66651K36239
$$ -378003 -454704 -384741 -577351 -437025 -513465 -433458 -493360 -303613 -240007 -606658 -370419
2117c70419j22670M12365l55889K25115l81632K32469q7982P9124j06454j8495
$$ -370419 -493089 -80724 -436613 -211498 -593130 -360661 -448643 -369519 -475973 -494468
2107d94468J95803j26171K84163j42332j94493K60315k04019q3597j17049P1099
$$ -494468 -298665 -424836 -140673 -283005 -477498 -217183 -421202 -504799 -621848 -550749
2097e50749J80427Q5448Q5004N973p7489N4489k84431K59128r4585J64246m12791
$$ -550749 -370322 -284874 -199870 -193897 -271386 -216897 -501328 -242200 -336785 -172539 -585330
2086e85330K06233j13540K21517o518j65999J76729j97670J09906J72548k12561
$$ -585330 -379097 -492637 -271120 -277638 -443637 -266908 -464578 -354672 -182124 -394685
2076c94685k4099P8533J72759k97557J79775l25259J85145j7407J02107j29050
$$ -394685 -418784 -340251 -167492 -465049 -285274 -610533 -425388 -442795 -340688 -469738
2066d69738J54297j62523K86810l79309J65987j03714R1261o5429L9776J16290
$$ -469738 -315441 -477964 -191154 -570463 -404476 -508190 -416929 -482358 -442582 -326292
2056c26292k59259K94921l1879Q8260k52448k5039Q1820k91169M87517o5352k5926
$$ -326292 -585551 -290630 -322509 -234249 -486697 -511736 -429916 -721085 -233568 -298920 -324846
2045c24846o983q5253M0507K02838k8335j3823j11945j72055L0990J0098j67389
$$ -324846 -331829 -417082 -376575 -173737 -202072 -215895 -327840 -499895 -468905 -458807 -626196
2034f26196J7579M00010k97026L00131j68043J24297m69356N73877k78752N38013
$$ -626196 -608617 -208607 -505633 -205502 -373545 -249248 -718604 -144727 -423479 114534
2024A14534o66832k5918L40196l57316M40033o42425N76763l48281L89385j79358
$$ 114534 -552298 -578216 -238020 -595336 -155303 -797728 -220965 -569246 -179861 -359219
2014c59219N971J6894l8068j29573J06480J6629O8544m58899O63717J5040O7511
$$ -359219 -353248 -336354 -374422 -503995 -397515 -380886 -312342 -771241 -107524 -92484 -24973
2003b4973m03286l2188r9249M6410J79306m445L474k46952L09557j71811J78526
$$ -24973 -428259 -460447 -559696 -513286 -333980 -338425 -334951 -581903 -272346 -444157 -265631
1992b65631k5881n6301J1717L7512j05421k5529r1619K12578k03120K62721l09277
$$ -265631 -291512 -347813 -336096 -298584 -404005 -429534 -521153 -308575 -511695 -248974 -558251
1981e58251L12260m51723L20230J01983J74832m30724J72365k5550m0104j7613
$$ -558251 -245991 -697714 -377484 -275501 -100669 -531393 -359028 -384578 -424682 -442295
1971d42295O3640J07718k41348N46211o47656K51474j90713M28644m45366L11266
$$ -442295 -378655 -270937 -512285 33926 -613730 -362256 -552969 -124325 -569691 -258425
1961b58425l18319K36940k01149J74771l0308K02627j30167J272J93285j25748
$$ -258425 -576744 -339804 -540953 -366182 -396490 -193863 -324030 -322758 -129473 -255221
1951b55221M3111m57056K98121j60724M45706o89452N47136l19611L84857k32557
$$ -255221 -212110 -669166 -371045 -531769 -86063 -775515 -228379 -547990 -163133 -395690
1941c95690L46576l96937K52966J28924j85428J147l70448J00725j9640r1065
$$ -395690 -49114 -446051 -193085 -64161 -249589 -248442 -618890 -518165 -537805 -628870
1931f28870o191M84054m38481L16103j54044K74175l14040K20947k57739K64780
$$ -628870 -635061 -151007 -589488 -273385 -427429 -153254 -467294 -246347 -504086 -239306
1921b39306l72649L05195L9814q3502k6189M6598O3983p0373k90724L20481K2223
$$ -239306 -611955 -306760 -266946 -350448 -376637 -330039 -266056 -336429 -627153 -306672 -284449
1910b84449Q5442l22379K45588N2564p2580k07145r454J36563J20347j92344J22670
$$ -284449 -199007 -521386 -275798 -223234 -295814 -502959 -512413 -375850 -255503 -447847 -325177
1899c25177k44993K04332k43456L55478k50035L28753j97708O9395o3477R4998
$$ -325177 -570170 -365838 -609294 -253816 -503851 -175098 -372806 -303411 -366888 -271890
1889b71890l3442j90386J69977j24992K4191l48852L45730k60082M83879n0919
$$ -271890 -305332 -495718 -325741 -450733 -426542 -775394 -429664 -689746 -205867 -256786
1879b56786m6291j59111K48035o9128J35109j58201O0951o7549k25162J74207
$$ -256786 -303077 -462188 -214153 -283281 -148172 -306373 -245422 -312971 -538133 -363926
1869c63926j74100M33811m49091L01499j88187J69298l507J19621k75182K22435
$$ -363926 -538026 -104215 -553306 -251807 -439994 -270696 -274203 -154582 -429764 -207329
1859b07329j29258j31086K38223k77419K63224q6039K40425n27381M20215j21161
$$ -207329 -336587 -467673 -229450 -506869 -243645 -329684 -89259 -616640 -196425 -317586
1849c17586J4707k69921J54999Q464J49845R9228k95803K02130j80672R3290j73899
$$ -317586 -302879 -572800 -417801 -409337 -259492 -160264 -456067 -253937 -434609 -341319 -515218
1838e15218O5605K13549j76147o3364J03701J44093l52129K82119k80700K01774
$$ -515218 -449613 -236064 -412211 -475575 -371874 -227781 -579910 -297791 -578491 -376717
1828c76717J40077j34314k3478Q4552J20598k95948j9156n2628K01511K15004
$$ -376717 -236640 -370954 -394432 -309880 -189282 -485230 -504386 -557014 -355503 -140499
1818a40499m9713l05130K60493l93558L22641j7659O1453k10697L77063m85877
$$ -140499 -190212 -495342 -234849 -628407 -305766 -323425 -261972 -472669 -95606 -581483
1808e81483O6933O452j4791K03768k37182K97732j77796K94975l38070K12539
$$ -581483 -514550 -508098 -522889 -319121 -556303 -258571 -436367 -141392 -479462 -266923
1798b66923j33816K919N6655j18851J41941j09068O8295l2065J81129J33287m48484
$$ -266923 -400739 -397820 -341165 -460016 -318075 -427143 -358848 -390913 -209784 -76497 -524981
1787e24981K19519j98621K5017J24138J9345j74307J17246J29950j06542j7137
$$ -524981 -305462 -504083 -479066 -354928 -335583 -509890 -392644 -262694 -369236 -386373
1777c86373j78231L74192R472j6712k97454K45703l18683J75590l31210M21942
$$ -386373 -564604 -190412 -180940 -197652 -495106 -249403 -568086 -392496 -723706 -301764
1767c01764k64101M16752l17420O6319J34894j24486P7543j38534K72373k17871
$$ -301764 -565865 -149113 -466533 -400214 -265320 -389806 -312263 -450797 -178424 -396295
1757c96295J82356k06228j46787Q7707J64003j07179J18563O1906j60675l1497
$$ -396295 -213939 -420167 -566954 -479247 -315244 -422423 -303860 -241954 -402629 -434126
1747d34126K37333j01580Q5940j91490J71412J27098k69686L0100j54399J42569
$$ -434126 -196793 -298373 -212433 -403923 -232511 -105413 -375099 -344999 -499398 -356829
1737c56829J66462j3842j21452K227p8812K11552l20173K08848l05357N07372
$$ -356829 -190367 -204209 -325661 -323434 -402246 -190694 -510867 -302019 -607376 -100004
1727a00004l80570J05834M3091O8682m1852j63977J01229L9964j05333Q6734J4681
$$ -100004 -480574 -374740 -331649 -262967 -304819 -468796 -367567 -327603 -432936 -346202 -331521
1716c31521l1573J79057r677j53588j62649k477J84531j98434K79559j56475J01852
$$ -331521 -363094 -184037 -193714 -347302 -509951 -512428 -327897 -526331 -246772 -403247 -301395
1705c01395q7246k5115J08369j54186L65616n6966m06998J99572r92J30862k45625
$$ -301395 -388641 -413756 -305387 -459573 -93957 -150923 -557921 -358349 -359341 -228479 -474104
1694d74104K7176J2335j0284O5589M1365k78745K59929k48916N69061m43667J37625
$$ -474104 -446928 -434593 -444877 -379288 -337923 -616668 -356739 -605655 -36594 -480261 -342636
1683c42636q7119J33766R86k16709M49476m81180L40208l59632M08598l49302
$$ -342636 -429755 -295989 -295003 -511712 -62236 -543416 -203208 -562840 -154242 -503544
1673e03544J38829j24196J50812J87738p7900n6554j1014J23856k48080J34114
$$ -503544 -364715 -488911 -338099 -150361 -228261 -284815 -295829 -171973 -420053 -285939
1663b85939J60503l19348J39986j8301J9067K32255l39157J68439k37650J53403
$$ -285939 -125436 -444784 -304798 -323099 -304032 -71777 -410934 -242495 -480145 -326742
1653c26742j1433K11511j36651l2255j05033J09184j71885j09651J19838J84552
$$ -326742 -338175 -126664 -263315 -295570 -400603 -291419 -463304 -572955 -453117 -268565
1643b68565L2479l40702K94852p7072J36271j64831J53268j27974P7344k36103
$$ -268565 -236086 -576788 -281936 -359008 -222737 -387568 -234300 -362274 -284930 -521033
1633e21033J02586O5836J55534P9440l47377N9702j68363L38234Q181j78537N1852
$$ -521033 -418447 -352611 -197077 -117637 -465014 -405312 -573675 -235441 -227260 -405797 -353945
1622c53945j95360J95902j53204J10974p3968M19495r0061j98616j79246J69387
$$ -353945 -549305 -353403 -506607 -395633 -469601 -50106 -140167 -338783 -518029 -348642
1612c48642J3204k5385q3707N1621R0277j34832K774J8411L67874j07833n5159
$$ -348642 -335438 -360823 -444530 -392909 -302632 -437464 -434690 -416279 -48405 -156238 -211397
1601b11397k8193r3537O802L6473k00126M2020J92404l4001j61684K28213j97981
$$ -211397 -239590 -333127 -326325 -289852 -489978 -447958 -255554 -289555 -451239 -223026 -421007
1590d21007J31355k35349N16810k63518K21193n00478O4616J23636N7252k61615
$$ -421007 -289652 -525001 -8191 -271709 -50516 -550994 -486378 -362742 -305490 -567105
1580e67105J88883o1129K29807m51512L67677n2450j35494J34511o4865J39717
$$ -567105 -378222 -439351 -209544 -661056 -293379 -345829 -481323 -346812 -411677 -271960
1570b71960L7430l76866L38721k21122K13737q8604j8420j9765N3884J3719J05252
$$ -271960 -234530 -611396 -272675 -493797 -280060 -368664 -387084 -406849 -352965 -339246 -233994
1559b33994N3327l20008N1423J42175J73488l52324M50441m26122M4398P3211
$$ -233994 -180667 -500675 -449252 -307077 -133589 -485913 -35472 -461594 -417196 -343985
1549c43985j06730J3764L2024J32861j01736M0837L4485j06227J29670j46113
$$ -343985 -450715 -436951 -404927 -272066 -373802 -332965 -298480 -404707 -275037 -421150
1539d21150L09153n9526r3459J45203l27823L694M9991J63207k68666Q9986n9919
$$ -421150 -111997 -171523 -264982 -119779 -447602 -443908 -393917 -230710 -499376 -409390 -469309
1528d69309J57255J3293L5794j47805r679M0044R0537N5446k56915M6220j4909
$$ -469309 -312054 -298761 -262967 -410772 -420451 -380407 -289870 -234424 -491339 -445119 -460028
1517d60028L57696l84561P9740m9371K13847k61064M26984l10919J48397j72657
$$ -460028 -102332 -486893 -407153 -456524 -242677 -503741 -76757 -387676 -239279 -411936
1507d11936M1630L9309M3983j76789J86931l21141M32319k25564J92722k86310
$$ -411936 -370306 -330997 -287014 -463803 -276872 -598013 -165694 -391258 -198536 -484846
1497d84846M3555K70829m27701L84328l47420M96859k66839K69975m68248L57592
$$ -484846 -441291 -170462 -598163 -213835 -561255 -64396 -331235 -61260 -529508 -171916
1487a71916l97749L85552j08468k20697J80128j18323K33706k47833K72874k95953
$$ -171916 -569665 -184113 -292581 -513278 -333150 -451473 -217767 -465600 -192726 -488679
1477d88679M02936k78926N2612o1958K17720j09393j9019j57033J31587o55J08401
$$ -488679 -85743 -364669 -312057 -374015 -156295 -265688 -284707 -441740 -310153 -310808 -202407
1466b02407l07836K10078M7032n3177j58303K254O333O3793K7768j82239L68910
$$ -202407 -510243 -300165 -253133 -306310 -464613 -462359 -456026 -392233 -364465 -546704 -177794
1455a77794j45947Q6808j76219K09369k00004J56104L0682p3273o6110m1535q1151
$$ -177794 -323741 -236933 -413152 -203783 -403787 -247683 -217001 -290274 -356384 -397919 -479070
1444d79070J08160k49207M69644j04696J6313q6560L871Q4936k11189J12982j69617
$$ -479070 -370910 -620117 -150473 -255169 -238856 -325416 -321545 -236609 -447798 -334816 -504433
1433e04433J96680j21232L18213l48959K55132J2304m30894K89953k11416K70497
$$ -504433 -307753 -428985 -110772 -459731 -204599 -192295 -623189 -333236 -544652 -274155
1423b74155k45559Q8848J21102N4649j93023R4873k68781M53535j98853n9420
$$ -274155 -519714 -430866 -309764 -255115 -448138 -353265 -622046 -168511 -367364 -426784
1413d26784J53749n9905R4899j11943J01228k35385r9394L05297k71298K34114
$$ -426784 -273035 -332940 -238041 -349984 -248756 -484141 -583535 -278238 -549536 -315422
1403c15422k25609J67128j16272J11825k5443J32082k51143l6193J37683K0733
$$ -315422 -541031 -373903 -490175 -378350 -403793 -271711 -522854 -559047 -421364 -400631
$$ [...]
##END NTUPLES=NMR SPECTRUM
##END=
