##TITLE=abcd
##JCAMPDX= 6.0         $$ Bruker NMR JCAMP-DX V2.0
##DATA TYPE= NMR SPECTRUM
##DATA CLASS= NTUPLES
##ORIGIN= UXNMR, Bruker Analytische Messtechnik GmbH
##OWNER= root
$$ XWIN-NMR		Version 3.5
$$ Tue Jun  2 18:29:51 2026 Russian Standard Time (UT+4h)  servis@DPX200
##.OBSERVE FREQUENCY= 200.131235884673
##.OBSERVE NUCLEUS= ^1H
##.ACQUISITION MODE= SIMULTANEOUS
##.ACQUISITION SCHEME= undefined
##.AVERAGES= 32
##.DIGITISER RES= 18
##SPECTROMETER/DATA SYSTEM= spect
##.PULSE SEQUENCE= zg
##.SOLVENT NAME= CDCl3
##.SHIFT REFERENCE= (INTERNAL, CDCl3, 0, 16.4885)
##AUDIT TRAIL= $$ (NUMBER, WHEN, WHO, WHERE, WHAT)
$$ ##TITLE= Audit trail, XWIN-NMR		Version 3.5
$$ ##JCAMPDX= 5.01
$$ ##ORIGIN= Bruker BioSpin GmbH
$$ ##OWNER= servis
$$ F:\spectra/data/av/nmr/H1/1/pdata/1/auditp.txt
$$ ##AUDIT TRAIL=  $$ (NUMBER, WHEN, WHO, WHERE, WHAT)
(   1,<2026-06-02 18:28:52.07 +0400>,<servis>,<DPX200>,
      <created by zg, POWCHK disabled, PULCHK disabled
       configuration hash MD5:
       00 E9 B6 7A A2 85 ED C7 34 08 36 98 17 FE 4E 26
       data hash MD5: 32K
       8D 89 9F D0 02 56 A4 AB 0D 36 A0 32 53 3B 7F 81>)
(   2,<2026-06-02 18:29:21.18 +0400>,<servis>,<DPX200>,
      <Start of raw data processing
       efp BC_mod = 2 LB = 0.05 FT_mod = 6 PKNL = 1 PHC0 = -412.19 PHC1 = 3.101563 SI = 16K 
       data hash MD5: 16K
       C8 1F 93 11 BF 48 9E 60 77 C2 09 4F 9B 74 D4 C2>)
$$ ##END=
$$ 
$$ hash MD5
$$ 64 DA 5C AB 38 66 44 3E 31 2B 34 CB 3E F5 42 AC
##$RELAX= 
##$RELAX= 
##$RELAX= 
##$RELAX= 
##$RELAX= 
##$RELAX= 
##$RELAX= 
##$RELAX= 
$$ Bruker specific parameters
$$ --------------------------
##$DU= <F:\spectra>
##$EXPNO= 1
##$NAME= <H1>
##$PROCNO= 1
##$TYPE= <nmr>
##$USER= <av>
##$AMP= (0..31)
100 100 100 100 100 100 100 100 100 100 100 100 100 100 100 100 100 100 
100 100 100 100 100 100 100 100 100 100 100 100 100 100 
##$AQSEQ= 0
##$AQ_mod= 1
##$AUNM= <au_zg>
##$AUTOPOS= <>
##$BF1= 200.13
##$BF2= 200.13
##$BF3= 200.13
##$BF4= 200.13
##$BF5= 500.13
##$BF6= 500.13
##$BF7= 500.13
##$BF8= 500.13
##$BYTORDA= 1
##$CFDGTYP= 0
##$CFRGTYP= 5
##$CHEMSTR= <none>
##$CNST= (0..31)
1 1 145 1 1 1 1 1 1 1 1 1 1 1 1 1 1 1 1 1 1 1 1 1 1 1 1 1 1 1 1 1 
##$CPDPRG= <>
##$CPDPRG1= <>
##$CPDPRG2= <>
##$CPDPRG3= <>
##$CPDPRG4= <mlev>
##$CPDPRG5= <mlev>
##$CPDPRG6= <mlev>
##$CPDPRG7= <mlev>
##$CPDPRG8= <mlev>
##$CPDPRGB= <>
##$CPDPRGT= <>
##$D= (0..31)
0 2 0 0 0 0 0 0 0 0.06 0 0 0 0 0 0 0.0002 0 0 0 0 0 0 0 0 0 0 0 0 0 0 
0 
##$DATE= 1780410531
##$DBL= (0..7)
120 120 120 120 120 120 120 120 
##$DBP= (0..7)
150 150 150 150 150 150 150 150 
##$DBP07= 0
##$DBPNAM0= <>
##$DBPNAM1= <>
##$DBPNAM2= <>
##$DBPNAM3= <>
##$DBPNAM4= <>
##$DBPNAM5= <>
##$DBPNAM6= <>
##$DBPNAM7= <>
##$DBPOAL= (0..7)
0.5 0.5 0.5 0.5 0.5 0.5 0.5 0.5 
##$DBPOFFS= (0..7)
0 0 0 0 0 0 0 0 
##$DE= 6
##$DECBNUC= <off>
##$DECIM= 32
##$DECNUC= <off>
##$DECSTAT= 4
##$DIGMOD= 1
##$DIGTYP= 9
##$DL= (0..7)
0 120 120 120 120 120 120 120 
##$DP= (0..7)
150 150 150 150 150 150 150 150 
##$DP07= 0
##$DPNAME0= <>
$$ [...]
##$SUBNAM4= <"">
##$SUBNAM5= <"">
##$SUBNAM6= <"">
##$SUBNAM7= <"">
##$SUBNAM8= <"">
##$SUBNAM9= <"">
##$SW= 20.6817932712277
##$SWIBOX= (0..15)
0 0 3 0 0 0 0 0 0 0 0 0 0 0 0 0 
##$SW_h= 4139.07284768212
##$TD= 32768
##$TD0= 1
##$TE= 0
##$TE2= 300
##$TE3= 300
##$TEG= 300
##$TL= (0..7)
0 120 120 120 120 120 120 120 
##$TP= (0..7)
150 150 150 150 150 150 150 150 
##$TP07= 0
##$TPNAME0= <>
##$TPNAME1= <>
##$TPNAME2= <>
##$TPNAME3= <>
##$TPNAME4= <>
##$TPNAME5= <>
##$TPNAME6= <>
##$TPNAME7= <>
##$TPOAL= (0..7)
0.5 0.5 0.5 0.5 0.5 0.5 0.5 0.5 
##$TPOFFS= (0..7)
0 0 0 0 0 0 0 0 
##$TUNHIN= 0
##$TUNHOUT= 0
##$TUNXOUT= 0
##$USERA1= <user>
##$USERA2= <user>
##$USERA3= <user>
##$USERA4= <user>
##$USERA5= <user>
##$V9= 5
##$VALIST= <valist>
##$VCLIST= <CCCCCCCCCCCCCCC>
##$VD= 0
##$VDLIST= <DDDDDDDDDDDDDDD>
##$VPLIST= <PPPPPPPPPPPPPPP>
##$VTLIST= <TTTTTTTTTTTTTTT>
##$WBST= 1024
##$WBSW= 30
##$XGAIN= (0..3)
0 0 0 0 
##$XL= 0
##$YL= 0
##$YMAX_a= 198013
##$YMIN_a= -308068
##$ZGOPTNS= <>
##$ZL1= 120
##$ZL2= 120
##$ZL3= 120
##$ZL4= 120
##$ABSF1= 0
##$ABSF2= 0
##$ABSG= 0
##$ABSL= 0
##$ALPHA= 0
##$AQORDER= 0
##$ASSFAC= 0
##$ASSFACI= 0
##$ASSFACX= 0
##$ASSWID= 0
##$AUNMP= <proc_1d>
##$AZFE= 0.1
##$AZFW= 0.1
##$BCFW= 0
##$BC_mod= 2
##$BYTORDP= 0
##$COROFFS= 0
##$CY= 18.4799938201904
##$DATMOD= 1
##$DC= 0
##$DFILT= <>
##$DTYPP= 0
##$F1P= 9.9274215381318
##$F2P= -0.165520771350173
##$FCOR= 1
##$FTSIZE= 16384
##$FT_mod= 6
##$GAMMA= 0
##$GB= 0
##$INTBC= 1
##$INTSCL= 4.127829e-11
##$ISEN= 128
##$LB= 0.05
##$LEV0= 0
##$LPBIN= 0
##$MAXI= 10000
##$MC2= 0
##$MEAN= 0
##$ME_mod= 0
##$MI= 50
##$NCOEF= 0
##$NC_proc= -6
##$NLEV= 6
##$NOISF1= 3.799351
##$NOISF2= 2.8
##$NSP= 0
##$NTH_PI= 0
##$NZP= 0
##$OFFSET= 16.48848
##$PC= 4
##$PHC0= -412.19
##$PHC1= 3.101563
##$PH_mod= 1
##$PKNL= yes
##$PPARMOD= 0
##$PSCAL= 4
##$PSIGN= 0
##$REVERSE= no
##$SF= 200.130005582386
##$SI= 16384
##$SIGF1= 3
##$SIGF2= 2
##$SINO= 400
##$SIOLD= 16384
##$SREGLST= <1H.CDCl3>
##$SSB= 0
##$STSI= 16384
##$STSR= 0
##$SW_p= 4139.07284768211
##$SYMM= 0
##$S_DEV= 0
##$TDeff= 32768
##$TDoff= 0
##$TI= <>
##$TILT= no
##$TM1= 0
##$TM2= 0
##$TOPLEV= 0
##$USERP1= <user>
##$USERP2= <user>
##$USERP3= <user>
##$USERP4= <user>
##$USERP5= <user>
##$WDW= 1
##$XDIM= 16384
##$YMAX_p= 390197674
##$YMIN_p= -1540501
$$ End of Bruker specific parameters
$$ ---------------------------------
##NTUPLES= NMR SPECTRUM
##VAR_NAME=  FREQUENCY,     SPECTRUM/REAL,   SPECTRUM/IMAG
##SYMBOL=    X,             R,               I
##VAR_TYPE=  INDEPENDENT,   DEPENDENT,       DEPENDENT
##VAR_FORM=  AFFN,          ASDF,            ASDF
##VAR_DIM=   16384,         16384,           16384
##UNITS=     HZ,            ARBITRARY UNITS, ARBITRARY UNITS
##FACTOR=    0.252644378177508, 1,           1
##FIRST=     3299.83951724647, 0,            0
##LAST=      -839.233330435636, 0,           0
##MIN=       -839.233330435636, -1540501,    0
##MAX=       3299.83951724647, 390197674,    0
$$ Real data points
##PAGE= N=1
##DATA TABLE= (X++(R..R)), XYDATA
$$ [...]
7202A376085l38211p77548L75887n5170Q73479j218112L82333L94430r33324J09986
7192A89835M50380N36351l72304k17098J067374p74288K17116N1347p3216r23625
7182A51872P98142J137883q88409n8916l44159j50657q74844J178827J70175l75015
7172G44899N74575r74658j5805J85619P08442l8769k89394L05853k40388R2217
7162A052591L31584j146440R93608o09207n73394M60630Q47444k80264Q44938
7153A921490j288301M00137J0543m78044M48231L65391L3130l49160l94997P85970
7143A454390L04044r20654J000030j063173J055364l05850J84136o68678M93085
7134A532694m57376j76602J14070J064269p8157O5423o86754j35821l55431M41826
$$ y = [1376085, 1037874, 260326, 636213, 581043, 1454522, 236410, 618743, 1013173, 79849, 189835, 640215, 1176566, 804262, 587164, 1654538, 880250, 1097366, 1148713, 1075497, 151872, 950014, 2087897, 1199488, 1140572, 796413, 645756, -229088, 949739, 1119914, 744899, 1319474, 344816, 329011, 514630, 1223072, 1184303, 894909, 1200762, 960374, 1052591, 1384175, 237735, 1231343, 622136, 48742, 509372, 1356816, 1076552, 1921490, 633189, 1033326, 1043869, 565825, 1014056, 1379447, 1412577, 1063417, 668420, 1454390, 1758434, 837780, 1837810, 774637, 1830001, 1524151, 1708287, 1039609, 1532694, 1075318, 898716, 1012786, 2077055, 1998898, 2064321, 1377567, 1241746, 886315, 1328141]
7124A328141K47923m81336r3658l34172O78417o69540K41443j14662L87703n04483
7114F85776J93927J11589j74422O65407j07082o10785P48743j008374J177215
7105A681994k87003q46949M39778N44103q31134J10230O59429j47399M58575n37956
7095A243668M00153o17772K03282J165304K3977r09932J205777r09828L35344
7086B139973K43350m11528L73672j6233j40088Q23442o87576P606n82259N27193
7076B277552r41988M32354K37453l24370q6020l10987r945J88053o52518K01299
7066A010883k29858J069590o13589n31840J491080o35052m13262l65157R13300
7057A696095q44447N34184J08935L8625o63518k21806O08145o67626n82899J320954
$$ y = [1328141, 1576064, 1094728, 1001070, 666898, 1345315, 675775, 917218, 802556, 1190259, 685776, 879703, 991292, 816870, 1482277, 1375195, 764410, 1513153, 504779, 1681994, 1394991, 548042, 987820, 1531923, 700789, 811019, 1470448, 1323049, 1781624, 1243668, 1643821, 1026049, 1229331, 2394635, 2418612, 1508680, 2714457, 1804629, 2139973, 2383323, 1971795, 2345467, 2329234, 2189146, 3012588, 2325012, 2332618, 1750359, 2277552, 1335564, 1767918, 2005371, 1681001, 1594981, 1283994, 1274049, 1462102, 809584, 1010883, 781025, 1850615, 1237026, 705186, 2196266, 1561214, 1147952, 782795, 1696095, 851648, 1385832, 1494767, 1533392, 869874, 648068, 1256213, 588587, 5688, 1326642]
7047A326642l531l27718M96227p3085n47825O62910j60856k1979o22765L39899
7037A067919J12706N46435j473310P25203M66251m00393k51930K97646O19702
7028A710229r39438O64887L083o75268n13869K49201O9890M53639n42710N34914
7018A014558o9018P4805L19123l85505K83975k60796M60707k75812j18482k63412
7008G80143O65733j27211p54168k02057O83664j8493J36338l69752L24698m05637
6998G13258J73484m30903N03772K83904j172623J022964j45998L43954K03965
6989A495777j15088n89849r4612L73177J626Q73420k50444N77159k94219L7920
6979B014867N60341O47119j87580m22276M49069j841102P60311n05654M77148
$$ y = [1326642, 1323111, 995393, 1491620, 1418535, 870710, 1533620, 1372764, 1350785, 728020, 1067919, 1180625, 1727060, 253750, 978953, 1445204, 1044811, 792881, 1090527, 1710229, 770791, 1435678, 1438761, 763493, 249624, 498825, 568715, 1022354, 479644, 1014558, 945540, 1020345, 1339468, 953963, 1237938, 977142, 1437849, 1162037, 1043555, 780143, 1445876, 1318665, 564497, 362440, 1046104, 1027611, 1163949, 794197, 1118895, 713258, 886742, 455839, 959611, 1243515, 70892, 1093856, 947858, 1291812, 1495777, 1380689, 790840, 696228, 1069405, 1071031, 1944451, 1694007, 2271166, 1976947, 2014867, 2575208, 3222327, 3034747, 2612471, 3061540, 1220438, 1980749, 1475095, 1952243]
6970A952243k07111o67484M54828n07759M37844j9600j35839Q7421K30414J23557
6960A748514k96189N48550m14108J99152k56528Q54113o0366K498119J197372
6951F018629O20638J14768K89828o20686p56004p06857j415719k88707m90757
6942B765133K40899k43079j059508M97195j430611J256078K34501k61955M59067
6933B457720r13486R04713n4793J63826j47344N76331J19272L85022J208917J054240
6923E754418J547554j6280k02884k19185r63389o84900r50116q85305p85074L82098
6913B976937j63528p69875J21123O45828j179308j77312P88893k48670l31017
6904A663071R03063j70905J01651o80197J529167p90746k38725P98439j40437
$$ y = [1952243, 1745132, 1077648, 1532476, 1024717, 1462561, 1442961, 1307122, 1394543, 1624957, 1748514, 1452325, 2000875, 1586767, 1785919, 1529391, 2383504, 2323138, 4821257, 6018629, 6639267, 6754035, 7043863, 6423177, 5667173, 4960316, 3544597, 3255890, 2765133, 3006032, 2762953, 1703445, 2200640, 770029, 2026107, 2260608, 1998653, 2457720, 1544234, 2448947, 2394154, 2557980, 2410636, 2986967, 3106239, 3491261, 4700178, 5754418, 7301972, 7285692, 7082808, 6863623, 5900234, 5215334, 4265218, 3379913, 2594839, 2976937, 2813409, 2043534, 2164657, 2810485, 1631177, 1453865, 2242758, 1994088, 1663071, 2566134, 2395229, 2496880, 1816683, 3345850, 2555104, 2316379, 3114818, 2974381]
6895B974381M28690K6468Q42297q69126J32494l59192k18183j130751J042561
6886B869639m61496n97132k0821L20805n20207N32842j46569M13353o9743m40885
6876A879786M44054N4713k25564j30204Q3881J20142J68850j56354k11183n28777
6866A499344J84372O4403O7283o00249J419822j65446k16911m35022P49407K01581
6856B768584q14082k31185N13948l81536O02487k71443j10212P26618o57306J08490
6846B254363j60981Q46437p80761K59723o0439p67161J94882k3864K48256j16125
6836A894330O2125P8809j043118j10439K61431N31029m18704K53598K06948J12449
6826A828458l25538K881k35134L32708n13790J14449O08193l33814L25319o54632
$$ y = [2974381, 3403071, 3429539, 4271836, 3402710, 3535204, 3176012, 2957829, 1827078, 2869639, 2408143, 1811011, 1790190, 2110995, 1590788, 2123630, 1977061, 2390414, 2320671, 1879786, 2323840, 2378553, 2152989, 2022785, 2106666, 2226808, 2395658, 2239304, 2028121, 1499344, 1683716, 1748119, 1815402, 1215153, 2634975, 2469529, 2252618, 1817596, 2567003, 2768584, 1954502, 1723317, 2237265, 1855729, 2458216, 2186773, 2076561, 2803179, 2145873, 2254363, 2093382, 2939819, 2159058, 2418781, 2358342, 1591181, 1786063, 1762199, 2010455, 1894330, 1956455, 2035264, 992146, 881707, 1143138, 1674167, 1255463, 1509061, 1716009, 1828458, 1502920, 1505801, 1270667, 1603375, 1089585, 1204034, 1812227, 1478413, 1803732, 1149100]
6816A149100P04198O02711q76505K69701n64167M63700j50224l75890r3106L38497
6806A468015p34766O27574O28958j180039M02666o13149P09475L16259p8630j38058
6796A408305n96851L80601o9550n23495R14892m77961l46269N91964q73116J503903
6786A912423q12820m8161k22416J08450l85253N88527N03259r03274P76287r1923
6776A425099l14098k77607p0786J11135l60278J246280m13269j77251m04868M61189
6766A225546J78491q32393O41407n67867O00917n42795Q31121n20177K62176m96839
6756G79587r3648O37765l23188L86067p51690L92173k38531R43971k92868k62897
6746A176741J92596l82056Q30389k67207n69614K6353j26439J97878Q647O00920
$$ y = [1149100, 1853298, 2456009, 1579504, 1849205, 1285038, 1748738, 1598514, 1222624, 1129518, 1468015, 733249, 1360823, 1989781, 809742, 1212408, 599259, 1308734, 1624993, 1546363, 1408305, 811454, 1192055, 1122505, 599010, 1513902, 1035941, 689672, 1281636, 408520, 1912423, 1099603, 1051442, 829026, 937476, 552223, 1140750, 1644009, 740735, 1517022, 1425099, 1111001, 833394, 762608, 873743, 513465, 1759745, 1346476, 1169225, 764357, 1225546, 1404037, 571644, 1213051, 645184, 1246101, 703306, 1534427, 1014250, 1276426, 779587, 685939, 1323704, 1000516, 1386583, 634893, 1027066, 788535, 1732506, 1439638, 1176741, 1369337, 987281, 1817670, 1550463, 980849, 1007202, 880763, 1078641, 1087288, 1688208]
6736A688208k1570l18592M1359k98926n09549N57449j10899k4472o4596P96347
6726A734759M5100k95403k40862Q14973o17818k44938N17677m56695l77923O66821
6716A545691N09393r40879P49410r7832k36773O04305K76629J52066P14035n80697
6706B695348O5184m9368m07059l54611Q3568p46994M69683m22770N73116j84761
6696A721336l64811M90288m91116M08554n3655P0599r92550O72868N58590N88333
6686B608436m95916Q02314p74684R21020N31698R89554O6707j27571J046538j408754
6676D159342m70630n09651j97153k40788o80761K2113Q50427o07901m79752M29162
6666B274408j29373P42019l89887j62395P1317j90589Q75699m01608n30216k7400
$$ y = [1688208, 1666638, 1348046, 1389405, 1090479, 580930, 1138379, 1027480, 1003008, 938412, 1734759, 1779859, 1484456, 1243594, 2058567, 1440749, 1195811, 1713488, 1256793, 878870, 1545691, 2055084, 1114205, 1863615, 1765783, 1529010, 2133315, 2409944, 2562010, 3276045, 2695348, 2760532, 2711164, 2304105, 1949494, 2033062, 1286068, 1755751, 1332981, 1906097, 1721336, 1356525, 1846813, 1355697, 1764251, 1710596, 1781195, 788645, 1461513, 2020103, 2608436, 2112520, 2914834, 2140150, 3061170, 3592868, 4582422, 4649129, 4521558, 5568096, 4159342, 3688712, 3179061, 2981908, 2741120, 2060359, 2082472, 2932899, 2324998, 1845246, 2274408, 2145035, 2887054, 2497167, 2334772, 2406089, 2215500, 3091199, 2689591, 2159375, 2131975]
6656B131975P12469N06654L5986J336191L40467j46561Q74321j273961r18433
6647C599108m15102L13304m09961q22077m9671R39923j693056N96491O56115j3111
6637B701963j15344L25791J58175q25662l29656N73595K88661l40443Q98553p29531
6627B606102K43508j12604L1042M83189R21311N0459r85564L466J8859O73431
6617C933199j179947O29092l30366J8680K49484J76942p01823l83361l8186Q31074
6607C204788o8093J90235Q20183r47475L14936J13905K35195q43365J032932n14617
6597C538624N65159j287597J645836k25110q1581k4259K56166P65618l01641L05761
6587E156976k17782J84412P06423j025759O45761N90133J076629j9283M42020
$$ y = [2131975, 2844444, 3351098, 3387084, 4723275, 5063742, 4917181, 5791502, 4517541, 3599108, 3184006, 3497310, 3087349, 2265272, 2215601, 3155524, 1462468, 2058959, 2715074, 2701963, 2586619, 2912410, 3070585, 2244923, 1915267, 2488862, 2777523, 2437080, 3335633, 2606102, 2849610, 2737006, 2768048, 3251237, 4172548, 4223007, 3237443, 3240909, 3259768, 3933199, 2753252, 3382344, 3051978, 3070658, 3320142, 3497084, 2795261, 2411900, 2373714, 3204788, 3136695, 3326930, 4147113, 3199638, 3514574, 3628479, 3863674, 3020309, 4053241, 3538624, 4103783, 2816186, 4462022, 4236912, 4155331, 4131072, 4387238, 5152856, 4851215, 5156976, 4939194, 5123606, 5830029, 4804270, 5450031, 6040164, 7116793, 7097510, 7539530]
6578G539530P79545N72097N26009J102453J399329K87388K668579J204124K343673
6569A8422727L000543M485433O500268J0523015J7215873K4222541K5648491J7582642
6561A27601533L488487p038014j5666557j7672061j6590688j4642432j2180471
6554D7299797j0091632p059049m529415l361863l806436k367124k194733p24074
6546A3165471j686983o18915m74229k88793j030165q8210n61590M51372j447664
6537G420294Q5860j31708m24743l86348J10769j31029k90271n00217l04527J67057
6527E615137l15282N32322j734045J065520m99240k6571k45095N84495p33346
6518D243895m30094K59558J28616j140456m36839J080973J81181j22929M45462
$$ y = [7539530, 8319075, 8891172, 9417181, 10519634, 11918963, 12206351, 14874930, 16079054, 18422727, 21423270, 25908703, 32408971, 42931986, 60147859, 84370400, 110018891, 127601533, 131090020, 124052006, 108385449, 90713388, 74122700, 59480268, 47299797, 37208165, 30149116, 25619701, 22257838, 18451402, 16084278, 13889545, 13165471, 11478488, 10859573, 10385344, 10096551, 9066386, 8978176, 8416586, 8867958, 7420294, 7506154, 7374446, 6949703, 6563355, 6674124, 6543095, 6252824, 5752607, 5448080, 5615137, 5299855, 5832177, 4098132, 5163652, 4664412, 4637841, 4392746, 4977241, 4243895, 3813801, 4073359, 4201975, 3061519, 2624680, 3705653, 3886834, 3763905, 4209367]
6509D209367k43889p58692m3059j19965N00134j39830N7265m54902L9353K27588
6499C273370k75460m1177j28793J44144q8987K07002m15940J70686l32098N07385
6489C020132o18251n0473J7109N83783j72107N9437n82898O83567m94942K22700
6479B668057J72960j073891P49222J65120p02268m45371P19258j6647k37667K26824
6469B225597Q50299m07139K7662l14093J27792o42944j49116P14713m15872N0222
6459B067121O45022j17781j423948K12603M62207j66077P26921m46771K4491K50796
6449B234584j09406k01094k16532K36286P4587J5149o22768L76469O01068m12187
6439A976156n8430L99507o12462L95916P2943K64826l49655l62380J32587p16254
$$ y = [4209367, 3965478, 3206786, 3163727, 3043762, 3543896, 3404066, 3461331, 3006429, 3045782, 3273370, 2997910, 2956733, 2827940, 2972084, 2883097, 3090099, 2674159, 2844845, 2512747, 3020132, 2401881, 2351408, 2368517, 2952300, 2780193, 2839630, 2256732, 2940299, 2445357, 2668057, 2841017, 1767126, 2516348, 2681468, 1979200, 1533829, 2253087, 2236440, 1998773, 2225597, 3075896, 2668757, 2696419, 2382326, 2510118, 1867174, 1718058, 2432771, 2016899, 2067121, 2712143, 2594362, 1170414, 1383017, 1845224, 1679147, 2406068, 1959297, 1983788, 2234584, 2125178, 1924084, 1707552, 1943838, 2018425, 2033574, 1410806, 1787275, 2388343, 1976156, 1917726, 2317233, 1704771, 2100687, 2173630, 2438456, 2088801, 1726421, 1859008, 1142754]
6429A142754Q41711m01363J21112L27149l17915r0059N60705j12182l44030M48664
6419B176546n00845K46561J17338j20909L04202o57911K39403P92841Q0452j95458
6409B482220k14832j65692L22564q05319j9812K55781l72455k47183J66611M16449
6399A818332k01620M21962m58798P42943q60817K10406K20211N12Q9430j21795
6389A860766R3209j93759L93578j001658M91640l96972Q28065p61781n5641j19770
6379A137677Q64404r83255P00510J14946J61007j2294J92285O5784j13856l42174
6369A785034P5546k34867L40686L85691n74515m23717K9594J58249j90623R69114
6359B320192n48732L34012o91489L72235m55455J06021q25615J558453k87972
$$ y = [1142754, 1984465, 1583102, 1704214, 2031363, 1713448, 1623389, 2184094, 2071912, 1727882, 2176546, 1675701, 1922262, 2039600, 1918691, 2222893, 1564982, 1804385, 2597226, 2677678, 2482220, 2267388, 2101696, 2424260, 1618941, 1599129, 1854910, 1482455, 1235272, 1401883, 1818332, 1616712, 2038674, 1579876, 2322819, 1462002, 1672408, 1892619, 1893131, 1982561, 1860766, 1953975, 1760216, 2153794, 1152136, 1643776, 1246804, 2074869, 1313088, 1257447, 1137677, 2002081, 1018826, 1719336, 1834282, 1995289, 1982995, 2175280, 2241064, 2127208, 1785034, 1860580, 1625713, 1966399, 2352090, 1777575, 1353858, 1383452, 1541701, 1351078, 2320192, 1771460, 2105472, 1413983, 1786218, 1330763, 1436784, 611169, 2169622, 1881650]
6350A881650P043j45076j21077n0773N6685n30704N38124j46350Q8437K34799
6340A812758L3654O37935j09882q62890J74731N79969n73840j10370O45992p15196
6330A512861j24576O25063j92750N89306j51858M2613J02269q52447j60169O09691
6320B000003m2846K09291k92878q5212Q6351N3418J74323j61633j566J21340k02771
6309A857820L05119J22848r8198J80751l42418O77407K2018n40759K99356M56523
6299B940467k89952K86202m22568n02792K08297J43411J88096o36550M05700K49945
6289B570256j81906N40715r7253L87149m61467J037082J95384J05742N05817J09188
6279D710707n05824K90954r6909P09804M00748M63507m17234J51650n79234J215130
$$ y = [1881650, 1888693, 1743617, 1622540, 1571767, 1628452, 1097748, 1635872, 1489522, 1577959, 1812758, 1846412, 2484347, 2374465, 1511575, 1686306, 2266275, 1692435, 1582065, 2228057, 1512861, 1388285, 2013348, 1820598, 2409904, 2258046, 2300659, 2402928, 1550481, 1390312, 2000003, 1957157, 2166448, 1873570, 1788358, 1874709, 1928127, 2102450, 1940817, 1939251, 2060591, 1857820, 2162939, 2285787, 2187589, 2368340, 2025922, 2703329, 2725347, 2184588, 2483944, 2940467, 2650515, 2936717, 2514149, 2011357, 2219654, 2363065, 2551161, 1914611, 2320311, 2570256, 2388350, 2929065, 2831812, 3218961, 2757494, 3794576, 3989960, 4095702, 4601519, 4710707, 4204883, 4495837, 4398928, 5108732, 5509480, 5972987, 5555753, 5707403, 5128169, 6343299]
6269F343299n85517K48476M18490j09090k35044l15683n08395K09753q03263R56208
6259E619234o3532M87833j89445p38929o71042l80383L1626n57172O4871q3759
6249C519302J60705r19154L55906K18112j67898j288315J221854J51870j79371
6240C073011Q35916K92172J98642M38854k88305M87737N04728r17383K32350J09388
6230D967110q81058j1641K47991l90422L98776o07626J18637M27253n81923o3769
6220C623328L74579J06435K83960J87108k50322m47295J62370p34175M53701l39918
6210C419771q9208k40415M84964N4358k91115K5975N86058N62865j104482O17788
6200D026559l15487P35057j350084M23442R04017j118586J493297m50828M07445
$$ y = [6343299, 5757782, 6006258, 6424748, 6315658, 6080614, 5764931, 5256536, 5466289, 4663026, 5619234, 5555702, 6043535, 5854090, 5115161, 4444119, 4063736, 4095362, 3538190, 3603061, 3519302, 3680007, 2760853, 3116759, 3334871, 3166973, 1878658, 3100512, 3252382, 3073011, 3908927, 4201099, 4399741, 4838595, 4550290, 5038027, 5542755, 4625372, 4857722, 4967110, 4086052, 4074411, 4322402, 3931980, 4330756, 3723130, 3841767, 4269020, 3687097, 3623328, 3997907, 4104342, 4388302, 4575410, 4325088, 3877793, 4040163, 3305988, 3759689, 3419771, 3330563, 3090148, 3575112, 3629470, 3338355, 3364330, 3950388, 4513253, 3408771, 4026559, 3711072, 4446129, 3096045, 3519487, 4423504, 3304918, 4798215, 4347387, 4754832]
6191D754832J0493m53191J013597l70041K72651j21334J08505p8202p43185M35059
6181D829184o49569K61648p50281O05186k43572L2815O52236j070178J018273
6172D685742r72002P29185l39138R31402p94814J197217k12681m17617j320154
6163C487140j76597L69076j27590l82030n1308K94060j103931R66572j29477p26152
6153B419763L31750M6348l6267l1061k11893L99288n19290K39562k45000J009771
6143C402971m37943M38771k65085Q7712o31750k87190O78632k47472k84032J63203
6133B617817M70371l55896k36123Q879K66072N91570k79584j69908l80271O44621
6123C177548j010729o4182O03124K6894J55065p70105N5999K71398M65437k94225
$$ y = [4754832, 4765325, 4312134, 5325731, 4955690, 5228341, 5107007, 5215512, 5137310, 4394125, 4829184, 4179615, 4441263, 3690982, 4296168, 4052596, 4085411, 4737647, 3667469, 4685742, 3713740, 4442925, 4103787, 5035189, 4240375, 5437592, 5224911, 4807294, 3487140, 3310543, 3679619, 3552029, 3169999, 3118691, 3412751, 2308820, 3275392, 3145915, 2419763, 2751513, 2797861, 2761594, 2730533, 2518640, 2917928, 2398638, 2638200, 2393200, 3402971, 2965028, 3403799, 3138714, 3226426, 2594676, 2307486, 2986118, 2738646, 2454614, 2617817, 3088188, 2732292, 2496169, 2505048, 2771120, 3362690, 3083106, 2913198, 2532927, 3177548, 2166819, 2102637, 2705761, 2732655, 2887720, 2117615, 2173614, 2445012, 2910449, 2616224]
6113B616224K42214k53265l17897j82195L99052K26849p36730N21618n97985J16264
6103B034149K31551O0052P6706P67408o81745K73885j61809K30485J13248q53470
6093B090460R60137N9370k24162K81408m74821n16555R28967j439378J249705
6084B915131j280283J345336n35390L1152O04639j30510k7667j72024J77400n4914
6074B872870j20220M43931L8249n22736k26831O20210l4211M6373l60004M55487
6064C213118l48773k67823J488690j370171L26889l38331Q84875q93251Q49125
6055C544348j019589J311539n44359m55954Q08747k62503P5286L21993k45153
6046C534355l27981k09666j3895L38787q65535k6482M80170l22824k7520J73875
$$ y = [2616224, 2858438, 2605173, 2287276, 2105081, 2504133, 2730982, 1994252, 2515870, 1917885, 2034149, 2265700, 2325752, 2402458, 3169866, 2488121, 2762006, 2600197, 2830682, 2943930, 2090460, 3050597, 3109967, 2885805, 3167213, 2692392, 2175837, 3104804, 1665426, 2915131, 1634848, 2980184, 2444794, 2475946, 3080585, 2950075, 2922408, 2750384, 2927784, 2872870, 2752650, 3196581, 3234830, 2712094, 2485263, 3105473, 3071262, 3117635, 2757631, 3213118, 2864345, 2596522, 4085212, 2715041, 3041930, 2703599, 3588474, 2695223, 3544348, 2524759, 3836298, 3291939, 2835985, 3644732, 3382229, 3457515, 3779508, 3534355, 3206374, 2996708, 2982813, 3321600, 2456065, 2429583, 2909753, 2586929, 2559409, 2733284]
6036B733284l25247N82146q3293P1072k13113j4850K06334J55047k23667O12121
6026C499834p45564j8339p45410Q52483j55764L88599j37277K91642l34979j14543
6016B780682J12421N07614k37394M18197K99822o61996O76681L56351n23177M0754
6006C769955j78513o17097l69182O59293M47641p71098j94872J07250q91733J40545
5996B102189O70655k2679p1920J7987o36236Q99511M84423j33307k78438j43199
5986B888986M16483l35405l74914P01914K62675p45105j96862N10897J35064K8615
5976C292348l71888J00896K72672n21555K74394N95024k89143O32382j095263
5967B889867L61452J78633J17523L97604J85558K51546p5934k12192K94319P37493
$$ y = [2733284, 2408037, 2990183, 2906890, 2977962, 2764849, 2749999, 2956333, 3111380, 2887713, 3499834, 2754270, 2735931, 1990521, 2843004, 2687240, 3075839, 2938562, 3230204, 2895225, 2780682, 2893103, 3400717, 3163323, 3581520, 3881342, 3219346, 3896027, 4252378, 3729201, 3769955, 3591442, 2974345, 2605163, 3264456, 3712097, 2940999, 2746127, 2853377, 1961644, 2102189, 2772844, 2750165, 2678245, 2696232, 2059996, 2959507, 3443930, 3310623, 3032185, 2888986, 3305469, 2970064, 2595150, 3297064, 3559739, 2814634, 2617772, 3128669, 3263733, 3292348, 2920460, 3021356, 3294028, 2772473, 3046867, 3641891, 3352748, 3985130, 2889867, 3251319, 3429952, 3547475, 3945079, 4130637, 4382183, 4306249, 4094057, 4388376, 5125869]
5957E125869p09067k57078j77807n26587l8259o59103P09535N60825m89817j157780
5947B380731P61611L85860j31863P89224q14501J63695o83748N49671j39662N50651
5937C811669o99953J05951J07665r44089L1384N57142j29348n13991M80284J24588
5927B931302M03313j22542L14074j16344M29286p50258J76986K04505K96276r81907
5917B784691J159959q84326M34682n3211J70882o86840R17447p96154J019378
5908D066508k92098j72181L23671j310880J176319k95916j1504j17164K32972
5899C599727o63892N13587K98951q66516N56860N49625j207790J221791j122629
5890B879714J203311j403750R72606M7413K57890m82791L52501K8910k36477M02594
$$ y = [5125869, 4416802, 4159724, 3981917, 3455330, 3417071, 2757968, 3467503, 4028328, 3538511, 2380731, 3142342, 3528202, 3396339, 4185563, 3371062, 3534757, 2851009, 3400680, 3261018, 3811669, 3111716, 3217667, 3325332, 2381243, 2412627, 2969769, 2840421, 2326430, 2806714, 2931302, 3334615, 3212073, 3526147, 3409803, 3839089, 3088831, 3265817, 3470322, 3766598, 2784691, 3944650, 3060324, 3495006, 3441795, 3612677, 2925837, 3843284, 3047130, 4066508, 3774410, 3602229, 3925900, 2615020, 3791339, 3495423, 3483919, 3366755, 3599727, 2935835, 3449422, 3748373, 2881857, 3438717, 3988342, 2780552, 4002343, 2879714, 4083025, 2679275, 3651881, 3699294, 3957184, 3474393, 3826894, 3855804, 3619327, 4021921]
5880D021921l44016k59410l50082L32322L08843n6653J29285k83858n93479J199715
5870D104588O723k51081J87693O1178j461551R69420k12647P18031o18794l73292
5860C130268k90596R40505K00881N94782o91183n36679K96905L78615o55920P93519
5850D161097o36176l59017n16130J031295l32254O50881L67449J07805o44351
5841C830599j53504P08386m99471j62052n77250J126468r11720J361575m96036
5832D226995M33350j48321n13472J15204n17205K60752Q54433m76893R0164O572
5822D331579l13741r7887O88345q05819Q59903q33547N21928l43804m899M17553
5812D419611j01004m9052L95192n42936M7429R45388k32605O385m16201r0812
$$ y = [4021921, 3677905, 3418495, 3068413, 3400735, 3709578, 3652925, 3782210, 3498352, 2904873, 4104588, 4111311, 3860230, 4047923, 4109101, 2647550, 3616970, 3404323, 4122354, 3503560, 3130268, 2839672, 3780177, 3981058, 4575840, 3884657, 3347978, 3644883, 4023498, 3367578, 4161097, 3524921, 3165904, 2649774, 3681069, 3348815, 3999696, 4367145, 4474950, 3830599, 3677095, 4385481, 3886010, 3723958, 3146708, 4273176, 3361456, 4723031, 4226995, 4660345, 4512024, 3998552, 4113756, 3596551, 3857303, 4711736, 4234843, 4325007, 4331579, 4017838, 3919951, 4608296, 3802477, 4662380, 3828833, 4350761, 4006957, 4002058, 4419611, 4318607, 4269555, 4664747, 4121811, 4169240, 5114628, 4882023, 4888408, 4472207, 4381395]
5802D381395K02736K88422o8583k58850L25219q4320n34389M0784j31688J103544
5792E264270p88354m83420j70780O65744k70110N48063K74695k53019m19745P47372
5782E114716J56117p3013k41970K99936m33271j54275K40900O22276J78113j272448
5772D437081M88552L79971L21011l00053N55362j16975K2018K85627M97772p12252
5762E858114Q25701p60559L70928n9490o78234k9601j3371R2231J73118j011804
5752D767033K001373o87680K36643k47938P40266o86412R14090k16275J073049
5743G894149j54402l45802j75681L49090n47520m01463J752498j005558O35054
5734H000365m7824L36341o13007M42028o17127Q60504R9035J56496R3801O70471
$$ y = [4381395, 4584131, 4872553, 4803970, 4545120, 4870339, 4786019, 4251630, 4292414, 4160726, 5264270, 4475916, 3992496, 3821716, 4487460, 4217350, 4765413, 5040108, 4787089, 4367344, 5114716, 5270833, 5197820, 4955850, 5255786, 4822515, 4668240, 4909140, 5531416, 5709529, 4437081, 4925633, 5305604, 5626615, 5326562, 5881924, 5764949, 5786967, 6072594, 6570366, 5858114, 6683815, 5923256, 6294184, 6234694, 5556460, 5526859, 5513488, 5605719, 5778837, 4767033, 6768406, 6080726, 6317369, 6069431, 6809697, 6123285, 7037375, 6821100, 7894149, 7739747, 7393945, 7218264, 7567354, 7019834, 6618371, 8370869, 7365311, 8000365, 7952541, 8288882, 7675875, 8117903, 7500776, 8361280, 8460315, 8616811, 8710612, 9381083]
5724I381083O95635m10653O46519M21891L49657K81991J91025J166079N96907
5715A3320134K64407J56608n719K8873K26019N78695N90021j267622J038681k39829
5705A4690268l12802O67475n29843J427656K29858m28121N72948J213322J040507
5696A8571268Q48901J163501J622751J656458K692796K600243K637758J931093
5688C3724769K912828n6895L002443j46395L92793m46118j623060j358870j755244
5679C4646251n36702j952891j006139j174478P2836j055700L04072o92804K63761
5670B8868206J80373N64077R18388R84599J446001K286332K273720K033271L054108
5661D2609075L934729L774861M621925K907235K934584J754676J004206n00807
$$ y = [9381083, 10076718, 9666065, 10312584, 10734475, 11084132, 11366123, 11557148, 12723227, 13320134, 13584541, 13741149, 13735430, 13764303, 13990322, 14569017, 15159038, 13891416, 14930097, 14690268, 14377466, 15044941, 14515098, 15942754, 16172612, 15744491, 16317439, 17530761, 18571268, 19420169, 20583670, 22206421, 23862879, 26555675, 29155918, 31793676, 33724769, 36637597, 36580702, 39583145, 39436750, 39829543, 39383425, 37760365, 36401495, 34646251, 34109549, 32156658, 31150519, 29976041, 30048877, 28993177, 29297249, 28604445, 28868206, 29048579, 29612656, 30531044, 31515643, 32961644, 35247976, 37521696, 39554967, 42609075, 46543804, 50318665, 54940590, 57847825, 60782409, 62537085, 63541291, 63040484]
5653F3040484j613409j944250l338827k983109l230550l290874k628434k572500
5645D1438531k175297j192133j528697n47473r59093J89773m42540J177824k84070
5636C5676825J426622k65741Q92058J638417J634923K264334K055029K213312
5628D7535779J913385K246291J253430J283451O89706m59109o79862j681709k92932
5619E1808430j778927n59112q42140n66453o05908r36350O03522J84005O9777
5610D7376844n93036J330875n13431N63384k16837j77174N58505m17766j207544
5601D6703820K59845j04950N9429P43175M28936L28368J418967L77922K396446
5592E2611958J542889J562558K368653J402948J977664K50081J160628J04649
$$ y = [63040484, 61427075, 59482825, 56143998, 53160889, 49930339, 46639465, 44011031, 41438531, 39263234, 38071101, 36542404, 35994931, 35035838, 35225611, 34783071, 35960895, 35676825, 37103447, 36837706, 37729764, 39368181, 41003104, 43267438, 45322467, 47535779, 49449164, 51695455, 52948885, 54232336, 54922042, 54462933, 53783071, 52101362, 51808430, 50029503, 49470391, 48628251, 48061798, 47455890, 46519540, 47123062, 47307067, 47376844, 46783808, 48114683, 47601252, 48164636, 47947799, 47770625, 48329130, 47911364, 46703820, 46963665, 46858715, 46918144, 47661319, 48090255, 48418623, 49837590, 50215512, 52611958, 54154847, 55717405, 58086058, 59489006, 61466670, 61716751, 62877379, 62982028]
5584F2982028j036790n93504k035063k137733j623647k709201k313127k838117
5576D7694846j587405k366815j900543j648037n48269j431631j04418o78216k74205
5567C7155307L24691J085169R47232n14318J207776K54341P17524N18142q75738
5558D0820126q35067j54179k721997l53803j513320r61102k239079j047406j856757
5549B9137416r83687r70822j849002n69377j228968o66110l33746j235701o96223
5540B0603780O6774k43230o10042J19249m94876N96817L55432m29999N31365J044750
5530B1540020J191665P01998J875556J665508J967738J627852J972789J102536
5522C3645662J976154N55002J07815j038579o65644j180976j155120j979862j642512
$$ y = [62982028, 61945238, 61351734, 59316671, 57178938, 55555291, 52846090, 50532963, 47694846, 46107441, 43740626, 41840083, 40192046, 39643777, 38212146, 38107728, 37429512, 37155307, 37479998, 38565167, 39512399, 38998081, 40205857, 40460198, 41177722, 41695864, 40820126, 39985059, 39830880, 37108883, 36755080, 35241760, 34280658, 32041579, 30994173, 29137416, 28153729, 27182907, 25333905, 24764528, 23535560, 22869450, 22535704, 21300003, 20603780, 20670554, 20427324, 19817282, 19936531, 19441655, 20038472, 20393904, 19963905, 20495270, 21540020, 22731685, 23433683, 25309239, 26974747, 28942485, 30570337, 32543126, 33645662, 35621816, 36176818, 36284633, 35246054, 34580410, 33399434, 32244314, 30264452, 28621940]
5513B8621940j056179j066502j258002n66542p73920p82881J24975j06575P35675
5504B3871989l32059J006334N64149J273858J015516K761245K838870L043560
5496C6043462L728770L562664K493513L661024M56842K055397n86547q51898j971304
5487D8591923k046321k957983l275433k940279l554199k115935k680091k423974
5479B6597708q33758j056195j391261M46469j068480M1203l80893P20772J159686
5470B4235251J19574J459982J286269R64590K789267J345862J505612J120765
5462C4827172J393416o88628N89816j814478o54004l315506j267792k808307k636369
5453B3625320q28117k093599k87865k041135p80807r1973j253307o77723o43596
$$ y = [28621940, 27565761, 26499259, 25241257, 24674715, 23900795, 23117914, 23242889, 23136314, 23871989, 23539930, 24546264, 25110413, 26384271, 27399787, 30161032, 32999902, 36043462, 39772232, 43334896, 45828409, 49489433, 49946275, 52001672, 51415125, 50563227, 48591923, 46545602, 43587619, 40312186, 37371907, 33817708, 31701773, 29021682, 26597708, 25763950, 24707755, 23316494, 23762963, 22694483, 22735686, 22354793, 23075565, 24235251, 24354825, 25814807, 27101076, 28065666, 30854933, 32200795, 33706407, 34827172, 36220588, 35531960, 36121776, 34307298, 33653294, 30337788, 29069996, 26261689, 23625320, 22797203, 20703604, 20415739, 18374604, 17593797, 17501824, 16248517, 15570794, 14927198]
5444A4927198o12607J34362m95543K46989k72381L88537q40411k3160L5371L36172
5434A3824527o24999J100634j232411m08598Q4719J41942o21271L2264o62297
5425A1634510K43744p2583m96067J412545j494433J023578l34045k31454l50428
5416A1335367R56720M94700p40607Q40928k7817M48694q4332k70182J263461k56928
5406A3960004J62313M82651j040650R88369k21559N4301o37982N31693l14075
5397A3965065R07846m50005j91039O91333l7938N57866p4494M12925N74975N98889
5387A6955423N02804Q93206J737441J01878J591085P25896P53092J363455J619572
5378B6243852J013098Q25059P56004J337186J016715o9334L53098L2380p05431
$$ y = [14927198, 14314591, 14448953, 13953410, 14200399, 13928018, 14316555, 13476144, 13452984, 13488355, 13824527, 13199528, 14300162, 13067751, 12659153, 12743872, 12885814, 12264543, 12296807, 11634510, 11878254, 11805671, 11309604, 12722149, 11227716, 12251294, 11917249, 11685795, 11335367, 12292087, 12786787, 12046180, 12887108, 12859291, 13307985, 13223653, 12953471, 14216932, 13960004, 14122317, 14604968, 13564318, 14552687, 14331128, 14385429, 13747447, 14279140, 13965065, 14872911, 14422906, 14231867, 14923200, 14885262, 15443128, 15368634, 15781559, 16356534, 16955423, 17458227, 18351433, 20088874, 20190752, 21781837, 22507733, 23260825, 24624280, 26243852, 27256950, 28082009, 28838013, 30175199, 31191914, 31122580, 31475678, 31508058, 30802627]
5369C0802627K47459j168175j37601q35239j71415q97533M96690k02844L86945
5360B8520914J116745J82109J599166J311256J623060J995707J941010J838905
5352D0128872J893021J632320J754555P66198P000k52043q12679q07368j744958
5343D2564918k335993k346193j289760k226438n51233k477567j127143j227537
5335B8983054l37038l70640l23879j73713M36956N86167j69883O93951Q11728
5326C0136703j398755m95839o6642q30600j533095l41280k062664j528496j817660
5317B0061672o46231k243193j048817l37270j421689k07634j149170n28668m78989
5308A2000011j45528k95938o74181J61463n12318K36661l50984o28042k96884
$$ y = [30802627, 31050086, 29881911, 29744310, 28909071, 28737656, 27840123, 28336813, 28133969, 28520914, 29637659, 29819768, 31418934, 32730190, 34353250, 36348957, 38289967, 40128872, 42021893, 43654213, 45408768, 46174966, 46181966, 45929923, 45117244, 44309876, 42564918, 40228925, 37882732, 36592972, 34366534, 33815301, 31337734, 30210591, 28983054, 28646016, 28275376, 27951497, 27777784, 28214740, 28800907, 28631024, 29324975, 30136703, 28737948, 28242109, 28175467, 27344867, 25811772, 25470492, 23407828, 21879332, 20061672, 19415441, 17172248, 16123431, 15786161, 14364472, 14156838, 13007668, 12479000, 12000011, 11854483, 11558545, 10884364, 11045827, 10533509, 10770170, 10419186, 9791144, 9494260]
5299I494260k23489N75695l85335O26905q31895N41938n60298K83057r89110N29081
5289I060809l88835q03232Q92509K26373j143928P33273m02408j68314p52824
5280G253423J37660J476076j353400P0260k96843m4412L87831l83078J05282j46249
5270G206550p5757k94980m2407K3189J02918L34686Q9806p18194j31713R7024
5260F591122m07437K56112l92379J238689j260831M90765k88059n551j40767J74309
5250F255973L6858o05376L29883p22334M36083k3387L10844k09424m02046K63208
5240E670282n14931L6887J87700j48810J00058L19957l09641o69844r4883K27097
5230D803872J10664Q3516j33298p86906J59206K66147m3248r22562Q63942R9176
$$ y = [9494260, 9270771, 9846466, 9461131, 10088036, 9256141, 9798079, 9237781, 9520838, 8531728, 9060809, 8671974, 7868742, 8761251, 8987624, 7843696, 8576969, 8174561, 8006247, 7253423, 7391083, 8867159, 7513759, 7584019, 7287176, 7242764, 7630595, 7247517, 7352799, 7206550, 7130793, 6835813, 6793406, 6816595, 6919513, 7254199, 7344005, 6625811, 6494098, 6591122, 6183685, 6439797, 6047418, 7286107, 6025276, 6516041, 6227982, 6222431, 6081664, 6255973, 6292831, 5687455, 6017338, 5295004, 5731087, 5707700, 6018544, 5809120, 5407074, 5670282, 5155351, 5192238, 5379938, 5231128, 5331186, 5651143, 5341502, 4671658, 4576775, 4803872, 4914536, 4998052, 4864754, 4077848, 4237054, 4503201, 4459953, 3537391, 4401333, 4500509]
5220D500509j44884j94704O31557m2180m25322m74378r3083K16382K40777q16079
5210C398595J12651j95538o08911J012831j34947N0940j49491k10915K59068J87389
5200C721672k36918R8494q06207K79948l79114J030767q97645N65490l49117O78644
5190C706014q3113o76664N79710o83536P59008p88333O13010j008320o1039M25233
5180B781970l48143J76079L49836J80907n4424n74157M50303j08459j86317k53881
5170B413714j49434J2924k39957K93462m70082R38596M9308n28230N06091m64479
5160B361913N71525n12346K15352m00471N5262o19876N26270n91197J071644j45499
5150B532577o68116P77641j95288k35288Q03013O7464l79226J5972n82640L42342
$$ y = [4500509, 4355625, 4160921, 4792478, 4750298, 4324976, 3850598, 3757515, 3973897, 4214674, 3398595, 3511246, 3315708, 2706797, 3719628, 3584681, 3635621, 3486130, 3275215, 3534283, 3721672, 3484754, 3583248, 2777041, 3056989, 2677875, 3708642, 2810997, 3376487, 3027370, 3706014, 3622901, 2946237, 3525947, 2842411, 3601419, 2813086, 3426096, 2417776, 2356737, 2781970, 2433827, 2609906, 2959742, 3140649, 3086225, 2512068, 2962371, 2853912, 2667595, 2413714, 2264280, 2277204, 2037247, 2330709, 1860627, 2799223, 2848531, 2320301, 2826392, 2361913, 2933438, 2421092, 2636444, 2235973, 2291235, 1671359, 2197629, 1606432, 2678076, 2532577, 1864461, 2642102, 2446814, 2211526, 3014539, 3082003, 2702777, 2718749, 2136109, 2478451]
5140B478451K24536J6963n65945k1998O0587N92208m14779J214945q32060k45432
5130B507476m49318M35685q20282P69582M3557J31878k73271K48752l79252k8840
5120B185967J32674K86723l63097J17081P9939J68093j51074k35673M97449l31274
5110B386808K35034J85984q0770o83249K90913K46387n3674p99411J598527j019758
5100B306791M80992m96740n0088Q06763J8523o6987M16385K35567l06729p4202
5090C270275k60045J14993L84640k22824J52222k41059J35989L37774k66423l82778
5080C022764M50960l41817M09228m0646o95390J067295o07252K30847J06584k61351
5070C341222o8528P46986q48366K52054J040001m54052M5253L26410k077n97170
$$ y = [2478451, 2702987, 2719950, 2154005, 2132007, 2192594, 2784802, 2370023, 3584968, 2752908, 2507476, 2058158, 2493843, 1673561, 2443143, 2486700, 2618578, 2345307, 2594059, 2214807, 2185967, 2318641, 2605364, 2242267, 2359348, 2439287, 2607380, 2456306, 2220633, 2718082, 2386808, 2621842, 2807826, 2727056, 2043807, 2334720, 2581107, 2527433, 1728022, 3326549, 2306791, 2787783, 2291043, 2240955, 3047718, 3066241, 2999254, 3415639, 3651206, 3344477, 3270275, 3010230, 3125223, 3509863, 3287039, 3439261, 3198202, 3334191, 3671965, 3405542, 3022764, 3473724, 3131907, 3541135, 3500489, 2805099, 3872394, 3265142, 3495989, 3602573, 3341222, 3272694, 4019680, 3171314, 3423368, 4463369, 4009317, 4054570, 4380980, 4378903, 3781733]
5060C781733K631L25643k91542q6433P59546n97307N56763m4312J200215J19158
5050E726095j42182L61639n19412m67447M82687P9185o71059K05847m01453J224215
5040E878115o07675Q47421J87870l80573J29415L38538k31627M04683J79518L77646
5030G123331J71476O2749M42539N07504J46087O45118L13046j73576N55530M06521
5020A0200325n92557L21605K41236K9547L90694J346100J177092K17944P07535
5011A4039521J374878j72937K37913j18071j15893n68854K99966P6850q3906N90711
5001A5560178m0403J606576J040867R00671R76459o60236O98935k64454k24537
4992A9594056O35226l04602J7258O67249K427280J87750J847759K087491J397337
$$ y = [3781733, 3784364, 4110007, 3818465, 3732032, 4491578, 3894271, 4451034, 4406722, 5606937, 5726095, 5583913, 5945552, 5426140, 4958693, 5441380, 5520565, 4849506, 5055353, 4653900, 5878115, 5270440, 6117861, 6305731, 5925158, 6054573, 6393111, 6161484, 6566167, 6745685, 7123331, 7294807, 7357556, 7800095, 8307599, 8453686, 9098804, 9411850, 9238274, 9793804, 10200325, 9607768, 9929373, 10170609, 10200156, 10590850, 11936950, 13114042, 13331986, 14039521, 15414399, 15241462, 15479375, 15361304, 15245411, 14676557, 14976523, 15053373, 14969467, 15560178, 15519775, 17126351, 18167218, 19067889, 20044348, 19384112, 20083047, 19818593, 19594056, 20229282, 19924680, 19941938, 20609187, 23036467, 23224217, 25071976, 27159467, 28556804]
4983B8556804K863013K095039J996939m51457r15032p03633j866397j851491j043876
4974B8679909o50038j507897K89413M98323n2086J87055N06970O76690J66171
4965B8794510j237857m67083l39343J40865n93716P75365Q81893Q96595K224627
4956C1075856K184836K628044K311636K664133K385182P78850L31147j974393
4948D2385291j128118l925292l383728j682445k654983k313840p58364o78924
4940B5859597o5421k56447l48117N41233o89472q36131p55658q46385n51445j005694
4930B1046060j91985R07437j42899Q32798J588557K866617R59696R30506J051313
4921B9848100j65991r78371j685716j978064j689089k291526j593058j940479
$$ y = [28556804, 31419817, 33514856, 35511795, 35060338, 34145306, 33441673, 31575276, 29723785, 28679909, 28029871, 26521974, 26811387, 27309710, 27257624, 27444679, 27951649, 28628339, 28794510, 27556653, 27089570, 26750227, 26891092, 26297376, 27072741, 27954634, 28851229, 31075856, 33260692, 35888736, 38200372, 40864505, 43249687, 44028537, 44359684, 42385291, 41257173, 37331881, 33948153, 32265708, 29610725, 27296885, 26538521, 25859597, 25794176, 25537729, 25189612, 25730845, 25041373, 24205242, 23449584, 22603199, 22051754, 21046060, 20854075, 21761512, 21618613, 22451411, 24039968, 26906585, 27866281, 28796787, 29848100, 29682109, 28703738, 27018022, 25039958, 23350869, 21059343, 19466285, 17525806]
4913A7525806l54647n94832q04496j041015J00056q18501o55207q09441k70477
4904A2277246m32804j1294o76362N44461j052789L92817N20014o29082J98712
4895A1130919N4342O05823o38224O61063j90396M60242r99446o40968p25708o41359
4885I076288o65612J1617q07553K91945r54511L36296r8858k65889k39306j84495
4875F499922j216449P59539n50687N19624K19708j63918j57409j48282j82308
4866E579740k61567J78472q04187Q41490j027026J033730n7244l57461j998j54867
4856D969082N88806m73076N28065N23946k051949J317825l35768R58434o89051
4847E336314M88833M11589k95737J51822n32393R88741r00392M51203j61825M69797
$$ y = [17525806, 17171159, 16576327, 15771831, 14730816, 14830872, 14012371, 13357164, 12547723, 12277246, 11844442, 11833148, 11156786, 11701247, 10648458, 11041275, 11561289, 10932207, 11130919, 11185261, 11791084, 11152860, 11813923, 11623527, 12083769, 11084323, 10443355, 9717647, 9076288, 8410676, 8422293, 7614740, 7906685, 6952174, 7288470, 7189612, 6923723, 6684417, 6499922, 5283473, 6043012, 5492325, 6011949, 6231657, 6067739, 5910330, 5762048, 5579740, 5318173, 5496645, 4692458, 5533948, 4506922, 5540652, 5483408, 5125947, 5123949, 4969082, 5557888, 5084812, 5612877, 6136823, 4084874, 5402699, 5066931, 6025365, 5336314, 5825147, 6236736, 5940999, 6092821, 5560428, 6549169, 5648777, 6099980, 5938155, 6407952]
4837F407952m0914k70896Q1306K98416P73952n07671M13406K66045n92987J368136
4827H196745J82165r26237O94256M38525j067727J943198k17469J025409N08909
4818A0777774O52732n23633J532453l06099N99756Q76981k37129L79578M70818
4809A4223231K86316K18622N32051P07303K86942j90413J280982Q24507j58777
4800A8010764J124826K43954j02376J503404K02538R60533N88976Q17059k03400
4791B3146278L08043J549793Q31957L9684N96677K27079J637888M38439J284724
4782C0060562J051394Q05184J799150J311149P07964J615229O30148n86194k97292
4773C7097294P79994K94859l114M45652R83833j04450M84883K62779R93953M06511
$$ y = [6407952, 6367038, 6096142, 6177448, 6475864, 7249816, 6742145, 7155551, 7421596, 6828609, 8196745, 8378910, 7452673, 8146929, 8585454, 7517727, 9460925, 9243456, 10268865, 10777774, 11430506, 10906873, 12439326, 12133227, 12732983, 13609964, 13372835, 13752413, 14223231, 14509547, 14728169, 15260220, 15967523, 16254465, 16064052, 17345034, 18169541, 18010764, 19135590, 19379544, 19277168, 20780572, 20983110, 21943643, 22532619, 23349678, 23146278, 23454321, 25004114, 25836071, 25875755, 26472432, 26699511, 28337399, 28775838, 30060562, 31111956, 31917140, 33716290, 35027439, 35735403, 37350632, 37980780, 37394586, 37097294, 37877288, 38172147, 38169033, 38614685, 39598518, 39494068, 39978951, 40241730, 41235683, 41642194]
4763D1642194K2368J235739K40489O88038N33266J962219K051776K181795K019905
4754E2577789K406175J708149J868584J834085Q33259J532348N16378M10809j07524
4745F3580052o89249Q57682r80995k016928n33482j376128j50821j66837J54168
4736E8677462O46734k16022m10154l57875J078614m33433m90256J406473m0365
4727E9861178J048761O07319K85441n86769k46601j143658l71099j411992j567870
4718E6474710k262057k058169k267995k115762l138149j125754k095934j082179
4710D0328711k67063j593356j100226J55456J75834q75534o81874J30234q5175
4701C6187007j150484O37255l31836n99577j508499P11748l83655p19413o15964
$$ y = [41642194, 41664562, 42900301, 43140790, 43828828, 44362094, 46324313, 48376089, 50557884, 52577789, 54983964, 56692113, 58560697, 60394782, 61228041, 62760389, 63276767, 63687576, 63580052, 62890803, 63748485, 62767490, 60750562, 60217080, 58840952, 58690131, 58523294, 58677462, 59324196, 59108174, 58698020, 58340145, 59418759, 58985326, 58495070, 59901543, 59861178, 60909939, 61517258, 61802699, 61215930, 60969329, 59825671, 59454572, 58042580, 56474710, 54212653, 52154484, 49886489, 47770727, 44632578, 43506824, 41410890, 40328711, 40061648, 38468292, 37368066, 37523522, 37699356, 36823822, 36141948, 36272182, 36187007, 35036523, 35673778, 35341942, 34742365, 33233866, 33945614, 33561959, 32842546, 32226582]
4692C2226582q13299j519942K0416j365865j286730j157471M4159n01681p61363
4683B4884806j434325N37179j851582j178091M4892q69426l54966n21195p27525
4674A8529767j82427p08473K38095J69178q89968m58378k62096k96041j002154
4665A5137503P4444j384963P87327j232195k52256l27306J550270k490381L38359
4656A2200802n42877J07478J7547p95986L53663K6431J08522q18548l76896k70381
4646A0009755n73782k55779l92879n84270M10328j64819p75832m3996j83435o46389
4636F798902M38516l79459M48846m09588k67439J50138l71804K10929q74102J425596
4626G170535j271279M56764n47359Q32132l43014j92565j44197R6291K81938o44446
$$ y = [32226582, 31413283, 29893341, 29913757, 28547892, 27261162, 26103691, 26147850, 25646169, 24884806, 23450481, 23987660, 22136078, 20957987, 21002879, 20133453, 19778487, 19257292, 18529767, 18347340, 17638867, 17876962, 18046140, 17156172, 16697794, 16435698, 16139657, 15137503, 15211947, 13826984, 14614311, 13382116, 13129860, 12802554, 14352824, 11862443, 12200802, 11657925, 11765403, 11782950, 10986964, 11340627, 11367058, 11475580, 10657032, 10280136, 10009755, 9435973, 9180194, 8787315, 8203045, 8613373, 8448554, 7672722, 7628726, 7445291, 6798902, 7237418, 6857959, 7306805, 6897217, 6629778, 6779916, 6408112, 6619041, 5744939, 7170535, 5899256, 6356020, 5808661, 6640793, 6297779, 6105214, 5961017, 6057308, 6339246, 5694800]
4616E694800Q46589m02152j52607j5864k71944Q36524l94284j25783J018793p00597
4606F333475J35738p99909O35032k88607l18604K13770J40194J57136p28242M69088
4596E949071o00902k11804J18415n4055J03985j42829k63549R13343k91668k49724
4586E270283j72566M82044Q0834J09289P26057k70743P80903q43065L73045K36658
4576F772739j110819R87349m77457K17786j20441l56680J42973o93518K57410
4567E619342j268282O55133K32039l62019Q27524k57366J126473j145741O64971
4558F092074N69184k67998N14980q76704q34202k51583O85924q51965k23203M2709
4548D599216p8004J4002k93162P16934k50122L08664j26473P72901m74210K19544
$$ y = [5694800, 6541389, 6139237, 5986630, 5970766, 5698822, 6535346, 6141062, 6015279, 7034072, 6333475, 6469213, 5669304, 6304336, 6015729, 5697125, 5910895, 6051089, 6208225, 5479983, 5949071, 5348169, 5136365, 5254780, 5200725, 5304710, 5161881, 4898332, 5811675, 5520007, 5270283, 5097717, 5579761, 5660595, 5769884, 6495941, 6225198, 7006101, 6163036, 6536081, 6772739, 5661920, 6649269, 6171812, 6389598, 6269157, 5912477, 6055450, 5361932, 5619342, 4351060, 5006193, 5238232, 4876213, 5703737, 5446371, 6572844, 5427103, 6092074, 6661258, 6393260, 6908240, 6031536, 5197334, 4945751, 5631675, 4779710, 4556507, 4599216, 4521212, 4535214, 4242052, 4958986, 4708864, 5017528, 4891055, 5663956, 5189746, 5409290]
4538E409290q83000R41912J95630m63259O71877n92100M59433m45807O83460k76188
4528E701248J04432j556907R97275L35061l03301O09083L38100p45249L67776
4519E847518P77896L60072k69233l73853l17714K98372K26856j9544J030424o7185
4509G493609l59383M55483j08716J250554o04779K85951m60359L15822m66075
4500G802107N82459o75533J02052L52352k12009K86922j131543J250832k59115
4491H098524Q49886k75219R04908n45123J50465p84664P07651l28376l93933m26383
4481G957736j60901N79676J003123N1786K463j19748J86157p9709K32172M81582
4471A0134337N12557Q18053l20798J007670j56397K024303r65281Q65398j80615
$$ y = [5409290, 4526290, 5468202, 5663832, 5200573, 5872450, 5280350, 5739783, 5293976, 5977436, 5701248, 5805680, 4248773, 5246048, 5581109, 5277808, 5886891, 6224991, 5479742, 5847518, 6625414, 6985486, 6716253, 6342400, 6024686, 6323058, 6549914, 6530370, 7560794, 7493609, 7134226, 7589709, 7480993, 8731547, 8126768, 8412719, 7952360, 8268182, 7802107, 8384566, 7709033, 7811085, 8163437, 7951428, 8238350, 7106807, 8357639, 8098524, 8948410, 8673191, 9578099, 9032976, 9183441, 8398777, 9106428, 8778052, 8384119, 7957736, 7796835, 8376511, 9379634, 9431420, 9433883, 9314135, 9500292, 9420583, 9652755, 10134337, 10646894, 11464947, 11144149, 12151819, 11995422, 14019725, 13054444, 13919842, 13739227]
4462A3739227P98768P39804L32466O98173J008867M89762J160959K305745N49029
4453B1822800J992043l10361J372491r1068K11062N84828j02088k90509K29459
4444B5418657l03245O29289j42333m59445j098241l79293J40987o92928j036892
4435B2076556k03992J58991j264923R40240r166R75182J63756J215291R98837
4426B5050772J137275K43196K260220P07417J399944J228295N70381O09352K301456
4417C5508308J906333K151003L555432M780372M652668N498202P149861O342709
4409G1544888Q989238Q466709J0661299J1574687J7631524K6248406M0964375
4402A96081126N8672787O6091735N1417130J7934896j4084965l8368048m8350363
$$ y = [13739227, 14537995, 15277799, 15610265, 16308438, 17317305, 17807067, 18968026, 21273771, 21822800, 23814843, 23504482, 24876973, 24785905, 24996967, 25581795, 25479707, 25189198, 25418657, 25115412, 25744701, 25602368, 25142923, 24044682, 23665389, 23806376, 23113448, 22076556, 21872564, 22031555, 20766632, 21706872, 21697706, 22672888, 22836644, 24051935, 25050772, 26188047, 26431243, 28691463, 29398880, 30798824, 32027119, 32597500, 33206852, 35508308, 37414641, 39565644, 43121076, 47901448, 52554116, 58052318, 65202179, 71544888, 80534126, 89000835, 99662134, 111236821, 128868345, 155116751, 196081126, 254753913, 320845648, 372262778, 390197674, 376112709, 337744661, 289394298]
4395B89394298m6405447m1279893l5486015k9622837k2140727j6462259j2010462
4388H5986658q612330p474277o228999n086230k296064k062253k782577k949050
4380D8494878k104321l732546k439245k471631k074170k173104j021286r38813
4372C1539762q38322N50700m01219o92954q79267L44239J579606J159564l14253
4363C2047856j302832j357452j363613J92213j408874j001242J440989Q7927L62039
4354B7697011M36833N61437p02612j144163j349240j422668p30430K76610j782941
4345B1839837m93850l68621o44917k47754j42968M26077O34030N49931J192598
4336B2744363j036854O30188N078k83211m95106l12438O98955j066483O60622
$$ y = [289394298, 242988851, 201708958, 166222943, 136600106, 114459379, 97997120, 85986658, 77374328, 69900051, 63671052, 58584822, 56288758, 54226505, 51443928, 48494878, 46390557, 42658011, 40218766, 37747135, 35672965, 33499861, 32478575, 31539762, 30701440, 31252140, 30850921, 30157967, 29278700, 29622939, 31202545, 32362109, 32047856, 30745024, 29387572, 28023959, 28216172, 26807298, 25806056, 27247045, 27334972, 27697011, 28133844, 28695281, 27992669, 26848506, 25499266, 24076598, 23346168, 23622778, 21839837, 21345987, 20977366, 20332449, 20084695, 19941727, 20367804, 21001834, 21551765, 22744363, 21707509, 22337697, 22342775, 22059564, 21564458, 21252020, 21950975, 20884492, 21545114]
4327B1545114K01810K327841l51939J943410K220022K332160J814693L646268
4319C5679379L678235R03565Q61238l98843k028770k708949m503276k666454l237540
4310B5578585k038410k531279j006169j248256k075426o9851o33897j186440L2152
4301A4821009J57743Q46431N949L68375J502385M39561L3276J16043n81475j066985
4291A6642312k57605q66133k026j952572K5677n78057N7500m65692K8797P952
4281A2640153m53970n12426q55742J52822j347569N71079o99928j64528M63544
4272I793435p58283k52464m00608j059699O01818m65444J090416j452137Q61085
4263G958119j169915N118N71677L09112m22679j20132q01276r2293K73526k48111
$$ y = [21545114, 21746924, 24074765, 23722826, 25666236, 27886258, 30218418, 32033111, 35679379, 39357614, 40261179, 41122417, 40723574, 38694804, 35985855, 31482579, 28816125, 25578585, 23540175, 21008896, 20002727, 18754471, 16679045, 16609194, 15975297, 14788857, 14821009, 14978752, 15825183, 15831132, 16199507, 17701892, 18141453, 18174729, 18290772, 17709297, 16642312, 16384707, 15518574, 15516548, 13563976, 13589653, 13011596, 13069096, 12603404, 12632201, 12640153, 12186183, 11673757, 10818015, 10970837, 9623268, 10194347, 9494419, 9329891, 9793435, 9035152, 8782688, 8382080, 7322381, 7924199, 7458755, 8549171, 7097034, 7958119, 6788204, 6793322, 7364999, 7674111, 7251432, 7131300, 6330024, 6237731, 6511257, 6263146]
4253F263146Q77482p53820k54752L69793K65286j7083o79999n42742P3834o18851
4243D982294O77950p66350J067277m88782O11738l63665R1428L25711P99682J06458
4233G043741N54045K57907j68940L02358K19772l53114j224639Q29935P2558J695969
4223I229592j94460J459890l63725l18432j74032n41904n28410m93290n46314
4214G528915j416250P1737m64064m43671L70711o16041q4370o69271O4922j9919
4204D322699m10318K74716o27956Q49669p09592k90817L15458L39470j99212J98102
4194D062219k9441K97893j64806k42236o53372J30809K13075n63021J002423r82322
4184C071221l43422P71194l8778j27344m57386j14800K32684k5473k97607n05614
$$ y = [6263146, 7140628, 6386808, 6132056, 6501849, 6767135, 6750052, 6070053, 5527311, 5601145, 4982294, 5660244, 4893894, 5961171, 5472389, 6084127, 5720462, 5811890, 6137601, 6937283, 7043741, 7597786, 7855693, 7686753, 7989111, 8208883, 7855769, 6631130, 7461065, 7533623, 9229592, 9035132, 10495022, 10131297, 9812865, 9638833, 9096929, 8568519, 8075229, 7528915, 6112665, 6184402, 5720338, 5276667, 5647378, 5031337, 4946967, 4277696, 4342618, 4322699, 3912381, 4187097, 3559141, 4408810, 3699218, 3408401, 3723859, 4063329, 3864117, 4062219, 4032778, 4330671, 4165865, 3923629, 3270257, 3401066, 3614141, 3051120, 4053543, 3071221, 2727799, 3498993, 3460215, 3332871, 2875485, 2760685, 2993369, 2967896, 2670289, 2164675]
4174B164675J299170p28589L49171p70187K03751J11892O0210R72051r36366J37774
4164B863552n65178m9691J220792r12422j38355L74757j25612K32064j05697K08354
4154C002564j37149L60736J17776L86228m04261O89051r5159m96682K90710l51969
4144C361845M09413q8881k08754k68120m7407q23391N83090l98530N76147j72615
4134B922797r38842J209911j269227J080526q35941K94143o24392l7240P53669
4125B555404o07293L53020p07816J39469J183833q53118M3307J71739P21793n78688
4115B421650N05965m37843r19342M43725j26204M16348O7254n648p02437l59915
4105A303553P36166m02715k71400J036122k17483n00513L20936J39383K15348
$$ y = [2164675, 3463845, 2735256, 3084427, 2314240, 2517991, 2629883, 2690093, 3662144, 2725778, 2863552, 2298374, 2248683, 3469475, 2557053, 2418698, 2793455, 2667843, 2899907, 2794210, 3002564, 2865415, 3226151, 3343927, 3730155, 3325894, 4014945, 3919786, 3423104, 3713814, 3361845, 3771258, 3682377, 3473623, 3205503, 3158096, 2334705, 2917795, 2519265, 3095412, 2922797, 1983955, 3193866, 1924639, 3005165, 2169224, 2463367, 1838975, 1801735, 2555404, 1948111, 2301131, 1593315, 1732784, 2916617, 2063499, 2106806, 2278545, 3000338, 2421650, 2927615, 2489772, 1570430, 2014155, 1887951, 2304299, 2371553, 2365905, 1663468, 1303553, 2039719, 1637004, 1365604, 2401726, 2184243, 1683730, 2004666, 2144049, 2359397]
4096B359397l36713k02059J78478M31988l20581j44701N71649n81079O62550j186675
4086A432254K19981M5309o71666J820455j345870Q50816n08310M02087l3847J5110
4076B226319j73981J21767o10209k0452N06122m22224L26883M40571l27040k70017
4066A797739O40881J99431k50194l05936O85006n32356o36742R20006o46970k65404
4056A605461O05747K93823n46870K05049L92915r463O62442k39086m30103j25842
4046B414073J68580O20529l10497Q3280K85082r79385J215604J30178L00563j454760
4036B473247R07001l29033q2144P7343K24571J12267p1532N92301o94807Q0426
4026C289640J201612l29613o08714J128141m5457n38941k13731N75920q2666n31372
$$ y = [2359397, 2022684, 1820625, 1999103, 2431091, 2110510, 1965809, 2537458, 1956379, 2618929, 1432254, 1652235, 1697544, 1025878, 2846333, 1500463, 2351279, 1842969, 2245056, 2211209, 2226319, 2052338, 2174105, 1563896, 1543444, 2049566, 1627342, 1954225, 2394796, 2067756, 1797739, 2438620, 2638051, 2387857, 2081921, 2766927, 2234571, 1597829, 2517835, 1870865, 1605461, 2211208, 2505031, 1958161, 2163210, 2556125, 2546662, 3209104, 2970018, 2539915, 2414073, 2582653, 3203182, 2892685, 2975965, 3261047, 2281662, 3497266, 3627444, 3928007, 2473247, 3380248, 3051215, 2969071, 3046414, 3270985, 3383252, 3311720, 3904021, 3209214, 3289640, 4491252, 4161639, 3552925, 4681066, 4635609, 4096668, 3882937, 4458857, 4376191, 3844819]
4016C844819l50784j5670j29728l58010O17451l48079o49728N37475M11252L7311
4006C596309L9967l72400J97290O16389p69429M48425O4173Q34159n63615M50555
3996D541823k86643R7603j3355j50786n00832n85489O14534j33280n31584L37575
3986C389566l30358n64774N89163n10548K65556L94604M09177j358135J189941
3977C474192q55463L03311m60846M77594N37625q62560R00893j197695K53572
3968B570623o69572L53324m09922M83719l80829j01964k42783L20749o9481J62676
3958B016540o49806N33241K8061L37131n0562J77587j059074L79545j151969P14643
3948A275337M38948M21070n73146l46014m24303M91260L11518K5829j0541o92274
$$ y = [3844819, 3494035, 3478365, 3348637, 2990627, 3608078, 3259999, 2610271, 3147746, 3558998, 3596309, 3636276, 3263876, 3461166, 4077555, 3308126, 3756551, 3820724, 4654883, 4091268, 4541823, 4255180, 4352783, 4339428, 4188642, 3687810, 3102321, 3716855, 3583575, 3051991, 3389566, 3059208, 2494434, 3083597, 2573049, 2838605, 3233209, 3642386, 2284251, 3474192, 2618729, 2922040, 2461194, 2938788, 3476413, 2613853, 3514746, 2317051, 2570623, 1901051, 2254375, 1844453, 2328172, 1947343, 1845379, 1602596, 1923345, 1853864, 2016540, 1366734, 1899975, 1928036, 2265167, 2214605, 2392192, 1333118, 1712663, 560694, 1275337, 1714285, 2135355, 1562209, 1216195, 791892, 1283152, 1594670, 1620499, 1609958, 917684]
3938I17684L76539j3267M06869o09265Q798M20027M74397o58151k16372J17257
3928A224516N82983j057648J57240k31315R93088j176176Q07245P0108k45181
3919A124860q5334K81980q13088O43261l8116R7468j45559q40943O57251q292
3909H73488l41009O6009R70702j162995L31754J19703j39257o0403l6453L34388
3899I55927O25734j057362O38404n7919q32135K94390P58973k13661M06730q30936
3889F88145j9292J34310o06964Q64811j176950Q00599l31404L56708L01720J95593
3879A207276j159357P57164o48841L24104O49786r80294J022962l86622k7647
3870G58531m98265L1674J172052q44552J101062j086145M83808r4803K00581p06128
$$ y = [917684, 1294223, 1280956, 1687825, 1078560, 1087358, 1507385, 1981782, 1323631, 1107259, 1224516, 1807499, 749851, 907091, 675776, 1668864, 492688, 1299933, 1370041, 1124860, 1039526, 1321506, 508418, 1151679, 1113563, 1211031, 1065472, 224529, 881780, 873488, 532479, 598488, 1569190, 406195, 737949, 857652, 718395, 657992, 621539, 955927, 1581661, 524299, 1162703, 1104784, 272649, 567039, 1326012, 1112351, 1519081, 688145, 668853, 803163, 196199, 1061010, -115940, 684659, 353255, 709963, 1011683, 1207276, 47919, 805083, 156242, 480346, 1130132, 149838, 1172800, 786178, 758531, 260266, 291940, 1463992, 619440, 1720502, 634357, 1118165, 1023362, 1223943, 517815]
3860E17815N165j73148J093066l32827k01983j8264l25637o69443Q60240j89255
3850E65729L68310J67200p52089L09970j87712L57512n39945M79996k55087L36498
3840H50382m86925Q73370m91345K7233k00314L91280m14045k8477P96640J15831
3830A433630m85034o53466k32284R84895n03823J078735j003243K65157o46666
3821B37901K24626m12156O86431o4427j053055P92018k92024K9948N51560K96848
3811I97670o12073l39234Q97630m86076K15745l47681j71709R5049r80817Q13075
3801H1579l67114J273237p06793j76321o49855J221299j325557J753140o94657
3792D08958N14860o57710O02119m1354p38877N42521k21992J48558j271276J182462
$$ y = [517815, 522980, 349832, 1442898, 1110071, 908088, 889824, 564187, -105256, 754984, 565729, 934039, 1101239, 349150, 659120, 471408, 828920, 288975, 768971, 513884, 850382, 363457, 1236827, 745482, 772715, 572401, 963681, 549636, 521159, 1317799, 1433630, 948596, 295130, 62846, 1047741, 543918, 1622653, 619410, 884567, 237901, 462527, 50371, 736802, 672375, -380680, 411338, 119314, 149262, 700822, 997670, 385597, 46363, 943993, 457917, 673662, 325981, 154272, 249321, -731496, 81579, -285535, 987702, 280909, 104588, -545267, 676032, -649525, 1103615, 408958, 923818, 266108, 868227, 826873, 87996, 630517, 408525, 557083, -714193, 468269]
3782D68269M69360l93218l80250J31860o56547O03752L49277l35930o3928R28630
3772A121275n40576J17066k49304K13468P07865j293995P11754l5602n92693N77451
3762G36709l63538L98466n22289J40344r1639l34491J121427k60547N3832o87935
3752A90339O65418p7750l03124M59942q9641o95171Q57076p60973M34798n63492
3742A17422N36863L96484o84157P3472P61398j247746Q02428j65106j97886K55732
3732F48904k18024k10055R6566l40513j0036J359503k014873J168900j90124p2114
3722B18134K88969k18604L95829o5469j089447J019249k2874L88521r64279L95538
3712C45567J42233l1780r804j01516k81208O97029n09057J59006L60784n77698
$$ y = [468269, 937629, 544411, 164161, 296021, -360526, 243226, 592503, 256573, 192645, 1121275, 580699, 697765, 448461, 661929, 1369794, 75799, 787553, 751951, 159258, 736709, 373171, 771637, 249348, 389692, 298053, -36438, 1084989, 824442, 878274, 190339, 855757, 778007, 474883, 934825, 845184, 150013, 1007089, 246116, 680914, 117422, 654285, 1050769, 366612, 440084, 1201482, -46264, 756164, 591058, 393172, 648904, 430880, 220825, 317391, -23122, -33158, 1326345, -688528, 480372, 290248, 218134, 507103, 288499, 684328, 618859, -470588, 548661, 525787, 914308, -49971, 345567, 487800, 456020, 446216, 344700, 63492, 760521, 251464, 410470, 771254, 193556]
3702A93556O6546N10996M16106n03975o3097l69365R4749n73193L10110N59729
3692F42162m29327j66072n5249M39219k34522J26715K1300J37652j09224j64037
3682B08617R2353M52457L03395j339382R28554l38713o93414K77007K44565N45894
3672F81333k65837N3595J21284k14058p11892J23737J488186j106249N48179l89356
3662C28922N39606k29074p91832O56127L60802l01207n30511P63861p04013L96082
3652D88763n68636M40464N6952K22282k43198J63670J85526o33568J21136N41781
3642G75172m97367N12041j08453J29860p22417L44002k61595K40758n73622O14986
3632D53365K37896n04714J063416j585772J046537j16211m08004M20620o70140
$$ y = [193556, 260102, 771098, 1187204, 683229, 620132, 250767, 345516, -227677, 82433, 642162, 212835, 46763, -8486, 430733, 196211, 322926, 344226, 481878, 372654, 208617, 300970, 753427, 1056822, -282560, 645994, 307281, -386133, -109126, 135439, 681333, 415496, 469091, 590375, 376317, -335575, -211838, 1276348, 170099, 718278, 328922, 868528, 639454, -152378, 503749, 864551, 563344, 32833, 796694, 92681, 488763, -79873, 360591, 417543, 639825, 396627, 560297, 745823, 112255, 233391, 775172, 277805, 789846, 681393, 811253, 88836, 432838, 171243, 412001, -161621, 453365, 691261, 186547, 1249963, -335809, 710728, 594517, 186513, 607133, -63007]
3623f3007L45259L49916m80387J0433j72060L11372R6962j19218J23181M42958
3613H45409p51608J241205j555974N05435j85919N72084m11620K7241o36953K67643
3603h3057K70827k56884n1564L49246J86418N4215Q6299j1236n97042N22212p83531
3592c14097K93039K27112p71380Q26968j007039Q36448L06197P36505j759611
3583f25858J199957m28753M1398l42276P17161o59675Q29616p10629J6584N73556
3573F11081O82514m21929m31547r75475J338847n89555q2545N66985n72624K2919
3563A48671k60909k18449O12327O32438j13383j69576m12509M96584J73506j89962
3553F98738J34229j16845j56670j14977k95276P9244K29508M32571m80632j42352
$$ y = [-63007, 282252, 632168, 151781, 162214, -9846, 301526, 398488, 279270, 402451, 845409, 93801, 1335006, -220968, 284467, 98548, 670632, 259012, 286253, -350700, -83057, 187770, -69114, -120678, 228568, 414986, 469201, 555500, 544264, -52778, 469434, -314097, -21058, 206054, -565326, 261642, -745397, 91051, 397248, 1133753, -625858, 574099, 145346, 186744, -155532, 561629, -98046, 731570, 20941, 37525, 611081, 1293595, 871666, 440119, -535356, 803491, 213936, 131391, 698376, 125752, 148671, -112238, -330687, 281640, 914078, 800695, 631119, 218610, 715194, 888700, 698738, 832967, 716122, 559452, 444475, 149199, 228443, 457951, 890522, 409890, 267538]
3543B67538n44270N10529K82985J5153L89952n32766K05632p28922Q80481j45398
3533F00914j74484J63849n53328J84476L58423o12192N4896R54648j299767Q76485
3523E53920K19441K39031n88003p59989P64058J94989n51168j52834J43466j40591
3513g7680N65030m84126L62410J2973n5284N77394j49423n1237r7480J8207r9116
3502E21668K46064m0850m55317L8432q82517R85066m47460O49771j203269J014549
3492D26137m0103l99376R22252m26627L64223p04953N6104R09311j61951j32827
3482H12190L01803n0787o71573K50861p26892N04037j93601J21496O63220j062516
3472e1762O99809n74513M22904j61097m09259N11556M42484q73410K6488J78513
$$ y = [267538, -276732, 233797, 516782, 531935, 921887, 389121, 594753, -134169, 746312, 600914, 426430, 590279, 36951, 221427, 579850, -32342, 22554, 977202, -322565, 553920, 773361, 1012392, 424389, -335600, 428458, 623447, 72279, -80555, 62911, -77680, 487350, 3224, 365634, 378607, 323323, 900717, 751294, 700057, 602577, 620784, 521668, 767732, 726882, 271565, 309997, -572520, 412546, -34914, 614857, -588412, 426137, 386034, -13342, 908910, 482283, 846506, 141553, 197657, 1106968, 945017, 812190, 1113993, 1063206, 391633, 642494, -84398, 419639, 226038, 347534, 1010754, -51762, 648047, 73534, 496438, 335341, -73918, 437638, 880122, 6712, 33200, 211713]
3462B11713K98758K56760L07248j262037J010208n3071q81715J009190l57915
3453E39139j007687Q42399L30213o62794M83571K18693J38397j51452r31833J343570
3443A142216p38003K25162j88700O39207l7361m11015o35931J222366j9384j163512
3433C5045Q22459o51633J79614m47654K06570l97668P68235K7531K01632M681
3423G48812M97923j162416R4065L8253L18572j80122O34260L1452j40875L014
3413H82938k05046N34382l37958J40913K12698j14976J251L21866o50624l11328
3403D74116J012018k09379p94807K21595Q3232J246770k65464l03370L28780Q7563
3393A881054M53611J59070N31257M03570L96011M32836Q363M99544M2900R71423
$$ y = [211713, 510471, 767231, 1074479, -187558, 822650, 769579, -112136, 897054, 539139, -468548, 373851, 704064, 41270, 524841, 743534, 881931, 730479, -201354, 1142216, 404213, 629375, 440675, 1079882, 1042521, 631506, -4425, 1217941, 1198557, 35045, 857504, 205871, 385485, -62169, 144401, -253267, 514968, 542499, 744131, 748812, 1246735, 84319, 178384, 216637, 535209, 355087, 989347, 1020799, 879924, 882938, 677892, 1212274, 874316, 1015229, 1227927, 1112951, 1114202, 1436068, 785444, 474116, 1486134, 1276755, 481948, 703543, 786775, 2033545, 1768081, 1464711, 1793491, 1881054, 2334665, 2493735, 3024992, 3428562, 3824573, 4257409, 4265772, 4765316, 4808216, 5779639]
3383E779639J803306R38746k05814l01122j079790j435860j014128l43162j261785
3374B880030m84367L15009r00814M12821p25384K02845m6714o00290N52727J03269
3364A709132J48712n44432j77848N21134l34892n10012O29390N8661L73935k20112
3354A653668l20499R13186K0005r01490J49034K73103m25179J36544K62163O66420
3344B426955j73976J3836M52531N99848K0966K83079J286585n76798l35349l2483
3334C965194M66425Q02976j49717J356690J362803K527517O848861J2504090J5159517
3325D4844356J1013852j514048l367539j0765689q638039p277849m762604n100104
3317A4432336l364408k267643k094916N09296q68408m60002j042051J42410j021326
$$ y = [5779639, 7582945, 8521691, 8315877, 8014755, 6934965, 5499105, 4484977, 4141815, 2880030, 2395663, 2710672, 1809858, 2222679, 1497295, 1700140, 1653426, 1053136, 1605863, 1709132, 1857844, 1313412, 1135564, 1656698, 1321806, 811794, 1441184, 1499845, 1873780, 1653668, 1333169, 2246355, 2266360, 1364870, 1513904, 1787007, 1361828, 1498372, 1760535, 2426955, 2252979, 2266815, 2719346, 3319194, 3340160, 3623239, 4909824, 4333026, 3997677, 3965194, 4431619, 5234595, 5084878, 6441568, 7804371, 10331888, 17180749, 29684839, 44844356, 55858208, 54344160, 50976621, 40210932, 31572893, 24295044, 19532440, 14432336, 11067928, 8800285, 6705369, 7214665, 6346257, 5886255, 4844204, 4986614, 3965288]
3308C965288P58158j813564R69936m23269j71487p11102L28927n27202j16779
3299B258906m37578n10725J028499K58413k28410n77080m2291n21577P42884m56632
3289A514409N58933j038986K67030P09489L3584l59306O4040n97570L39900K76280
3279A767803q68523k60791J075253o34085k19761M09835o07479P67336m31668
3270I97920L95999N98369j146005P67943k10855n30397N19625n72018L94097l38912
3260H75766J5771J80402o48557O10826O41712q59636M33100K45188q98724L07324
3250I03172N04134j056602M70505l15564J000552p57279k09302K52653L5858m10132
3240D17995n9951L40845q99423Q80241k67012m99146P95265O62754j14959q22948
$$ y = [3965288, 4723446, 2909882, 3879818, 3456549, 3285062, 2573960, 2902887, 2375685, 2258906, 1821328, 1310603, 2339102, 2597515, 2369105, 1792025, 1749734, 1228157, 1971041, 1514409, 2073342, 1034356, 1301386, 2010875, 2044459, 1685153, 1749193, 1151623, 1491523, 1767803, 899280, 638489, 1713742, 1079657, 859896, 1269731, 662252, 1429588, 997920, 1393919, 1992288, 846283, 1614226, 1403371, 872974, 1392599, 820581, 1214678, 875766, 891537, 1071939, 423382, 1034208, 1675920, 816284, 1249384, 1494572, 595848, 903172, 1407306, 350704, 821209, 505645, 1506197, 748918, 539616, 792269, 828127, 417995, 358044, 698889, -200534, 679707, 412695, -86451, 708814, 1371568, 1256609, 433661]
3230D33661M61618q82806O44532k85225L59225K37249p2299M10222r90872N40729
3220H56034j90059m8848m15111M91035l67038j58968K36J11863K8217m16855L35982
3209B26488m04640K8112J002368k53823n49958R3811O58225l20639l62986j82031
3199f5073K35773L33518m0811J11869K67779n29453j3250O17719q11645J391532
3189A497958n29769o42375O19897p99949L77760p15651L35182M87335J72408p08866
3179I3930P2825j62179K29383Q04909n82800r1684j4587N86833j213751N24484
3169B47363J67364q9058j30763J43325j016889P87002L1019N43468o50n02121
3159A80060l37915N89150R61044n40220q72272j14389Q21023o81976R70528j170038
$$ y = [433661, 895279, 12473, 657005, 371780, 731005, 968254, 895955, 1306177, 315305, 856034, 665975, 617127, 202016, 693051, 326013, 167045, 167281, 279144, 307361, -109494, 226488, -178152, -150040, 852328, 598505, 48547, 142358, 800583, 479944, 116958, -65073, 170700, 504218, 463407, 575276, 843055, 313602, 300352, 918071, 106426, 1497958, 968189, 325814, 945711, 145762, 523522, -192129, 143053, 630388, 802796, 93930, 166755, 4576, 233959, 1038868, 456068, 364384, 349797, 936630, -277121, 247363, 414727, 325669, 194906, 338231, -678658, 108344, 139363, 682831, 682181, 180060, -157855, 431295, 1392339, 852119, -20153, -134542, 686481, 4505, 975033, -195005]
3149a95005N82209n21034N08602l71968k97748J83910L31442j82075P63514j05355
3139F96492k03501m07778J97780J40247J9690N0506m18669O24835l45873M73941
3129H27670o56951R12892p03215r1071L80332O35431j325954j26535M06437p05136
3119d46100Q54875k33237o2499J84184j11223l01489L59604J7575q6032l59745
3109a84087L60520o6547P0589J03952N97418p82312J63475n5459K61528l97148
3099G1929K80004k52307J353731j187428m92479R91450m13654Q832L05383J42418
3089H07879o75638P83850p18337R15802j575765N50296J33649R356m90971Q48867
3079E88988L13905m8770q42692k9697L66933O7839J63346m08810M96488j050138
$$ y = [-195005, 387204, -133830, 374772, 2804, -294944, -111034, 220408, 38333, 801847, 696492, 492991, 85213, 282993, 423240, 442930, 493436, 74767, 699602, 353729, 827670, 170719, 1083611, 380396, 289325, 669657, 1305088, -20866, -147401, 259036, -446100, 408775, 175538, 113039, 297223, 186000, -115489, 244115, 261690, 175658, -184087, 176433, 109886, 180475, 284427, 881845, 99533, 263008, 207549, 469077, 71929, 351933, 99626, 1453357, 265929, -226550, 764900, 351246, 360078, 665461, 807879, 132241, 916091, 197754, 1113556, -462209, 88087, 221736, 231092, -259879, 588988, 902893, 854123, 11431, -18266, 348667, 416506, 579852, 171042, 667530, -382608]
3069c82608q0776N04051M52146l64475k28334M93615m35828q3119J098028j459890
3059d87190Q79106L9474j92996M94983k11635n30027M17830o17070j29000N23068
3049A86543l22066J95232r95054J064595J14863J595p83994J01097K37899O57356
3039D58066n46321K23532K78948n45095M28290o64285Q11170R1928o08613N95082
3029E22702j165661O17341L66134m46333N79118q97448L55524k11001M98781j35006
3019H4151M13485o3890m67732m9025n40584O38221j70597L50388M38668m12964
3009B20121K47052o80711O70433l22818K84182K0434p1260P2231m72357J16514
2999H3821O1337M64267n12893J94764K34693L25870n98669j08825L59326k24947
$$ y = [-382608, -463384, 40667, 492813, 128338, -99996, 393619, -42209, -125328, 972700, -487190, 391916, 431390, 238394, 733377, 521742, -8285, 409545, -207525, -336525, 186543, -135523, 59709, -935345, 129250, 244113, 245708, -538286, -437189, -199290, 458066, -88255, 135277, 414225, -130870, 297420, -366865, 444305, 536233, -72380, 522702, -642959, -25618, 340516, -105817, 473301, -424147, -68623, -279624, 219157, 84151, 497636, 433746, -33986, -83011, -623595, 14626, -155971, 194417, 633085, 220121, 467173, -213538, 456895, 134077, 418259, 438693, 367433, 439664, -32693, 83821, 145158, 609425, 96532, 291296, 525989, 851859, 253190, 144365, 503691, 278744]
2989B78744J5583p26464N84359N39870l10666j39520Q42395j002731l0537L02419
2979C53452J4495O64716n40195n36649K03198p30743P42477Q09157o32543N36639
2969H84004k29899o34860O90417R0398p97802L81358k2131M17054q57095N84157
2959E05601m44216o94470N86126o11788R41274l62488L22143o22808q4126R12234
2949D47482J24453l80434p77736J145408k99942n15727P76920o38219k88995P22321
2939C15531j88417J70042n07659K07493J20028N17240r6272o2233k36771n33491
2929b94509K61209N52656k49067J55688j204077N21183O69677J17631K7767J40094
2919F98252j006231k61767Q52056M78089p76936M31327p07087N13621J26339p79087
$$ y = [278744, 294327, -432137, 152222, 692092, 381426, 241906, 1084301, 81570, 51033, 353452, 367947, 1032663, 492468, -44181, 159017, -571726, 170751, 979908, 347365, 884004, 654105, 19245, 709662, 800060, 2258, 383616, 361485, 778539, -78556, 505601, 61385, -633085, -46959, -658747, 282527, -79961, 242182, -380626, -464752, 447482, 571935, 191501, -586235, 559173, 259231, -256496, 520424, -117795, -406790, 315531, 127114, 297156, -210503, -3010, 117018, 634258, 537986, 475753, 238982, -294509, -33300, 519356, 270289, 425977, -778100, -256917, 412760, 530391, 558158, 698252, -307979, -569746, 282310, 760399, -16537, 414790, -292297, 221324, 347663, -431424]
2909d31424P86964l79580Q98126p34249l48931l3754J197310j182690K4361R29675
2899G25808n73876N20894o58700M81923j04560j143671Q98137m99854O79813k31814
2889I4100M01782r21224K98262j58163k74459L07891O78465p1225J0869o0641
2879C05657M3172k75033K39371P3652m88970L32898M15406j39873L8025M65253
2869A009558o37402m75032n4954J392704j497386O88147k53565L76104j172011
2860f23837M09486M68188j019503J361867j06915j2453o46148N29443o2166n31243
2850b33281l6346N10475N59815n47924l1050j88946m29963J040100r50233Q71280
2840E63927l88051J71282p52132P65582q24439Q14719K22346l36083Q2845P76283
$$ y = [-431424, 355540, -24040, 874086, 139837, -209094, -242848, 954462, -228228, -203867, 725808, 151932, 672826, 14126, 496049, 391489, -752182, 145955, -353899, 325914, 94100, 495882, -425342, -127080, -285243, -559702, -251811, 426654, 355429, 366298, 305657, 348829, 73796, 313167, 386819, -102151, 230747, 646153, 506280, 544305, 1009558, 372156, -102876, -157830, 1234874, -262512, 425635, 172070, 548174, -623837, -214351, 253837, -765666, 596201, 489286, 476833, -169315, 360128, 297962, -233281, -269627, 240848, 800663, 252739, 221689, 32743, -397220, 642880, -307353, 563927, 175876, 347158, -404974, 360608, -463831, 350888, 573234, 237151, 319996, 1096279]
2830A096279j16608k59601k65790q54705P74241k50004M23412r46852O8593R14540
2820E83505p56493P7465k23407K87435L98217n92296Q33824p33286Q98604r29225
2810a55657M25323K97396J6333o94624M98492M37474r91484p52846J098257m57836
2800b79172J085933r27745M96369k88501l36838M24481j88364P40055j312429
2791e86211J260541r15621O12409j315402J585185n78634p91140L23106M69973
2782F4206L10054q22968P69740L83652k16171k10497M45987j505134J160374k00097
2772A79146J13190n84797l23688R22666n43878M66479L9724O06300m10806k7065
2762D37271o77143L35801N41027n20855j94544k57873N87885Q4791k48363l92368
$$ y = [1096279, 979671, 720070, 454280, -400425, 373816, 123812, 547224, -399628, -331035, 583505, -172988, -95523, -318930, -31495, 366722, -225574, 608250, -125036, 773568, -155657, 269666, 567062, 583395, -111229, 387263, 824737, -166747, -919593, 178664, -279172, 806761, -120984, 375385, 86884, -249954, 174527, -13837, 726218, -586211, 674330, -241291, 371118, -944284, 640901, 62267, -728873, -405767, 64206, 374260, -448708, 321032, 704684, 488513, 278016, 724003, -781131, 379243, 179146, 292336, -292461, -616149, 306517, -237361, 229118, 268842, 875142, 464336, 437271, -239872, 95929, 636956, 116101, -78443, -336316, 251569, 336360, 87997, -304371]
2752c04371K62834j7042J28248k56849O19581K00199j312960L53918L32208L48893
2742C54659m34399M16962j82395l73552j10536J267709k71741j059126m6080J078531
2732F40032p51404j36470Q87053j028060M00002j68977K58433j2106n68251P47977
2722B68229J09790m76025k76024R5865K35505N55923N97732j269259J70016J79281
2712A91033k43513L27409l57125M11594q62479M78483o0828K41750L58043l57037
2702A27330K85303j036674J326919J42039L71627j204142q8089K99226m88450
2693b64911K86838P36254q93993N9497O84482q08318K00302O6781K4206o65818
2683e74680L49614N64189q02910P25197r7660N56745o40694O16937m07346p62909
$$ y = [-304371, -41537, -58579, 69669, -187180, 432401, 632600, -680360, -326442, 5766, 354659, -79740, 337222, 154827, -218725, -329261, 938448, 666707, -392419, -438499, 640032, -111372, -247842, 639211, -388849, 11153, -157824, 100609, 88503, -479748, 268229, 378019, -98006, -374030, -278165, -42660, 513263, 1110995, -158264, 11752, 191033, -52480, 274929, -82196, 329398, -533081, -54598, -115426, 126324, 484367, 127330, 412633, -624041, 702878, 844917, 1216544, 12402, -75687, 223539, -264911, 21927, 758181, -135812, -76315, 608167, -200151, 151, 66932, 91138, -574680, -225066, 339123, -463787, 261410, 163750, 720495, 79801, 696738, 289392, -473517]
2673d73517J231260q47470K07012l56244L45297L35120m61248J94837J82818j6631
2663C41234l91350M41964r8757k63757O76954n07858K68044j79946l42151K59255
2653B03632l99704O00269o48229K01127J047697k25792k13760r19351M93594o05527
2643d66044J113616q56404Q57749o86400J25927N518M73685n33044J69843m28675
2633b24229q3772O13402p57672J195563n36766J65473n50095O88607l77838O7277
2623A99950N47363q76627K96566l85779N1552K54994L36173j063k29291k62858
2613f9020j88929R06696r34397J9229O96372j445810N70376J134931j154863N16820
2603E1405k39047J889O7635L02499P92122o42450O3487l02492L38034l35041L16943
$$ y = [-473517, 757743, -89727, 117285, -238959, 106338, 441458, -19790, 175047, 357865, 341234, -50116, 391848, 293091, 29334, 706288, 198430, 466474, 286528, -55623, 203632, -196072, 404197, -244032, -42905, 1004792, 779000, 565240, -354111, 139483, -466044, 647572, -208832, 648917, -37483, 88444, 93962, 567647, 34603, 204446, -224229, -308001, 305401, -452271, 743292, 206526, 371999, -178096, 510511, 132673, 199950, 747313, -129314, 167252, -218527, -166975, 88019, 424192, 423129, 193838, -69020, -257949, 648747, -285650, -266421, 429951, -1015859, -445483, 689448, -465415, 51405, -187642, -185753, -118118, 184381, 976503, 334053, 397540, 95048, 433082, 98041, 414984]
2592D14984J2317K72160j037537P53364o33264K84021K89807m81915j46834K9960
2582b42937L86352j309772J535204l57302J0520j71294K50773K09759p02495J04915
2572b86277P42917m38847m1274j89099J89427o9821O29543l65851j05961N11776
2562E76533n55168n52299L28878N12721o31258K68815M34279k05689o03247L95663
2552c0772Q13746l44369K2134L65685j046066J6479L49992m99116R9430N18617
2542B65760j94858m74461k06098N98885J0697o47263J207814o38038k13173J75732
2532a15003l3330O81031j04381j37443o1168M27584J44829l64395n20082k40993
2522c23351L57763J74658n3030Q46528p15285K02927L18639q99409P05248m42700
$$ y = [414984, 427301, 699461, -338076, 415288, -217976, 66045, 355852, -126063, -272897, -242937, 143415, -1166357, 368847, 11545, 22065, -149229, 101544, 311303, -391192, -286277, 456640, 17793, -23481, -212580, -23153, -92974, 536569, 170718, 64757, 576533, 21365, -530934, -202056, 310665, -320593, -51778, 382501, 176812, -426435, -30772, 782974, 438605, 460739, 826424, -219642, -203163, 146829, -352287, -252857, 265760, 70902, -403559, -609657, -10772, -75, -647338, 560476, -77562, -290735, -115003, -148333, 532698, 428317, 290874, 229706, 657290, 802119, 437724, -82358, -323351, 34412, 209070, 156040, 1002568, 287283, 490210, 808849, -90560, 614688, 171988]
2512A71988J163649j471420l73681M02033N28411p94010j32465Q83189o33543
2503b55849J612063j021572L18580J96873j5776p90992k45607M5151M02669l40273
2493i4733O00165p62633n7033j27301P98499k35642N31808n52047N94533j226768
2483e31152O31028r59672O99068Q1437j083003J747131m90675O65341j043959
2474b84456m8256Q49249o23493L35811Q1908M66112r30888l13521M73078p216
2464a672K30671m59962N92673j12756L48024j48279m28035l73486L71074R2378
2454A10630K85968k64541Q785R6424r5420n81356P55287l1242K75136p95633O44380
2443D08418j35602j19609m28782Q51971j082900O73351k45915K0213N40731q04995
$$ y = [171988, 1335637, -135783, -509464, -107431, 420980, -373030, -505495, 377694, -255849, 1356214, 334642, 653222, 850095, 834319, 43327, -202280, -157129, 245540, -94733, 505432, -257201, -314234, -441535, 356964, 121322, 653130, 101083, 695616, -531152, 99876, -859796, -160728, -79291, -1162294, 584837, 94162, 759503, -284456, -332712, 516537, -106956, 228855, 310763, 776875, -154013, -467534, 5544, -1672, 228999, -230963, 361710, 248954, 596978, 448699, 20664, -352822, 18252, 110630, 396598, 132057, 140842, 237266, 141846, -439510, 315777, 284535, 559671, -235962, 408418, 272816, 153207, -275575, 576396, -506504, 166847, -79068, -58855, 481876, -323119]
2433c23119J269180m22374m65808o38726K62753P86574P9627o92943j62440l8852
2423c46128M93665K61037K10442m88765L65298m33349q39859M06944P35744j83366
2413A81663l18328m12497N02421K4237J44193J0891m407j99509j93468J95553
2403f9251l7609P81153q9038o66317K11844J6408m3599K51100N73195k90555j305869
2392f68538O08520L82308M83517r53449J015759j334708O12246r54393Q46258
2383C7520r7426k41459P00719j004285N31227k16215J447950q74065j4742m47423
2373a78199L37293j030571O99375r6618M86172m78410J60990K55626j82699Q05009
2363G77968o90743N52800n32765o02232O83446P65818q94075M02677k59367L61837
$$ y = [-323119, 946061, 523687, 57879, -580847, -318094, 468480, 548107, -144836, -307276, -346128, 147537, 408574, 619016, 130251, 495549, 62200, -777659, -370715, 365029, 181663, -136665, -549162, -46741, -22504, 121689, 132580, 128173, -71336, -264804, -69251, -106860, 674293, 585255, -81062, 130782, 147190, 103591, 354691, 927886, 637331, -668538, -60018, 322290, 805807, -147642, 868117, -466591, 145655, -808738, 37520, -59906, -301365, 399354, -604931, -73704, -289919, 1158031, 283966, 269224, -178199, 159094, -871477, -172102, -268720, 217452, -260958, -99968, 155658, -27041, 777968, 87225, 640025, 107260, -494972, 188474, 954292, 60217, 462894, 203527, 565364]
2353E65364p11035j04451J028056l24873l43092O5154Q02708j290669O75523o44729
2343b82044k22666K60881P19140m11962N6739j79080k77461Q02607n58853N93337
2333E00638p3442P759j61792n6221l81511R0545P99959n94872o09986J096976
2323F18053r93242L36479N84466K14749q10996J28638K8836J03440N14398m94333
2313B30488j80689j4633J33855K74624m98859K67891q7947L67262n74669J56591
2303G3914M91352l21367Q0242k50236k33482N41433j03908N954K28809j092834
2293e80123O8641O27873j46926q31685O27210P5905n80853N1044K91486R77267
2283E79839L7758p67104N1825n11278J257860j21332n3408j001864O04504l18468
$$ y = [565364, -145671, -250122, 777934, 453061, 109969, 175123, 977831, -312838, 362685, -282044, -504710, -243829, 475311, 63349, 120088, -58992, -336453, 466154, -92699, 500638, 427196, 434955, 273163, 216942, -164569, -74024, 725935, 131063, -478923, 618053, -375189, -38710, 545756, 760505, -50491, 78147, 106983, 210423, 724821, 230488, 49799, 35166, 169021, 443645, -55214, 212677, 124730, 491992, -82677, 73914, 565266, 243899, 324141, 73905, -159577, 381856, 277948, 283902, 512711, -580123, -511482, 116391, -30535, -862220, -235010, -159105, -739958, -688914, -397428, 579839, 617597, -149507, -97682, -608960, 648900, 527568, 474160, -527704, 76800, -241668]
2273b41668j806N20788o74700J72843M02650l65954J075239J62036o56357k80010
2263A13061l80916P56117m67617J176115j364610M03759J4345J50552p49094O25731
2253B77443l98135N5758O47141n84254R82302j090572N38182j06030k37979k08228
2243a24372L79035r0709j00852M9903k87488O75776q13092K4226O33958o12959
2233b66574R14081j010471N38501n32771Q18080p55354O03314o42903L47518o16021
2223f02600J110412n06679P2941N23235j02604n91864k6659P92066p99054K67666
2213A36860m75326J31979m01195J002217j011337J490758j050161j12637M70474
2204A81632l46067J79272O96771p28050J18734J42351r24125J634496o02056m00089
$$ y = [-241668, -243474, 277314, -397386, -224543, 178107, -187847, 887392, 1049428, 393071, 113061, -267855, 488262, 20645, 1196760, -167850, 235909, 250254, 400806, -348288, 277443, -120692, -64934, 582207, -2047, 980255, -110317, 427865, 321835, 83856, -124372, 254663, 163954, 63102, 113005, -174483, 501293, -311799, -287573, 346385, -266574, 647507, -362964, 175537, -357234, 460846, -294508, 308806, -334097, 13421, -602600, 507812, 1133, 74074, 597309, 494705, -97159, -123818, 668248, -130806, 136860, -338466, -206487, -607682, 394535, -616802, 873956, -176205, -288842, 181632, -164435, 14837, 711608, -16442, 102292, 244643, -679482, 955014, 352958, -47131]
2194d7131P35140j146391N16178j31463L56070j96925k07672M48946j37619k06522
2184a7389o7749N33332r01165l92179O44713J1168l06145P75744o17474j8858
2174c56002R20554j36890K06141N7651r97011J767974j396240l38406J42452J97420
2164F7643K31889l24549m4530J20647L84273r95261J196164m33844L54002k27118
2154C29316m79840Q87449j202345J46803O64936k78641K71748L89213o00035q711
2144A19893l47345L25310K43970M18627m01485K38128J47661n37385O46180o11750
2134B41804J56590J52793k72739L98248j83910l83326M15712m46527k93224L19796
2124A05217l83213k4313M02100k62227K03506Q45223j219510N67683N8694N1186
$$ y = [-47131, 688009, -458382, 57796, -73667, 282403, 85478, -122194, 326752, 189133, -17389, -85138, 448194, -452971, -845150, -200437, -189269, -495414, 280330, -337144, -356002, 564552, 427662, 633803, 691454, -305557, 1462417, 66177, -272229, -129777, 67643, 299532, -25017, -69547, 51100, 435373, -559888, 636276, 202432, 556434, 329316, -150524, 736925, -465420, -318617, 346319, 67678, 339426, 728639, 128604, 119893, -227452, 97858, 341828, 760455, 358970, 597098, 744759, 207374, 853554, 241804, 398394, 551187, 278448, 676696, 492786, 109460, 525172, 78645, -214579, 105217, -277996, -302309, 99791, -162436, 41070, 886293, -333217, 234466, 293160, 344346]
2114C44346k46735m07209J10694n1327l68759N78354O61743j224635N34985N8914
2104i629O79594l47000k23027J0098L33259m89027r46409Q84982M22137n28377
2094b13399K19794l68229J053238q22586j50287L46901j26315O6209R9240o43013
2084e38447O32647n80893M11845k4110k07968M12673k20598j72193P81586R25820
2074A420362j387181j12727L05491n90849L57646P0433q16401N65248l39912M5651
2064d82239P55642l06179J27450L66757j8917M51970q91059j151119J346650l16318
2054a17362P9586J82451j60288O2782O48322j308733P29732m73589J040728m87952
2044A95677o22379O65645r8872L13984p15503N92976K90624N1306m64051L66158
$$ y = [344346, 97611, -309598, -198904, -250231, -618990, -40636, 621107, -603528, -68543, -9629, 669965, 322965, 99938, 110036, 443295, -45732, -992141, -107159, 314978, -213399, 6395, -361834, 691404, -131182, -281469, 65432, -60883, 5326, 104566, -538447, 94200, -486693, -74848, -98958, -306926, 105747, -114851, -287044, 494542, 1420362, 33181, -79546, 225945, -364904, -7258, 63175, -753226, -187978, -527890, -482239, 273403, -32776, 94674, 461431, 442514, 894484, 3425, -1147694, 198956, -117362, -37776, 144675, -15613, 47169, 695491, -613242, 116490, -357099, 683629, 195677, -426702, 238943, 140071, 454055, -261448, 331528, 622152, 673458, 209407, 575565]
2034E75565J9825o95911j55143K35729L64496O4399n12332N79278j246242J074341
2024C04005j68850j4687k32381l34349P71853o3782K45885O4633p57047J64190
2014b0530r9739o6399P5950L49268l45356Q7134L25101q41741O08487k60134M30981
2003B43022k10424j68147Q26452j29812o54865M06243k24498J97424J90379K29815
1993G05589m58035n23901O01329o81459K49683J41703l8250j65141j21178J098701
1983H09041j100816M26009M62697j44480r64199N37268O41448j019559P39069
1974C86478n32453P38441j419939P07830J80769j59468l55663J300066J94303
1965A040364j155280O27964p69620L22227J23196j76711p8625L84775q60065N69983
$$ y = [575565, 595390, -100521, -255664, -19935, 344561, 408960, -103372, 475906, -770336, 304005, 135155, 120468, -111913, -446262, 325591, 261809, 507694, 572327, -184720, -20530, -120269, -186668, -110718, 238550, -106806, -19672, 305429, -536312, 72175, -187959, 243022, 32598, -135549, 690903, 561091, -93774, 312469, 87971, 285395, 475774, 705589, 247554, -276347, 324982, -356477, -106794, 34909, -3341, -168482, -289660, 809041, -291775, 134234, 596931, 452451, -511748, 25520, 666968, -352591, 386478, -145975, 592466, -827473, -119643, 61126, -98342, -454005, 846061, 1040364, -114916, 513048, -256572, 65655, 188851, 12140, -66485, 318290, -541775, 28208]
1955B8208l08225M32407m96360M69483Q377l05547K30748M47335r44579R30066
1945D91913o16631k87898K25423P32318j11035j17612l99443K55325p77325M68319
1935a36646L18588p2021P38642j485812P66709q4323k13674P74670j429112J033283
1925B10304M24982m40249M15464o24044k5744m54822R19288l77629L0148J35290
1915B12988m90123M82921p89193K2828m9400J95776N81254L29721j88497j07428
1905B00847k18698N04073j065447L86069M33390J97430q06575K30879O78548q14308
1895b73792N59366m73242K13156L72067n1155K56365l84404k59292m03239O63474
1885B19304k3937K31779J96269j105155Q60082m93386l6695O29582r25223J92503
$$ y = [28208, -280017, 152390, -343970, 125513, 133890, -171657, 59091, 506426, -438153, 491913, -124718, -412616, -187193, 545125, 434090, 316478, -82965, 172360, -604965, -136646, 181942, 109921, 848563, -637249, 129460, 45137, -168537, 606133, -822979, 210304, 635286, 195037, 610501, -13543, -39287, -494109, 425179, 47550, 77698, 212988, -277135, 205786, -583407, -560579, -609979, -414203, 167051, 496772, 308275, 200847, -17851, 486222, -579225, -193156, 240234, 437664, -368911, -138032, 540516, -273792, 285574, -187668, 25488, 397555, 346400, 602765, 218361, -40931, -444170, 219304, 195367, 427146, 623415, -481740, 378342, -115044, -151739, 477843, -447380, -254877]
1875b54877M08292K30232j30847M96689j281646J50055J481840j785538j8546
1866g04346O88562K33558L83773j253691Q40027K46374p42635L87865Q08248l33475
1856E54260j066898J137740k78522o03131K52492J12406K28503n07275K04875
1847C4450J79943l54226j61910K08523K89006p04003L96471N52003l89459M14986
1837D65784J8827r23265Q61797j092490J721103j213806K47055n75902M63913
1828b6984L98666o31261N56701L63479o60924M03968n08841M0983J06206m6671
1818d678J61701J34569m31516L86757N24828p04128K57529k21692k29638j99233
1808c25501R08164m08176R0980L24756r85762j18687K20758P70202l52735j105386
$$ y = [-254877, 153415, 383647, 252800, 749489, -532157, -382102, 1099738, -685800, -704346, -15784, 217774, 601547, -652144, 187883, 434257, -308378, 79487, 887735, 554260, -512638, 625102, 346580, -256551, -4059, 108347, 336850, -170425, 34450, 214393, -139833, -301743, -93220, 195786, -508217, -111746, 440257, 50798, 465784, 484611, -438654, 423143, -669347, 1051756, -162050, 85005, -490897, -26984, 371682, -259579, 297122, 660601, -323, 403645, -105196, -64213, 41993, -4678, 157023, 291592, -139924, 246833, 771661, 67533, 325062, 103370, -126268, -325501, 582663, 174487, 265467, 590223, -395539, -514226, -293468, 476734, 123999, -981387]
1798i81387K64192L97342O90834r46992L62200m58122R18473n57848N64053k93712
1788d0967p7644J99813J6979N55335j108522L15903J67663k36376K86216m07913
1778c29513J035152k29997n1627j78581o3512L70287j107872J051810l67088p8828
1768E0231j81664k65915K19353K56522j52539M89869l67490J4276k39344L02337
1758A25636q3557l41987R42852j286049J091008p8597P8071L6676n76904Q2312
1748a0539l15390J91710N81869K22009L86347q40681m83227L80418M83925m33610
1738A62831k60944M85685m1764m90365j06782M38459M69646q36438J061536p63542
1728A18322K99801K94003l50000j054030J045255k57903l69943l16810J106671
$$ y = [-981387, -717195, -319853, 370981, -576011, -213811, -671933, 246540, -311308, 252745, -40967, -118611, 81202, 98181, 653516, -455006, -139103, 28560, -207816, 78400, -329513, 705639, 475642, 424015, 245434, 181922, 552209, -555663, 496147, 129059, 50231, -131433, -397348, -177995, 78527, -74012, 415857, 48367, 62643, -176701, 125636, 42079, -299908, 642944, -643105, 447903, 369306, 447377, 484053, -92851, -10539, -325929, -134219, 447650, 669659, 1056006, 215325, -267902, 112516, 596441, 162831, -98113, 387572, 345808, -144557, -251339, 187120, 656766, -179672, 881864, 118322, 418123, 712126, 362126, -691904, 353351, 95448, -274495, -591305, 515366]
1719E15366q75976L92854j5016M13017k77319p39034J097684j96144j55879o21744
1709d62191O72046q69368N93509r1550M56260L02118r22072Q04475L33394n32586
1699B84035K01889r22612J93525L55379m83890J80328q0372L46677K8745m90456
1689c86752M46795l59419K84564K84725k58355M34839n92909J87780k98435o6232
1679c23399J26364J72287K65710n73678M8224O43422n02707k83980k19493P55671
1669A08421k65488M10361J1244k22197j42163j34761k31193R51046j15664K08529
1659E78135p01920O757k53921N35142L90873l58834N66744j093434M57969q4309
1649D3202J588n0250j12882n39530K90750N61977j00468M02201J28525o33510
$$ y = [515366, -360610, 32244, 17228, 430245, 152926, -586108, 511576, 315432, 159553, -462191, 209855, -659513, -66004, -157554, 298706, 600824, -321248, 483227, 816621, 284035, 485924, -436688, -243163, 112216, -371674, -191346, -271718, 74959, 103704, -386752, 60043, -299376, -14812, 269913, 11558, 446397, -146512, 41268, -257167, -323399, -197035, -24748, 240962, -332716, -284492, 358930, -143777, -427757, -647250, 108421, -157067, 253294, 264538, 42341, -99822, -234583, -465776, 485270, 369606, 578135, -123785, -117028, -370949, 164193, 555066, 196232, 762976, -330458, 127511, 43202, 44790, -5460, -118342, -657872, -367122, 194855, 94387, 496588, 625113, -8397]
1639h397j04445k86299q4737R99884l24620J05715p75823J94747N23415l82260
1629a42820j38865M2018N31709j60336L85766m83384O46458m88295o9547j34112
1619a1408R8300K23497K12964p88459N67403r9488m79533K08655P6036J209799
1609A217766r81941l46632L56343q28954O55211r0772L03937r3457j241935J202260
1599A51826j79434L10025m09190K11845l10981L69404L47817k58251j60111J7738
1589I0688j6179M78777o24499P2262L99833m83002J55813J63474o71302L92259
1579d1876P5089K321k26614l48608K19750R13511N6616l06246m55962k37619M57427
1568A07789J41245M46749p54063O68897j94645n43367J00059R57240r41421k57579
$$ y = [-8397, -112842, -399141, -483878, 516006, 191386, 297101, -478722, -283975, 239440, -142820, -281685, -239667, 292042, 131706, 517472, 34088, 680546, 192251, 122704, -11408, 86892, 310389, 523353, -265106, 302297, 202809, -276724, -68069, 7967, 1217766, 235825, -110807, 245536, -583418, 71793, -18979, 284958, 191501, -1050434, 151826, -27608, 282417, -126773, 85072, -225909, 143495, 491312, 233061, 72950, 90688, 74509, 553286, -71213, 1049, 400882, -82120, 73693, 237167, -434135, -41876, 33213, 35534, -191080, -539688, -319938, 593573, 650189, 343943, -112019, -349638, 107789, 249034, 695783, -58280, 610617, 415972, -127395, -27336, 929904, -11517, -269096]
1558b69096K55903j90302k41422J12377O18604n42256k14642M8215r0455K8283
1548d84791P42099J95398k29917K41908l8684K24201n96412L015m6351k94134
1538b83668K13792j72592n6949J73020l24400O1380O40631p28558Q98437K44526
1528F65619r48182Q01377r01430L73513N5871M33364k443p07428J175386q5215
1518H60432j235561k78287O95383N65464j193377J292257p4892l37645j39770
1509A54004n40159O30334L5176o87598k43396O17457O0602O98J75848o92510Q91095
1498D01551p94528P34879J79890o73517J65614P82230q13957m11407K26813K14667
1488A2235N28323o15733J53719k79326J032709r99642J381408r16583m4979M45833
$$ y = [-269096, -13193, -203495, -444917, -332540, 286064, -256192, -470834, -422619, -513074, -484791, 257308, 452706, 222789, 464697, 426013, 650214, 53802, 56817, 10466, -283668, -69876, -242468, -299417, -126397, -450797, -389417, 251214, -477344, 421093, 665619, -282563, 518814, -382616, -9103, 46768, 480132, 477689, -229739, 945647, 860432, -375129, -653416, 41967, 607431, -585946, 706311, 631419, 293774, 154004, -386155, 244179, 279355, -408243, -651639, -34182, 26420, 27118, 202966, -489544, 401551, -392977, 341902, 521792, -151725, 13889, 796119, -17838, -429245, -202432, 12235, 540558, -75175, 78544, -200782, 831927, -167715, 1213693, 297110, 252131, 697964]
1478F97964p07536K0283l51354L39890L12733m43208N99376n07168m4125L86801
1468C03656k850l68474J40411J77459k00623P69518r55753O22028q41918N65525
$$ y = [697964, -9572, 10711, -340643, -753, 311980, -131228, 468148, -39020, -83145, 303656, 300806, -67668, 72743, 250202, 49579, 819097, -136656, 485372, -356546, 208979]
$$ [...]
##END NTUPLES=NMR SPECTRUM
##END=
