##TITLE=abcd
##JCAMPDX= 6.0         $$ Bruker NMR JCAMP-DX V2.0
##DATA TYPE= NMR SPECTRUM
##DATA CLASS= NTUPLES
##ORIGIN= UXNMR, Bruker Analytische Messtechnik GmbH
##OWNER= root
$$ XWIN-NMR		Version 3.5
$$ Thu Jun  4 18:35:56 2026 Russian Standard Time (UT+4h)  servis@DPX200
##.OBSERVE FREQUENCY= 200.131235884673
##.OBSERVE NUCLEUS= ^1H
##.ACQUISITION MODE= SIMULTANEOUS
##.ACQUISITION SCHEME= undefined
##.AVERAGES= 32
##.DIGITISER RES= 18
##SPECTROMETER/DATA SYSTEM= spect
##.PULSE SEQUENCE= zg
##.SOLVENT NAME= CDCl3
##.SHIFT REFERENCE= (INTERNAL, CDCl3, 0, 16.4885)
##AUDIT TRAIL= $$ (NUMBER, WHEN, WHO, WHERE, WHAT)
$$ ##TITLE= Audit trail, XWIN-NMR		Version 3.5
$$ ##JCAMPDX= 5.01
$$ ##ORIGIN= Bruker BioSpin GmbH
$$ ##OWNER= servis
$$ F:\spectra/data/av/nmr/H1/1/pdata/1/auditp.txt
$$ ##AUDIT TRAIL=  $$ (NUMBER, WHEN, WHO, WHERE, WHAT)
(   1,<2026-06-04 18:29:26.26 +0400>,<servis>,<DPX200>,
      <created by zg, POWCHK disabled, PULCHK disabled
       configuration hash MD5:
       00 E9 B6 7A A2 85 ED C7 34 08 36 98 17 FE 4E 26
       data hash MD5: 32K
       D5 37 69 56 F2 5B 8F B4 CD B6 C7 25 1C EE A0 2F>)
(   2,<2026-06-04 18:35:36.67 +0400>,<servis>,<DPX200>,
      <Start of raw data processing
       efp BC_mod = 2 LB = 0.05 FT_mod = 6 PKNL = 1 PHC0 = -412.19 PHC1 = 3.101563 SI = 16K 
       data hash MD5: 16K
       21 A6 C7 BF C8 33 E6 85 7D DE 4F F4 70 98 8C E2>)
$$ ##END=
$$ 
$$ hash MD5
$$ AB B3 FF 3D 75 70 83 04 61 E3 A2 C6 D5 91 E9 87
##$RELAX= 
##$RELAX= 
##$RELAX= 
##$RELAX= 
##$RELAX= 
##$RELAX= 
##$RELAX= 
##$RELAX= 
$$ Bruker specific parameters
$$ --------------------------
##$DU= <F:\spectra>
##$EXPNO= 1
##$NAME= <H1>
##$PROCNO= 1
##$TYPE= <nmr>
##$USER= <av>
##$AMP= (0..31)
100 100 100 100 100 100 100 100 100 100 100 100 100 100 100 100 100 100 
100 100 100 100 100 100 100 100 100 100 100 100 100 100 
##$AQSEQ= 0
##$AQ_mod= 1
##$AUNM= <au_zg>
##$AUTOPOS= <>
##$BF1= 200.13
##$BF2= 200.13
##$BF3= 200.13
##$BF4= 200.13
##$BF5= 500.13
##$BF6= 500.13
##$BF7= 500.13
##$BF8= 500.13
##$BYTORDA= 1
##$CFDGTYP= 0
##$CFRGTYP= 5
##$CHEMSTR= <none>
##$CNST= (0..31)
1 1 145 1 1 1 1 1 1 1 1 1 1 1 1 1 1 1 1 1 1 1 1 1 1 1 1 1 1 1 1 1 
##$CPDPRG= <>
##$CPDPRG1= <>
##$CPDPRG2= <>
##$CPDPRG3= <>
##$CPDPRG4= <mlev>
##$CPDPRG5= <mlev>
##$CPDPRG6= <mlev>
##$CPDPRG7= <mlev>
##$CPDPRG8= <mlev>
##$CPDPRGB= <>
##$CPDPRGT= <>
##$D= (0..31)
0 2 0 0 0 0 0 0 0 0.06 0 0 0 0 0 0 0.0002 0 0 0 0 0 0 0 0 0 0 0 0 0 0 
0 
##$DATE= 1780583365
##$DBL= (0..7)
120 120 120 120 120 120 120 120 
##$DBP= (0..7)
150 150 150 150 150 150 150 150 
##$DBP07= 0
##$DBPNAM0= <>
##$DBPNAM1= <>
##$DBPNAM2= <>
##$DBPNAM3= <>
##$DBPNAM4= <>
##$DBPNAM5= <>
##$DBPNAM6= <>
##$DBPNAM7= <>
##$DBPOAL= (0..7)
0.5 0.5 0.5 0.5 0.5 0.5 0.5 0.5 
##$DBPOFFS= (0..7)
0 0 0 0 0 0 0 0 
##$DE= 6
##$DECBNUC= <off>
##$DECIM= 32
##$DECNUC= <off>
##$DECSTAT= 4
##$DIGMOD= 1
##$DIGTYP= 9
##$DL= (0..7)
0 120 120 120 120 120 120 120 
##$DP= (0..7)
150 150 150 150 150 150 150 150 
##$DP07= 0
##$DPNAME0= <>
$$ [...]
##$SUBNAM4= <"">
##$SUBNAM5= <"">
##$SUBNAM6= <"">
##$SUBNAM7= <"">
##$SUBNAM8= <"">
##$SUBNAM9= <"">
##$SW= 20.6817932712277
##$SWIBOX= (0..15)
0 0 3 0 0 0 0 0 0 0 0 0 0 0 0 0 
##$SW_h= 4139.07284768212
##$TD= 32768
##$TD0= 1
##$TE= 0
##$TE2= 300
##$TE3= 300
##$TEG= 300
##$TL= (0..7)
0 120 120 120 120 120 120 120 
##$TP= (0..7)
150 150 150 150 150 150 150 150 
##$TP07= 0
##$TPNAME0= <>
##$TPNAME1= <>
##$TPNAME2= <>
##$TPNAME3= <>
##$TPNAME4= <>
##$TPNAME5= <>
##$TPNAME6= <>
##$TPNAME7= <>
##$TPOAL= (0..7)
0.5 0.5 0.5 0.5 0.5 0.5 0.5 0.5 
##$TPOFFS= (0..7)
0 0 0 0 0 0 0 0 
##$TUNHIN= 0
##$TUNHOUT= 0
##$TUNXOUT= 0
##$USERA1= <user>
##$USERA2= <user>
##$USERA3= <user>
##$USERA4= <user>
##$USERA5= <user>
##$V9= 5
##$VALIST= <valist>
##$VCLIST= <CCCCCCCCCCCCCCC>
##$VD= 0
##$VDLIST= <DDDDDDDDDDDDDDD>
##$VPLIST= <PPPPPPPPPPPPPPP>
##$VTLIST= <TTTTTTTTTTTTTTT>
##$WBST= 1024
##$WBSW= 30
##$XGAIN= (0..3)
0 0 0 0 
##$XL= 0
##$YL= 0
##$YMAX_a= 194190
##$YMIN_a= -317268
##$ZGOPTNS= <>
##$ZL1= 120
##$ZL2= 120
##$ZL3= 120
##$ZL4= 120
##$ABSF1= 0
##$ABSF2= 0
##$ABSG= 0
##$ABSL= 0
##$ALPHA= 0
##$AQORDER= 0
##$ASSFAC= 0
##$ASSFACI= 0
##$ASSFACX= 0
##$ASSWID= 0
##$AUNMP= <proc_1d>
##$AZFE= 0.1
##$AZFW= 0.1
##$BCFW= 0
##$BC_mod= 2
##$BYTORDP= 0
##$COROFFS= 0
##$CY= 18.4799938201904
##$DATMOD= 1
##$DC= 0
##$DFILT= <>
##$DTYPP= 0
##$F1P= 9.9274215381318
##$F2P= -0.165520771350173
##$FCOR= 1
##$FTSIZE= 16384
##$FT_mod= 6
##$GAMMA= 0
##$GB= 0
##$INTBC= 1
##$INTSCL= 4.127829e-11
##$ISEN= 128
##$LB= 0.05
##$LEV0= 0
##$LPBIN= 0
##$MAXI= 10000
##$MC2= 0
##$MEAN= 0
##$ME_mod= 0
##$MI= 50
##$NCOEF= 0
##$NC_proc= -8
##$NLEV= 6
##$NOISF1= 3.799351
##$NOISF2= 2.8
##$NSP= 0
##$NTH_PI= 0
##$NZP= 0
##$OFFSET= 16.48848
##$PC= 4
##$PHC0= -412.19
##$PHC1= 3.101563
##$PH_mod= 1
##$PKNL= yes
##$PPARMOD= 0
##$PSCAL= 4
##$PSIGN= 0
##$REVERSE= no
##$SF= 200.130005582386
##$SI= 16384
##$SIGF1= 3
##$SIGF2= 2
##$SINO= 400
##$SIOLD= 16384
##$SREGLST= <1H.CDCl3>
##$SSB= 0
##$STSI= 16384
##$STSR= 0
##$SW_p= 4139.07284768211
##$SYMM= 0
##$S_DEV= 0
##$TDeff= 32768
##$TDoff= 0
##$TI= <>
##$TILT= no
##$TM1= 0
##$TM2= 0
##$TOPLEV= 0
##$USERP1= <user>
##$USERP2= <user>
##$USERP3= <user>
##$USERP4= <user>
##$USERP5= <user>
##$WDW= 1
##$XDIM= 16384
##$YMAX_p= 421606583
##$YMIN_p= -4131465
$$ End of Bruker specific parameters
$$ ---------------------------------
##NTUPLES= NMR SPECTRUM
##VAR_NAME=  FREQUENCY,     SPECTRUM/REAL,   SPECTRUM/IMAG
##SYMBOL=    X,             R,               I
##VAR_TYPE=  INDEPENDENT,   DEPENDENT,       DEPENDENT
##VAR_FORM=  AFFN,          ASDF,            ASDF
##VAR_DIM=   16384,         16384,           16384
##UNITS=     HZ,            ARBITRARY UNITS, ARBITRARY UNITS
##FACTOR=    0.252644378177508, 1,           1
##FIRST=     3299.83951724647, 0,            0
##LAST=      -839.233330435636, 0,           0
##MIN=       -839.233330435636, -4131465,    0
##MAX=       3299.83951724647, 421606583,    0
$$ Real data points
##PAGE= N=1
##DATA TABLE= (X++(R..R)), XYDATA
$$ [...]
11808i54297J343991j048757r40253Q20074J527534j380390j385282J755426k41821
11799e03775J35788j580418J365155j777186K290784P7860j532145Q5559k37123
11790a675501J879701p30739L71860m29039Q82391k09258j584969j078821J872380
11781g01995O49762o72399p48746J321448j725840R87937k22871n85578K435560
11772G37278n55039r0541j452177L18400k21950K118720l326268P73933n22849
11763b220493L123886j484108l27449P45441J834182o76208j682904M927L96536
11754b86190j82410J15162k93124j649266K301438q25442l99757M01304o4006
11745h82291k63006J375402m26831N44249j800494M5749K78897J602629K65447
$$ plain form
11808 -954297 389694 -659063 -1599316 -779242 748292 -632098 -2017380 -261954 -503775
11799 -503775 -367987 -1948405 -583250 -2360436 -69652 8208 -1523937 -1438378 -1675501
11790 -1675501 204200 -526539 -154679 -583718 298673 89415 -1495554 -2574375 -701995
11781 -701995 -52233 -724632 -1473378 -151930 -1877770 -889833 -1112704 -1698282 737278
11772 737278 182239 91698 -1360479 -1042079 -1264029 854691 -2471577 -1697644 -2220493
11763 -2220493 903393 -580715 -908164 -162723 1671459 995251 -687653 -682726 -286190
11754 -286190 -468600 -353438 -646562 -2295828 5610 -819832 -1219589 -818285 -882291
11745 -882291 -1145297 230105 -196726 347523 -1452971 -1407222 -1128325 474304 739751
11736G39751N33586j626181m48017n37869P29981o20719J258552p73585P5820
11727f68681M58384k902294L553588n55614q97305o82330O73218q505L93841M34382
11717b01316J297137l016364j39127L395017l62789r43247j843525J900077J84322
11708B70185j588632r12156J710671N27383J090071j652430N0660n38788K34632
11699h08404Q33674j165361J359832j016762Q8633q56349J034228l96286K242139
11690A315344m765953K844192j243825K269215l352349K220147O4306N67129m17593
11681d99387L9238l37125R5737l87887q9690M13408O94373j66000j281009Q13650
11671g04692q7208j05394O50302J373270k359023L58582J54541N66957n95026
$$ plain form
11736 739751 1273337 -352844 -800861 -1338730 -608749 -1229468 29084 -744501 -668681
11727 -668681 -210297 -3112591 440997 -114617 -1011922 -1694252 -1021034 -1029539 -635698 -201316
11717 -201316 1095821 -1920543 -2059670 1335347 972558 29311 -1814214 85863 270185
11708 270185 -1318447 -2230603 -519932 7451 1097522 -554908 -504248 -1043036 -808404
11699 -808404 25270 -1140091 219741 -797021 -708388 -1564737 -530509 -926795 1315344
11690 1315344 -3450609 -606417 -1850242 418973 -2933376 -713229 -648923 -81794 -499387
11681 -499387 -460149 -797274 -701537 -1089424 -1179114 -765706 -71333 -237333 -1518342 -704692
11671 -704692 -791900 -897294 -246992 1126278 -1232745 -874163 -719622 -152665 -747691
11662g47691p43058K550398j53756k458841l8557m51065J009251P50604j3766
11653b96481N50155k444108J199244N26075j607753J890607j232233J030754o91721
11644a075461o75791J977222j731346L17244l4670k07266J294058n89868k71827
11635i97705o85177J772944j2965m09245m42911J172643R89611l416357K134525
11626A05363j22139q62572L4752J008008K49291k58388j498151J304963j361183
11617a400056J001973k59353K98065q32562J683733k050696L60040m18979P26562
11608h91273K56074k096981K509978J486788j503204j510119K001807Q54584n76654
11599E31000l162716J762001j838888L281379J012324l613660M79397J588208
$$ plain form
11662 -747691 -1490749 1059649 905893 -1552948 -1591505 -2042570 -1033319 -282715 -296481
11653 -296481 253674 -2190434 -991190 -465115 -2072868 -182261 -1414494 -383740 -1075461
11644 -1075461 -1751252 225970 -1505376 -1188132 -1222802 -1430068 -136010 -725878 -997705
11635 -997705 -1682882 90062 77097 -332148 -775059 397584 1387195 -2029162 105363
11626 105363 -16776 -879348 -844596 163412 412703 154315 -1343836 -38873 -1400056
11617 -1400056 -398083 -657436 -359371 -1191933 491800 -1558896 -1198856 -1617835 -891273
11608 -891273 -635199 -2732180 -222202 1264586 -238618 -1748737 253070 1107654 531000
11599 531000 -2631716 -869715 -2708603 572776 1585100 -2028560 -1549163 39045
11591C9045l71816j048598M3819K305085o07226j936025N9479r3773J551726p73321
11581h31605N12831Q9710R1465j977305K479024k43592j390919J226718K84707
11572B41034j879752J256207l54071M82070k035516R87202K068779l222596K812915
11563C56272k76062M15604n83178j603203J171746j907227L710660j211346j531122
11554a457856J738578M77513r36322j60113p22751l75719R45260j014132J475645
11545b9897j862401J785995j206234J49658O60181K65046q47763M07252p95457
11536a473620O60489l45728J136871j218725P50536J345038j070160j073198M49485
11527h39012K248630k228238J394651r43909J275294o85175j29367k444663J766336
$$ plain form
11591 39045 -332771 -1381369 -1337550 967535 360309 -1575716 -1516237 -1610010 -58284 -831605
11581 -831605 -318774 -229064 -137599 -2114904 364120 120528 -1270391 -43673 241034
11572 241034 -1638718 -382511 -736582 -254512 -2290028 -1302826 765953 -2456643 356272
11563 356272 80210 495814 -87364 -1690567 -518821 -2426048 1284612 73266 -1457856
11554 -1457856 280722 758235 -178087 -338200 -1060951 -1436670 -491410 -1505542 -29897
11545 -29897 -1892298 -106303 -1312537 -1162879 -502698 -237652 -1085415 -678163 -1473620
11536 -1473620 -813131 -1158859 -21988 -1240713 -490177 854861 -215299 -1288497 -839012
11527 -839012 1409618 -818620 576031 -367878 907416 222241 92874 -2351789 -585453
11518e85453j48101O27928l99577K44101k318487M24280K992632m30805n66129
11509a59611j599138J351974j517696J950909j371721K670645l135795J487586
11501c22847j12225j394543K490879l89243l31504k70989p89565J857898k381414
11492a643553J375536R11773q16623j60492r66378J852957j300483L41957j179387
11483a584693K461202j243995J063910k321091N27885O99620o58025M46726j22051
11474g30512j80965K54912J118361r04408Q17851j00235O29699l127552J811704
11465d11145o2904o41627R36154l31186j249410J120438N76087q88338K71741
11456f80190k07453j21118j624760K508827r38237K038545j516452P95239j963680
$$ plain form
11518 -585453 -733554 -105626 -505203 -261102 -2579589 -2155309 837323 406518 -159611
11509 -159611 -1758749 -406775 -1924471 26438 -1345283 1325362 -1810433 -322847
11501 -322847 -435072 -1829615 661264 272021 -59483 -330472 -1120037 737861 -1643553
11492 -1643553 -268017 643756 -172867 -333359 -1299737 553220 -747263 -405306 -1584693
11483 -1584693 876509 -367486 696424 -1624667 -1096782 -397162 -1055187 -608461 -730512
11474 -730512 -911477 -656565 461796 -442612 375239 275004 904703 -2222849 -411145
11465 -411145 -474049 -1115676 -179522 -510708 -1760118 -639680 -63593 -951931 -680190
11456 -680190 -887643 -1008761 -2633521 -124694 -1062931 975614 -540838 254401 -1709279
11447a709279J897442p70658J2305J286315R32562l793076Q95778Q3421P54289
11438d10901l45555o1333P24035M41301p187k65620n21965Q38309p61360n33960
11428i04236L35378K75506L1080j293951R03155N434P89603J016581r67831j951357
11418a760638P66558P17318M92751K74253j370916O51694P50797k572799j06551
11409b157533Q38722J899230N560l265480K614938L34867l80390l17888j198568
11400a626542K768602n71371k669390K511438k271573M190237k440574p39753
11392h48926l77169m62901K072384l082825J681059K311687j951866K18825m7672
11383d87404k196133J310244R27696j08787K91500j015934J068696p86152r27164
$$ plain form
11447 -1709279 188163 -582495 -570190 716125 1648687 -2144389 -1248611 -1165190 -410901
11438 -410901 -756456 -817789 -93754 347547 340360 74740 -447225 391084 -370276 -904236
11428 -904236 -568858 -293352 -262272 -1556223 -653068 -647634 141969 1158550 190719 -1760638
11418 -1760638 -994080 -276762 215989 490242 -880674 -228980 521817 -2050982 -2157533
11409 -2157533 -1318811 580419 585979 -2679501 -64563 270304 -110086 -427974 -1626542
11400 -1626542 1142060 570689 -2098701 412737 -1858836 2331401 -109173 -848926
11392 -848926 -1226095 -1688996 383388 -2699437 -1018378 1293309 -658557 -439732 -487404
11383 -487404 -2683537 -1373293 -445597 -554384 -262884 -1278818 -210122 -996274 -1923438
11374a923438K517635k646035L103943k384341J017511L52813K45819N62746l371500
11365b524847J647652L43160O48424j196982J234020j941894J217408j187055
11357a760114L004466k235479N50764j599927R87701l69942J323754k95652J22545
11348b71884l78724j601560J449107P49990p54502o65917J632197p36472J11546
11339d66219j363330N00657Q76143m64433J760157k446683K755164p07939k132812
11330a689295J338581k94776m10270J518753k70019m36845j383143K376147r11232
11321a62099p94641J385486j123183k701262K377923J293047j230446J67308O86009
11312a01858K20433l015813K564894k12536Q01781J702733l073481n74637L91348
$$ plain form
11374 -1923438 594197 -2051838 1052105 -1332236 -314725 38088 283907 846653 -2524847
11365 -2524847 -877195 -534035 114389 -1082593 151427 -1790467 -573059 -1760114
11357 -1760114 1244352 -991127 -440363 -2040290 -1052589 -1422531 -98777 -394429 -271884
11348 -271884 -650608 -2252168 -803061 -53071 -807573 -1473490 158707 -577765 -466219
11339 -466219 -1829549 -1328892 -452749 -917182 842975 -1603708 1151456 443517 -1689295
11330 -1689295 -350714 -645490 -1055760 462993 192974 -243871 -1627014 749133 -162099
11321 -162099 -956740 428746 -694437 -3395699 -1017776 275271 -955175 -787867 -101858
11312 -101858 118575 -2897238 -332344 -544880 256901 1959634 -1113847 -1688484 -1297136
11303a297136M18589j87201N97231P39034o34953P24125n1335m08497J718237
11294A618094o65168q53758L60263J232099k297139j288832J589387k9932m26540
11285g61526Q4816R544l12427l29315Q5753j412765J205984K217299l77595k387489
11275a977721J253671Q19862k250103O410J804625K020987l114254J41827M32201
11266h62495n02810K005404m19832l30693j326891q12488J464975j083308K286715
11257D18577r46318n779l08507K27552n06248M50417J326411J203045k476914
11248f17764p8512j48970L31577m44489j379061K810676k155836l26708O95440
11239a313647K030369j573559J18874Q3008j85610r22574J624228j651902q28317
$$ plain form
11303 -1297136 -878547 -1065748 -468517 270517 -364436 359689 308354 -100143 1618094
11294 1618094 952926 99168 459431 1691530 -605609 -1894441 -305054 -334986 -761526
11285 -761526 -676710 -667166 -979593 -1308908 -1223155 -2635920 -1429936 787363 409768 -1977721
11275 -1977721 -724050 95812 -2154291 -2147881 -343256 1677731 -1436523 -1294696 -862495
11266 -862495 -1365305 640099 220267 -110426 -1437317 -2249805 -784830 -1868138 418577
11257 418577 -527741 -533520 -842027 -614475 -1120723 -670306 656105 1859150 -617764
11248 -617764 -696276 -845246 -513669 -958158 -2337219 473457 -1682379 -2009087 -1313647
11239 -1313647 716722 -856837 -737963 -654955 -840565 -1763139 -138911 -1790813 -2619130
11230b619130L372127j246806p15500q61096J874764m2117k437736K005071O25750
11221d4673R48095j448481k77523J55187p43831Q55386l22748J947418j513731
11212d44901J884462j118820j127552k92928M01320j879123J085845J023863J300558
11203H32724m299668K314029J797206q21118o89249p5609R73214K50227m81835
11194b00079O55917k908190K000756j53921R71826k239140J435063j293821K599200
11185H67611j456376K076119j912753n20276P07276j80607J371138j594140J230839
11176E88831j5327j124556n25608m20757J527122j52458K90619l59076k712540
11167b903750K969584m93317M84338j64613l07004o4350j398819J04028L110651
$$ plain form
11230 -2619130 752997 -493809 -1209309 -2070405 -195641 -237758 -2675494 -670423 -44673
11221 -44673 903422 -545059 -822582 -667395 -1411226 -555840 -878588 1068830 -444901
11212 -444901 1439561 320741 -806811 -1099739 -698419 -2577542 -1491697 -467834 832724
11203 832724 -3466944 -1152915 644291 -176827 -866076 -941685 31529 281756 -200079
11194 -200079 455838 -2452352 -451596 -605517 366309 -1872831 -437768 -1731589 867611
11185 867611 -588765 1487354 -425399 -945675 -238399 -419006 952132 -642008 588831
11176 588831 573504 -551052 -1076660 -1497417 29705 -122753 167866 -191210 -2903750
11167 -2903750 65834 -427483 56855 -107758 -414762 -479112 -1877931 -1773903 1336748
11158A336748j863507L54992j07484p0193j648696J040458J172463j135984P22807
11149a98396Q74424j145678r18960J353011n25744P21768l41429J206504j014686
11140A0814M12074j072571L93257J101609p64719q72534J954108q87562j695073
11131a420597p34454J649925J607981j526093J39935j938875J731003k51015L05382
11122d36808p44599K455720l300176Q35570n36417Q18367J70862l79077J732830
11113F16272k167916J446741o01364o12115J610137m80806j087170q95865K119988
11104e2098j328886M05856K64402N36607P58998j505850J430432Q90777k451287
11095a051049J088518q96986O2794j17185n26208J300041k08516l82336L344037
$$ plain form
11158 1336748 -526759 -171767 -279251 -349444 -1998140 -957682 214781 -921203 -198396
11149 -198396 676028 -469650 -1388610 -35599 -561343 160425 -181004 1025500 10814
11140 10814 422888 -649683 -256426 845183 80464 -792070 1162038 274476 -1420597
11131 -1420597 -2155051 -505126 1102855 -423238 -283303 -2222178 -491175 -742190 -436808
11122 -436808 -1181407 1274313 -2025863 -1190293 -1726710 -908343 -737481 -1116558 616272
11113 616272 -1551644 -104903 -706267 -1318382 291755 -189051 -1276221 -2172086 -52098
11104 -52098 -1380984 -975128 -710726 -174119 584879 -920971 509461 1400238 -1051049
11095 -1051049 37469 -859517 -796723 -913908 -1440116 -140075 -348591 -730927 2613110
11086B613110l085933K13813j23008j43954K2520K09480j556688Q41472k555972
11077c565160L692582j629229K345827j236317j413592P99220L62328R63665p54969
11068d35645l11820o29865L10320J024361q92969K044571j123546N28109n28085
11059a4569n95466J026987k32032J16627q05062j263502J148141P94632j53629
11050B2127j65571j352489K142470P75301j080005q04514j482605K378052k29963
11041B02803j207184M31467j291547J008461o39079o28027J091301r04515K536588
11032F00268j104911M59798J321347j892466k4919j574579J562834N00714K91947
11023A40033O81984k875895K67779M28139R59501M00956j122426O45154M55339
$$ plain form
11086 2613110 -472823 -259010 -382018 -525972 -503452 -293972 -1850660 -1009188 -3565160
11077 -3565160 127422 -1501807 844020 -392297 -1805889 -1006669 -644341 319324 -435645
11068 -435645 -747465 -1377330 -1067010 -42649 -935618 1108953 -14593 513516 -14569
11059 -14569 -610035 416952 184920 301547 -503515 -1767017 -618876 175756 22127
11050 22127 -143444 -1495933 646537 1421838 341833 -462681 -1945286 432766 202803
11041 202803 -1004381 -572914 -1864461 -856000 -1495079 -2123106 -1031805 -1936320 600268
11032 600268 -504643 -44845 1276502 -615964 -640883 -2215462 -652628 -151914 140033
11023 140033 822017 -2053878 -1786099 -1357960 -398459 2497 -1119929 -474775 -19436
11014a9436p29712J281153k528850R40803O76194J883011o41102k551044n91126
11005b280109J589998R76220p21845N74393j362316K90129j073743K700917l07048
10996C86596L02235j073625L93535j587405N29564J725461k215656R12170O2249
10987e64876M32976j486517K76872j44143o284j344604M513153k239945m01237
10978i64605O2149K022096k53456j036548K40810q64251J016577k705237K322453
10969a60012j363435J481907q98064k52057N38553j210540J422578J00161l33211
10960f74120L39488K87666j985370K621244q06582n96306N34101j303731K593200
10951A009590j046636M2540J65152k413655J874023j24132k79223J003086k065521
$$ plain form
11014 -19436 -749148 532005 -1996845 -1056042 -379848 1503163 862061 -1688983 -2280109
11005 -2280109 -690111 286109 -435736 138657 -1223659 -933530 -2007273 693644 386596
10996 386596 688831 -384794 8741 -1578664 -1049100 676361 -1539295 -627125 -564876
10987 -564876 -131900 -1618417 -1341545 -1485688 -1491972 -2836576 1676577 -563368 -964605
10978 -964605 -902456 1119640 866184 -170364 70446 -793805 222772 -2482465 -160012
10969 -160012 -1523447 -41540 -939604 -1191661 -653108 -1863648 -441070 -340909 -674120
10960 -674120 -334632 -46966 -2032336 588908 -217674 -813980 -279879 -1583610 1009590
10951 1009590 -37046 5494 170646 -2243009 -368986 -493118 -772341 230745 -1834776
10942a834776K423721l543J23292m1957n55748j48171j199796R23057O30365p78942
10932d62498J52992j764259J821913p60440r24449O62782P64947J124184j560750
10923i45578O33083j438413l58050M548887l061184j51418r61183P33786J489693
10914D89623j835126J143882j031375l95330K244437k226804J162013j63451M43398
10905a68733K61719M83947j728138j15271O77742K14548j732843J953679j415740
10896a569090K884848j568893k26492j762516K424439Q95078j023416j727855
10888a673897J913778q37550j64972J574533j126692r7611o33536J931448M98204
10879A383705k037685k46232m02261N07295q48221J18362j262059J459629P26778
$$ plain form
10942 -1834776 588945 585402 708694 666737 110989 -37182 -1236978 -313921 316444 -462498
10932 -462498 -309506 -2073765 -251852 -1012292 -1936741 -1273959 -509012 615172 -945578
10923 -945578 -312495 -1750908 -2108958 2439929 -621255 -772673 -1733856 -1000070 489623
10914 489623 -1345503 -201621 -1232996 -1628326 616111 -1610693 -448680 -612131 -168733
10905 -168733 92986 576933 -1151205 -1266476 -588734 -374186 -2107029 -153350 -1569090
10896 -1569090 1315758 -253135 -479627 -2242143 182296 1077374 53958 -1673897
10888 -1673897 239881 -597669 -762641 811892 -314800 -412411 -1045947 885501 1383705
10879 1383705 -653980 -900212 -1302473 -795178 -1643399 -1525037 -2787096 -1327467 -600689
10870f00689m410r06453R47936N50589n22300Q41515L38476l596630J237284K416796
10860G02114j753264J040987M14197j051037L31398L59656n52154m01352j59968
10851a069423K491028k496746P14295j166548p23441K332779j446105N27131k56063
10842a093093J35090K16983K16037p617O33841j237935J545665k058223m63403
10833b112655J849741M37145j778563M27123J452948p46225M11321j241906p0474
10824a371545Q57872Q98796J482698l358897K60668o8587j82477K272065n00839
10815B89754j57801l48568M40170m882M48970k093920J281458j34159r68030Q87425
10805c59583n04408o43831K4200M5811L446078j223966j948100N25515J242683
$$ plain form
10870 -600689 -605099 -1511552 -563616 -13027 -535327 306188 644664 -2951966 -1714682 702114
10860 702114 -1051150 -10163 404034 -647003 -315605 44051 -508103 -909455 -1069423
10851 -1069423 1421605 -1075141 -360846 -1527394 -2250835 81944 -1364161 -837030 -1093093
10842 -1093093 -958003 -741020 -524983 -532600 101241 -1136694 408971 -1649252 -2112655
10833 -2112655 -262914 174231 -1604332 -1177209 275739 -470486 -59165 -1301071 -1371545
10824 -1371545 -513673 385123 1867821 -1491076 -1230408 -1298995 -1481472 790593 289754
10815 289754 131953 -216615 223555 218673 667643 -1426277 -144819 -278978 -1247008 -359583
10805 -359583 -863991 -1507822 -1483622 -1437811 2008267 784301 -1163799 -638284 604399
10796F04399j177956j707268J682662M20681K2476j220117J448523l48143j105716
10787a380459P54192J474882j128729L06410k180337J314017J175342o14449l55278
10778f34409l11406J719562j576234M26107P58238p41081K022087j635881o30992
10769f04009j33686n36489N4730r31601K244829n24501j290830J544376j178564
10760a355745O82741P97650q24463k56714k83981L046629l714235n88813Q47232
10751a649699l98967K230130o22501O61093O06394p61160l70768k463149J650693
10742a117934p04189L79361K258925O17820j738150j84669j55074K91351j346525
10733a699084K284470j885571k74857J878686j509097r00032K343524j98138j84657
$$ plain form
10796 604399 -573557 -2280825 -598163 -177482 -155006 -1375123 73400 -274743 -1380459
10787 -1380459 -626267 848615 -280114 26296 -2154041 -840024 335318 -279131 -634409
10778 -634409 -945815 773747 -802487 -376380 381858 -359223 1662864 26983 -604009
10769 -604009 -737695 -1274184 -1219454 -2151055 93774 -430727 -1721557 -177181 -1355745
10760 -1355745 -673004 124646 -699817 -956531 -1240512 1806117 -1908118 -2496931 -1649699
10751 -1649699 -2048666 181464 -441037 220056 826450 65290 -305478 -2768627 -1117934
10742 -1117934 -1822123 -1442762 816163 1433983 -304167 -488836 -643910 -352559 -1699084
10733 -1699084 585386 -1300185 -1575042 303644 -1205453 -2105485 238039 39901 -144756
10724a44756k514430K243784K306173p74842j662637p11182J03691l9455k060943
10715c254597L354699l23014k59601n22905J181969j80696j16150q64716M62168
10706e22843k87626J531010j847422q41029L003230k351499J833873j544297L768307
10697B741704m102571o05811K438123p52131p62029n13170J2283J827779j908647
10688a624470J784856O46763p8278j692494j162480J867908m56167M72690j237642
10679a479314J450123n02954K38964l109830J340382K751237k5859k860523R38450
10670a259324O07410J255967k859445K665882m53177j05822K18447j542592M16714
10661a055940J599288J220952j122863j246214m96229M67481p62477J777257o20280
$$ plain form
10724 -144756 -2659186 -415402 1890771 1115929 -546708 -1257890 -1154199 -1193654 -3254597
10715 -3254597 100102 -222912 -482513 -1005418 176551 -4145 -120295 -985011 -522843
10706 -522843 -810469 720541 -1126881 -1967910 1035320 -1316179 517694 -1026603 2741704
10697 2741704 -1360867 -1966678 471445 -280686 -1042715 -1555885 -1543602 284177 -1624470
10688 -1624470 160386 807149 728871 -963623 -2126103 -258195 -714362 -241672 -1479314
10679 -1479314 -29191 -532145 -293181 -3403011 -2062629 688608 662749 -2197774 -1259324
10670 -1259324 -651914 604053 -2255392 410490 -42687 -148509 69938 -1472654 -1055940
10661 -1055940 543348 1764300 641437 -604777 -1101006 -633525 -1396002 381255 -239025
10652b39025m8221j250731M28325K626130j037779n37393J45185L77953j633100
10643a168656q5624M61634m08703j231018J934755N86410n8026j372148J908296
10634E66920j795453J623341j52665j035304M4921P12206q7656j082272R20277
10625b85685N48300m992q87577L82653p06476P05029j6948j206468N59893j141116
10615b053387J458188r97453J575874O65444l36404j505971O47628q35517J920011
10606E38413k020819J056495q88149N64748M29692l41223M48433k102368L629843
10597A315065j746239n34216p39807P57478L40797j437665J741040r33023R02990
10588c33580J647938q66448k906173J606027M62076p57530Q82663K49300j139008
$$ plain form
10652 -239025 -287246 -1537977 -1109652 1516478 478699 -58694 86491 464444 -1168656
10643 -1168656 -1254280 -792646 -1201349 -2432367 -497612 88798 30772 -1341376 566920
10634 566920 -1228533 394808 242143 -793161 -748240 -36034 -123690 -1205962 -285685
10625 -285685 262615 257623 -629954 -247301 -953777 -248748 -265696 -1472164 -912271 -2053387
10615 -2053387 -595199 -1592652 -16778 648666 312262 -1193709 -546081 -1381598 538413
10606 538413 -1482406 -425911 -1314060 -749312 -319620 -660843 -212410 -2314778 1315065
10597 1315065 -431174 -965390 -1705197 -947719 -606922 -2044587 -303547 -1236570 -333580
10588 -333580 1314358 447910 -2458263 -852236 -390160 -1147690 -265027 -15727 -1154735
10579a154735J82115K58852m89916q2485Q93089j085191J360430j999233K476805
10570C59731j603226Q84204J45050o54731K460938l093138q67201K355061j63611
10561a76923j497152Q28602K295656k041044k71414k50214p50448n1196J332655
10552e81478O10740L86276N85988q43629j516153R14525P08481j25323j437961
10543a298534o53597P34J748469R7406m72508l86306J238952k762855J606417
10534h81822R49355L81061j74339m26272M26538j220922J10872K139766n59480
10525G44757j447878J76773j77620P69594j208981L09269j331554K043115m24498
10516e47023j069647L52240J35677K359303j360207p84555p86182n580K299648
$$ plain form
10579 -1154735 -972620 -713768 -1203684 -1286169 -393080 -1478271 -117841 -2117074 359731
10570 359731 -1243495 -359291 -214241 -868972 1591966 -1501172 -2368373 -13312 -176923
10561 -176923 -1674075 -845473 1450183 -590861 -862275 -1112489 -1862937 -1914133 -581478
10552 -581478 29262 415538 1001526 157897 -1358256 -443731 264750 139427 -1298534
10543 -1298534 -1952131 -1951397 -202928 -105522 -578030 -964336 274616 -2488239 -881822
10534 -881822 67533 448594 274255 -152017 274521 -946401 -835529 1304237 744757
10525 744757 -703121 -526348 -703968 65626 -1143355 -834086 -2165640 -122525 -547023
10516 -547023 -1616670 -1264430 -1128753 1230550 -129657 -914212 -1700394 -1705974 593674
10507E93674j515842n08221J440692J82242j728667K25321K964153l91205q98669
10498C63478M00116j158075n24411J991648j114912m1806l90187J264489j763541
10489i73201o9436K013614q81154M26841K84673k039956O26849p00997j0866J96086
10479a127547r49129L429602k276419J223482j594305M37979K469269k247900
10471f34968J183303k298519K742843K58143k379365P64697K00571j178014J500616
10462A59307M6539R06676r86052Q66498j780964k49394J315453m9934j458277
10453a230148J432318j56521k25946n67795R87113j896088O48169J122477M15128
10444E28707k532429K061452j73734r34791l64106R76830o88939J945810p4003
$$ plain form
10507 593674 -922168 -1430389 10303 192545 -1536122 -1310801 1653352 1262147 363478
10498 363478 763594 -394481 -918892 1072756 -42156 -83962 -474149 790340 -973201
10489 -973201 -1042637 970977 89823 516664 801337 -1238619 -611770 -1312767 -1323633 -1127547
10479 -1127547 -2076676 1352926 -923493 299989 -1294316 -856337 1612932 -634968
10471 -634968 548335 -1750184 992659 1250802 -1128563 -363866 -163295 -1341309 159307
10462 159307 205846 1112522 126470 992968 -787996 -1037390 278063 228129 -1230148
10453 -1230148 202170 45649 -180297 -748092 239021 -1657067 -1008898 113579 528707
10444 528707 -2003722 57730 -116004 -1050795 -1414901 -438071 -1127010 818800 744797
10435G44797k125187m4653J596462n36700o25653J236495j240192Q45489m56765
10426f05907o8181j306008K525729n89616k72952k58029L38648j471345K213794
10417E06133J209483k459724j484929K406788j445903Q06686M76897l12871q9387
10408c86827m4819J220598l657968L253639Q65405j354558J1688J21004K20758
10399B48920j458262r1072O11883j030945J090820q48945J638263Q47781j890706
10390h82263r38320J019580K5569q9569r43218K226511j842950J180410J183733
10381I39483l109563L708284k398471Q90477j898952K809873K68591j436869j50341
10372c77488K06869j23163J70504Q69948j340042L00851M25098R88136j800437
$$ plain form
10435 744797 -1380390 -1425043 171419 -365281 -990934 245561 -994631 -149142 -605907
10426 -605907 -674088 -1980096 545633 -43983 -316935 -574964 -236316 -1707661 506133
10417 506133 1715616 -744108 -2229037 177751 -1268152 -461466 15431 -297440 -386827
10408 -386827 -431646 788952 -2869016 384623 1250028 -104530 -92842 28162 248920
10399 248920 -1209342 -1300414 -688531 -1719476 -628656 -1477601 160662 1008443 -882263
10390 -882263 -1820583 -801003 -775434 -865003 -1808221 418290 -1424660 -244250 939483
10381 939483 -2170080 1538204 -860267 30210 -1868742 941131 1209722 -227147 -377488
10372 -377488 -170619 -293782 -123278 746670 -593372 -292521 132577 1120713 -679724
10363f79724P5960J681146K82703j645908n53789J282176l96297o15889K14041
10354c55581J301011q97920q98350J160824L25240k77754J149261j469133m1207
10345c609K13511o62894R47840l69513J45248j300913j184020K012166P46197
10336E44013P4043P56820k443191J572155j168886K681359j438522R04455k927075
10327a444829J509682p36647J691295j552906k400211M183620j478673J22514
10319a06155r57427O04318J512029j632419J018339k994775M356538j707142Q39768
10310I33074l012602J509696R3944l63435j79280O64540n09140K563709l097780
10301a397274K088080k670716K611075L72067j062787R07861k195222J823682
$$ plain form
10363 -679724 -603764 1077382 1360085 -285823 -839612 442564 46267 -569622 -355581
10354 -355581 945430 47510 -850840 309984 635224 357470 1506731 37598 -3609
10345 -3609 209902 -452992 494848 125335 270583 -1030330 -2214350 -202184 544013
10336 544013 618056 1374876 -1068315 503840 -665046 2016313 577791 1482246 -1444829
10327 -1444829 64853 -671794 1019501 -533405 -2933616 1250004 -228669 -106155
10319 -106155 -1063582 -459264 1052765 -579654 438685 -2556090 1800448 93306 933074
10310 933074 -2079528 -569832 -475888 -839323 -1018603 -354063 -863203 1700506 -1397274
10301 -1397274 690806 -1979910 631165 1003232 -59555 848306 -1346916 476766
10293D76766J766128l161927j079894M35527K940611j588263j546539K119549
10285C61958j173719J299078k163679K210836k513822J959857O9052n27147J185241
10276G07655j078478j09757n52005m98158N80167J946735k438650K06125k36492
10267a472858K542556j724127j155088J425011l5212l65015m35345l06222J736720
10258B10420O45712l28531j490966n68596M64086j83402J379688N35651J545554
10249B209616j839928j369747q86903J333426R8043K71853J74238o24865Q45380
10240B11113j523474Q66519K05574J115178j067444J55474L18810m78033p0182
10231b66465j244853J518088n6581n51307j61114j218645J871049J080074j252942
$$ plain form
10293 476766 2242894 -919033 -1998927 -1563400 1377211 -211052 -1757591 361958
10285 361958 -811761 487317 -1676362 534474 -1979348 -19491 49561 -477586 707655
10276 707655 -370823 -480580 -1032585 -1530743 -950576 996159 -1442491 -1236366 -1472858
10267 -1472858 1069698 -654429 -1809517 -384506 -419718 -784733 -1220078 -1526300 210420
10258 210420 856132 527601 -963365 -1531961 -1067875 -1251277 128411 664062 2209616
10249 2209616 369688 -1000059 -1886962 -553536 -455493 -183640 -9402 -634267 211113
10240 211113 -1312361 -445842 -240268 874910 -192534 -37060 281750 -196283 -266465
10231 -266465 -1511318 6770 -49811 -601118 -762232 -1980877 -109828 970246 -282696
10222b82696j200036J086828M87540j91544P0976J44402J78981P36639l71489
10213F59601r23499j95511K425920j354088l18634p00432J436013j499338j343138
10204a813106Q04906K472188J25728j934182o95501n26099L359638k923158J353578
10195B23992M73552p56342j801651R82090J076239j267766J632554M36074q33933
10186A64809j617021J374330n26113R94735P24112r87596k073314O51732K090229
10177G95903o00117J012487L02970j465069j416551P73386J353121k527878K519690
10168G47942o23261j639881N53420O11193M31970M48188j72807k124118M10521
10159a356833K410576l492484K203857N62779N20260l227384k39926J410302N08708
$$ plain form
10222 -282696 -1482732 -395904 91636 -99908 -28932 115470 294451 1031090 659601
10213 659601 -263898 -459409 1966511 612423 293789 -406643 1029370 -469968 -1813106
10204 -1813106 -1008200 1463988 1589716 -344466 -1039967 -1566066 1793572 -1129586 223992
10195 223992 697544 -58798 -1860449 -878359 197880 -1069886 562668 998742 164809
10186 164809 -1452212 -77882 -603995 390740 1114852 127256 -1946058 -1294326 795903
10177 795903 195786 1208273 1511243 46174 -1370377 -596991 756130 -1771748 747942
10168 747942 124681 -1515200 -961780 -350587 81383 529571 356764 -1767354 -1356833
10159 -1356833 1053743 -2438741 -234884 327895 848155 -2379229 -2619155 -1208853 -700145
10150g00145K345014j591966k589204K761863j03100K90465j901147K217918O4229
10141G93927j164890J936668l992911K276019P30927l22057j903319K282703M17265
10132A054332k279352j034854L357535k652105K164292J86439j495206j054364
10124a753283J020417J902477j840232j99440n86857R94388P50543m06360j133350
10115a251697J863667r36038m69935j320116J471543j126052J361769J098904
10107F92045K01569j325208p68455K87935q32308K86666K360372j16845l015873
10098b230102R51204p67674J532554J482995r39287p73455J206387K98679j748975
10089i87674M13811j45641j544666J812195K09800O48335j551363P62828q83457
$$ plain form
10150 -700145 1644869 52903 -2536301 225562 122462 412927 -1488220 729698 793927
10141 793927 -370963 1565705 -2427206 -151187 579740 257683 -1645636 637067 1054332
10132 1054332 -1225020 -2259874 1097661 -1554444 609848 796287 -698919 -1753283
10124 -1753283 -732866 1169611 -670621 -870061 -1456918 -462530 288013 -118347 -1251697
10115 -1251697 611970 -324068 -794003 -2114119 -642576 -1768628 -406859 692045
10107 692045 893614 -431594 -1200049 -912114 -1744422 -1457756 902616 785771 -2230102
10098 -2230102 -1278898 -2046572 -514018 968977 29690 -743765 462622 761301 -987674
10089 -987674 -573863 -719504 -2264170 -451975 -242175 406160 -1145203 -382375 -1265832
10080a265832J356488J228734j160025k442706J637709J315958q56511o04495
10072g90680J24757j002492N18588J596413o36898j11635O57114Q43636k192914
10063i94111Q49793o71503q58055J003500l25421K45958k341946L950429j586430
10054g27786N63485K97698p40917q3798J468207j647296k784751L195256j83974
10045f43876J58041P67133o94951k35501k09114K083650O10239k107000q36915
10036a108294M43483Q99519k89739j330658J0357J251132O82663j528063R48508
10027b1092j465609K523852j914579k65684Q5523Q79588J487508m251786J080436
10018a861843l4871K135601N46552j205519n93064J621218j309583P52938k12019
$$ plain form
10080 -1265832 90656 1319390 159365 -2283341 -645632 670326 -186185 -790680
10072 -790680 -665923 -1668415 -1149827 446586 -190312 -301947 355167 1198803 -994111
10063 -994111 -144318 -815821 -1673876 -670376 -995797 -749839 -3091785 858644 -727786
10054 -727786 -164301 133397 -607520 -691318 776889 -870407 -3655158 -459902 -643876
10045 -643876 -485835 281298 -413653 -649154 -858268 1225382 1835621 -271379 -1108294
10036 -1108294 -664811 234708 -55031 -1385689 -1375332 -124200 558463 -969600 -21092
10027 -21092 -1486701 1037151 -877428 -1143112 -1057589 -178001 1309507 -2942279 -1861843
10018 -1861843 -1896714 238887 785439 -420080 -1013144 608074 -701509 51429 -160590
10009a60590k70849J441137l831491m1316L204669J027374j137602j175927Q65934
10000g8661j47846n36301J109638K9645j119916q88173J465922m60190J718696
9991A092814k191580J330519j604365J025518O43939N49588P6000j281321K0024
9982c38864N04878j316145J464149q61769m01684M06092J125386m13757J122050
9973A290336r47096J73527J158667k792472R55738n025N67536l44236j375135
9964a318160K382891k333194J803068r69262L64501J5701K038226k575122J119119
9955E27768j85476k0786j423182J128241l62591n55056J325341j470512j824679
9946b860932L334821q66002r79801K266089r1264K32875k566874L137888m194737
$$ plain form
10009 -160590 -431439 1009698 -2821793 -2863109 341560 1368934 231332 -944595 -78661
10000 -78661 -226507 -762808 346830 376475 -743441 -1631614 -165692 -625882 1092814
9991 1092814 -1098766 231753 -1372612 -347094 296845 846433 922433 -358888 -338864
9982 -338864 166014 -1150131 314018 -547751 -949435 -543343 582043 168286 1290336
9973 1290336 343240 516767 1675434 -1117038 -161300 -166325 401211 56975 -1318160
9964 -1318160 1064731 -1268463 534605 -434657 -70156 -54455 1983771 -591351 527768
9955 527768 342292 321506 -1101676 26565 -336026 -891082 434259 -1036253 -2860932
9946 -2860932 473889 -392113 -1371914 894175 802911 1035786 -1531088 1606800 -2587937
9937b587937n09882K857034j147689K060819k347400J504386l81155j071925Q16737
9928h07012n77797L219829j731626k421281J591644o74335O25323K376439j110155
9919D91029k082943K279649q38534M59624j966931J907576L40377j138763J403840
9910H54924l234925J264822K35940Q58586r71132r0662j43759L45248L61203r42681
9900a462436k26100J028762j041685J787392j784823K233480j601989J9534J084982
9891C7117J014707L5866l452965L075556j070878k62987k9306O0719J10529K090288
9881A608646j514964j934628Q08247J776928j160185p93954J657317k330825K406707
9872E23289k542899R14560j458358J446158N36487k1264j239600K028846k040907
$$ plain form
9937 -2587937 -3097819 -240785 -1388474 672345 -1675055 -170669 -551824 -1623749 -807012
9928 -807012 -1384809 1835020 103394 -2317887 -726243 -1400578 -775255 1601184 491029
9919 491029 -1591914 687735 -150799 308825 -1658106 249470 589847 -548916 854924
9910 854924 -2380001 -1115179 -879239 -20653 -991785 -1082447 -1226206 -880958 -519755 -1462436
9900 -1462436 -1688536 -659774 -1701459 85933 -1698890 534590 -1067399 -1047865 37117
9891 37117 1051824 1087690 -2365275 710281 -360597 -623584 -652890 -592171 -481642 1608646
9881 1608646 93682 -1840946 -1032699 744229 -415956 -1209910 447407 -1883418 523289
9872 523289 -2019610 -1105050 -2563408 -1117250 -580763 -602027 -1841627 187219 -1853688
9863a853688J593522n94214o248K192737l938187J838161L82997K87010j99584
9854b97494l10802K216270k743109q30792K278835j102909N12067J487574j671381
9845d61741O7072K58654l76898p03808j032849J444645J153485j140177J358171
9836E66554j038049J332107k726524P24442P43164Q52033j886300J824647k487039
9827b094965O39426K004660Q94431l734185J687501n11906P71522J03643l20497
9818e60370K28609q22996O40371Q44162k464275J0610R28822N01033J192800O27607
9808A126373q28088M03267l440168L581016m68360j772603J521714q6971n56329
9799e20149k64954q32451K908507k663333L023125j826499j621346L033334K77028
$$ plain form
9863 -1853688 -260166 -854380 -860628 1332109 -2606078 -767917 -384920 -97910 -297494
9854 -297494 -608296 1607974 -1135135 -1965927 312908 -790001 -277934 1209640 -461741
9845 -461741 -394669 -136015 -512913 -1216721 -2249570 -804925 348560 -791617 566554
9836 566554 -471495 860612 -1865912 -1141470 -398306 453727 -1432573 392074 -2094965
9827 -2094965 -1455539 549121 1443552 -2290633 -603132 -1115038 -343516 -239873 -560370
9818 -560370 -331761 -1154757 -514386 329776 -2134499 -2123889 -1195067 -694034 498766 1126373
9808 1126373 298285 701552 -2738616 842400 374040 -1398563 123151 36180 -520149
9799 -520149 -785103 -1617554 1290953 -1372380 1650745 -175754 -1797100 1236234 1513262
9790A513262k18748r55757J146127J320506m40158N94799J658890j059484k336862
9781A222575J495469q32402k67400j360205L26796O21708j151989m6639l11783
9772c03870L25904J63708J552778k286192j079140K020754l86036q500j439454
9763a440048J042028j751403L52476K290536L7909j730817N16348j9266J715585
9754A013348j430400o3087J120620j800474J758790Q55141k108913j82777J624109
9745G86357q55522O0407j077726L745804j775128j046639j55951q18251K483909
9736A347260j78147p83342p57743m48077J805008J097614j062469j090807j349342
9727a420045J364110o30077n37868n0389L131054k831328l54302M08235J421763
$$ plain form
9790 1513262 1294514 338757 1484884 2805390 2365232 2960031 4618921 3559437 1222575
9781 1222575 2718044 1885642 1618242 258037 584833 1206541 54552 7913 -303870
9772 -303870 22034 185742 1738520 -547672 -1626812 393942 7906 -594 -1440048
9763 -1440048 -398020 -2149423 -1796947 493589 531498 -1199319 -682971 -702237 1013348
9754 1013348 -417052 -480139 640481 -1159993 598797 1453938 -654975 -837752 786357
9745 786357 -69165 -8758 -1086484 2659320 884192 -162447 -318398 -1136649 1347260
9736 1347260 1169113 385771 -371972 -820049 984959 2082573 1020104 -70703 -1420045
9727 -1420045 -55935 -686012 -1223880 -1274269 1856785 -974543 -1328845 -920610 501153
9718E01153L71620J12547J01027J132911j668421N53126l89644O20394J832280
9709C166993l813676J326041J779055j256537J969390j249728p99930J993249
9701C114857M83422J314230l719392K423022j039653p37361L01161o1438j050741
9692A028107o24766L41173l6820L9787M03252j315856j149018Q18440O72812K59940
9682D37051o94453P13897k01873J60702n60292l36874J426242r17847Q85447j564832
9672f52832Q3320o62975J200158o10901J55018q68228J708981r46952j740423
9663b334834K399999p51482K981908k358542O56470L46807j201375K175667l603474
9654a688856Q50624J61122k57354O22593n84358R84155m52858m65389j573839
$$ plain form
9718 501153 872773 985320 1086347 2219258 550837 1103963 714319 1334713 3166993
9709 3166993 -646683 679358 2458413 1201876 3171266 1921538 1121608 3114857
9701 3114857 3598279 4912509 1193117 3616139 2576486 1839125 2140286 2078848 1028107
9692 1028107 403341 744514 707694 747481 1150733 -165123 -1314141 -495701 177111 437051
9682 437051 -257402 456495 254622 415324 -144968 -481842 944400 26553 912000 -652832
9672 -652832 -569512 -1232487 -32329 -643230 -488212 -1356440 352541 -594411 -2334834
9663 -2334834 65165 -686317 2295591 -62951 593519 940326 -261049 1914618 -1688856
9654 -1688856 -838232 -677110 -934464 -311871 -896229 87926 -364932 -830321 -2404160
9645b404160K117167J072590m90355q05939M32863l08346J83470L26139r09696
9636g86267n96211J227830j554245J139897L69163N04205p99926n01637m85639
9627a482830M92313m65174J782617l62180k116745k80636J095418K074353l44923
9618C92213j364520K65843K34237j85164j853472J581880J142923p48806j113095
9609a647961o15411J302950R1799K70114P41043M7806R48832j617938j57943R28741
9599B92032K59356Q3763j943381O22989p99479K21444J452696j448097J833205
9590E74528j509015J127095p46667n29367O2781K51562M66215L16462k220884
9581b207290L70088J736697o62637P8979J278170j473400J403268j840542R1722
$$ plain form
9645 -2404160 -286993 785597 295242 -510697 -77834 -386180 -202710 123429 -786267
9636 -786267 -1382478 -154648 -1708893 -568996 -199833 304372 -495554 -997191 -1482830
9627 -1482830 -990517 -1455691 326926 -35254 -2151999 -2432635 -1337217 737136 392213
9618 392213 -972307 -706464 -472227 -657391 -2510863 -928983 213940 -534866 -1647961
9609 -1647961 -2263372 -960422 -868623 -598509 142534 190340 1139172 -478766 -636709 292032
9599 292032 551388 635151 -1308230 -685241 -1484720 -1263276 189420 -1258677 574528
9590 574528 -934487 192608 -554059 -1083426 -1020645 -769083 -302868 13594 -2207290
9581 -2207290 -1837202 -100505 -763142 -684163 594007 -879393 523875 -1316667 -1224945
9572a224945o15215K357735j266096O481j032471K404174j615248L91153N63960
9563c0472N75747L0449j244237k205188L343967m88241M07603j887240N4150J194175
9553b49287o90584R81878j90698M68855o14331N8937n26880o26052J294200J003883
9543I09921j792051j907776L377368l12872L31218j527339J757516k645831J605265
9534b04581r92346J771436j363752J53169J181693j499977J461907p07408q60060
9525a059919J733202j520458J315282o62583p43674J40119J472335k018753k26456
9516a570905K37209J702036j709863J433302K23811k884920K110058P68135q52273
9507e43410j781070K420712j252860k19580M7259K116919l17125M27194K77604
$$ plain form
9572 -1224945 -1840160 517575 -748521 -742040 -1774511 629663 -985585 -594432 -30472
9563 -30472 545275 575724 -668513 -2873701 470266 -17975 389628 -1497612 -1443462 -249287
9553 -249287 -939871 42007 -148691 320164 -294167 -235230 -762110 -1388162 -93962 909921
9543 909921 -882130 -2789906 587462 274590 605808 -921531 835985 -1809846 -204581
9534 -204581 -1196927 574509 -789243 -636074 545619 -954358 507549 -199859 -1059919
9525 -1059919 673283 -847175 468107 -194476 -938150 -798031 674304 -1344449 -1570905
9516 -1570905 -1333696 368340 -1341523 91779 315590 -2569330 -459272 308863 -543410
9507 -543410 -2324480 96232 -1156628 -1376208 -1328949 787970 470845 898039 1175643
9498A175643K51961J599941k81987j126386j089346k92332J706320q78375k135497
9489a070058N61768j558135J898357j214843M57233L95593J471737j996343n71158
9480a625849J729821J369179k064269m41058K83631m80119K76317L2372n06385
9471a426360m35986K210636m2983j157807K40431j016453Q46112R30159p51285
9462f03536k9481j470544J833596k911021L155132N26492j021474R38700m0015
9453C77849j093422L66254m49193L77645r0711J038965j280813r36709K113828
9444D23693m55235m65617J101365N20309j227393l65136J144525j238242O27545
9435F5814n60649o8283j626030L436087k538941J300577j958134K414529N23415
$$ plain form
9498 1175643 1427604 3027545 2745558 1619172 529826 237494 1943814 1065439 -1070058
9489 -1070058 -508290 -2066425 -168068 -1382911 -925678 -530085 941652 -1054691 -1625849
9480 -1625849 103972 1473151 -591118 -1032176 -748545 -1228664 -952347 -919975 -1426360
9471 -1426360 -1862346 348290 305307 -852500 -612069 -1628522 -782410 147749 -603536
9462 -603536 -633017 -2103561 -269965 -3180986 -25854 500638 -520836 417864 377849
9453 377849 -715573 -349319 -798512 -420867 -511578 527387 -753426 -1690135 423693
9444 423693 -31542 -497159 604206 1124515 -102878 -468014 676511 -561731 65814
9435 65814 -494835 -563118 -2189148 1246939 -1292002 8575 -1949559 464970 988385
9426I88385o32900l34400r72513P92652j09031o61613l52008J846072o06195N11980
9416D70429j261497k29548l77628Q95132N56195K86247J325794l66082r04071
9407C94971l434895L131275J146454l4340n71366o12939n06086m53949N27434
9398d13441K120832k505591J882357p01798r48621L25907l26888R23794j663245
9389a306694O66757Q62417j516001M39250M87825P01J306965r03574Q33998k072463
9379a200819K062990r22981N98327L92676j410942J235868N26307j534767N13325
9370B59984O03705R75840j502988K385517M70930l156116K049867q85672K002748
9361C203815k509937K161614n55691j252418O1627N74602p89671K306911k418438
$$ plain form
9426 988385 355485 21085 -951428 -158776 -267807 -929420 -1281428 564644 -41551 470429
9416 470429 -791068 -1020616 -1398244 -503112 53083 339330 1665124 1299042 394971
9407 394971 -3039924 91351 1237805 1203465 632099 19160 -486926 -940875 -413441
9398 -413441 1707391 -798200 1084157 382359 -566262 -240355 -567243 356551 -1306694
9389 -1306694 -639937 222480 -1293521 -854271 -366446 -365745 941220 37646 871644 -1200819
9379 -1200819 862171 -60810 537517 930193 -480749 755119 1281426 -253341 259984
9370 259984 863689 1839529 336541 2722058 3192988 36872 2086739 1201067 3203815
9361 3203815 693878 2855492 2299801 1047383 1109010 1683612 893941 3200852 782414
9352G82414l90368J263456N05077j067884k542210K307563l75117j845646M385108
9343C022393k165043j445275M09644l25414J506433o64014M15833j935253J645535
9334D64839n58839j630114K308503P8487N4202j969359K144592j501058N45035
9325f3712J311231r21794j156585J662231M72542l077869J3562J829088j65187
9316i6493o345K333347j178354k640752L936512j289572j673909j3802J903437
9307A274069p29655o46790n96391K1520M68941K085097k146029L45132J418347
9298A494241J74699k809101K553209j606750K582809j449752N1794j414172L867815
9289C444792k449889J3407J468945J819065k162483j532012K856250j739161n29854
$$ plain form
9352 782414 392046 1655502 2160579 1092695 -1449515 858048 482931 -1362715 3022393
9343 3022393 857350 -587925 -178281 -503695 1002738 338724 754557 -1180696 464839
9334 464839 -94000 -1724114 584389 662876 717078 -1252281 892311 -608747 -63712
9325 -63712 1247519 325725 -830860 831371 1303913 -1773956 -1760394 68694 -96493
9316 -96493 -102838 2230509 1052155 -1588597 2347915 1058343 -615566 -629368 1274069
9307 1274069 544414 -102376 -698767 -677247 -208306 1876791 -269238 75894 1494241
9298 1494241 1668940 -1140161 1413048 -193702 2389107 939355 991149 -423023 3444792
9289 3444792 994903 1008310 2477255 4296320 2133837 601825 3458075 1718914 1189060
9280A189060R98721j153355M16179J587241J14518P63498j784655K848246P3251
9271E052704j531745J830201k415916J234003n05k165395j605891K052400j5852
9262B434004K505049m155210K803127j496062k30235q21752J060821N44343M59155
9253C103240q75365K65430J227023O89757R9050L10723k22043K30810O49546j173947
9243D304224n9870o12774K850237l184745k180361M029218j325884K71763j032133
9234C059675J807989j278947n49134K680031k380335m40544J331980p75958L332707
9225F787464j508971O51185p17476K474798j68626J77529K932765J474551l33604
9216A1769615Q61464J645787N92912k081716J562123J211105L59932J69612j652436
$$ plain form
9280 1189060 2187781 1034426 1450605 3037846 3152364 3915862 2131207 4979453 5052704
9271 5052704 3520959 5351160 2935244 4169247 4168742 2003347 397456 2449856 2434004
9262 2434004 4939053 783843 3586970 2090908 1860673 1038921 2099742 2644085 3103240
9253 3103240 2227875 2493305 3720328 4410085 4509135 4819858 4597815 4828625 5478171 4304224
9243 4304224 4244354 3631580 6481817 3297072 1116711 5145929 3820045 4091808 3059675
9234 3059675 4867664 3588717 3039583 5719614 3339279 2898735 4230715 3454757 6787464
9225 6787464 5278493 5929678 5212202 7687000 7518374 7695903 10628668 12103219 11769615
9216 11769615 12631079 14276866 14869778 12788062 14350185 15561290 15921222 16090834 14438398
9207A4438398k462379j99667j390875N91360l172853q41320k6827q60495K374092
9198H449434k052506j7741J583860M22609P18620l72517O09803L42199j020164
9189H663597q09763j178523K385542J963004l301171Q93731J366638L004256J860030
9180A4847341O947226J576169K780439K424961N25212l815196k968769l90259
9172B1927124j293397m082375J051723o72278O17573P46537J07745J432989l22100
9163A9513541q55159K001083K030496k892406l627634k239477r79986k704600
9155A0245858q6737j716951l832460K379224j87169P30786k507946P14621j059005
9146D680221J26556n4368J003815j131725P53703q21537m26481J535124m6567
$$ plain form
9207 14438398 11976019 11776352 10385477 10976837 7803984 6962664 6935837 6075342 8449434
9198 8449434 6396928 6379187 7963047 8385656 9104276 8731759 9341562 9683761 8663597
9189 8663597 7853834 6675311 9060853 11023857 7722686 8616417 9983055 12987311 14847341
9180 14847341 21794567 23370736 26151175 28576136 29101348 25286152 22317383 21927124
9172 21927124 20633727 16551352 17603075 16930797 17548370 18294907 18402652 19835641 19513541
9163 19513541 18658382 20659465 22689961 19797555 16169921 13930444 12950458 10245858
9155 10245858 10159121 8442170 4609710 6988934 6801765 7532551 5024605 5739226 4680221
9146 4680221 4806777 4752409 5756224 4624499 5378202 4556665 4130184 5665308 5618741
9137E618741J49425m45783n59306n01654O46745P51559l2556j508754R41484J918488
9127F978389j613971k027745N44930J905704m24011L84483J662592j767568J215164
9118F857967J470352j906161M24156K68127K184582j402326p01921l81568M43887
9109G257095K840198p05787j202435K376264j622228K377176k080048K520472
9101A1760707J770835J073920R50370L62530L219057M027751j146340N750173
9093B7769003M285250N885948O716818J4386704K8489531N2131890Q7217838J28733221
9085C55616203O5990380m7886072p3298036p1711480n6586760l9179224l7653309
9078I5291702k3425076j5286219j2684708m549913n126703m153293k192467m412541
$$ plain form
9137 5618741 5768166 5322383 4763077 4261423 4908168 5659727 5627171 4118417 5059901 6978389
9127 6978389 5364418 3336673 3881603 5787307 5363296 5747779 7410371 5642803 6857967
9118 6857967 8328319 6422158 6846314 7114441 9299023 7896697 7194776 6813208 7257095
9109 7257095 10097293 9391506 8189071 10565335 8943107 11320283 9240235 11760707
9101 11760707 13531542 14605462 15555832 15918362 19137419 23165170 22018830 27769003
9093 27769003 32054253 37940201 44657019 59043723 87533254 139665144 226882982 355616203
9085 355616203 421606583 373720511 300422475 228710995 172124235 132945011 95291702
9078 95291702 71866626 56580407 43895699 39345786 34219083 30065790 27873323 23460782
9070B3460782j365794k183577j612088M21398j717535q50865o33552o07896K551645
9061A7462518r58768Q68338j355354k976409K878961k464438P56841j252168O92363
9052A3651884J754890Q25735K89694J876504l88344M58538k979307j048034j086580
9043A3354980r88881p4388l02394l492838k41697O21343J35139K36863j82394
9034I065733p67198j166086K53919n09456j437137R0795J654996j076593r47635
9025E161338j000328j037961J405978L22683J109281n2294o24093k8676q89923
9016D366005J35611J848650m408638K444242k263754J526547Q03061l22350m18698
9007C710676P26480j027150o72909p16410J353742M48431k054359Q25841N59921
$$ plain form
9070 23460782 22094988 19911411 18299323 18720721 17003186 16152321 15518769 14910873 17462518
9061 17462518 16503750 17372088 16016734 13040325 15919286 13454848 14211689 12959521 13651884
9052 13651884 15406774 16232509 16522203 18398707 18010363 18468901 15489594 14441560 13354980
9043 13354980 12366099 12291711 11989317 8496479 8254782 8876125 9011264 9248127 9065733
9034 9065733 8298535 7132449 7386368 6876912 5439775 5530570 7185566 6108973 5161338
9025 5161338 4161010 3123049 4529027 4851710 5960991 5908697 5284604 5255928 4366005
9016 4366005 4501616 6350266 1941628 4385870 2122116 3648663 4451724 4129374 3710676
9007 3710676 4437156 3410006 2737097 2020687 3374429 3822860 1768501 2594342 3154263
8998C154263J202684j686842m99380N61829J461501n97047j342828J094816j019455
8989B329541m63011Q61623j365544P95906j260738J125721J728874j644388J245109
8980C353093l159444J513734P2515j781697J040054J461959j530276m21818j184421
8971f36301K332295Q5270n08097O66169j123925J707455N80903j456882q6757
8962A560130o7970Q71602j026438l70254J77851K64409L55839p18986N11055p741
8952A549497p66503j007737R30931O74365O08695j172507J053544k543190J534915
8943H62010L52176r77965N20900P52695J004793l531879K32575O11832J98951
8934B6088J203754j74759p6420k87795j836073J949864J016932l11111q07923
$$ plain form
8998 3154263 4356947 2670105 2170725 2732554 4194055 3597008 2254180 3348996 2329541
8989 2329541 1866530 2728153 1362609 2158515 897777 2023498 3752372 2107984 3353093
8980 3353093 193649 1707383 1779898 -1799 1038255 2500214 969938 548120 -636301
8971 -636301 1695994 1781264 1273167 1939336 815411 2522866 3103769 1646887 1560130
8962 1560130 1492160 2363762 1337324 967070 1144921 1409330 1765169 1046183 1557238 1549497
8952 1549497 782994 -224743 706188 1380553 1989248 816741 1870285 -672905 862010
8943 862010 1214186 236221 757121 1509816 2514609 -1017270 -784695 -172863 26088
8934 26088 1229842 1055083 978663 690868 -1145205 804659 1821591 1510480 702557
8925G02557J005766q58069k176483l12048L652662p16154j057630j487163J228193
8916a8369Q0316J484826j69992j677082n90515J055063O61845k93048N37206n80192
8906D90058l98054J971020k304009L79374k06539n93711J439160m0150q24933
8897h7784m19605P81209N08380j380493J333187P28291j458591m09898M19218
8888A3914J105488j053576J78347O67343j055215O15484j405185J016826J419203
8879A502629j315024K96269j352119J566970o50439J830023j636507l47973l97237
8870e03408K45922j460695K018519k87726R64094j018762j043680K064911j698340
8861g19165K355875j600454o51402J100631j518183J602208o23927K05690J16491
$$ plain form
8925 702557 1708323 850254 -1326229 -1638277 2014385 1298231 240601 -1246562 -18369
8916 -18369 61947 1546773 1376781 -300301 -890816 164247 826092 533044 1070250 490058
8906 490058 92004 2063024 -240985 138389 -68150 -661861 777299 737149 -87784
8897 -87784 -507389 273820 782200 -598293 734894 1463185 4594 -405304 13914
8888 13914 1119402 65826 244173 911516 -143699 471785 -933400 83426 1502629
8879 1502629 187605 483874 -868245 698725 48286 1878309 241802 -106171 -503408
8870 -503408 -257486 -1718181 300338 12612 976706 -42056 -1085736 979175 -719165
8861 -719165 1636710 36256 -615146 485485 -1032698 569510 -54417 151273 267764
8852B67764j214371J415476o80878K44576O38649j047280J090137j223591q00499
8843a310017M3062K962301j103310j313136k474611K854816R07623q57310M93829
8834B03247O26821L70208j008600O54375k113069K041525k58913p00348j508434
8825a693188L82144K214796k089849Q59134L97639M66909p37180j368388K035891
8816D67908j155845K98258j19239j6213P6831J17663K24358j311303N00509J579732
8806F62659M62414k292214J596308j51877n74201k432123P80985K212873J251691
8797A516515j365329J57291j402639P28887L03418J145285j036985j661384J332780
8788b82161j547435K964823q20859o42625o82650M22420J002372j968396J452994
$$ plain form
8852 267764 -946607 468869 -212009 32567 671216 -376064 714073 -509518 -1310017
8843 -1310017 -1266955 1695346 592036 -721100 -3195711 -340895 566728 -290582 203247
8834 203247 830068 1200276 191676 846051 -1267018 774507 515594 -184754 -1693188
8825 -1693188 -1311044 903752 -1186097 -326963 70676 537585 -199595 -1567983 467908
8816 467908 -687937 -389679 -508918 -525131 -448300 -330637 -106279 -1417582 -917073 662659
8806 662659 1125073 -1167141 429167 277290 -296911 -2729034 -1948049 264824 1516515
8797 1516515 151186 308477 -1094162 -365275 -61857 1083428 46443 -1614941 -282161
8788 -282161 -1829596 1135227 314368 -328257 -1010907 -588487 413885 -1554511 -101517
8779a01517J35472j219653N90233P24016n57320q03405O16760K79646k58349j66810
8769g60927K00970J119909m9016k06457J1021p15043R64963j252218N8116j78678
8759h07360K842476j838924o5475r10659J777740p19084j218535J879116j534372
8750e95077j47963o52315P60727o86858j204304K524520l60796J375975k585335
8741a571426K134163k90003n00819N70752p22210j460098J609666r23052M34520
8732g18507j226055M686165k239408q82639n78468J635833p20032M66127P79535
8723A202551m87878j031206K61991n34683j39711Q10308O67980j094092o44852
8714i89592L56818r5229J82009J041298k6146N76269k758170K044264P671k189095
$$ plain form
8779 -101517 33955 -1185698 -595465 128551 -428769 -1232174 -615414 -335768 -594117 -760927
8769 -760927 -559957 559952 510936 304479 315500 -399543 565420 -686798 -628682 -807360
8759 -807360 2035116 196192 130717 -779942 997798 278714 -939821 939295 -595077
8750 -595077 -743040 -1395355 -634628 -1321486 -2525790 -1270 -362066 1013909 -1571426
8741 -1571426 562737 272734 -228085 342667 -379543 -1839641 -229975 -1153027 -718507
8732 -718507 -1944562 2741603 502195 -380444 -958912 676921 -43111 423016 1202551
8723 1202551 714673 -316533 -54542 -589225 -728936 81372 749352 -344740 -989592
8714 -989592 -632774 -728003 -545994 495304 469158 1045427 -1712743 331521 339192 -1849903
8704a849903L58051J977933r80698j892111R13722K029812j473986L99237M64183
8695e3760k207409J568104J315939m69919j249744p45542K609480j106851M37977
8686I8275r37933M31007M12180K13834o86534j54474K89541n83835J342603Q18971
8676A243635j587150j091885J795896L39152k136462L886845J07090n34046q72420
8667A150655r19220j363253P35603P75816J31185j436057K138906k182292j27137
8658a095794o9742K533192J34793j324738o73732O04472q13129J96585l10483
8649h18576J917352l39766j822810P07571J188120k273663J751345q8421J999460
8640B220612m226438l63337J928357k472134K640802Q21347k187397L61244K67811
$$ plain form
8704 -1849903 -1491852 486081 -494617 -2386728 -1473006 556806 -917180 -517943 -53760
8695 -53760 -2261169 -693065 622874 152955 -1096789 -1842331 767149 -339702 98275
8686 98275 -839658 -408651 3529 217363 -469171 -623645 -334104 -917939 424664 1243635
8676 1243635 -343515 -1435400 360496 699648 -1436814 2450031 2557121 2023075 1150655
8667 1150655 231435 -1131818 -396215 379601 510786 -925271 1213635 -968657 -1095794
8658 -1095794 -1165536 1367656 1502449 177711 -496021 108451 -704678 -508093 -818576
8649 -818576 1098776 759010 -1063800 -356229 831891 -1441772 309573 221152 2220612
8640 2220612 -2005826 -2369163 -440806 -2912940 -272138 549209 -1638188 -1276944 -1009133
8631a009133J005815n07961m69211J882704l009509J145465J135720n23322J05438
8622b43994n94335N4960P12413R8324l15011K03639L82948j246126J448309l02210
8612A98917j218535N66963J860000k043627J27357J514308p58344q70037J087776
8603D64778k79491k60206J00087N53820j720469L95067K667188k213860k59040
8594e52126m36739K92912P99815N7401j348603J190396r42132K93279j379136
8585b024933J937699j618147K341842Q55605k180920K3177L27087j214079J590509
8576C7840j99185N24359K99874o58726L82432j911881J707079O54119k323821
8567a487910K773391l61437k18810l110940L009465j605406L25766m66036R85886
$$ plain form
8631 -1009133 -3318 -511279 -980490 902214 -2107295 -961830 173890 -349432 -243994
8622 -243994 -838329 -783369 -70956 27368 -287643 -84004 298944 -947182 501127 198917
8612 198917 -1019618 -452655 1407345 -636282 -508925 1005383 247039 -622998 464778
8603 464778 185287 -74919 25168 578988 -1141481 -746414 1920774 -293086 -552126
8594 -552126 -988865 -695953 103862 161263 -1187340 3056 -939076 -645797 -2024933
8585 -2024933 -87234 -1705381 636461 1492066 -688854 -665677 -338590 -1552669 37840
8576 37840 -161345 363014 662888 4162 386594 -1525287 181792 835911 -1487910
8567 -1487910 1285481 924044 705234 -2405706 603759 -1001647 -675881 -1141917 -156031
8558a56031j493835J420679p61094O02186J641402k312985n56910N12532J482874
8549C78818j179380J22050J610775k795390N35338O49474J404581k529843P20982
8540a082595l52258Q98652N7483j67662j70744J345745M04868j359570j84580
8531f10661J783001j07214m396684K922146M45302o68017p69796J225788j447965
8522a624100l55291L652904j366619j706964m55969m78877L479802k306671L73450
8513g88335q71342J05381M81993m18259J440149p50326k27929J059722p61899
8504g30845Q9867J117572j225751J21508p10520R79209j351107J015285Q14117
8495A19335r37586J955992j331181R56331j418008n03339O49957o99575J092517
$$ plain form
8558 -156031 -1649866 -229187 -990281 -388095 1253307 -1059678 -1616588 -1104056 378818
8549 378818 -800562 -678512 932263 -1863127 -1327789 -678315 726266 -1803577 -1082595
8540 -1082595 -1434853 -536201 -478718 -646380 -817124 528621 933489 -426081 -610661
8531 -610661 1172340 1065126 -3331558 -409412 35890 -632127 -1401923 -176135 -1624100
8522 -1624100 -1979391 1673513 306894 -1400070 -1856039 -2334916 1144886 -1161785 -788335
8513 -788335 -1659677 -1554296 -1072303 -1490562 -50413 -800739 -1028668 31054 -730845
8504 -730845 -640978 476594 -749157 -627649 -1338169 -358960 -1710067 -694782 119335
8495 119335 -818251 1137741 -193440 762891 -655117 -1158456 -508499 -1208074 -115557
8486a15557j154688m57084J032743O82080j904266J795716M70612m77955M90961
8477C62562j578398Q94992J034721r47495j986202K158978J547150j325712k011896
8468a851300M23287J128655K60045J743157k683453R33830n27530J125547P43143
8459A295381l89567o47964j31986M06452L61144l403135K623663Q00374k018382
8450a104020l73124R05441L28313J582788k331184J315233o88701K66292j589967
8441a688929J190129J309004l90065k672332K352630o42377J12936j352008K063525
8432B82513J18406M19204j635736j714335J884857J211622J77205j259445J479109
8423I63400j091149P58933P86927j749817P65178k95768j38576j304537J045834
$$ plain form
8486 -115557 -1270245 -1727329 -694586 -12506 -1916772 -121056 349556 -128399 362562
8477 362562 -1215836 -320844 713877 -233618 -2219820 -60842 1486308 160596 -1851300
8468 -1851300 -1428013 -299358 -39313 1703844 -979609 -45779 -573309 552238 1295381
8459 1295381 905814 257850 125864 532316 893460 -2509675 113988 914362 -1104020
8450 -1104020 -1477144 -571703 -243390 1339398 -991786 323447 -365254 -98962 -1688929
8441 -1688929 -498800 810204 420139 -2252193 100437 -541940 -429004 -1781012 282513
8432 282513 400919 820123 -815613 -2529948 -645091 566531 743736 -515709 963400
8423 963400 -127749 631184 1418111 -331706 433472 137704 -872 -1305409 -259575
8414b59575O36718j347130n01764P82157o3786J374475j286971Q11858m51586
8405c05604K3838n64869J80050O8719q99866R51463j54818k69332o64637J163305
8395d71751j418506J92530J883279L17307j34173j712912J228475o72164Q92111
8386A04196j126914J039382K61444J109178j736017j507648J073099P28335Q16615
8377G61670j125231q5715r94168J248550R3944M91327o61951k66439J303278j829364
8367a064099M42593p5963N16615n64939M7261p45502L29126M89906J46258j228048
8357a706792j04372n37688K269103q24239J280504j706393N08360J826475j946439
8348i41481J541693l60135n97126J702661k064013l90930K6287J462399K8328
$$ plain form
8414 -259575 377143 -969987 -1471751 -689594 -753380 621095 -665876 145982 -305604
8405 -305604 -281766 -846635 -666585 -597866 -1497732 -546269 -701087 -970419 -1635056 -471751
8395 -471751 -1890257 -1697727 185552 502859 368686 -1344226 -115751 -787915 104196
8386 104196 -1022718 16664 278108 1387286 -348731 -1856379 -783280 -54945 761670
8377 761670 -363561 -449276 -1443444 -194894 -100950 390377 -271574 -538013 765265 -1064099
8367 -1064099 -621506 -697469 -180854 -745793 -698532 -1444034 -1114908 -625002 -478744 -1706792
8357 -1706792 -1811164 -2348852 -79749 -903988 376516 -1329877 -821517 1004958 -941481
8348 -941481 600212 240077 -357049 1345612 -718401 -1109331 -1083044 379355 407683
8339D07683j721507J690553m15006r74133M74944J961189j372595o68042K68572
8330c48342l72944M24395L43076j541687K107704q18441K124296l447047q08634
8321b337624J244751K151847J53720j133429j593233J338813n3788O87256n77185
8312a18872J248322L54975j198153n47590J128515o30880O25357r15363J34740
8303H1051r68851n9214J084215K58325M00118p57553J713411p53690j70093J394987
8293B222706o5628j335862q587Q61520k78830J78390l47104J073098k658152M309270
8283C950821l223889J098790j84937J668427K36727n61387o51247J315975L2630
8274C681910n18251k06845j810458K016872M32203R70662j080687r15401J543140
$$ plain form
8339 407683 -1313824 376729 -38277 -1012410 -537466 1423723 51128 -616914 -348342
8330 -348342 -721286 -296891 46185 -1495502 612202 -206239 1918057 -1528990 -2337624
8321 -2337624 -1092873 1058974 1212694 79265 -1513968 -175155 -228943 458313 -118872
8312 -118872 1129450 1484425 286272 -261318 867197 236317 861674 -53689 81051
8303 81051 -887800 -947014 137201 395526 795644 38091 1751502 997812 827719 2222706
8293 2222706 2157078 821216 812629 1674149 1395319 1573709 1226605 2299703 -358449 3950821
8283 3950821 726932 1825722 1640785 3309212 3545939 2984552 2333305 3649280 3681910
8274 3681910 3163659 2956814 1146356 3163228 3595431 4566093 3485406 2570005 4113145
8265D113145k149175L63135N30968J362016P88583k506631J948640j319759J478403
8256D609325j244151j404732J471198j990k3131j700559J913346j52064J12948
8247C580190K20574r63230q29740L598591r95630j468632R01571K8069J525633
8238E597396k238895R72190J485573k097380L205752l081628J928433j387492
8230D383949K69942L26585p34324j446188J124802R12967k558432l21028J929910
8221C888183j9221p86224j497614J607072k484224P14815K199643j986118n55473
8212A080839Q2478j260929n85631K306316P81552j216954N86544O89901j292387
8203A171729K15362r59147r84226K103935p54990L51974j302726M29606r84113
$$ plain form
8265 4113145 1963970 2327105 2858073 4220089 5008672 2502041 4450681 3130922 4609325
8256 4609325 3365174 1960442 3431640 3429650 3406519 1705960 3619306 3467242 3580190
8247 3580190 3800764 2837534 2007794 5606385 4610755 3142123 4043694 4071763 5597396
8238 5597396 3358501 4330691 5816264 3718884 6924636 3843008 5771441 4383949
8230 4383949 4653891 4980476 4246152 2799964 3924766 4837733 2279301 1958273 3888183
8221 3888183 3868962 3082738 1585124 3192196 707972 1422787 3622430 1636312 1080839
8212 1080839 1163317 -97612 -683243 1623073 2404625 1187671 1774215 2464116 1171729
8203 1171729 1387091 427944 -556282 1547653 792663 1144637 -158089 271517 -712596
8194g12596l81326R59036N052087j705229q80432l162183J055713J357748J665957
8185C248775l796911J611902j80806r97354K361828O9814J4659j631078J063514
8176A764343N41210r45535j275166R2561J579015p73232r68430Q43991m51690
8167D07067L588080l629743J263303j98431K44048P87511o47128M56036j637941
8158F32802J85741J122407j243750K312468l116967j63468K793386J40078r33065
8149A729632k502691L073688O84917j128241l89844l5253J168299K278890r92610
8140C886787j977560J628980J133596k207605J473781Q52813j633905m10258J152348
8131C898977j277106J010219M19455J365392J135493M4904J52177j103265L181836
$$ plain form
8194 -712596 -1093922 -134886 4917201 3211972 2331540 -830643 225070 1582818 3248775
8185 3248775 -548136 1063766 882960 -114394 2247434 2317248 2331907 700829 1764343
8176 1764343 2305553 1360018 84852 177413 1756428 983196 14766 858757 407067
8167 407067 3995147 365404 1628707 1430276 1674324 2461835 1814707 2270743 632802
8158 632802 818543 1940950 697200 3009668 -107299 -270767 2522619 2662697 1729632
8149 1729632 -773059 2300629 2985546 1857305 1467461 1432208 2600507 4879397 3886787
8140 3886787 1909227 3538207 4671803 2464198 3937979 4790792 3156887 2746629 3898977
8131 3898977 2621871 3632090 4051545 5416937 6552430 6597334 6749511 5646246 8828082
8122H828082M50256j670428K464390j219494M27114j280000K137923Q19146j32538
8113A0824451j49703j541223K792595k177424k664115J398726Q43829M79368j234986
8104H571518L30198j559005R79298j14091J54293j943552J589866j196824j268363
8095E543338n25619M60730J215597p85719P32686j155938P63627P18564j239319
8086E727947J432367J247691M17897Q73442r47256P23988N7132K425080j842383
8077A0115905J941491J501283J021091J875563J124424K024249P90676J414198
8069B1808880K436977J638622P78549K524560l80347J540448O96997j475636j54953
8060B9414097k056485p88813k809499r04393j535409J74135l670187L59642k639445
$$ plain form
8122 8828082 9278338 7607910 10072300 8852806 9279920 7999920 10137843 10956989 10824451
8113 10824451 10674748 9133525 11926120 9748696 7084581 8483307 9327136 9806504 8571518
8104 8571518 8901716 7342711 8322009 8207918 8362211 6418659 8008525 6811701 5543338
8095 5543338 5017719 5478449 6694046 5908327 6641013 5485075 6248702 6967266 5727947
8086 5727947 7160314 8408005 8825902 9699344 8752088 9476076 9533208 11958288 10115905
8077 10115905 12057396 13558679 14579770 16455333 17579757 19604006 20394682 21808880
8069 21808880 24245857 25884479 26663028 29187588 28807241 30347689 31044686 29569050 29414097
8060 29414097 27357612 26568799 23759300 22854907 21319498 21493633 17823446 18183088 15543643
8051A5543643k731928R59277j032143j632094k24355K94396o07446O90952j964161
8042I296141k189087r541K945575m990853M39391l33312J757045j516480J381633
8033F780512j972991K41468L7712K135452m574359K386262Q90022k782954J592222
8024D733346j757162J363397j243062q95453q22651K574050J424108k849109q13360
8015A714104M77219P92198O21722k088411K22622R80976M92903M72082j878398
8006A807017L11833K391196p09904j650716R3801q06120Q97383j076929J039921
7997B297482j298831J959902l12388M33025j507848M22708J83078O54824k350359
7988D81593J401086J776543p26317j189416l074275K788263Q41634j25938j392519
$$ plain form
8051 15543643 12811715 13770992 12738849 11106755 10882400 11176796 10569350 11260302 9296141
8042 9296141 7107054 7097513 10043088 5052235 5491626 5158314 6915359 5398879 6780512
8033 6780512 4807521 5048989 5086701 7222153 2647794 5034056 5924078 3141124 4733346
8024 4733346 2976184 4339581 3096519 2201066 1378415 3952465 5376573 2527464 1714104
8015 1714104 2191323 2983521 3605243 1516832 1739454 2720430 3213333 3685415 1807017
8006 1807017 2118850 4510046 3800142 2149426 2243227 1437107 2334490 1257561 2297482
7997 2297482 998651 2958553 2646165 3079190 1571342 1994050 2177128 2831952 481593
7988 481593 1882679 3659222 2932905 1743489 -1330786 1457477 2299111 2173173 780654
7979G80654Q25192l34483J779517j411693j615734J208653P88044K65714K67600
7970B553464L40529j372259L70747k79484P23631p49688J360091j152593Q88614
7961B683052k627553J166960J172014p58418l49303n74444M8751J579991m67769
7952A873281M02539J51843j780357Q76040k597603J444725N36099p40107m86635
7943c20175J174701k07796N97324l14799O6386j418310K617084j922848Q11477
7934A083044J0085n03915l47936Q450n4505J102921j264248J813604k100705K37868
7924a5337K83718J25867j324714K921977k773877J681083q08334j271092L21603
7915h59106J526716N5576q64899J170692L129k288484K683649k78334r13588j049047
$$ plain form
7979 780654 1605846 1271363 3050880 1639187 23453 1232106 2020150 2285864 2553464
7970 2553464 2893993 1521734 1892481 1612997 2336628 1586940 2947031 1794438 2683052
7961 2683052 55499 1222459 2394473 1636055 1286752 712308 761059 2341050 1873281
7952 1873281 2275820 2427663 647306 1523346 -1074257 370468 906567 166460 -320175
7943 -320175 854526 646730 1244054 929255 995641 -422669 2194415 271567 1083044
7934 1083044 1093129 589214 241278 249728 195223 1298144 33896 1847500 -253205 -15337
7924 -15337 268381 394248 -930466 1991511 -782366 898717 90383 -1180709 -859106
7915 -859106 667610 723186 -141713 1028979 1032108 -1256376 1427273 1148939 235351 -813696
7905h13696L512847k024351k06203j176891K358080j109240n18565J733880k830967
7896a075106K953185j58209j282999J587153k808106J847158j427586R86051K219663
7887B841204k731524P98262j065845J568557k026097K411759J01632k939021J299116
7878B58043p9301k57442J567988j178332k1656M1703P7210J001173l46059J369317
7868B432644j172969O9873O26152q02805j49649J483419j294240j62102R34473
7859A964796p14976j40546J214654J984790m250823N342233k624102j283391R03748
7850B396383K32043q39417P04940P2280q73806p44636K665535r11700n60841j2616
7840B128165m60897Q1499Q1838K640110l049299R63807j095397R69848j79839
$$ plain form
7905 -813696 2699151 674800 468597 -708294 1649786 540546 21981 1755861 -1075106
7896 -1075106 1878079 1719870 436871 2024024 -784082 1063076 -364510 621541 2841204
7887 2841204 109680 907942 -157903 1410654 -615443 1796316 1897948 -1041073 258043
7878 258043 178742 -78700 1489288 310956 289300 331003 408213 1409386 1063327 2432644
7868 2432644 1259675 1329548 1955700 1152895 1003246 2486665 1192425 1030323 1964796
7859 1964796 1249820 1109274 2323928 4308718 57895 5400128 2776026 1492635 2396383
7850 2396383 2628426 1789009 2493949 2566229 1692423 947787 3613322 2701622 2140781 2128165
7840 2128165 1667268 1748767 1830605 4470715 1421416 2385223 1289826 2259674 2079835
7831B079835J106618p00960J924811n50803l139915O88658K554863j077137J69425
7822C055395L76063J21263j106373J759987l81813J65307j407642J344941q54358
7813C072770R36457J819722l843340K14795J712433q03120j003368P10051L049157
7804E865557l44771q73677j238215O67728m50646J880701j491963j0402j861112
7795B143200L630719k485829K320073k816131J224594j243931J969169k337181
7787B404683J866767r95953K544624j487769j088043m31887L55943O76465j942299
7778A902531J141476J953893k149218N6967J453813j28161O6254j079403J81502
7769C399654r68703R51458o52041r04502J925965J746295k491334n74462J919547
$$ plain form
7831 2079835 3186453 2485493 4410304 3859501 719586 1408244 3963107 2885970 3055395
7822 3055395 3431458 3552721 2446348 4206335 3824522 3989829 2582187 3927128 3072770
7813 3072770 4009227 5828949 1985609 2200404 3912837 3109717 2106349 2816400 5865557
7804 5865557 5520786 4647109 3408894 4076622 3625976 5506677 4014714 4004312 2143200
7795 2143200 5773919 3288090 5608163 2792032 4016626 2772695 4741864 2404683
7787 2404683 4271450 3275497 5820121 4332352 3244309 2812422 3168365 3844830 1902531
7778 1902531 3044007 4997900 2848682 2905649 4359462 4231301 4297555 3218152 3399654
7769 3399654 2430951 3382409 2730368 1825866 3751831 5498126 3006792 2432330 4351877
7760D351877j214544O85828k582961P38126K54295J48640J472366j699740o70267
7751A483620k13669J240443M97320j168179J256780m04227j321522k76270Q81656
7742A975952p26992J184414j533927M88607j056284J179944J67020j940148J730373
7733A468959n09300J428231q82766q9603r99992J019198R0289j642758J162947
7724A045205p25732J512631j340101J380037l073243J587344k51828J18490K25841
7715D78644N09329J480574k678184J029097O24516j433360K222156j924333p87839
7706d79400J491148J223401j53434j498741p03865J679725q01232k125563J984217
7697F16256j290258J272480O29482q63721j544314J43067J135051J558503o64305
$$ plain form
7760 4351877 3137333 3823161 1240200 1978326 2232621 2381261 3853627 2153887 1483620
7751 1483620 1269951 2510394 3007714 1839535 3096315 2692088 1370566 1094296 1975952
7742 1975952 1248960 2433374 899447 1388054 331770 1511714 1678734 -261414 1468959
7733 1468959 959659 2387890 1505124 1415521 415529 1434727 1525016 -117742 1045205
7724 1045205 319473 1832104 492003 1872040 -1201203 386141 134313 252803 478644
7715 478644 987973 2468547 -209637 819460 1443976 10616 2232772 308439 -479400
7706 -479400 1011748 2235149 2081715 582974 -120891 1558834 757602 -1367961 616256
7697 616256 -674002 598478 1227960 364239 -1180075 -1037008 98043 1656546 992241
7688I92241O65961n07062o26217O03781K00487j243941m93523j10667J584895
7679A065955p07747j176313J317465j366447J107609M97329K169381k311273j967936
7670a371977N91165K148692k019017J571002J37042k229164K998942J0803j775295
7661F2193J036607Q89507k058409p72163K31912P90209M15387j079419n32099
7652a016275L79285N20102M48048j187791K250256n70910j095327K229903l340312
7643a383021q26130L034244j170850K4317p21398J785251J45243k635928L399465
7634A651193p24136p02959J076175k130927N90700l61110N03607L60455j547123
7625a284125J730764Q78991j737242J068008k027676L070176j571413n69469R62316
$$ plain form
7688 992241 1658202 1151140 524923 1128704 1329191 85250 -408273 -518940 1065955
7679 1065955 358208 -818105 499360 -867087 240522 737851 2907232 595959 -1371977
7670 -1371977 -780812 1367880 -651137 919865 1056907 -1172257 1826685 1837488 62193
7661 62193 1098800 1988307 -70102 -842265 -610353 179856 595243 -484176 -1016275
7652 -1016275 -636990 -116888 331160 -856631 1393625 822715 -272612 1957291 -1383021
7643 -1383021 -2209151 825093 -345757 -321440 -1042838 742413 887656 -1748272 1651193
7634 1651193 927057 224098 1300273 -830654 -239954 -601064 -97457 262998 -1284125
7625 -1284125 446639 1325630 -411612 656396 -1371280 1698896 127483 -441986 520330
7616E20330j662340J513129m15324M39924j105672J336705K81893L95736m61181
7607H43200n40775k68750J484757p19374p35402j004294K92595P82763J155843
7598A290563k124460J354216k00102m82937m48162J195316J474186l077951K644433
7589A625102j488836R12399k497390K044873j114491J982121p80395r54178M33241
7580A62446J202516m90085k94886M91916r65337N24330k83916K77747j404261
7571g79530L368547l048849K256821o34067q76563o4583J922900j306344L18543
7562A156875j213851J734886j397885M04961K563948j949118O50325J617319j941896
7553A625564q05471O99438R65630j668383Q34880o77697j105468J983372j093334
$$ plain form
7616 520330 -1142010 371119 -44205 395719 -709953 626752 908645 1304381 843200
7607 843200 302425 33675 1518432 799058 63656 -940638 -648043 134720 1290563
7598 1290563 -833897 520319 320217 -162720 -610882 584434 2058620 -1019331 1625102
7589 1625102 136266 1048665 -1448725 596148 -518343 1463778 683383 -270795 162446
7580 162446 1364962 874877 579991 1071907 106570 630900 346984 624731 -779530
7571 -779530 2589017 -459832 1796989 1162922 286359 221776 2144676 838332 1156875
7562 1156875 -56976 1677910 280025 684986 3248934 1299816 1950141 3567460 1625564
7553 1625564 820093 1519531 2485161 816778 1651658 973961 -131507 1851865 758531
7544G58531P98179K03282j211338R71651k203993L480033q61012j35188J198m02914
7534A398429J18611P11722m57224o62084P70428J71239J098579k758911K623866
7525C014655k24784q86591J041311k198953R50212K16171o25877J911954o48875
7516B549223M25345J140717q67369N04141k335394J163263K211908j578118J03029
7507C316745J052312j879345N19369J016008P3239J604607K2301m13355k941586
7498B370295L703609j002310m26849q26373J294399j220998R32026K444456o11636
7489F656619j801797R11954o41950J058357l47336J980609q20233r66109K136959
7480H167073k582749K99571J626070J000324J521094j154351R50149m92786j583906
$$ plain form
7544 758531 1556710 1759992 548654 1520305 -683688 2796345 1935333 1800145 1801343 1398429
7534 1398429 1517040 2228762 1771538 1109454 1879882 2051121 3149700 390789 3014655
7525 3014655 2789871 1903280 2944591 745638 1695850 1912021 1286144 3198098 2549223
7516 2549223 2974568 4115285 3247916 3752057 1416663 2579926 4791834 3213716 3316745
7507 3316745 4369057 2489712 3009081 4025089 4098328 5702935 5725236 5311881 2370295
7498 2370295 6073904 5071594 4644745 3818372 5112771 3891773 4823799 7268255 6656619
7489 6656619 4854822 5766776 5124826 6183183 5835847 7816456 6996223 6030114 8167073
7480 8167073 5584324 5883895 7509965 8510289 10031383 8877032 9827181 9334395 7750489
7471G750489J7208l1076J215002j365270J51534J18716J393059j247675L583960
7462A1585947J65779P18600l384313L047937l710397K662665j359431q28092j34921
7453H763774P27857o54260J39737n59509M165509j853104K333822o51266j614576
7444A0797984L444387k136265k23533j416137J297401k18196j021055K630157
7436A3154743j732321n20476Q59267k881411K539597O50003j305274M19433J786386
7427A2969947j215253k755954k44078J644810m94468k99586K10982j384460K841908
7418A1273848J168036K26390j398627J336209j250488Q3457M36352j240973j687087
7409H947117O69128m37936j877231J67838P2432K385153j325989j630918J064454
$$ plain form
7471 7750489 7767697 7736621 8951623 7586353 7737887 7856603 9249662 8001987 11585947
7462 11585947 11751726 12470326 9086013 12133950 8423553 11086218 9726787 8898695 8763774
7453 8763774 9491631 8837371 8977108 8417599 12583108 10730004 13063826 12412560 10797984
7444 10797984 14242371 12106106 11882573 10466436 11763837 11545641 10524586 13154743
7436 13154743 11422422 10901946 11761213 8879802 11419399 12069402 10764128 11183561 12969947
7427 12969947 11754694 8998740 8754662 10399472 9905004 9605418 9816400 8431940 11273848
7418 11273848 12441884 12668274 11269647 12605856 11355368 11438825 11875177 10634204 8947117
7409 8947117 9616245 9178309 7301078 7468916 7541348 9926501 8600512 6969594 8034048
7400H034048Q93730n92258j213489N75139p93859o41347j060731J833249j988995
7391E045487J717388J64242J938911m999118L742209m96880r51547r09094J062674
7382F314272p96189k257005J668349J68653l500288P82289J353317J371983k66397
7373D838984k114582J166358K71598J251970k511935o62727K150921p31867p60215
7364B898505J330476N3301k155434L475045l479382J572048j474454K123422j327350
7355C016177J146827n15630n3069j020914J448268j497002n03536K34538l55195
7346A900464m62014J707980p65245J86272J638215J085521j679736k049434J327225
7337B889248n8163M72817l98848j871557J611613R38672M73072j008422P75403
$$ plain form
7400 8034048 8927778 8335520 7122031 7697170 6903311 6261964 5201233 7034482 5045487
7391 5045487 6762875 6927117 8866028 3866910 7609119 7112239 6160692 5251598 6314272
7382 6314272 5518083 3261078 4929427 5098080 1597792 2380081 3733398 5105381 4838984
7373 4838984 2724402 3890760 4162358 5414328 2902393 2239666 4390587 3658720 2898505
7364 2898505 4228981 4282282 2126848 5601893 2122511 3694559 2220105 4343527 3016177
7355 3016177 4163004 3647374 3594305 2573391 4021659 2524657 2021121 2255659 1900464
7346 1900464 1438450 3146430 2381185 2567457 4205672 5291193 3611457 1562023 2889248
7337 2889248 2831085 3303902 2905054 1033497 2645110 3583782 4056854 3048432 3823835
7328C823835L06690j709033J256635j270542Q2539n40494K401101j352811j201923
7319A795997L746J337363J095579n89924k199778J279681j080596j04348P43006
7310B280726J707468j869864j477074K547963j086246o07533Q61450K129130j454252
7301C031768k96116j569472j25649p48344K931135j606749q38509N77631K67717
7292A623412p11469J841358p50714R33493j988365K87841J70460k53155L19123
7283A471984l65337J799219j60805q72322j02173k40579O23374n8468J17116m07089
7273A804920O23144j301172p91696j68951K267225k7616j013409r8501J072131
7264B366075q7529L0460q64583N19638N76556l073914K129234j908619J935009
$$ plain form
7328 3823835 4130525 2421492 3678127 2407585 2490124 1949630 4350731 2997920 1795997
7319 1795997 1799743 3137106 4232685 3642761 1442983 2722664 1642068 1537720 2280726
7310 2280726 3988194 2118330 641256 3189219 2102973 1495440 2356890 4486020 3031768
7301 3031768 2735652 1166180 1040531 292187 3223322 1616573 778064 1355695 1623412
7292 1623412 911943 2753301 2002587 2936080 947715 1235556 1406016 1152861 1471984
7283 1471984 1106647 2905866 2745061 1872739 1770566 1529987 2153361 2094893 2212009 1804920
7273 1804920 2428064 1126892 335196 166245 2433470 2405854 1392445 1293944 2366075
7264 2366075 2278546 2309006 1444423 1964061 2540617 -533297 1595937 -312682 1622327
7255A622327M0541J443203k71528k17272k590598L720587j777901K459911p15672
7246C713598k353886P30067j322993K652407l33157N39454k343677k52363J869408
7237B898858p59207j3478j387284J815720o78969k10335R13622K80014k114859
7228G44082J565042l77905J020131l587028L141820j166820P34661K83514J774921
7219D132418k501845L66989k181747K807619n17840o04411J555095l289239L539681
7210C306720j260174j182332J255317m07862J606409l37622k209048J555215L14567
7201B641190l64492p76566j363888J102142m71990m76819J431913k207878J576429
7192A090041L10411l39842j3791q85594J012096J378527k881542O58807M37174
$$ plain form
7255 1622327 1662868 3106071 2834543 2617271 26673 3747260 1969359 4429270 3713598
7246 3713598 1359712 2089779 766786 3419193 3086036 3625490 1281813 1029450 2898858
7237 2898858 2139651 2126173 738889 2554609 1875640 1665305 2578927 2858941 744082
7228 744082 2309124 1931219 2951350 -635678 2506142 1339322 2073983 2357497 4132418
7219 4132418 1630573 1997562 -184185 2623434 2105594 1501183 3056278 -232961 3306720
7210 3306720 2046546 864214 2119531 1711669 3318078 2980456 771408 2326623 2641190
7201 2641190 2276698 1500132 136244 1238386 766396 289577 1721490 -486388 1090041
7192 1090041 1400452 1060610 1046819 161225 1173321 2551848 -329694 329113 766287
7183G66287l47830M97826J678650j739036j158413r4788K356375j896302N45294
7174F08063J289100J043789r14928j257411l31876m36769L846733k853043L57892
7165A351550K59567m34999l81388Q25992l66940p4871o94087K064297l152064
7156f02943J251583O81095J91114q72577J304606j326724O40114O55749j230883
7147F91134N87249N42765M69573j095152P356N8578j045545R40892r14329q69473
7137f26952J939465j351797L9600K2383K076282O57217l420115J327931N51612
7128A215626O73200k33684k132284p47471J334816M23037p90056k82597K259282
7119A719869J205307l434272J191472K487287r35914l771559J092065q02651L77082
$$ plain form
7183 766287 418457 916283 2594933 855897 -302516 -397304 1959071 62769 608063
7174 608063 1897163 2940952 2026024 768613 436737 -32 3846701 993658 1351550
7165 1351550 1611117 1176118 794730 1620722 1253782 1178911 484824 2549121 -602943
7156 -602943 648640 1329735 1520849 648272 1952878 626154 1266268 1922017 691134
7147 691134 1278383 1821148 2290721 1195569 1202925 1261503 215958 1156850 242521 -626952
7137 -626952 1312513 -39284 316 22699 2098981 2756198 -663917 664014 1215626
7128 1215626 1888826 1655142 -477142 -1224613 110203 533240 -256816 -539413 1719869
7119 1719869 2925176 -509096 682376 3169663 2233749 -1537810 -445745 -1248396 -871314
7110h71314J282193Q11806k659377L168269j92798p07389q32317J189845k156460
7101i67542J024185J186275k523851J890059l31991K99180j973665K627100L56587
7092A586337l218974L542504j690930j481550K482638k197202L32274K76108L94487
7083B5692j00203j75211L58236l84188J118326J003608l372714L35731K289226
7074A098503n46130K17869j340452J754443R7296J218076o19404m92737K67440
7065A654904k019590N32702O02598o39540K317419j481122j562082K68297J567095
7056A240681J282311j781212O1205O09266J45054P32200j630545R29405R1860
7047A680225r33037n78869r36160J591646K92051Q27421j266758N84188o96988
$$ plain form
7110 -871314 410879 1222685 -1436692 1731577 1538779 831390 -927 1188918 -967542
7101 -967542 56643 1242918 -1280933 609126 277135 576315 -1397350 1229750 1586337
7092 1586337 -1632637 1909867 218937 -1262613 1220025 -977177 -644903 -368795 25692
7083 25692 -74511 -249722 108514 -275674 842652 1846260 -1526454 -1190723 1098503
7074 1098503 552373 770242 -570210 1184233 1281529 2499605 1880201 1387464 1654904
7065 1654904 -364686 168016 770614 131074 2448493 967371 -594711 -326414 1240681
7056 1240681 2522992 741780 802985 1412251 1557305 2289505 658960 1588365 1680225
7047 1680225 747188 168319 -767841 823805 1115856 1943277 676519 1260707 563719
7038E63719M20285J902774j352435k35608j650684L411213j250031j907676J822509
7029A724066j23420j85297P04859j00992R94354j161447j29823k127617J225294
7020H19977Q34084n07289j195676J260699j037346J501238j191240l61655K771405
7011B894197n20014N90184m049470K084772M01117K86425q46992j54363j332269
7002f46413J763352n2318j345471P83338J024094R55164o75245N4527j168685
6993F92343J01048l6123l18210M30868j211369j110850J928123J923970j129381
6984A270419j059246j748290J970376j398114K991140r06788J861044k889408
6976I1133K10665J75740J011455j14219r79515J587572q20665O70067q398k076001
$$ plain form
7038 563719 984004 2886778 1534343 1298735 -351949 3059264 1809233 -98443 1724066
7029 1724066 1600646 1415349 2120208 2019216 3013570 1852123 1722300 -405317 819977
7020 819977 1654061 1146772 -48904 1211795 174449 1675687 484447 122792 2894197
7011 2894197 2374183 2964367 -1085103 999669 1400786 1687211 840219 685856 -646413
7002 -646413 1116939 1064621 -280850 502488 1526582 2481746 1806501 1861028 692343
6993 692343 793391 757268 439058 869926 -341443 -1452293 475830 2399800 1270419
6984 1270419 211173 -1537117 433259 -964855 2026285 1119497 2980541 91133
6976 91133 301798 477538 1488993 1374774 395259 1982831 1162166 1832233 1823835 -252166
6966b52166J525716j532941m12206J850123L68255M841k480354J148825J629208
6957A849301M64849N40028k589344M83766J745174k843701J533089N56991j207911
6948E32242K91484L63850P95529l000650K155891J07445j530109K063952n0253
6939A729381j892895J050204N5021Q54205j012642R36068l00562j085870J873603
6930B206513k357501J609280M12666O26135q12788j030510J168140j17210K71765
6921A976490J509908j276738Q42271J484667j758566Q27642p88706P42351j66125
6912C393194J195040p15811j436088l04841K196405j437933P25518j50519K48479
6903C713444l05101J180725j928611n287K396467k85791j968529J125604M1987
$$ plain form
6966 -252166 1273550 -259391 -671597 1178526 1546781 1551622 -928732 220093 1849301
6957 1849301 2314150 2854178 264834 748600 2493774 -349927 1183162 1740153 532242
6948 532242 823726 1187576 1983105 -1017545 1138346 1245791 -284318 1779634 1729381
6939 1729381 -163514 886690 941711 1795916 783274 1719342 1418780 332910 2206513
6930 2206513 -150988 1458292 1870958 2497093 1684305 653795 1821935 1704725 1976490
6921 1976490 3486398 2209660 3051931 4536598 2778032 3605674 2816968 3559319 3393194
6912 3393194 4588234 3872423 2436335 2131494 4327899 2889966 3615484 3464965 3713444
6903 3713444 3408343 4589068 2660457 2655170 5051637 4765846 2797317 3922921 3964908
6894C964908N50656j265201k76092M62580P89417J486j794233J444941K023172
6885E901634j913204O38278J094848j099129M40174r61103P61885j964462K057028
6876D955949o63760p33724O77199k49252k430723J661220o68131J245173o53362
6867C140589n73215K45207J610820J336194j088181Q16808J246523K131970n79474
6858H287241J1381O15094K722002L82574k723159J62556p07720r4285r48373j702432
6848F004879n40674j02446o00610R31420j319594m89783n37846k55033J241501
6839D331814o93351L12393M14352o61430Q05558N30140O75115J096543P28692
6830G539826L30063P06017L365202m27733M91718r61604J066759k919990p11993
$$ plain form
6894 3964908 4515564 3250363 2974271 3436851 4226268 4227754 2433521 3878462 5901634
6885 5901634 3988430 4626708 5721556 4622427 5062601 4101498 4863383 2898921 4955949
6876 4955949 4292189 3558465 4235664 3986412 1555689 3216909 2548778 3793951 3140589
6867 3140589 2567374 2812581 4423401 5759595 4671414 5488222 6734745 8866715 8287241
6858 8287241 8298622 8913716 11635718 12018292 9295133 9457689 8749969 8655684 7707311 6004879
6848 6004879 5464205 5361759 4761149 5692569 4372975 3883192 3345346 3090313 4331814
6839 4331814 3638463 3950856 4365208 3703778 4509336 5039476 5714591 6811134 7539826
6830 7539826 7869889 8575906 11941108 11513375 12005093 11043489 12110248 9190258 8478265
6821H478265j271165o12005k004222l79033m01871J408502J59550j154321O01146
6812D824846r16867L009901j714056N56076r94446m87371J73977j452581K573667
6803E573146j18355M67081q2441J167855n91147P66509Q9081j826570K02197p45930
6793D901426N80360L3290q94017Q92631p92899N38335j799503P02885J992057
6784F154565j450827P49995k437424j185991J740234R27288L90183k283256P42069
6775C346836n01312N94878J076376j015052j128690K335736k734863J196642J192343
6766D362894L35192p72430L61141l09442j331811J305926J334180k551270j478822
6757A255558J502847m71582J359763q77004M98639j376699J385750n61082j40139
$$ plain form
6821 8478265 7207100 6595095 4590873 4211840 3809969 5218471 5378021 4223700 4824846
6812 4824846 3907979 6917880 5203824 5759900 4765454 4278083 4452060 2999479 5573146
6803 5573146 5454791 5921872 5839431 7007286 6416139 7182648 7271729 5445159 5647356 4901426
6793 4901426 5481786 5515076 4621059 5513690 4720791 5259126 3459623 4162508 6154565
6784 6154565 4703738 5453733 3016309 1830318 3570552 4497840 4888023 2604767 3346836
6775 3346836 2845524 3440402 4516778 3501726 2373036 4708772 1973909 3170551 4362894
6766 4362894 4698086 3925656 4286797 3977355 2645544 3951470 5285650 2734380 1255558
6757 1255558 2758405 2286823 3646586 2769582 3268221 1891522 3277272 2716190 2576051
6748B576051P69475P96739j332110q45671J266095n20308J094283p31563N05176
6739C578167K94554j44936n55387J485848j476543n1298j189465J825372k36134
6730C530178n75670o41720l90641K001949j099719M50840L99930l02952j96274
6721C175921p26753J781174K13835n69900o47297l38869J723978j185848j644993
6712A781248J284443K353614j235541j10122P49291r12040R7994J437175q47561
6703D598501j714311K861491n11190j242333j736714O09751J943575p1193j418455
6694C319122j488956J543972K929066p96828m96819j70468O00716r4588N87850
6685E933067j380004J484336P37450o38988J965549p0472Q38248p51274j755877
$$ plain form
6748 2576051 3345526 4142265 2810155 1964484 3230579 2710271 3804554 3072991 3578167
6739 3578167 3872721 3727785 3172398 4658246 3181703 3130405 1940940 3766312 3530178
6730 3530178 2954508 2312788 1922147 3924096 2824377 3275217 3675147 3372195 3175921
6721 3175921 2449168 4230342 4444177 3874277 3226980 2888111 4612089 3426241 1781248
6712 1781248 3065691 5419305 4183764 4073642 4822933 3910893 4008887 5446062 4598501
6703 4598501 2884190 5745681 5234491 3992158 2255444 2865195 4808770 4737577 3319122
6694 3319122 1830166 3374138 6303204 5506376 5009557 4839089 5439805 5345217 5933067
6685 5933067 4553063 6037399 6774849 6135861 8101410 8030938 8869186 8117912 6362035
6676F362035J170890k707377J272323Q85068j164609J270604k671209L165742
6668G583467j878242r49970L154860j918366J592287K025806k080095K202529
6660I732276j46455J017117k730503L06960R61651k562391J036611J261054K393818
6651A1270138l70582l59403k218912P66568j96331J171513l827183K647888p46486
6642H137210K571440L60767l761336L77514O20563K186557l5518j080193L305870
6633A2682874j947061J243170K89581m236992J862101J149312q96153k037856
6625H108976P92232K011898k237252J725193k9515j068795L32502J441470k403727
6616H672982J395527k60003N1610k11499k65160K41032N71298l97810l06501O19599
$$ plain form
6676 6362035 7532925 4825548 6097871 6982939 5818330 7088934 4417725 7583467
6668 7583467 5705225 4755255 7910115 5991749 7584036 9609842 7529747 9732276
6660 9732276 9585821 10602938 7872435 8179395 9141046 6578655 7615266 8876320 11270138
6651 11270138 10899556 10540153 8321241 9087809 8891478 10062991 6235808 8883696 8137210
6642 8137210 10708650 11069417 7308081 7685595 8306158 10492715 10457197 9377004 12682874
6633 12682874 10735813 11978983 12268564 8031572 9893673 11042985 10146832 8108976
6625 8108976 8901208 10913106 8675854 10401047 10371532 9302737 9635239 11076709 8672982
6616 8672982 10068509 9808506 9860116 9648617 9383457 9624489 10195787 9797977 9491476 10111075
6606A0111075K261674N70969j229526m09375O9306j326603N67950L13574j286175
6597I642869L19951p33907q82191R88861K139226n66373q32806K11465J035954
6588A1323049J18974j351033J258840n30422O37276k53196j887325J166697P4659
6579A0557519J452088N04475j125141N35331j240167J000496J36629l89294J135540
6570A2567476K32596j717267j42637Q55945j4613O58949O72202M56907j011369
6561A2558189o47817P64045J536194j103144N00653j398105J289186K500278k097955
6552A3901524J476832N23854J650139j471714N82079N5871l17056Q13515l1290
6543A7183754O38033p92523K585427r77472N91359n38693J314702J009402J50661
$$ plain form
6606 10111075 12372749 12943718 11714192 11304817 11374123 10047520 10615470 10929044 9642869
6597 9642869 9962820 9228913 8346722 9335583 11474809 10908436 10075630 10287095 11323049
6588 11323049 11442023 10090990 11349830 10819408 11456684 11203488 9316163 10482860 10557519
6579 10557519 12009607 12514082 11388941 11924272 10684105 11684601 11821230 11431936 12567476
6570 12567476 12800072 11082805 10940168 11796113 11781500 12440449 13112651 13569558 12558189
6561 12558189 11910372 12674417 14210611 13107467 13608120 12210015 13499201 15999479 13901524
6552 13901524 15378356 15902210 17552349 16080635 16662714 16718585 16401529 17215044 17183754
6543 17183754 17821787 17029264 19614691 18637219 19228578 18689885 20004587 21013989 21164650
6534B1164650m68867P39468j395408J771168R47306j888790J243286J246842j919483
6525B1440172J647492m77228L833524k710369L36999J529950q53950K825160J53702
6516B7725452p7840K909612k520307J723357j452625N57634Q64134p83592k226
6507B8943599K611480k406491L782652o79457J797897J310640k86140K517888
6499C7592068k13757R4044m06528P9993p36538K55803j055456O22387J086341
6490C7318357K26141j296217R77295J319146J238880J417561J022087j121156
6482D1102094L922006n12463l124263n74366L80236j924032j606665K612964j424527
6473C8850984M79927J556360M87417J303311K770091K683873M66166l183261J191932
$$ plain form
6534 21164650 20695783 21435251 20039843 21811011 22758317 20869527 22112813 23359655 21440172
6525 21440172 23087664 22610436 26443960 23733591 24070590 25600540 24746590 27571750 27725452
6516 27725452 27647612 30557224 28036917 29760274 28307649 28865283 29729417 28945825 28943599
6507 28943599 31555079 29148588 32931240 32251783 34049680 35360320 35074180 37592068
6499 37592068 37378311 37472355 37065827 37145820 36409282 36665085 35609629 36232016 37318357
6490 37318357 37544498 36248281 37225576 38544722 39783602 41201163 42223250 41102094
6482 41102094 45024100 44511637 41387374 40813008 41193244 39269212 37662547 40275511 38850984
6473 38850984 39330911 40887271 41374688 42677999 45448090 48131963 48598129 45414868 46606800
6464D6606800j873479J263343k471753l044974K20102P07904k499609O49472K245922
6455D1803728P60971j332953K124407K619980j379567P59220L14958k060880j80699
6446D3429165j8121j949986O27758j385061O57856j91251K154380n65285Q1388
6437D2840843L940851K094417L07824K874118K487329o81452j795407J655268
6429E3723791j538025p53190l97526p89574M85099j182143N00216N79587K666889
6420E3295124K29238o8563N65741L019857l88299J816164R35063j690437m74320
6411E7239568J474261r41375J359916j056211J271512l542932l0239J75014p53126
6402E5196388J28622r5560j756825j972692J966767J015772J685824q1705L70674
$$ plain form
6464 46606800 44733321 45996664 43524911 40479937 40700039 41407943 38908334 39557806 41803728
6455 41803728 42564699 41231746 43356153 45976133 44596566 45355786 45670744 43609864 43429165
6446 43429165 43411044 41461058 42088816 40703755 41361611 41170360 43324740 42759455 42840843
6437 42840843 46781694 48876111 49183935 52058053 54545382 53863930 52068523 53723791
6429 53723791 52185766 51432576 51035050 50245476 50730575 49548432 50048648 50628235 53295124
6420 53295124 53524362 53455799 54021540 57041397 56653098 58469262 59404325 57713888 57239568
6411 57239568 58713829 57772454 59132370 58076159 59347671 55804739 55774500 55949514 55196388
6402 55196388 55325010 55229450 53472625 51499933 53466700 54482472 56168296 56086591 56457265
6393E6457265J264624k15249J857333L23913l3504K635120j118463K358103M14252
6384F3943394K387290K495251k99578K951216K98422k302936O23837J87246l000312
6375F7283830j159498j42134J329121n88735j988578j486399P78427J777695K655582
6366F8459311k546716M304369J099859K407247J840519L062918L657877L329730
6358H5615114K063160P40201m79210n52711j712305j925432m956960l602518k440870
$$ plain form
6393 56457265 57721889 57506640 59363973 59687886 59654382 62289502 61171039 63529142 63943394
6384 63943394 66330684 68825935 68526357 71477573 71775995 69473059 70096896 70284142 67283830
6375 67283830 66124332 65982198 67311319 66722584 64734006 63247607 64026034 65803729 68459311
6366 68459311 65912595 70216964 71316823 73724070 75564589 78627507 82285384 85615114
6358 85615114 87678274 88418475 87939265 87386554 85674249 83748817 78791857 75189339 72748469
$$ [...]
##END NTUPLES=NMR SPECTRUM
##END=
