##TITLE=abcd
##JCAMPDX= 6.0         $$ Bruker NMR JCAMP-DX V2.0
##DATA TYPE= NMR SPECTRUM
##DATA CLASS= NTUPLES
##ORIGIN= UXNMR, Bruker Analytische Messtechnik GmbH
##OWNER= root
$$ XWIN-NMR		Version 3.5
$$ Wed Jun 24 19:19:01 2026 Russian Standard Time (UT+4h)  servis@DPX200
##.OBSERVE FREQUENCY= 200.131235884673
##.OBSERVE NUCLEUS= ^1H
##.ACQUISITION MODE= SIMULTANEOUS
##.ACQUISITION SCHEME= undefined
##.AVERAGES= 32
##.DIGITISER RES= 18
##SPECTROMETER/DATA SYSTEM= spect
##.PULSE SEQUENCE= zg
##.SOLVENT NAME= CDCl3
##.SHIFT REFERENCE= (INTERNAL, CDCl3, 0, 16.4885)
##AUDIT TRAIL= $$ (NUMBER, WHEN, WHO, WHERE, WHAT)
$$ ##TITLE= Audit trail, XWIN-NMR		Version 3.5
$$ ##JCAMPDX= 5.01
$$ ##ORIGIN= Bruker BioSpin GmbH
$$ ##OWNER= servis
$$ F:\spectra/data/av/nmr/H1/1/pdata/1/auditp.txt
$$ ##AUDIT TRAIL=  $$ (NUMBER, WHEN, WHO, WHERE, WHAT)
(   1,<2026-06-24 19:18:23.23 +0400>,<servis>,<DPX200>,
      <created by zg, POWCHK disabled, PULCHK disabled
       configuration hash MD5:
       00 E9 B6 7A A2 85 ED C7 34 08 36 98 17 FE 4E 26
       data hash MD5: 32K
       DC E8 0C 63 9D 4E 6E E5 43 AC 7D 68 52 46 52 A7>)
(   2,<2026-06-24 19:18:28.62 +0400>,<servis>,<DPX200>,
      <Start of raw data processing
       efp BC_mod = 2 LB = 0.05 FT_mod = 6 PKNL = 1 PHC0 = -412.19 PHC1 = 3.101563 SI = 16K 
       data hash MD5: 16K
       C1 5B 2E B6 C3 C2 27 81 AF 55 59 DB E9 AD 2E 79>)
$$ ##END=
$$ 
$$ hash MD5
$$ DF EA 0C 8C 15 15 35 79 DD D7 9C FC AA C2 3B 47
##$RELAX= 
##$RELAX= 
##$RELAX= 
##$RELAX= 
##$RELAX= 
##$RELAX= 
##$RELAX= 
##$RELAX= 
$$ Bruker specific parameters
$$ --------------------------
##$DU= <F:\spectra>
##$EXPNO= 1
##$NAME= <H1>
##$PROCNO= 1
##$TYPE= <nmr>
##$USER= <av>
##$AMP= (0..31)
100 100 100 100 100 100 100 100 100 100 100 100 100 100 100 100 100 100 
100 100 100 100 100 100 100 100 100 100 100 100 100 100 
##$AQSEQ= 0
##$AQ_mod= 1
##$AUNM= <au_zg>
##$AUTOPOS= <>
##$BF1= 200.13
##$BF2= 200.13
##$BF3= 200.13
##$BF4= 200.13
##$BF5= 500.13
##$BF6= 500.13
##$BF7= 500.13
##$BF8= 500.13
##$BYTORDA= 1
##$CFDGTYP= 0
##$CFRGTYP= 5
##$CHEMSTR= <none>
##$CNST= (0..31)
1 1 145 1 1 1 1 1 1 1 1 1 1 1 1 1 1 1 1 1 1 1 1 1 1 1 1 1 1 1 1 1 
##$CPDPRG= <>
##$CPDPRG1= <>
##$CPDPRG2= <>
##$CPDPRG3= <>
##$CPDPRG4= <mlev>
##$CPDPRG5= <mlev>
##$CPDPRG6= <mlev>
##$CPDPRG7= <mlev>
##$CPDPRG8= <mlev>
##$CPDPRGB= <>
##$CPDPRGT= <>
##$D= (0..31)
0 2 0 0 0 0 0 0 0 0.06 0 0 0 0 0 0 0.0002 0 0 0 0 0 0 0 0 0 0 0 0 0 0 
0 
##$DATE= 1782314302
##$DBL= (0..7)
120 120 120 120 120 120 120 120 
##$DBP= (0..7)
150 150 150 150 150 150 150 150 
##$DBP07= 0
##$DBPNAM0= <>
##$DBPNAM1= <>
##$DBPNAM2= <>
##$DBPNAM3= <>
##$DBPNAM4= <>
##$DBPNAM5= <>
##$DBPNAM6= <>
##$DBPNAM7= <>
##$DBPOAL= (0..7)
0.5 0.5 0.5 0.5 0.5 0.5 0.5 0.5 
##$DBPOFFS= (0..7)
0 0 0 0 0 0 0 0 
##$DE= 6
##$DECBNUC= <off>
##$DECIM= 32
##$DECNUC= <off>
##$DECSTAT= 4
##$DIGMOD= 1
##$DIGTYP= 9
##$DL= (0..7)
0 120 120 120 120 120 120 120 
##$DP= (0..7)
150 150 150 150 150 150 150 150 
##$DP07= 0
##$DPNAME0= <>
$$ [...]
##$SUBNAM4= <"">
##$SUBNAM5= <"">
##$SUBNAM6= <"">
##$SUBNAM7= <"">
##$SUBNAM8= <"">
##$SUBNAM9= <"">
##$SW= 20.6817932712277
##$SWIBOX= (0..15)
0 0 3 0 0 0 0 0 0 0 0 0 0 0 0 0 
##$SW_h= 4139.07284768212
##$TD= 32768
##$TD0= 1
##$TE= 0
##$TE2= 300
##$TE3= 300
##$TEG= 300
##$TL= (0..7)
0 120 120 120 120 120 120 120 
##$TP= (0..7)
150 150 150 150 150 150 150 150 
##$TP07= 0
##$TPNAME0= <>
##$TPNAME1= <>
##$TPNAME2= <>
##$TPNAME3= <>
##$TPNAME4= <>
##$TPNAME5= <>
##$TPNAME6= <>
##$TPNAME7= <>
##$TPOAL= (0..7)
0.5 0.5 0.5 0.5 0.5 0.5 0.5 0.5 
##$TPOFFS= (0..7)
0 0 0 0 0 0 0 0 
##$TUNHIN= 0
##$TUNHOUT= 0
##$TUNXOUT= 0
##$USERA1= <user>
##$USERA2= <user>
##$USERA3= <user>
##$USERA4= <user>
##$USERA5= <user>
##$V9= 5
##$VALIST= <valist>
##$VCLIST= <CCCCCCCCCCCCCCC>
##$VD= 0
##$VDLIST= <DDDDDDDDDDDDDDD>
##$VPLIST= <PPPPPPPPPPPPPPP>
##$VTLIST= <TTTTTTTTTTTTTTT>
##$WBST= 1024
##$WBSW= 30
##$XGAIN= (0..3)
0 0 0 0 
##$XL= 0
##$YL= 0
##$YMAX_a= 227346
##$YMIN_a= -381925
##$ZGOPTNS= <>
##$ZL1= 120
##$ZL2= 120
##$ZL3= 120
##$ZL4= 120
##$ABSF1= 0
##$ABSF2= 0
##$ABSG= 0
##$ABSL= 0
##$ALPHA= 0
##$AQORDER= 0
##$ASSFAC= 0
##$ASSFACI= 0
##$ASSFACX= 0
##$ASSWID= 0
##$AUNMP= <proc_1d>
##$AZFE= 0.1
##$AZFW= 0.1
##$BCFW= 0
##$BC_mod= 2
##$BYTORDP= 0
##$COROFFS= 0
##$CY= 18.4799938201904
##$DATMOD= 1
##$DC= 0
##$DFILT= <>
##$DTYPP= 0
##$F1P= 9.9274215381318
##$F2P= -0.165520771350173
##$FCOR= 1
##$FTSIZE= 16384
##$FT_mod= 6
##$GAMMA= 0
##$GB= 0
##$INTBC= 1
##$INTSCL= 4.127829e-11
##$ISEN= 128
##$LB= 0.05
##$LEV0= 0
##$LPBIN= 0
##$MAXI= 10000
##$MC2= 0
##$MEAN= 0
##$ME_mod= 0
##$MI= 50
##$NCOEF= 0
##$NC_proc= -8
##$NLEV= 6
##$NOISF1= 3.799351
##$NOISF2= 2.8
##$NSP= 0
##$NTH_PI= 0
##$NZP= 0
##$OFFSET= 16.48848
##$PC= 4
##$PHC0= -412.19
##$PHC1= 3.101563
##$PH_mod= 1
##$PKNL= yes
##$PPARMOD= 0
##$PSCAL= 4
##$PSIGN= 0
##$REVERSE= no
##$SF= 200.130005582386
##$SI= 16384
##$SIGF1= 3
##$SIGF2= 2
##$SINO= 400
##$SIOLD= 16384
##$SREGLST= <1H.CDCl3>
##$SSB= 0
##$STSI= 16384
##$STSR= 0
##$SW_p= 4139.07284768211
##$SYMM= 0
##$S_DEV= 0
##$TDeff= 32768
##$TDoff= 0
##$TI= <>
##$TILT= no
##$TM1= 0
##$TM2= 0
##$TOPLEV= 0
##$USERP1= <user>
##$USERP2= <user>
##$USERP3= <user>
##$USERP4= <user>
##$USERP5= <user>
##$WDW= 1
##$XDIM= 16384
##$YMAX_p= 275825937
##$YMIN_p= -3858177
$$ End of Bruker specific parameters
$$ ---------------------------------
##NTUPLES= NMR SPECTRUM
##VAR_NAME=  FREQUENCY,     SPECTRUM/REAL,   SPECTRUM/IMAG
##SYMBOL=    X,             R,               I
##VAR_TYPE=  INDEPENDENT,   DEPENDENT,       DEPENDENT
##VAR_FORM=  AFFN,          ASDF,            ASDF
##VAR_DIM=   16384,         16384,           16384
##UNITS=     HZ,            ARBITRARY UNITS, ARBITRARY UNITS
##FACTOR=    0.252644378177508, 1,           1
##FIRST=     3299.83951724647, 0,            0
##LAST=      -839.233330435636, 0,           0
##MIN=       -839.233330435636, -3858177,    0
##MAX=       3299.83951724647, 275825937,    0
$$ Real data points
##PAGE= N=1
##DATA TABLE= (X++(R..R)), XYDATA
$$ [...]
7349D186000J600078q75145J93820j51260q55017R42721n55841L34069m12691
7340D406734O61430l80436L70564K94515k055917K285826j518348o64560j08289
7331C291519K14925J425326r40142J288187j45976M37562n16864n23431K8707
7322D559813J609989j644827J389087q82693k25961q51974q92801J291133R67907
7313E319673R536k395783O20346J054690L20277j426137j52040J509234l80112
7304D479684o07853o35529O3692l67754j123898J024035M38276L42646n63652
7295C049647J89940k32173K117790o95840k659733O03849J155824p37226O90205
7286C482283l144601J971186J71689r34644r21484K341062k11937n224l4523j188837
$$ y = [4186000, 5786078, 4910933, 5104753, 4953493, 4098476, 5041197, 4485356, 4819425, 4406734, 5068164, 4687728, 5058292, 5352807, 3296890, 5582716, 4064368, 3399808, 3291519, 3506444, 4931770, 3991628, 5279815, 5133839, 5571401, 5054537, 4531106, 4559813, 6169802, 4524975, 5914062, 5031369, 4805408, 3953434, 3060633, 4351766, 5319673, 5329209, 2933426, 3553772, 4608462, 4928739, 3502602, 3350562, 4859796, 4479684, 3871831, 3236302, 3299994, 2932240, 1808342, 2832377, 3270653, 3613299, 3049647, 3239587, 3007414, 5125204, 4429364, 1769631, 2373480, 3529304, 2792078, 3482283, 337682, 2308868, 2480557, 1545913, 624429, 2965491, 2753554, 2748330, 2713807, 1524970]
7276A524970K348701j232476j589062P88473J213280J539376k330979j50777l0179
7267B081327M66411n02878o85680J888004l63030k14905m30943q19539J463542
7258B882309O9423M72652j957378J751319l94403M065j807322J054377J673469
7249C748511j970888m19575J531732k983k08673j814661J558242M0853R60678
7240C423236k527306R43671P2335j14486J090407j933602J011553J197629o25634
7231B537803l46680k66421k126574J451081l52435J22717J729469j633177P57081
7222A872864r07669J187344P86314o35908j851523J565559m59569J223286k018172
7213G62526J664447O15645K44953j048939p38563j40385N15865J167732j722895
$$ y = [1524970, 3873671, 2641195, 1052133, 1840606, 3053886, 4593262, 2262283, 2111506, 2081327, 2547738, 2044860, 1359180, 3247184, 2884154, 2669249, 2238306, 1418767, 2882309, 2951732, 3424384, 1467006, 3218325, 2823922, 2827987, 1020665, 2075042, 3748511, 1777623, 1358048, 2889780, 2886797, 2678124, 863463, 2421705, 2462558, 3423236, 895930, 1839601, 1911936, 1797450, 2887857, 954255, 1965808, 3163437, 2537803, 2191123, 1924702, -201872, 1249209, 896774, 1019491, 2748960, 1115783, 1872864, 965195, 2152539, 2938853, 2302945, 451422, 2016981, 1557412, 2780698, 762526, 2426973, 3042618, 3287571, 2238632, 1500069, 1359684, 1875549, 3043281, 1320386]
7204A320386J608338j223508K54930J388260k404386J915714J760799l051661
7196A568872J126457q09507j262307J204905r3176M57543J353939n22470j451423
7187A572833k08793K86462N75493N01983l29610k331612K511757L03620J419519
7178D301652j013104n18359Q3389J712175j546399p05102J46673j214955K016235
7169C262205l1137j79311N01085J678887k871580O12494J670273l04765K36989
7160D575140m31916q41993J217457J66206j734142J701697o13478n24902K085296
7151E599365k382588Q24436L57514O26636r1207K02623r1273J485022j042765
7142E487763m29514m1549M23009o52902K867417j695983k662110R42521J408375
$$ y = [1320386, 2928724, 1705216, 1960146, 3348406, 944020, 2859734, 4620533, 1568872, 2695329, 1885822, 623515, 1828420, 1735244, 2192787, 3546726, 3024256, 1572833, 1364040, 1650502, 2225995, 2727978, 2398368, 66756, 2578513, 2882133, 4301652, 3288548, 2770189, 2853578, 4565753, 3019354, 2314252, 2460925, 1245970, 3262205, 3231068, 3051757, 3552842, 5231729, 2360149, 2972643, 4642916, 4338151, 4575140, 4143224, 3301231, 4518688, 4684894, 2950752, 4652449, 4038971, 3514069, 5599365, 3216777, 4041213, 4398727, 5025363, 4934156, 5136779, 5045506, 6530528, 5487763, 5058249, 5016700, 5439709, 4786807, 7654224, 5958241, 3296131, 4238652, 5647027]
7133E647027J19466R9796k399876N85909P3441o93266P70203j292367q5779O99577
7123C524131J980798j980124J084645j730690K5579N89083o26865P26201o08342
7114B984416R65248j089394n90403K080413j07536k079235k68640L14955Q62068
7105C071892m98768j443593K257532o02365Q91071m50692j078386m19155M1652
7096A769188p64358K505065r56874M13177m61008j583317M79140M99796K32166
7087B132975q05130J022210O75833j908975J659022j092448N92810j07455M84417
7078B653259j121859K17414L04568k31959J177414j410959J56459J079122j805597
7069A017862l07242K470937k538990J181067J076224j164694J412380k026789
$$ y = [5647027, 5766493, 5866289, 3466413, 4052322, 4125763, 3432497, 4202700, 2910333, 2824554, 3524131, 5504929, 3524805, 4609450, 2878760, 2904339, 3493422, 2866557, 3592758, 2984416, 3949664, 2860270, 2269867, 4350280, 4242744, 2163509, 1894869, 2209824, 3071892, 2573124, 1129531, 3387063, 2784698, 3675769, 3225077, 2146691, 1727536, 1769188, 1004830, 3509895, 2553021, 2966198, 2505190, 921873, 1401013, 1900809, 2132975, 1327845, 2350055, 3025888, 1116913, 2775935, 1683487, 2276297, 2168842, 2653259, 1531400, 1748814, 2053382, 1821423, 2998837, 1587878, 1744337, 2823459, 1017862, 710620, 3181557, 642567, 1823634, 2899858, 1735164, 3147544, 1120755]
7061A120755j73093K09966K777066j630585L33741k455943j597261L997067j338364
7052A243349J775612j935614J139559o88318K542441l072439M40240q23014Q96246
7043A518062M51939j186217K643879j153577j117973J170412R8827L49148j352987
7034A421513M23524m35435J1973J454763j531471N63030J043529j039137L591216
7025E503505m303248J121969n4992Q41082r02113n27138N66177M18348l49380
7016B314210L5518O6225n67927o2557J251599j425268J666145k333040J820024
7007B764929J508917j433564j218212Q47381j25531K359029k979254o30245J447083
6998B540533Q0683N22324j405743j333709J623439K00182o28290o73681k50139
$$ y = [1120755, 947662, 1157628, 3934694, 2304109, 2637850, 181907, -1415354, 2581713, 1243349, 3018961, 1083347, 2222906, 1534588, 4077029, 1004590, 1444830, 621816, 1518062, 1970001, 783784, 3427663, 2274086, 1156113, 2326525, 2425352, 2774500, 1421513, 1845037, 1409602, 1421575, 2876338, 1344867, 1907897, 2951426, 1912289, 5503505, 1200257, 2322226, 2267234, 3108316, 2206203, 1679065, 2245242, 2663590, 2314210, 2349728, 2415953, 1848026, 1785469, 3037068, 1611800, 3277945, 944905, 2764929, 4273846, 2840282, 1622070, 2469451, 2343920, 4702949, 1723695, 1093450, 2540533, 2621216, 3143540, 1737797, 404088, 2027527, 2227709, 1599419, 925738, 675599]
6989F75599M73512J248661j892208J208670N64625J875762j472326J608532l546050
6980G44777Q60894n30127J352671p75805K093327j954070K97818l21278J573117
6971C341324j734075m639j58231J955468k45678n81220J112136j074145p75356
6962A835584K011670J019190j819571j593550J061264j851444J800645j95211
6954B268577o08473p76569J862088K091597l388168O11134N19576k50475J240021
6945C569308p68030k39304J673109j051957j004096J003408j429464L507969k918405
6936B342538j53232J596986j275063j133893l27680L64364L395211l057788P64743
6927B516186q72032n66561L011938j360224m69570j145307P10748L219640k776551
$$ y = [675599, 1149111, 2397772, 505564, 1714234, 2278859, 4154621, 2682295, 4290827, 744777, 1605671, 1075544, 2428215, 1652410, 3745737, 1791667, 2089485, 1768207, 3341324, 1607249, 1602610, 1444379, 3399847, 3154169, 2572949, 3685085, 2610940, 1835584, 3847254, 4866444, 3046873, 1453323, 2514587, 663143, 2463788, 2268577, 1660104, 883535, 2745623, 4837220, 1449052, 2060186, 2579762, 2329287, 3569308, 2801278, 2561974, 4235083, 3183126, 2179030, 3182438, 1752974, 5260943, 2342538, 2189306, 3786292, 2511229, 1377336, 1049656, 1414020, 4809231, 1751443, 2516186, 1644154, 1077593, 4089531, 2729307, 2259737, 1114430, 1825178, 5044818, 2268267]
6918B268267k65151j53800J500782j140785K249548j355114J40843q31043J436112
6909C849659j112022o52580K020750k570838J431624j469042J397142Q88208P72594
6900D555495m41577k51042R75134r72522R24350O736m86257R62961R64711k284506
6890C953483J139822j134098K292812l08095j124970M87805n40082J65009N28587
6881E460273R63939j289564K012218k58009m24591K546160k938777K659622k302758
6872F428513K342209k417385k566146L166253k557m19033r40650p86823Q46056
6863E650437r70661Q99582J271426l29411k85849K845137J276407l32499K77799
6854A0302368J310681o50272O33384O28363o73567K9912k505131P59295N02354
$$ y = [2268267, 2003116, 1849316, 3350098, 2209313, 4458861, 3103747, 3244590, 2413547, 3849659, 2737637, 2085057, 4105807, 1534969, 2966593, 1497551, 2894693, 3782901, 4555495, 4113918, 3862876, 4838010, 3865488, 4789838, 4796574, 4310317, 5273278, 6237989, 3953483, 5093305, 3959207, 6252019, 5943924, 4818954, 5306759, 4766677, 4931686, 5460273, 6424212, 5134648, 7146866, 6888857, 6464266, 9010426, 6071649, 8731271, 6428513, 8770722, 6353337, 3787191, 6953444, 6950887, 6531854, 5591204, 4804381, 5650437, 4679776, 5579358, 6850784, 6521373, 6235524, 9080661, 10357068, 10024569, 10302368, 11613049, 10962777, 11596161, 12224524, 11550957, 11580869, 9075738, 9835033, 10337387]
6845A0337387K86686n53748k56232k787412K827771k337131m86625l04494J470502
6836H196704l72086P41746R91253j842184J654596l87683J134788J833075j266141
6827A0684068J200186J25380K204690k048947n38060j519815m22987r91982M82541
6818I175074J27509J70200j829213J513348J964819r89326j73850j713800K120108
6809A0364869j23765j831384J34755o50716M6241K75783J012269l23834k95681
6800H608537R92625j467881P38065o34145J731583m17752p66901j122249K131351
6791I793233q62475r9146J183908n45696J184092o41791j361881j592940J325258
6782H382562m16923P83671m91409j664261j06065J396461j931339O54903j309637
$$ y = [10337387, 10624073, 10070325, 9814093, 7026681, 9854452, 7517321, 7030696, 6726202, 8196704, 7824618, 8566364, 9557617, 7715433, 9370029, 8982346, 10117134, 11950209, 10684068, 11884254, 12009634, 14214324, 12165377, 11627317, 10107502, 9684515, 8692533, 9175074, 9302583, 9472783, 7643570, 9156918, 11121737, 10132411, 9958561, 8244761, 10364869, 10241104, 8409720, 8544475, 7893759, 7940000, 8215783, 9228052, 8904218, 8608537, 9601162, 8133281, 8871346, 8237201, 9968784, 9551032, 8784131, 7661882, 9793233, 8930758, 8831612, 10015520, 9469824, 10653916, 10012125, 8650244, 7057304, 8382562, 7965639, 8749310, 8257901, 6593640, 6487575, 7884036, 5952697, 6607600, 5297963]
6773E297963j74767R77345K45570J12806p68547J13569Q86942K120398O25255
6764I436534k097974K48207j159832R35723L7438q26615l58309Q115o8691l69604
6754E784992k4220j151192J599551R2247j905768K11908N18287J742270m85509
6745F382566L92247j693805Q77775M0604K96675l51462k156118Q59728N43586
6736E191796l69187J929947q80161p22933p20034K13658K408274r6789j971626
6727D982945J070199j265519J217024J42195k99815n82513O96681R48683O73501
6718G583381j758676J97594J154114j49324o23519J77555R30688r48189j22585
6709F441039q26114L182302j066280j7727L03150l62425R18282j310169R1238
$$ y = [5297963, 5123196, 6100541, 6346111, 6458917, 5690370, 5803939, 6690881, 8811279, 9436534, 7338560, 7586767, 6426935, 7362658, 7400096, 6573481, 6215172, 6223287, 6154596, 5784992, 5760772, 4609580, 6209131, 6301378, 4395610, 4607518, 5125805, 6868075, 6382566, 6774813, 5081008, 5958783, 5999387, 6296062, 5944600, 3788482, 4648210, 5191796, 4822609, 6752556, 5872395, 5149462, 4429428, 4643086, 7051360, 6954571, 4982945, 6053144, 4787625, 6004649, 6146844, 5847029, 5264516, 5961197, 6909880, 7583381, 5824705, 6022299, 7176413, 7027089, 6403570, 6581125, 7511813, 6563624, 6441039, 5614925, 8797227, 7730947, 7713220, 8016370, 7653945, 8572227, 7262058, 7353296]
6700G353296m78553m97900k48054L65209M32258J033949n88124k69677J635709
6691H738113j507303p53584L81249m50954K046473j47844q98096O48427j013404
6682G043077J727449J261987j781833J062323M93301J345578K9179j116362l82140
6673I682559J183915j363287J721594k469685N44697J992023q04495k596664J175120
6664I065777N74842o71809J965678l6531j719221J151249l80709R85771M9703
6655A0984750J18134J214129p31412N20085K535076J339420k099631Q56776j266829
6646A3470498J788439J690118k459139j174166J81539J845949j552532K297770
6638A6088476j770235J596579M10622N18294K430665j20132o31061J298536k035408
$$ y = [7353296, 6874743, 6376843, 6128789, 6493998, 6926256, 7960205, 7372081, 7102404, 8738113, 7230810, 6477226, 6858475, 6407521, 8453994, 8306150, 7408054, 8056481, 7043077, 8770526, 10032513, 8250680, 9313003, 9806304, 11151882, 11181061, 10064699, 9682559, 10866474, 9503187, 11224781, 8755096, 9299793, 11291816, 10487321, 7890657, 9065777, 9640619, 8968810, 10934488, 10897957, 9178736, 10329985, 9949276, 10935047, 10984750, 11102884, 12317013, 11585601, 12105686, 14640762, 15980182, 13880551, 14737327, 13470498, 15258937, 16949055, 14489916, 13315750, 13497289, 15343238, 13790706, 16088476, 14318241, 15914820, 16325442, 16843736, 19274401, 19154269, 18523208, 19821744, 17786336]
6629A7786336j477024K664161J74331j24379j802326K04857N54325j016682O36225
6620A7599824J746313j056107R69316j123336J149802Q91110r12422K423953j327513
6611B0360940M57708J611136O58570J57950k161090K997099L40900K372691J25779
6602B6921683p05435O94924O25631q84739p85539j765517O79539j501884K27073
6593B3505736j137239K4811j235009n57385Q4014O71931o43459J047889k88381
6584B1472908J074403l82002L93142p50186J912131r0242J872215Q33093J084941
6575B7420403L221604r8707n25034L57087k802628J146838k421316j150365j038649
6566B4109233j327750L674186j204073Q2526O75372j356996j145585M31450J889003
$$ y = [17786336, 16309312, 18973473, 19147804, 19023425, 17221099, 17425956, 17980281, 16963599, 17599824, 19346137, 18290030, 19259346, 18136010, 19285812, 20176922, 19264500, 21688453, 20360940, 20818648, 22429784, 23088354, 23246304, 21085214, 24082313, 24423213, 26795904, 26921683, 26216248, 26911172, 27536803, 26652064, 25866525, 24101008, 24780547, 23278663, 23505736, 22368497, 22393308, 21158299, 20600914, 20684928, 21356859, 20713400, 21761289, 21472908, 22547311, 22165309, 22558451, 21808265, 23720396, 23630154, 25502369, 26335462, 27420403, 30642007, 30543300, 30018266, 30375353, 27572725, 28719563, 26298247, 25147882, 24109233, 22781483, 26455669, 25251596, 25334122, 26009494, 24652498, 23506913, 23938363, 25827366]
6557B5827366k036869J25321k60506J743127K76334p91983K157483J871178J39459
6548B9050910q88K500296j656718n86108J040441j430098M620539m099501K818025
6539C2256898j314649p1782J931277N1448k89899l57328K034200q23557l44539
6530C3072069K83306J76196J208386o89432k110612J569952J234759p35328k46188
6521C3763108J093416J330751N94590p13395L637801Q98606q80735j387632K77262
6512C8613772L045765j271187j494375J021454q94697K689551Q59863o63342N0542
6503D1957346l0534K61728J967371r29199j42371K921859k555682J893672q85203
6494D4458987J989430j634058M12743R01150q87352J910250l842864L998934j869468
$$ y = [25827366, 23790497, 23915818, 23655312, 25398439, 25674773, 24882790, 27040273, 28911451, 29050910, 29050022, 31550318, 29893600, 29307492, 30347933, 28917835, 33538374, 29438873, 32256898, 30942249, 30870467, 32801744, 32853192, 32563293, 32205965, 34240165, 33416608, 33072069, 33355375, 33531571, 34739957, 34050525, 31939913, 33509865, 34744624, 34009296, 33763108, 34856524, 36187275, 36781865, 36068470, 39706271, 40604877, 39724142, 38336510, 38613772, 41659537, 40388350, 38893975, 39915429, 39020732, 41710283, 42570146, 41906804, 41957346, 41926812, 42188540, 44155911, 43226712, 43084341, 46006200, 43450518, 45344190, 44458987, 46448417, 44814359, 45227102, 46128252, 45240900, 47151150, 43308286, 47307220, 45437752]
6485D5437752k72600J566695K83874r63238n19072L237593J08383K003880j724464
6476D9158803K590567q27845j367248J396119k878008l795J410566J200414p11351
6467D9968222j909171J112448P07479K422690J455123n85650K249463j787617
6459E3632987j12335R48867j211704N19903l266861Q7125J722427j114853k627040
6450D8578516J648509J059957j96916O09995l34528K266266k60358O40098K45823
6441E4257362j99833o54847l67651M17107k427331M783304k504328K329505L39889
6432E5973177N88244K013904P73832M2288L677270J759607k488560Q6261K15376
6423F2641399q8631k12470m51702q23681J717843L9428j811217J474394L787645
$$ y = [45437752, 45165152, 46731847, 47015721, 46052483, 45533411, 48771004, 48879387, 50883267, 49158803, 51749370, 50921525, 49554277, 50950396, 48072388, 48068593, 49479159, 50679573, 49968222, 48059051, 49171499, 49878978, 52301668, 53756791, 53171141, 55420604, 53632987, 53520652, 54469519, 53257815, 53777718, 50510857, 50597982, 52320409, 51205556, 48578516, 50227025, 51286982, 51090066, 51700061, 51365533, 53631799, 53371441, 54011539, 54257362, 54057529, 53402682, 53035031, 53452138, 51024807, 55808111, 53303783, 55633288, 55973177, 56561421, 58575325, 59349157, 59391445, 63068715, 64828322, 62339762, 62426023, 62641399, 62552768, 62340298, 61888596, 61064915, 62782758, 62822186, 61010969, 62485363, 66273008]
6414F6273008P59120J462977J10737J301969L38610K60398l093965J163750J483195
6405G0059799j538025J241490l250474J16665O22311j352761p31352N83610J50695
6396F5901958j872946J590005J542161N60443K483463k425310J171262J263953
6388G0214989J585133K400717k086552K372777Q54456J923929J484019J393810
6380H0143278R08418M0195M93660K344759k050681j338366J039523j895965n21211
6371G9163610p53451n25875p436j282732J211399m79978K523964K986495J566204
6362H4402200L467070K019600L457629M274589n88920R89488J229991M9609j042301
6353I8258955k565551l938399j837725j252291l552041j911270k296260l113903
$$ y = [66273008, 67032128, 68495105, 68605842, 69907811, 70246421, 70506819, 67412854, 68576604, 70059799, 68521774, 69763264, 66512790, 66629455, 67251766, 65899005, 65167653, 65751263, 65901958, 64029012, 65619017, 67161178, 67721621, 70205084, 67779774, 68951036, 70214989, 71800122, 74200839, 72114287, 74487064, 75341520, 77265449, 78749468, 80143278, 81051696, 81091891, 81585551, 83930310, 81879629, 80541263, 81580786, 79684821, 79163610, 78410159, 77884284, 77876848, 76594116, 77805515, 77325537, 79849501, 82835996, 84402200, 87869270, 89888870, 93346499, 97621088, 97032168, 98021656, 99251647, 99301256, 98258955, 95693404, 91755005, 89917280, 88664989, 85112948, 83201678, 80905418, 77791515]
6345G7791515k442781j036009j507979o86487N39624L75468q7201m24892J106167
6336G3627425P42131j525959J074088Q4006k09137j269413j377404k142627l626592
6327F5376518k183636k064841k690484p40185l367685j066999L84311k645025
6319E1001974k734155J351872k554335j035834o46590m091753M167914l043978
6311D2415115j90462j070201P9236J005177l47887o07374k44326J6972l22467
6302D0733783j081631J229121k858878l06730j212573P9603R25230j642248j933
6293C5863744j04825Q8254k672333J724554j169427o92790J614608k558337K86663
6284C2380111q19595k074451L430392k193175J664188j238241q10610k71239M99706
$$ y = [77791515, 75348734, 74312725, 72804746, 72118259, 72657883, 73033351, 72946150, 72521258, 73627425, 74369556, 72843597, 73917685, 74001691, 73792554, 72523141, 71145737, 69003110, 65376518, 63192882, 61128041, 58437557, 57697372, 54329687, 53262688, 53646999, 51001974, 48267819, 49619691, 47065356, 46029522, 45382932, 41291179, 45459093, 42415115, 42224653, 41154452, 41233688, 42238865, 41890978, 41283604, 41039278, 41056250, 40733783, 39652152, 40881273, 38022395, 37715665, 36503092, 36582695, 37507925, 35865677, 35863744, 35758919, 35847173, 33174840, 34899394, 33729967, 33037177, 34651785, 32093448, 32380111, 31560516, 29486065, 32916457, 30723282, 32387470, 31149229, 30338619, 30067380, 30567086]
6275C0567086O3039k524663J211603k080282Q43816o68304k489803j33983l79983
6266B4408526j327608J690877j906096O50658o76986j473955m090828L361589
6258B0636177j21616r25181l48861J989195j327315M95241l171893J526280K48580
6249A9000607n65591J361924q54966j187946K348147j238808k015717K692116
6241A9539766k277127j828105K791260l57336Q34189m14630n82864j2865P58134
6232A8450422k68413O7798p51417N26366J153948L7283k427671n77454K111059
6223A8321921K13569l64565J725298o9832o01798j22670j201785J482047L80644
6214A9762829R97677K77601p35589N4573L66037p89968j830454L158254k033595
$$ y = [30567086, 30630125, 28105462, 29317065, 27236783, 28080599, 27412295, 24922492, 24788509, 24408526, 23080918, 24771795, 22865699, 23516357, 22839371, 21365416, 17274588, 20636177, 20514561, 19589380, 19240519, 21229714, 19902399, 20397640, 17225747, 18752027, 19000607, 18435016, 19796940, 18941974, 17754028, 20102175, 18863367, 16847650, 19539766, 17262639, 15434534, 18225794, 17868458, 18702647, 18288017, 17705153, 17692288, 18450422, 18182009, 18249807, 17498390, 18024756, 19178704, 19215987, 16788316, 16210862, 18321921, 18535490, 18170925, 19896223, 19826391, 19224593, 19101923, 17900138, 19382185, 19762829, 20760506, 21038107, 20302518, 20357091, 20723128, 19933160, 18102706, 21260960, 19227365]
6205A9227365o4636O80072k440642J398269P42951m32411J495325l09653j19985
6196B0176655p53984M14527j627267J650941k322418M499334j481612j641249
6188A8914927O49253m81170J699516j966400J367396o47562l58869M16329p82231
6179A8811189P05525k69513J898941R37921k321199L8259J204384o15698m13597
6170A9976212M02057j02089R66867m42383l98501j163457l4396K049107m02621
6161B0850796l080424K263192J3425j334854J023860L72992J39635J097725p0345
6152B1276002r54676R84721j389140J194945j254806N49526k1662j082752J109311
6143B0411469j468997K177868o88299J430977j037578J973951k194051L31102
$$ y = [19227365, 19162729, 19842801, 17402159, 18800428, 19543379, 19110968, 20606293, 20296640, 20176655, 19422671, 19837198, 18209931, 19860872, 17538454, 22037788, 20556176, 18914927, 19564180, 19083010, 20782526, 18816126, 20183522, 19535960, 19177091, 19593420, 18811189, 19516714, 19247201, 21146142, 22084063, 19762864, 19801123, 21005507, 20389809, 19976212, 20378269, 20276180, 21243047, 20800664, 20402163, 19238706, 19204310, 21253417, 20850796, 17770372, 20033564, 20046989, 18712135, 19735995, 20108987, 20248622, 21346347, 21276002, 20321326, 21306047, 19916907, 21111852, 19857046, 20406572, 20384910, 19302158, 20411469, 18942472, 21120340, 20432041, 21863018, 20825440, 22799391, 20605340, 20936442]
6135B0936442R96989j035044j80641J69821k73807J581634j079588n12606J222292
6126B1825492L70783L2895k236737K110715M50139q18836j186131J240660r9257
6117B1689723j180477K130713p36001k217544K056455j041783L77789j387208
6109A9691667J826402J581878k532269R87023r56242J1241K214042j261010J552578
6100B3115310J92473M849j796413O53450L549289j199091j56177K677393J59858
6091B7200941n24661O31269k87637j025154O05695j45856N1566j029486j275371
6082B4201306J374889N54843J492113r18010K150917j761272j108593R08794l54313
6073B6540674j029480R38984j79480p99939k37634R28479m84579J389296j251245
$$ y = [20936442, 21933431, 20898387, 20717746, 20887567, 20613760, 22195394, 21115806, 20603200, 21825492, 22196275, 22229170, 19992433, 22103148, 22553287, 21734451, 20548320, 21788980, 21689723, 20509246, 22639959, 21903958, 19686414, 21742869, 20701086, 21078875, 19691667, 21518069, 23099947, 20567678, 21554701, 20598459, 20609700, 22823742, 21562732, 23115310, 23307783, 23312632, 21516219, 22169669, 25718958, 24519867, 24363690, 27041083, 27200941, 26676280, 27307549, 27019912, 25994758, 26600453, 26454597, 26506163, 25476677, 24201306, 25576195, 26131038, 27623151, 26705141, 28856058, 27094786, 25986193, 26894987, 26540674, 25511194, 26450178, 26270698, 25470759, 25233125, 26161604, 25677025, 27066321, 25815076]
6064B5815076J246431j471639J705080m76284O06570K83086k62134J279371k118771
6055B6606786J153035q72621j623082J494722r92540R90626J289617k183166M008398
6046B9871775j214660O71135L6861j8835m11640L65123j444162J991468N78983
6037C0426048l163248n36328M63750Q80660k9742j310898p00864J376207L53843
6028B7759428o55290l30329J40037j371751J172810K02581j350238R78244O8207
6019B6613699N63158j233958k268464J72991J95809R24190r8227J432207n48462
6010B5752943J02857K022434Q24743J41944k93960n44396j595232K286540k043465
6001B6654408j853961K444314j424531K437650q29100r91425N57953J057923q11198
$$ y = [25815076, 27061507, 25589868, 27294948, 26818664, 27425234, 27708320, 27446186, 28725557, 26606786, 27759821, 26887200, 25264118, 26758840, 25766300, 26756926, 28046543, 25863377, 29871775, 28657115, 29328250, 29365111, 29346276, 28934636, 29299759, 27855597, 29847065, 30426048, 27262800, 26726472, 27190222, 28070882, 28041140, 26730242, 26029378, 27405585, 27759428, 27104138, 26773809, 26913846, 25542095, 26714905, 26917486, 25567248, 26545492, 26613699, 27176857, 25942899, 23674435, 23847426, 24043235, 24967425, 24869198, 26301405, 25752943, 25855800, 27878234, 28702977, 28844921, 28550961, 28006565, 26411333, 28697873, 26654408, 24800447, 27244761, 25820230, 28257880, 27428780, 26437355, 26995308, 28053231, 27242033]
5992B7242033L15372J192410r6003l24344R76758k628619L029131l084879J333739
5983B7955598j655428j407887p61022J944162j066248k50511K331979k535929
5975B4554714K806409k505639K93302K337500j487662j449321J074461K64671
5967B5888435J363838k79702J244000q86425K253537j957156K757551r13019m49852
5958B9021207N28105m34294J916196r61980J681613j305624O45649q42O43835
5949C1733865J862018k16263j520o39214M28463J018181P56266O76758L57125
5940C5975679m2107n33981K763687j50295j602723J518936l74748L992124m64668
5931D1081904J462955K27218N86992L077809K876841M6573J158554L55324N19161
$$ y = [27242033, 27557405, 28749815, 28653812, 28329468, 29306226, 26677607, 29706738, 26621859, 27955598, 26300170, 24892283, 24131261, 26075423, 25009175, 24758664, 27090643, 24554714, 27361123, 24855484, 25148786, 27486286, 25998624, 24549303, 25623764, 25888435, 27252273, 26972571, 28216571, 27330146, 29583683, 27626527, 30384078, 29471059, 29021207, 29549312, 29115018, 31031214, 30069234, 31750847, 30445223, 31090872, 31090030, 31733865, 33595883, 33379620, 33378100, 32738886, 33167349, 34185530, 34941796, 35618554, 35975679, 35933572, 35399591, 38163278, 38012983, 36410260, 37929196, 37554448, 41546572, 41081904, 42544859, 42772077, 43359069, 46436878, 49313719, 49360292, 50518846, 50874170, 51393331]
5922E1393331J097956q21495M36869M25891j614699K876630j545768J458532J630343
5913E5337590K616936l97399J850166k04894J133622k365540j631779n31255k287816
5904E3519631L28807j641598j695050j357429j56213L93767J410437R49272k54890
5895E1496734q1265K103806J251575K313456J026237m24492Q56936J527705K581220
5886F2651912k170823J983871k178265L46936J13326J237957J30345J061125J428430
5877F4604814K162247L219495q62634K294402R09152m03656Q35221k536070K23691
5868G0446662k840008j601895p78397q61921j313300J001315L72328j225613q80385
5859F2318786Q25543R81918j93217j605424k908821j378360o34919q28325k226099
$$ y = [51393331, 52491287, 51669792, 52106661, 52532552, 50917853, 53794483, 52248715, 53707247, 55337590, 57954526, 57557127, 59407293, 59202399, 60336021, 57970481, 56338702, 55807447, 53519631, 53848438, 52206840, 50511790, 49154361, 48998148, 49391915, 50802352, 51751624, 51496734, 51415469, 53519275, 54770850, 57084306, 58110543, 57686051, 58542987, 60070692, 62651912, 60481089, 62464960, 60286695, 60633631, 60746957, 61984914, 62115259, 63176384, 64604814, 66767061, 69986556, 69123922, 71418324, 72327476, 71923820, 72759041, 70222971, 70446662, 67606654, 66004759, 65226362, 64364441, 63051141, 64052456, 64424784, 63199171, 62318786, 63144329, 64126247, 63933030, 62327606, 59418785, 58040425, 57405506, 56577181, 54351082]
5850E4351082L93202j152877k293167K47982n94752r09878M96267J227196o44097
5841E1120958K909503k341973K593885p42812K017968J401208K241837j223224
5833E7977350L31283k939769P55127p88029l33414l08896J576515N7746L58331
5824E6686244l92083o87164J475524J035087K24756k380238K27696l269096l36985
5815E2583741j282188r88827j656841j1528l613775k026358j024597M46752j786551
5806D0639828J827007j538776J38568p59467o20999J547982L48835r13578Q78219
5797D1547619k20443J701349n05538m04373J082228k560655K638248j734999o64936
5788D0878500j418919p03669J558689O4114k029391l50997l29814k271886K872203
$$ y = [54351082, 54744284, 53591407, 51298240, 51546222, 50951470, 50041592, 50537859, 51765055, 51120958, 54030461, 51688488, 54282373, 53539561, 55557529, 56958737, 59200574, 57977350, 58308633, 55368864, 56123991, 55335962, 55002548, 54693652, 56270167, 56327913, 56686244, 56294161, 55606997, 57082521, 58117608, 58342364, 55962126, 56189822, 52920726, 52583741, 51301553, 50312726, 48655885, 48644357, 45030582, 43004224, 41979627, 42426379, 40639828, 42466835, 40928059, 41066627, 40307160, 39686161, 41234143, 41582978, 40669400, 41547619, 41327176, 43028525, 42522987, 42118614, 43200842, 40640187, 43278435, 41543436, 40878500, 39459581, 38755912, 40314601, 40378715, 38349324, 37998327, 37668513, 35396627, 38268830]
5779C8268830J90136j338981J011117k15424J111695L34527j336222L124806J239016
5770D2389500L71642J605645l182738J892311J870290k696591L29841r39933k029280
5761C9610687J584238j632798N27363l384784K531003L73365j075138N73886o65623
5752C8442199J14051K895828k559606J474804J665544J516486J102046N45647
5744D5196999k445297K139263J989181K090531J557627J717155K302797K819238
5736E7367494j769792L928561n33805J017638J518823m03354K28634N37510q6778
5727F1804931l63941J292393k622668K516289k103389L396206L8427J619771L40127
5718F5918146L675433K96664K661932K510842Q44711M466076J67003M227965M080454
$$ y = [38268830, 38458966, 37119985, 38131102, 37915678, 39027373, 39361900, 38025678, 41150484, 42389500, 42761142, 44366787, 41184049, 43076360, 44946650, 42250059, 42579900, 41639967, 39610687, 41194925, 39562127, 40089490, 36704706, 39235709, 39609074, 38533936, 39107822, 38442199, 38556250, 41452078, 38892472, 40367276, 42032820, 43549306, 44651352, 45196999, 42751702, 44890965, 46880146, 48970677, 50528304, 52245459, 54548256, 57367494, 55597702, 59526263, 58992458, 60010096, 61528919, 61125565, 61354199, 61891709, 61804931, 61440990, 62733383, 60110715, 62627004, 60523615, 63919821, 63958248, 65578019, 65918146, 69593579, 69890243, 72552175, 75063017, 75907728, 80373804, 80540807, 84768772, 88849226]
5709H8849226L864277N265655L344078N890516M816304M467886N503445N288028
5701A27289415K717142O209996K347898L112580L815456o92505K820148j980588
5693A45639542j899334n93012l198931l772892L10703l105527k20004m07670J716151
5684A34469026K518186M73942R81325K831684N794853K937947M620472M148605
5676A58776040P282377N411811P863957P481593P590022P616718N007445M853249
5668B11883212M514033L791839L97600J439825k226983k741669l963441p813497
5660B05280919m123171p784486m869081n163803m991374j241500j045592k135087
5652A73926825j794640o8257J219315K090871p27522K381541L097668Q10131L737995
$$ y = [88849226, 92713503, 97979158, 101323236, 107213752, 112030056, 116497942, 122001387, 127289415, 130006557, 136216553, 138564451, 141677031, 145492487, 144799982, 147620130, 145639542, 143740208, 143147196, 139948265, 136175373, 136486076, 133380549, 133160545, 132752875, 134469026, 136987212, 137461154, 138442479, 141274163, 147069016, 150006963, 154627435, 158776040, 166058417, 171470228, 179334185, 186815778, 194405800, 202022518, 207029963, 211883212, 216397245, 220189084, 220586684, 222026509, 219799526, 217057857, 213094416, 205280919, 201157748, 193373262, 188504181, 183340378, 178349004, 177107504, 176061912, 173926825, 172132185, 172063928, 173283243, 175374114, 174646592, 177028133, 180125801, 180935932, 184673927]
5643A84673927L795868M037167M582977M713022L547742N057590P09989L228739
5635B14347021K636237J803739m72400K37016j677362M00056k49119k618340k150006
5626B12256842P4668O00963j7340r00285n37519K457422N45797j142945K055054
5617B15392657J304375J101175j066400O68086R84881L118253Q38173j053037
5609B21288163J226686N1061K307392j025376j063637Q72586j356376k157497
5601B20143002k258730j956298k945611l071034k207035n57055m038604p69123
5593B02339512l051062k021582k250645k734046r89122k192764p27277n065295
5585A83307719j506773j734132j076613k094417k283462k346389k171757l144955
$$ y = [184673927, 188469795, 192506962, 197089939, 201802961, 205350703, 210408293, 211118282, 214347021, 216983258, 218786997, 218314597, 218551613, 216874251, 217274307, 217025188, 214406848, 212256842, 212331510, 212932473, 212915133, 212014848, 211477329, 213934751, 214480548, 213337603, 215392657, 216697032, 217798207, 216731807, 217399893, 218384774, 221503027, 222341200, 221288163, 222514849, 222565910, 224873302, 223847926, 222784289, 223656875, 222300499, 220143002, 217884272, 215927974, 212982363, 209911329, 207704294, 207147239, 203108635, 202339512, 199288450, 197266868, 195016223, 192282177, 191293055, 189100291, 188373014, 183307719, 181800946, 180066814, 178990201, 176895784, 174612322, 172265933, 170094176, 166949221]
5577A66949221j371296k020948k900421k315566j676637k177853k186548j816936
5569A50483016l510024k057937Q98469k168287k203800O48640M81589J154029
5561A43725695J228362j942410j548908L110748k536382j069993q97242J442496
5553A41512366j310995R87386l452841O47468m15130j096535J282252j101218
5545A37052753J240549k380568q19227N56993j587404k247459J651031Q18559
5537A34285227m82874L060790L0740L276687L446030L320811K387682L08720M382690
5528A54016503K031656n70969J163037j257040k497014J790199j700175l58138
5520A52618059J1260l449333j012006k023020j263541k986703q67901k060268
$$ y = [166949221, 165577925, 163556977, 160656556, 158340990, 156664353, 154486500, 152299952, 150483016, 146972992, 144915055, 145813524, 143645237, 141441437, 142090077, 142571666, 143725695, 144954057, 143011647, 141462739, 144573487, 142037105, 140967112, 140069870, 141512366, 140201371, 141188757, 137735916, 138383384, 137968254, 136871719, 138153971, 137052753, 138293302, 135912734, 135093507, 135650500, 134063096, 131815637, 133466668, 134285227, 133802353, 136863143, 136893883, 140170570, 143616600, 146937411, 149325093, 149633813, 154016503, 156048159, 155477190, 156640227, 155383187, 152886173, 154676372, 152976197, 152618059, 152629319, 149179986, 148167980, 146144960, 144881419, 141894716, 141026815, 138966547]
5512A38966547j261941j085148j828230j027787J830263k842276J541021p151
5504A34285298K928313J970539L83982K291959j26725K807952J921567j65758
5496A46297127l492661k1217j302866k539068j165953j812516L62764l899663
5488A32425947R21632j775102k351283O67664l362796M70381j308453K35289K12789
5479A26136068j032950Q01218k390p92177J803276k23886J622817L20768k644896
5470A25987848K513611q23279o45983n59749m76909m3314o85479j406406J50607
5461A24010947q9413R33812p41649p51843J137572k9860J652782N86533q18914
5452A25889967K067644J219774L949000m26672J999377L718K586905p06711o19252
$$ y = [138966547, 137704606, 136619458, 134791228, 133763441, 135593704, 132751428, 134292449, 134285298, 137213611, 139184150, 139568132, 141860091, 141733366, 144541318, 146462885, 146297127, 142804466, 142783249, 141480383, 138941315, 137775362, 135962846, 136325610, 132425947, 133347579, 131572477, 129221194, 129888858, 126526062, 126996443, 125687990, 125923279, 126136068, 125103118, 125904336, 125901946, 125109769, 126913045, 126689159, 128311976, 128632744, 125987848, 128501459, 127678180, 127032197, 126472448, 125995539, 125952225, 125266746, 123860340, 124010947, 123921534, 124855346, 124113697, 123361854, 124499426, 124469566, 126122348, 126708881, 125889967, 127957611, 129177385, 133126385, 132699713, 134699090, 134702808, 137289713, 136583002, 135963750]
5443A35963750J314083j625299O68097M51036j718273J71964j95384j046932m35974
5434A33547068p22470R8753o0562K160940q08293k12816R9180k55708N9526O66614
5424A34572232m24378R38720m66842q08149k43930K054225R79839q73383r17954
5415A34810380J05974L023004j278555Q72587M15676J559685Q82192J606791J022253
5406A43019987J93830N29315P33532n91532J860370j426141l01959J513948M93425
5397A46024775o21607N88447J725972P21649J220936J284323K147758L142708
5389A56234961K602280L486743K263735L401621K765163Q54791J479282j339686
5381A71748890N136085K91840J092864M62874Q20701K080086p16865n07464J76261
$$ y = [135963750, 137277833, 135652534, 136320631, 136771667, 135053394, 135225358, 135029974, 133983042, 133547068, 132824598, 132923351, 132862789, 135023729, 134215436, 134002620, 134101800, 133846092, 133905618, 134572232, 134147854, 135086574, 134619732, 133811583, 133567653, 135621878, 136601717, 135728334, 134810380, 134916354, 137939358, 136660803, 137533390, 137949066, 139508751, 140390943, 141997734, 143019987, 143213817, 143743132, 144476664, 143885132, 145745502, 144319361, 144017402, 145531350, 146024775, 145403168, 145991615, 147717587, 148439236, 149660172, 150944495, 153092253, 156234961, 158837241, 162323984, 164587719, 167989340, 170754503, 171609294, 173088576, 171748890, 176884975, 177176815, 178269679, 178732553, 179553254, 181633340, 180916475, 180409011, 180585272]
5372A80585272K217049K217722J356502J140258K350021L226971K441631L123603
5364A98659029L983160K064124J575067M71177j318388K109395k137841J407615
5356B06813338l5817Q00860j780346m366892m113448R58544k045462k238722k590628
5347A91401427j983458M58128L93350k365453j055258r4534J329024m90938k881984
5338A84710304j779290j647681o97930l063828n147376j685791j589668o991442
5330A62107298l877741m431500l689487m134418m288607l799957k695953n029070
5322A30160565j160006m149939o56428l540105j920538l236620k277067J082821
5314A14302683n15493k910540J59355j931464p60034k012125j132392P09623o49486
$$ y = [180585272, 182802321, 185020043, 186376545, 187516803, 189866824, 193093795, 195535426, 198659029, 202642189, 204706313, 206281380, 206752557, 205434169, 207543564, 205405723, 206813338, 206777521, 207578381, 205798035, 201431143, 197317695, 198276239, 196230777, 193992055, 191401427, 189417969, 189876097, 190269447, 187903994, 186848736, 186754202, 188083226, 187592288, 184710304, 182931014, 181283333, 180585403, 177521575, 172374199, 170688408, 169098740, 162107298, 158229557, 153798057, 150108570, 145974152, 141685545, 137885588, 135189635, 130160565, 129000559, 124850620, 124194192, 120654087, 118733549, 115496929, 113219862, 114302683, 113787190, 110876650, 111036005, 109104541, 108344507, 106332382, 105199990, 105909613, 105260127]
5305A05260127l355876j442046j234776j092891j889877Q31532l855506P03919
5297I3924606k379074k169928j156980k694392N4958j062646k018224O819r10043
5288H1595096q80314o80285l629053l0666l54395P54952k103451k311436p84243
5279G1576205j498196J150452j217823L63207k119899l51161q57951k491811J58329
5270F4711352m30171q03538n99876p57284N72673o29442k03488j918178J72061
5261F0114109J073077k101330j373961J038829j972071J590934l799639M43084
5253E5013032l87727J599075j792921n53462k237334K84905Q28339j118972R418
5244E1644353m06029j238729L80910M7199J111526j482840n62503j698726M98450
$$ y = [105260127, 101904251, 100462205, 99227429, 98134538, 96244661, 97076193, 93220687, 93924606, 91545532, 89375604, 88218624, 85524232, 85579190, 84516544, 82498320, 82505139, 81595096, 80714782, 80034497, 76405444, 76374778, 76020383, 76775335, 74671884, 72360448, 71576205, 70078009, 71228461, 70010638, 70373845, 68253946, 67902785, 67044834, 64553023, 64711352, 64281181, 63477643, 62877767, 62120483, 62693156, 62063714, 61860226, 59942048, 60114109, 61187186, 59085856, 57711895, 58750724, 56778653, 58369587, 54569948, 55013032, 54625305, 56224380, 54431459, 53877997, 51640663, 51925568, 52753907, 51634935, 51644353, 51238324, 49999595, 50380505, 50427704, 51539230, 50056390, 49493887, 47795161, 48293611]
5235D8293611m2952J205267j908003q66312n99846J448481j80209k475866k62686
5226D4611485J840246k655987j122098J433858p45101N72303j771726k059779
5218D0103201K756216r98416j42560m21102n78275k718769K593761j399371j056442
5209C8138243M9774P2892j84626k066188P85700j507286K285318j792037k593405
5200C3188385J615747j249103J466607k639589N04245k487813J454520K26668
5192C2079667j50564j735028J872733k487380Q41407j002287O03577J74339r22016
5183B9274448j282513k07394R64488M89461J024054l440311J81850o13678O2453
5174B6452858R11100l81811p56976P19954J172969j284122l34712j589763M10793
$$ y = [48293611, 48250659, 49455926, 47547923, 46681611, 46081765, 47530246, 47350037, 44874171, 44611485, 46451731, 43795744, 42673646, 44107504, 43362403, 43934706, 42162980, 40103201, 42859417, 41861001, 41718441, 41297339, 40719064, 38000295, 40594056, 39194685, 38138243, 38188017, 38260909, 38076283, 36010095, 36795795, 35288509, 37573827, 35781790, 33188385, 34804132, 33555029, 35021636, 32382047, 32886292, 30398479, 31852999, 32079667, 31929103, 30194075, 32066808, 29579428, 30420835, 29418548, 30022125, 30196464, 29274448, 27991935, 27784541, 28749029, 29238490, 30262544, 26822233, 27004083, 26390405, 26452858, 27363958, 26982147, 26225171, 26945125, 28118094, 26833972, 26499260, 24909497, 25320290]
5165B5320290J768415k301740Q74973M99459l72647j139463j70235Q58699K64831
5156B5602582j75462J145948j692053p63194J45361j565677O05258n32122J270692
5147B4041333N92382L33178j676166R38420J348239k368316M12261k111156K982176
5138B4492351j066996p53051J87448m84576J397854j214065N008N48429r93456
5129B2118946m88599Q71133N30194r43455k6265q1491J775502n22851n93793J625358
5119B4264679j329023L33830O75011k172451j05375J676479Q09237K67552o461
5110B4413478p24909K56399n17716r56786p81704K387676q1250o64497j222568
5101B2108123J505612m74376L276310k462466n8066n824O17339J07606O36571
$$ y = [25320290, 27088705, 24786965, 25661938, 26161397, 25788750, 24649287, 24479052, 25337751, 25602582, 25427120, 26573068, 24881015, 24117821, 24263182, 22697505, 23302763, 22770641, 24041333, 24633715, 24966893, 23290727, 24229147, 25577386, 23209070, 23621331, 21510175, 24492351, 23425355, 22672304, 22859752, 22375176, 23773030, 22558965, 22563973, 23112402, 22118946, 21630347, 22501480, 23031674, 22088219, 22061954, 21980463, 23755965, 23233114, 22639321, 24264679, 22935656, 23269486, 23944497, 21772046, 21666671, 23343150, 24152387, 24419939, 24413478, 23688569, 23944968, 23427252, 22470466, 21688762, 24076438, 23995188, 23330691, 22108123, 23613735, 23139359, 26415669, 23953203, 23895137, 23889313, 24506652, 24614258, 25250829]
5092B5250829k38897J111924O10759m11118K265152q37634L58199O00354k032665
5083B6676903L217038L70683P38720j421625J1615N06800K740686j012115o26338
5074C1202367R2605K419614m47378J45961r10128J007151J190410J691506n74649
5065C5817459j30210Q02532J676411N77230j65689P34550J363696o33561K622923
5056D2665341k721567O59169K391994Q14499P87871J212423P61683J085944K89639
5047D7946996J622130o27157o57156J472725l43567L47683K490712Q34850J126737
5038E4213953J52567K640178j68998R94455r49256J782032J426167M99127J002393
5029F1592618L70746J267677K132895J344649Q37585K336713J275826L059474
$$ y = [25250829, 25011932, 26123856, 26734615, 26323497, 28588649, 27751015, 28109214, 28709568, 26676903, 29893941, 30264624, 31003344, 29581719, 29593334, 30100134, 32840820, 31828705, 31202367, 31294972, 33714586, 33267208, 33413169, 32503041, 33510192, 34700602, 36392108, 35817459, 35687249, 36489781, 38166192, 38743422, 38577733, 39312283, 40675979, 40042418, 42665341, 39943774, 40602943, 42994937, 43809436, 44597307, 45809730, 46571413, 47657357, 47946996, 49569126, 48941969, 48284813, 49757538, 49413971, 49761654, 52252366, 53087216, 54213953, 54366520, 57006698, 56837700, 57832155, 56882899, 58664931, 60091098, 60590225, 61592618, 61963364, 63231041, 65363936, 66708585, 67546170, 69882883, 71158709, 74218183]
5021G4218183Q35729K0320J890527K366242Q31764K138009Q29415N10130K123911
5012H5764230j636166J174030j045017o57456K904064k26976R26255q22706J594588
5003H7974846Q33472J407080J782738K527548J996410K724244J430678M579432
4995A05256448K438449J965529N823518J768264M612063L301534M783992J299239
4987A31249036N606506q99223L080061k40428j888433p46639l042354m69267k121563
4978A30527696j074033k593967k533538J059818J667956P8206K162096k66555
4970A29027679K583368K883304j92665L794128L612245L444990K639361L505106
4962A51297516N540262K734166N963345M025764M162345M812937K668649P12228
$$ y = [74218183, 75053912, 75074232, 76964759, 79331001, 80162765, 82300774, 83130189, 83640319, 85764230, 84128064, 85302094, 84257077, 83599621, 86503685, 86276709, 87202964, 86380258, 87974846, 88808318, 90215398, 91998136, 94525684, 96522094, 99246338, 100677016, 105256448, 107694897, 109660426, 115483944, 117252208, 121864271, 125165805, 129949797, 131249036, 136855542, 135956319, 139036380, 138795952, 136907519, 136160880, 133118526, 132649259, 130527696, 129453663, 126859696, 124326158, 125385976, 127053932, 127132138, 129294234, 129027679, 131611047, 134494351, 134301686, 138095814, 141708059, 145153049, 147792410, 151297516, 156837778, 159571944, 165535289, 169561053, 173723398, 178536335, 181204984, 181917212]
4954A81917212m19234j963458L752326K588953J563283O32028j122515o73603
4946A86274992l790024m691679p473323o040547q153745m238431l803902k108178
4938A45975163j64615j160677J149039Q39925L748128R43837K097301K266602
4930A55694703M282734P50099K330376p2314O27415j540200k413593k776502o602349
4921A50280369k306209m516094l139270j534646m323892k867488l314414N98378
4913A28876734J077492k193685j114088j458515J813206l91064o89367J378396
4905A27299109K273481M00188J023955N23460J600760Q6188R24285j344447j330371
4896A31456608J530735n57488l504765j488349j426700k129751l33321l324124
$$ y = [181917212, 181497978, 179534520, 183286846, 185875799, 187439082, 188071110, 186948595, 186274992, 182484968, 177793289, 170319966, 164279419, 156125674, 151887243, 148083341, 145975163, 145810548, 144649871, 145798910, 146638835, 150386963, 151330800, 153428101, 155694703, 159977437, 160727536, 163057912, 162985598, 163613013, 162072813, 159659220, 156882718, 150280369, 147974160, 143458066, 140318796, 138784150, 134460258, 131592770, 128278356, 128876734, 129954226, 127760541, 126646453, 125187938, 127001144, 126610080, 125920713, 127299109, 129572590, 129972778, 130996733, 131520193, 133120953, 133207141, 134131426, 132786979, 131456608, 132987343, 132429855, 128925090, 127436741, 126010041, 123880290, 123546969, 120222845]
4888A20222845j092989k203671n10297o92282k327364l98366j70925l05309J314370
4879A13836012q81137n70611L85050J637527M90561p76324j301236J888775j903448
4870A12805169K471841j960906R41533K054844N33626Q12942J420701j549232
4862A17530518K277274o6872j086954K018533O94233P33359o45654J426117K467966
4853A25348520l20360J915173J054981J877514l58972L26251j537233N93367K368594
4844A31267835p14720J103751K163492P39679J71405J351468J92878L155555n50512
4835A38880831Q92738l21476n08914J923897l12297k449564J368248M83057K47436
4826A40203956K734717M59762P05404l12794K051944M20090J22005q2581j67316
$$ y = [120222845, 119129856, 116926185, 116415888, 115723606, 113396242, 112997876, 112826951, 112521642, 113836012, 112954875, 112384264, 112769314, 114406841, 114897402, 114121078, 112819842, 114708617, 112805169, 115277010, 113316104, 114257637, 116312481, 116846107, 117659049, 119079750, 117530518, 119807792, 119740920, 118653966, 120672499, 121366732, 122100091, 121454437, 122880554, 125348520, 125028160, 126943333, 127998314, 129875828, 129516856, 129843107, 128305874, 128899241, 131267835, 130553115, 131656866, 133820358, 134560037, 134731442, 136082910, 136275788, 139431343, 138880831, 139773569, 139452093, 138943179, 140867076, 140554779, 138105215, 139473463, 139956520, 140203956, 142938673, 143398435, 144103839, 143791045, 145842989, 146263079, 146385084, 146302503, 146135187]
4817A46135187M70157j461268j75261P24824k61827J063499O11258J325894J237685
4808A49670148L072073m07893J93468P64855M73861K386634n10106L088306Q27225
4799A59558571J178265L280101J313803L334219J808824L930446J422050J994979
4791A77821258M049520L578389K765387K591670J544870L499843K728556L641697
4783B02221190K101629J755479L327949N027478L882288O366182L941571N614046
4775B34237812N863717M627047O606175L517275N295707n05103L520559N95339
4767B63758528K669813K526852o77249O37614L748254M75203J105472J581450
4759B75825937j918961R65662R726J01380j555479j70740j507176j965804k833249
$$ y = [146135187, 146605344, 145144076, 144968815, 145693639, 145431812, 146495311, 147106569, 148432463, 149670148, 152742221, 152334328, 152527796, 153292651, 153766512, 156153146, 155643040, 158731346, 159558571, 160736836, 164016937, 165330740, 168664959, 170473783, 174404229, 175826279, 177821258, 181870778, 185449167, 188214554, 190806224, 192351094, 195850937, 198579493, 202221190, 204322819, 206078298, 209406247, 214433725, 218316013, 224682195, 228623766, 234237812, 240101529, 244728576, 251334751, 254852026, 260147733, 259642630, 263163189, 263758528, 266428341, 268955193, 268277944, 268915558, 272663812, 273139015, 274244487, 275825937, 273906976, 274872638, 274882364, 274983744, 273428265, 273257525, 271750349, 269784545, 266951296]
4750B66951296m98591R87947j600953k287689k082711n104396n807352m735090
4742B45822461o084625k837342n153286k818911l512074m504730l374549l803931
4734B13733013j966095m051270l317175j563892l701083l488645k934814k266443
4726A90443596j140666k103577l523476k552573k744028l719386k134947k354835
4718A70170108k268736n458326K00747k477218m801351l757679q42540k536268
4710A48228737m3861l150820j826385k227981j208665k28155M54974k723846k280864
4701A34993134j025055J112715l135659k324099r36543j053438j308258j563893
4693A24758904L996K0917j477966j919331j039363k892333N09921l81912j983613
$$ y = [266951296, 266452705, 267440652, 265839699, 263552010, 261469299, 256364903, 250557551, 245822461, 239737836, 236900494, 231747208, 228928297, 225416223, 220911493, 217536944, 213733013, 211766918, 207715648, 204398473, 202834581, 199133498, 195644853, 192710039, 190443596, 189302930, 187199353, 183675877, 181123304, 178379276, 174659890, 172524943, 170170108, 167901372, 162443046, 162643793, 160166575, 155365224, 151607545, 150765005, 148228737, 148184876, 145034056, 143207671, 140979690, 139771025, 139542870, 139997844, 137273998, 134993134, 133968079, 135080794, 131945135, 129621036, 128684493, 127631055, 126322797, 124758904, 124762900, 124783817, 123305851, 121386520, 120347157, 117454824, 117964745, 117582833, 115599220]
4684A15599220k288733n72922j696263J812784l076303j320839j006646j94273
4676A07256025k037238J059310L20429j721347j368505r57079j523453K95028
4668A01323170m898j545386j227599j072186P90143r72107n07003j314898J83930
4659I5653166J090899r76626p48430m17426J79920J240533q75802m87680N4698
4650I4713252j156584N62335r64804j587463r02144Q74422q04444q86230m6798
4641H9801542k192398R10360k19997j25701r15239J924991k661142R00303J87757
4632H7610476k778781k43674q62554k076209J126054k469896R53972p17415M0855
4623H0582828J152401M51954k60738J347008L0037L33544P56830K08184K14231
$$ y = [115599220, 113310487, 112737565, 111041302, 112854086, 109777783, 108456944, 107450298, 107256025, 105218787, 106278097, 106598526, 104877179, 103508674, 102551595, 101028142, 101323170, 101318272, 99772886, 98545287, 97473101, 98263244, 97291137, 96784134, 95469236, 95653166, 96744065, 95767439, 95019009, 94601583, 94781503, 96022036, 95146234, 94658554, 94713252, 93556668, 94119003, 93154199, 91566736, 90664592, 91539014, 90734570, 89848340, 89801542, 87609144, 88519504, 88299507, 88173806, 87258567, 89183558, 86522416, 87422719, 87610476, 84831695, 84588021, 83725467, 81649258, 82775312, 80305416, 81259388, 80541973, 80582828, 81735229, 82187183, 81926445, 83273453, 83303490, 83637034, 84393864, 84602048, 84816279]
4614H4816279j54258Q13591l61433j403805r44876j556381J492030j003359M03511
4605H2101299j734812J729820q6575J644282R55200j133574J621330n22277m50186
4596H4124507k759128j357885k99840m97512j086208k439249K27247j587432k19818
4587G4104682k131903L57121N38160n4218q60233l81830M50023j003594j59060
4578G0859148J00633k131737l50992k497047J178080j330291j892318J328166
4570F5263642N36635K17631J851404j056189J527602j378040K11522M96591l53644
4561F7317154j670534n83401j863840j825306P30527j738784k028372j609861
4553E6727583J012953l89418N85900l432628k818676L306885j760022O89904j982822
$$ y = [84816279, 84662021, 85475612, 85114179, 83710374, 82765498, 81209117, 82701147, 81697788, 82101299, 80366487, 82096307, 82009732, 83654014, 84609214, 83475640, 85096970, 84574693, 84124507, 81365379, 80007494, 79707654, 79210142, 78123934, 75684685, 75911932, 74324500, 74104682, 71972779, 72329900, 72868060, 72813842, 71953609, 71571779, 72021802, 71018208, 70859148, 70959781, 68828044, 68477052, 65980005, 67158085, 65827794, 63935476, 65263642, 65800277, 66017908, 67869312, 66813123, 68340725, 66962685, 67174207, 67670798, 67317154, 65646620, 65063219, 63199379, 61374073, 62104600, 60365816, 58337444, 56727583, 57740536, 57351118, 57937018, 54504390, 51685714, 54992599, 53232577, 53922481, 51939659]
4544E1939659j436436o29746j872941k671096K88377P74581k333930O00295j619240
4535D3039523K85385J353532k591280k168583J303895j252490J126220n70289
4527D0525913j340883j457294R80982q44512n57011j29211k16158R23440j997247
4518C5888019p00974Q03733R21245j79875j200882J585036n82805r03444l7798
4509C5592255q26748k290736k79334J046436O78038j255218l308239J95589k21692
4500B9330351O85613o57966R50778N65225O7873j268453O25269Q66461j006996
4491C0158155m87947J130625j141676J806105l608399J062457j821155J510639
4483B8608804L2077n15319K26238r41679J588918J127395l098688K072688J172022
$$ y = [51939659, 50503223, 49873477, 48000536, 45329440, 45617817, 46392398, 44058468, 44658763, 43039523, 43324908, 44678440, 42087160, 39918577, 41222472, 39969982, 41096202, 40525913, 39185030, 37727736, 38708718, 37864206, 37307195, 37177984, 36961826, 37885266, 35888019, 35187045, 35990778, 36912023, 36732148, 35531266, 37116302, 36533497, 35630053, 35592255, 34765507, 32474771, 32195437, 33241873, 33919911, 32664693, 29356454, 29552043, 29330351, 30015964, 29357998, 30308776, 30874001, 30941874, 29673421, 30298690, 31165151, 30158155, 29670208, 30800833, 29659157, 31465262, 27856863, 28919320, 27098165, 28608804, 28640881, 28125562, 28351800, 27410121, 28999039, 30126434, 27027746, 29100434, 30272456]
4474C0272456r8927O61603k24798K486307j166541J056997K975849J523686J731075
4465C9217707Q62703o75605K65143j766052l90699l542447J523458K71542k915269
4456C2850481j642308P64718l00121M7651l2066q99549m54101l9614J309669N41795
4446C2146555L85383r55785J301718J332809L214443R62730J649992M46836M838534
4437D5323215L820681k604425J840280l067923R38200j889507k258193n66354
4429D1535974j540480k391078O60514p06214q07747k16193k12843j360224J245477
4420C6207186J010967k701874J686911L12870K100415l18444p04242J224053n76226
4411C8241616J468874m55130K408585m52985J065563P237l700378J048045l487284
$$ y = [30272456, 30173529, 30835132, 30610334, 33096641, 31930100, 32987097, 35962946, 37486632, 39217707, 40080410, 39404805, 39669948, 37903896, 37513197, 33970750, 35494208, 35765750, 32850481, 31208173, 31972891, 31672770, 31720421, 31688355, 30788806, 30334705, 30295091, 31604760, 32146555, 32531938, 31576153, 32877871, 34210680, 37425123, 38387853, 40037845, 40484681, 45323215, 49143896, 46539471, 48379751, 45311828, 46250028, 44360521, 42102328, 41535974, 39995494, 37604416, 38264930, 37558716, 36750969, 36534776, 36321933, 34961709, 36207186, 37218153, 34516279, 36203190, 36516060, 38616475, 38298031, 37593789, 38817842, 38241616, 39710490, 39255360, 41663945, 41210960, 42276523, 42283760, 38583382, 39631427, 36144143]
4402C6144143P55704m07788j594314J180495j139604J837147m82081J734078J60395
4393C8188175M43375n4j903474j23009J538179j042219m3647l99126n3277k9795
4383C6575128j606620r02740M18045j319632J245854o11660j294831K266872r17634
4374C3852782J050955m53923K744201p49105q08298L13373J29187J151772J651483
4365C8882427J168830M99728K515887j515528m87341k39304k006511J752012l540313
4356C7029887J234210J873078K003202J578318R33581J113412J557002M2305n38657
4347D6826338k613799P70761k557465K53795J027695j466322O09512l60429k00456
4338D2289630K379503j333396Q32571K295039k22979N39720R47244O51694L663207
$$ y = [36144143, 36899847, 36492059, 34897745, 36078240, 34938636, 36775783, 36293702, 38027780, 38188175, 38631550, 38631496, 36728022, 36605013, 38143192, 37100973, 37057326, 36658200, 36604923, 36575128, 34968508, 34065768, 34483813, 33164181, 34410035, 33798375, 32503544, 34770416, 33852782, 34903737, 34449814, 37194015, 36444910, 35636612, 35949985, 36079172, 37230944, 38882427, 40051257, 40550985, 43066872, 41551344, 41064003, 40824699, 38818188, 40570200, 37029887, 38264097, 40137175, 42140377, 43718695, 44652276, 45765688, 47322690, 47364995, 46826338, 44212539, 44983300, 42425835, 42679630, 43707325, 42241003, 42850515, 42490086, 42289630, 44669133, 43335737, 44168308, 46463347, 46240368, 46780088, 47727332, 48379026, 52042233]
4329E2042233l80019M977214J376074O709752O538668N874910P849834M336444
4321H9325110O771989N711836J365332M255517K150141L87177p78063m484796
4313A04704243l113498n805072q154646o535227q385288m442257n804917n492100
4305E6971238m406335l299068k028189j462746l306953j077972K102964j111102
4297D2381837J287215M03357J92030j283342j387536J73749r20147j385770l956415
4288C5504978k009658k98309r96613j215246j297048j558520j87622m28913Q73125
4279B8386174j439562j11024j070749K97154l039290J25917j132138J01279q99528
4270B1218233r99387p62451P02977o72934j62704j741446J492209k252944l56940
$$ y = [52042233, 51662214, 56639428, 58015502, 64725254, 71263922, 77138832, 84988666, 89325110, 96097099, 101808935, 103174267, 107429784, 109579925, 109967102, 109189039, 104704243, 101590745, 95785673, 87631027, 81095800, 72710512, 68268255, 62463338, 56971238, 52564903, 49265835, 47237646, 45774900, 42467947, 41389975, 43492939, 42381837, 43669052, 44072409, 44264439, 42981097, 41593561, 41767310, 40847163, 39461393, 35504978, 33495320, 33197011, 32200398, 30985152, 29688104, 28129584, 27941962, 27513049, 28386174, 26946612, 26835588, 25764839, 26061993, 23022703, 23148620, 22016482, 22117761, 21218233, 20218846, 19456395, 20159372, 19486438, 19323734, 17582288, 19074497, 16821553, 16464613]
4261A6464613k23082j096696N39972j701329K265078l98207J28736Q24005j140479
4252A5662611j661668p2594J968116n08342r30481j527057M72283N00973J60610
4243A4064451j125421J82430j274315O88417L58091r08200o08321Q25733j212793
4234A0990072J670884r62142P8034k99491j82047l95054j853885R08599L38062
4225A0293032m47962r4653k88761J356703p43831L01881k29159j692473K422827
4216A0877604l40178q51765n93113o34425J248381l89214o58488J449986M10182
4207A0518970r57066n37367J59768O55624k435535m04792R53139J686859p09985
4198H929615k292j182209J801533O45432k396846o77521J229378k732286L152971
$$ y = [16464613, 16241531, 15144835, 15684807, 13983478, 16248556, 15850349, 15979085, 16803090, 15662611, 14000943, 13928349, 15896465, 15388123, 14457642, 12930585, 13402868, 13903841, 14064451, 12939030, 13121460, 11847145, 12535562, 12893653, 11985453, 11377132, 12202865, 10990072, 12660956, 11698814, 11776848, 11477357, 11295310, 10900256, 9046371, 9954970, 10293032, 9845070, 9750417, 9461656, 10818359, 10074528, 10376409, 10147250, 8454777, 10877604, 10537426, 9685661, 9092548, 8458123, 9706504, 9317290, 8658802, 10108788, 10518970, 9561904, 9024537, 9184305, 9839929, 7404394, 6999602, 7952741, 9639600, 8929615, 8927323, 7745114, 9546647, 10192079, 7795233, 7117712, 8347090, 5614804, 8767775]
4189H767775j828718J058952K52527p75933r150k37004j228434Q93791N26861
4180G420667r96505N09181M15395j42871L41724N53706M06980j733743J606538
4171H381072l460420J717065j212338L61760J6965K162538j643999M08218m14184
4162F316677Q00695J50896o63699j609176K569738M49086q4296k700127k14314
4153E015480L769108k902660J474261k064647P35766J264320l066190J529520
4145E754958J651642K3892o3384m49706j59783o28141j39859j589636J658755
4136F058738r47460J837432n09471j419037k25705J557806k27201r34126O84469
4127E875445j320048K593284j115829j131286l34754K160994p27045P8978J89669
$$ y = [8767775, 6939057, 7998009, 8250536, 7474603, 7465453, 7228449, 6000015, 6893806, 7420667, 6424162, 6933343, 7348738, 7205867, 7547591, 8101297, 8508277, 6774534, 8381072, 4920652, 6637717, 5425379, 5787139, 5804104, 7966642, 6322643, 6730861, 6316677, 7117372, 7268268, 6604569, 4995393, 7565131, 8014217, 7929921, 5229794, 5015480, 8784588, 5881928, 7356189, 5291542, 6027308, 7291628, 4225438, 5754958, 7406600, 7430492, 7367108, 6917402, 6757619, 6129478, 5989619, 4399983, 6058738, 5111278, 6948710, 6439239, 5020202, 4794497, 6352303, 6125102, 5190976, 5875445, 4555397, 7148681, 6032852, 4901566, 4566812, 6727806, 6000761, 6079739, 6269408]
4118F269408j44154p7873k531521L042269R05445k717282J956379p21060k212197
4109C769414J301531N52835o1774o92123O22964J003618l29119k09264k435140
4100C522942J225462m67238m6134P47855N18641j129685o35861J186525j27121
4091D795386L554P25049L22076j121669J353165j390618k22574J935659j288969
4082E111059J346571j900127K263561o07602j385577N9300P29114K09690N82022
4073F408011r09091m75429K030623p11782J267497l403534P29809J422058O70078
4064G028240k616031J044026k7903J331212O61280l96927J116058M10979l03595
4055H247339j351864J809909L97690j537501K37190M27080N80594j37844n11229
$$ y = [6269408, 6125254, 6047381, 3515860, 6558129, 7463574, 4746292, 6702671, 5981611, 3769414, 5070945, 5623780, 5562006, 4869883, 5492847, 6496465, 6167346, 5958082, 3522942, 4748404, 4281166, 4235032, 4982887, 5501528, 4371843, 3735982, 4922507, 4795386, 4798940, 5523989, 5846065, 4724396, 6077561, 4686943, 4464369, 6400028, 5111059, 6457630, 4557503, 6821064, 6213462, 4827885, 4887185, 5616299, 5825989, 6408011, 5498920, 5023491, 7054114, 6342332, 7609829, 4206295, 4936104, 6358162, 7028240, 4412209, 5456235, 5428332, 6759544, 7420824, 7023897, 8139955, 8550934, 8247339, 6895475, 8705384, 9103074, 7565573, 7802763, 8229843, 8810437, 8672593, 8161364]
4046H161364R66097M96319p02374m34708J301758n61570m10728J860900q15380
4037I861678j038012K080528j553711J827787j05759p51826J794172j079985j226716
4028I808156K555958r00713K70621P15747k15028L183441j515260l17705P91662
4019A4376879o27649L15744r44524J677067j307597m11j703031P19727n23457
4010A1982748j304762J080294k73475J391545j755105m29618j487918L697192
4002A2900901j868340J054589p792Q69505R14935j208929O48580N69088k485948
3993A1386589J520632n22602Q5162j64090m9832p08331L33589k72780N35416j323719
3983A0820034l66328q61210m8243j107689K235747k739367R36188J027762L98630
$$ y = [8161364, 9127461, 9623780, 8921406, 8486698, 9788456, 9226886, 8816158, 10677058, 9861678, 8823666, 10904194, 9350483, 11178270, 11072511, 10320685, 12114857, 11034872, 9808156, 12364114, 11463401, 11734022, 12449769, 12234741, 15418182, 13902922, 13585217, 14376879, 13749230, 14064974, 13120450, 14797517, 13489920, 13489509, 11786478, 12506205, 11982748, 10677986, 11758280, 11484805, 12876350, 11121245, 10691627, 9203709, 12900901, 11032561, 12087150, 12079358, 12948863, 13863798, 12654869, 13303449, 13872537, 11386589, 12907221, 12384619, 12469781, 12305691, 12255859, 11547528, 11881117, 11608337, 12143753, 10820034, 10453706, 9592496, 9544253, 8436564, 10672311, 7932944, 8869132, 9896894, 10295524]
3974A0295524Q99876j475303k31652r43712J79397J270521l99581j605261J184160
3965I173969M08500j373007r62907o25115R86530q56124J347201k324509J619409
3956G393947j064126l54752M50408n19209J610514p35900k043633r38365K931412
3947F730296o96703L33975N69890j272657J35369J444285j51073j371366j520817
3938D201199J481468j377139j31685k82416M29325K01083o57376N38700K8624
3929D431783M08131N296k727911J615840J021220m09847L85234j223506J167286
3920D673526j510757j156030J345930r48471Q46290Q14412M36362j951009N41610
3911C091863j137670L326899o61440j35273j154828o35998j349643K510776L99661
$$ y = [10295524, 11195400, 9720097, 9488445, 8544733, 8724130, 9994651, 9595070, 7989809, 9173969, 9582469, 8209462, 7246555, 6621440, 7607970, 6751846, 8099047, 5774538, 7393947, 6329821, 5975069, 6425477, 5906268, 7516782, 6780882, 4737249, 3798884, 6730296, 6033593, 6367568, 6937458, 5664801, 5800170, 7244455, 7093382, 5722016, 4201199, 5682667, 4305528, 4173843, 3891427, 4320752, 4521835, 3864459, 4403159, 4431783, 4839914, 4845210, 2117299, 3733139, 4754359, 4344512, 4729746, 3506240, 4673526, 3162769, 2006739, 3352669, 2404198, 3250488, 4064900, 4501262, 2550253, 3091863, 1954193, 5281092, 4619652, 4484379, 3329551, 2693553, 1343910, 3854686, 4254347]
3902D254347j435717r57708K636957j291567o02056j198766R65713K52294J8442
3893B641939J727421j692150J342691N1231j845445J661601J74672J716361j441540
3884D336781k044007J119467q39977Q16097j578564J367207M6817K72195p17524
3875B778492k954013L377847J58849L17539j979266k46654J625762k04968j01082
3866B772506l91986p16797O00791K45606p96928N97463J827897j795468j38536
3857B204548m97786P40819K75461q15357r24144J893512j287716J52367O54408
3848B396112L26628J08899q92841J34187J945188j756699M37374j594310O76796
3839A781334j667639J303780o87285R90722J277791j405626j55582J830158j960944
$$ y = [4254347, 2818630, 1860922, 4497879, 3206312, 2604256, 1405490, 2371203, 2623497, 2641939, 4369360, 2677210, 4019901, 4071132, 2225687, 3887288, 4061960, 5778321, 4336781, 2292774, 3412241, 2572264, 3388361, 1809797, 3177004, 3223821, 3496016, 2778492, -175521, 3202326, 3361175, 3678714, 1699448, 1452794, 3078556, 2873588, 2772506, 2380520, 1663723, 2264514, 2510120, 1713192, 2310655, 4138552, 2343084, 2204548, 1706762, 2447581, 2723042, 1907685, 983541, 2877053, 1589337, 1741704, 2396112, 2722740, 2831639, 1938798, 2072985, 4018173, 2261474, 2698848, 1104538, 1781334, 113695, 1417475, 730190, 1720912, 2998703, 1593077, 1437495, 3267653, 1306709]
3830A306709J261893j67679q21763n7900J571708j230089j010266J96303n15471
3821E33445K45285J416076p0397o71706r71947o58356J711315M43172k47870J294075
3811C023092L99619K50392n75738j735160J412802m72599O48054j875947J152627
3802B227142P29312o80290j21268j176645J464342n01326r67154J435159j292441
3793A116831J215681j704255L11846P48136l85345K689493k787269J213447o91639
3784A726926p73448O00452j470186K339361j427631J54374J655314n73438k03211
3775B028513l50403j039335N33323J504660j175186l86154J671538N12757n22193
3766B777520k512168O55641M16914K078537k238361K192088j959680M19625J91332
$$ y = [1306709, 2568602, 2400923, 1579160, 1521260, 3092968, 1862879, 852613, 1048916, 533445, 778730, 2194806, 2124409, 1452703, 480756, -177600, 1533715, 1976887, 1729017, 3023092, 3422711, 3673103, 3097365, 1362205, 2775007, 2302408, 2950462, 1074515, 2227142, 2956454, 2276164, 2154896, 978251, 2442593, 1941267, 974113, 2409272, 1116831, 2332512, 628257, 940103, 1688239, 1302894, 3992387, 1205118, 2418565, 1726926, 953478, 1553930, 83744, 2423105, 995474, 1149848, 2805162, 2231724, 2028513, 1678110, 638775, 1172098, 2676758, 1501572, 1115418, 2786956, 3299713, 2777520, 265352, 920993, 1337907, 3416444, 1178083, 3370171, 1410491, 1830116, 2021448]
3757B021448j264577J282279k58900J725628j556505k63319J51834l3044j507372
3748B97472J258636L86271k31833O08479k144501Q87617O4653P49617N18995j75757
3738B219649K00725k049028M20416L37095J860307J252821k816190o75314J626059
3729B376540j6663m22038j831930R56327j925049K532792n88049m11519K08607
3720H79018Q88262j627985Q56372n33904K420915j893252n73301J320194j3791
3711A722528j969214K652513j933292K664389k417454J061694j937412J241651
3703A085403j272920J429298O55983p46711J662934k714872J190081Q17613L67983
3694B474792k6839j906470Q69909J298232L12044k262427o00478P31272J553416
$$ y = [2021448, 756871, 2039150, 1780250, 3505878, 1949373, 1686054, 1837888, 1804844, 297472, 1556108, 1942379, 1710546, 2319025, 174524, 1062141, 1126794, 1876411, 2395406, 2219649, 2420374, 371346, 791762, 1128857, 2989164, 4241985, 1425795, 750481, 2376540, 2359877, 1937839, 105909, 1062236, -862813, 1669979, 1081930, 670411, 879018, 1767280, 139295, 995667, 461763, 2882678, 989426, 416125, 1736319, 1722528, -246686, 2405827, 472535, 3136924, 719470, 1781164, -156248, 1085403, -187517, 1241781, 1897764, 1151053, 2813987, 99115, 1289196, 2106809, 2474792, 2447953, 541483, 1411392, 2709624, 3021668, 759241, 158763, 890035, 2443451]
3685B443451J154149k018493j944175J208651J085867k52111K22444o13128m77014
3676H09641R48804k82279N19505p45297J477901j29362k800353K120735l72028
3667A547267N95422L9279l283776L876609j530975P27402q53983k12775K743493
3658C647963k264234j01967l35027J958111J17509m11305k177826j145092K056974
3649A345106J901790n88050j689893M47440O04225m36752m58956J064227m91462
3640A697675J57470q91400K13799N44330r29627m62259j244517K595935n3292
3631A628114j68847N96242k492940K877459j097132J15477K08238j574996J145035
3622A236650J07o58260R77158k166217K840908j552641J383834j562431J123610
$$ y = [2443451, 3597600, 1579107, -365068, 843583, 1929450, 1677339, 1899783, 1286655, 809641, 1758445, 1476166, 1995671, 1250374, 2728275, 2598913, -201440, 1919295, 1547267, 2142689, 2181968, -1101808, 2774801, 1243826, 1971228, 1117245, 904470, 3647963, 1383729, 1281762, 946735, 2904846, 3022355, 2611050, 433224, -711868, 1345106, 3246896, 2658846, 968953, 1416393, 2020618, 1583866, 1124910, 2189137, 1697675, 1855145, 963745, 1177544, 1721874, 792247, 329988, -914529, 1681406, 1628114, 1459267, 2055509, -437431, 2440028, 1342896, 1458373, 1666611, 91615, 1236650, 1236757, 578497, 1555655, -610562, 2230346, 677705, 2061539, 499108, 1622718]
3613A622718j093319P29040l69525O49028l60513J219523j386677O90137N30832
3604B231244j077077R57230j192384J55011Q72574k265428K390892O02572j488921
3595A185713J576026j574884P26698q02974M9779L30189q12692Q20916K77772
3586A776543O18795k427750K179987O49216M2323j347598j059423J087565j395669
3577A23989j765692L468584r79646K29516J680595m91321p44572K70685m26418
3568A365720J380924j467425J647412k930905J074207j601137K818215p02267
3560A584744J641377j966111l43665p26171J307533j488735J450022j315043J409046
3551A552997o08671P45564J571259k921461Q85043N71975J29862J78708k312120
$$ y = [1622718, 529399, 1258439, 888914, 1537942, 1177429, 2396952, 1010275, 1700412, 2231244, 1154167, 2111397, 919013, 1074024, 1946598, -318830, 2072062, 2674634, 1185713, 2761739, 1186855, 1913553, 1110579, 1160358, 1490547, 677855, 1498771, 1776543, 2395338, -32412, 2147575, 2796791, 2839114, 1491516, 432093, 1519658, 123989, -1641703, 1826881, 847235, 1076751, 2757346, 2266025, 1521453, 1792138, 1365720, 2746644, 1279219, 2926631, -4274, 1069933, -531204, 2287011, 1584744, 3226121, 1260010, 916345, 190174, 1497707, 8972, 1458994, 143951, 1552997, 944326, 1689890, 3261149, 339688, 1224731, 1796706, 1926568, 2105276, -206844]
3542b06844K449513n88820j247017N9534M82599P59849l09738l050685J613312
3533c8297J617055j718329J750194k561430L944814k023535N57872j045687J360426
3524A843083j919276M08246j917430J234724J314305N45110p98996j36551P20418
3515A293633J175430k619526j199011K940095m66571j001411R7894O29021k86889
3506E62665R94321o08830j66426p33497Q95733M42638j595066R42528m47050K80754
3496E67770N15814K033566j466863j809616J67417q52518J259271N07336j57310
3487G64867N10129j061609Q28392n67995O12887j061953R43014n8873J16042M33455
3477A458356o15055j523619J061119J728547L34652o28344q46479m35218P41389
$$ y = [-206844, 2242669, 1653849, 406832, 466366, 948965, 1708814, 1399076, -1651609, -38297, 1578758, -139571, 1610623, -950807, 2994007, 970472, 1528344, 482657, 1843083, -76193, 332053, -1585377, -350653, 963652, 1508762, 709766, 573215, 1293633, 2469063, -150463, -1349474, 1590621, 1124050, 122639, 220533, 849554, 562665, 1556986, 948156, 781730, 48233, 943966, 1386604, -208462, 734066, 287016, 567770, 1083584, 3117150, 1650287, -159329, 8088, -844430, 414841, 922177, 764867, 1274996, 213387, 1041779, 473784, 1086671, 24718, 967732, 908859, 1024901, 1458356, 843301, -680318, 380801, 2109348, 2444000, 1815656, 969177, 533959, 1275348]
3468A275348p74798M73901n53325R12215R10817p57349k13814M02825K071946
3459C747766k919575R57816J472820j220953j440434N22418J269536j804740j146346
3450e61692R70916J418318m18066R5716l83989Q34799j263646M38625k68071k2920
3440H39990L63284P26973k043179K6927K315243j436844J958949n45431k035319
3431A70593J404995N92538j173923K795347n78407k342203J895923m68377m88864
3422A807622k55583n76871j70468K175084j361762Q23860l75219j002631L353912
3413D417944k380563q52233k40941R45971j769037J585123r64892L69485k12833
3404H98024J433179k195236J254796Q62891k540003L385997j254378J476267j559740
$$ y = [1275348, 500550, 974451, 421126, 1333341, 2244158, 1486809, 1272995, 1675820, 3747766, 828191, 1786007, 3258827, 2037874, 597440, 1119858, 2389394, 584654, -561692, 409224, 1827542, 1409476, 1505192, 1121203, 1956002, 692356, 1130981, 862910, 839990, 1203274, 1930247, -112932, -86005, 2229238, 792394, 2751343, 2205912, 170593, 1575588, 2168126, 994203, 3789550, 3211143, 868940, 2764863, 2296486, 1807622, 1552039, 975168, 804700, 2979784, 1618022, 2441882, 2066663, 1064032, 4417944, 2037381, 1185148, 944207, 1890178, 121141, 1706264, 741372, 1110857, 898024, 2331203, 135967, 1390763, 2253654, -286349, 3099648, 1845270, 3321537, 1761797]
3395A761797l71111K686703k572293M48124n92982K659355k412782P85571m40238
3386A952144J63507K94014J309370J606560k133088k71174J668691J264477r80251
3377D874250q05548k007869K331252j588521N68979k557766K321267J01852m44219
3368B793677o96712q75265P5924l92122J037788k340517K10343K567435K47785
3359B628336n30921j799987k02374J388577O83623N12370m256666J903958P24520
3350A051436J067739j834998K443549j905325M99604k470333J717448j43610J230614
3341A656124j59011j045779n5192R04025j189133M91972J57336J700403J823952
3332D284697l622461K74746L39034L79807J083752l31376J67755m80504J536678
$$ y = [1761797, 1390686, 4077389, 1505096, 1953220, 1360238, 4019593, 1606811, 2392382, 1952144, 2115651, 2409665, 3719035, 5325595, 3192507, 2921333, 4590024, 5854501, 4874250, 4068702, 2060833, 4392085, 2803564, 3372543, 814777, 3136044, 3237896, 2793677, 2096965, 1221700, 1297624, 905502, 1943290, -397227, -186884, 2380551, 2628336, 2097415, 297428, 95054, 1483631, 2167254, 2679624, -1577042, 326916, 1051436, 2119175, 284177, 2727726, 822401, 1322005, -1148328, 569120, 425510, 1656124, 1497113, 451334, 396142, 1300167, 111034, 603006, 760342, 2460745, 4284697, 662236, 936982, 1276016, 1655823, 2739575, 2408199, 2575954, 2095450, 3632128]
3323C632128k524092J186994j443520O98450p6589J025448m60991K58059k387117
3314i1230O09664J459479L65939K95677p37961j601911J340620q71188j37540
3305F31549J147556j458085K533818j429943j73980L13713N55753K13527P20476
3296C054384m07060J56438p52892k185835L383892j170001P14923k724575J818862
3287A888136l40753P95008j861854O06534j257580P14914m41893K023259j573442
3278E52329o4925O14462J038914Q25678j700943j949889m97509P03410J566400
3269A087927L91785j981898j171754L122930j819862L275426o60147j61369M26148
3260B509186k169013Q35587l12134R72284k11441m6392j016132J698107j238389
$$ y = [3632128, 1108036, 2295030, 851510, 1549960, 1473371, 2498819, 2037828, 2295887, -91230, 518434, 1977913, 2343852, 2639529, 1901568, 299657, 1640277, 769089, 631549, 1779105, 321020, 2854838, 1424895, 1250915, 1564628, 2120381, 2333908, 3054384, 2647324, 2803762, 2050870, -134965, 3248927, 2078926, 2793849, 69274, 1888136, 1547383, 2342391, 480537, 1087071, -170509, 544405, 102512, 2125771, 552329, 487404, 1101866, 2140780, 2966458, 1265515, -684374, -1181883, -478473, 1087927, 1479712, -502186, -1673940, 1448990, -370872, 2904554, 2244407, 2083038, 2509186, 340173, 1175760, 863626, 1835910, 1624469, 1578077, 561945, 2260052, 1021663]
3251A021663j095692r62814J458235J630629j801359j099463J037752O41689r71839
3242a41199J145352P86669l91473K59275K32072j178924M67321k777676M12353
3233a186230K858212m77247J195592j908824J494089O31099o60253k547510N93370
3224g702J215158m85722K651000j575351j505257O67357Q49969n96731m17224
3215G95497J91439n18466R65163q07720K673n49367K483417k522452K671125j542729
3205A168580l74717r66274R61324l46573p00675K459131p26419P79016o96838
3196A556555j259833K864840j463118n11450o86976n54666R52245J110924l717113
3187a708592K516259K27811m94717j065333J666326m88245J029858j945183N52130
$$ y = [1021663, -74029, -1036843, 421392, 2052021, 250662, -848801, 188951, 830640, -141199, 1004153, 1790822, 1399349, 1658624, 1890696, 711772, 1179093, -1598583, -1186230, 1671982, 1194735, 2390327, 481503, 1975592, 2606691, 1946438, -601072, -7702, 1207456, 721734, 3372734, 1797383, 292126, 959483, 1809452, 1212721, 795497, 986936, 468470, 1433633, 625913, 628586, 79219, 2562636, 40184, 2711309, 1168580, 793863, -172411, 788913, 442340, -258335, 2200796, 1474377, 2253393, 1556555, 296722, 3161562, 1698444, 1186994, 500018, -54648, 897597, 2008521, -1708592, 807667, 1035478, 540761, -524572, 1141754, 653509, 1683367, -261816, 290314]
3178B90314J024846J324700k322147P18853n95778j172284L595325k781776J234883
3169A316936l51403j03635J72595J209284j075868N21561j01213j842926J432986
3160A178317j299420O75007J135520r85502K771468o08157l010055Q51475q24960
3151a16307P52160j81708Q36657p68606J455071j617326J345314j950579o29598
3142h74922J104266K173090l051359L73825j081523P15508L749371k934002N11897
3133F86151J981698j097934j260238J336967j791602J449878l24015j153670J547884
3124A375119j743052Q27048J695936k218441M55618r01778n14701K261400j96339
3115A040810O30123k41245O10957j588966J290925p0053J218848n26606o56403
$$ y = [290314, 1315160, 2639860, 317713, 1036566, 440788, -731496, 2863829, 82053, 1316936, 965533, 861898, 1034493, 2243777, 1167909, 1689470, 1588257, -254669, 1178317, -121103, 553904, 1689424, 703922, 3475390, 2867233, -142822, 708653, -116307, 635853, 454145, 1290802, 522196, 1977267, 359941, 1705255, -245324, -874922, 229344, 2402434, -648925, -275100, -1356623, -641115, 3108256, 174254, 686151, 2667849, 1569915, 309677, 1646644, -144958, 1304920, 980905, -172765, 1375119, -367933, 459115, 2155051, -63390, 392228, -509550, -1024251, 1237149, 1040810, 1670933, 1429688, 2040645, 451679, 1742604, 1672551, 2891399, 2364793, 1708390]
3106A708390j083668M23091k598550L707869k056404J435034P9389J097025k82938
3097B429238j588059l32860j297394K842217k102484J608933j574414J339853
3089A325030p08125l67593Q39053q37483J823921k053985k08466N77601N49220
3080I39173p90433L60493l11329Q73734M64519j412029P59882N1108j47212j86744
3070F01162o59312J571551o84037J44740M46345j175352J051328j127004r25851
3061g56430K041600o91774J767972j566348J238550K03002j179937O0828j485198
3052c67735J751671J018129l67170j635210k34106j34618o85920J054624J007738
3043A407403m58231q85587J4000j113763K271669k987273M859056k519733R04147
$$ y = [1708390, 624722, 1047813, -1550737, 2157132, 100728, 1535762, 1615151, 2712176, 2429238, 841179, 508319, -789075, 2053142, -49342, 1559591, -14823, 1325030, 616905, 249312, 1088365, 250882, 2074803, 20818, -187648, 389953, 939173, 148740, 509233, 197904, 1071638, 1536157, 124128, 884010, 935118, 787906, 601162, -58150, 1513401, 829364, 974104, 1420449, 245097, 1296425, 169421, -756430, 1285170, 593396, 2361368, 795020, 2033570, 2236572, 1056635, 1117463, -367735, 1383936, 2402065, 2034895, 399685, 165579, 30961, -654959, 399665, 1407403, 949172, 63585, 77585, -1036178, 1235491, -1751782, 3107274, 587541, 1491688]
3034A491688K86770k010024k687194K574007K022611j505740K661054j940218
3026H92954J237447r08560j387475K69816N06571O95870N04690j070639m99620
3017B41054K83619K92675p40229J617953j594577O67898p44963J203614p36327
3008D90717m55825J83854L06174Q38126M69137j066590q33799l63870K219264
2999A787188j701695j676857L430703q76718P42150k701387K074542n26205m10133
2990A41588j60660j130830L161342N93408j138251m10536k019877L766840k210853
2981E92171k86094r3331n09295K068124j19636l69227k043555K215066M82455
2972A936678j410483L19045j893842J925504O34835j114797j68253m20925K302768
$$ y = [1491688, 1778458, -231566, -2918760, -344753, 1677858, 172118, 2833172, 892954, 2130401, 1221841, -165634, 104182, 610753, 1306623, 1811313, 740674, 241054, 524673, 817348, 77119, 1695072, 100495, 768393, 23430, 1227044, 490717, 34892, 218746, 524920, 1363046, 1832183, 765593, -68206, -432076, 1787188, 85493, -1591364, 1839339, 962621, 1704771, -996616, 1077926, 551721, 141588, -19072, -1149902, 2011440, 2604848, 1466597, 1056061, -963816, 2803024, 592171, 306077, 212746, -296549, 1771575, 1651939, 1282712, -760843, 1454223, 1936678, 526195, 845240, -1048602, 876902, 1511737, 396940, 228687, -192238, 2110530]
2963B110530R47804j768068n11622m10456J209355j023365l94663m42747K4852
2954b58380J358008o00529j78246K92018J623158k200882M96516J415952P12397
2945B660012j731898N21587j119274P63787O74080j893317J464256j263615J153207
2936A228825l98404k374125L433072j178208Q51354j83570J89684k66912k7358
2927A274358J690777j580202L10203j267j251154P27723m29727j524809l83156
2918a167254M25412L188210j018927j155058j63706r42912P72449J042012o88846
2909B91380K02568n27327J112713j0277j549160K722963j725812Q69129j304304
2900H1873k96900M18612j001716M48392N11184O4029J888566j669903r18295J010139
$$ y = [2110530, 3058334, 1290266, 778644, 368188, 1577543, 554178, 159515, -283232, -258380, 1099628, 499099, 320853, 612871, 2236029, 35147, 531663, 1947615, 2660012, 928114, 1449701, 330427, 1094214, 1768294, -125023, 1339233, 75618, 1228825, 830421, -1543704, 1889368, 711160, 1562514, 1378944, 1568628, 1301716, 1274358, 2965135, 1384933, 1695136, 1693869, 442715, 1170438, 740711, -784098, -1167254, -741842, 2446368, 1427441, 272383, 108677, -834235, -61786, 980226, 291380, 493948, -33379, 1079334, 1069057, -480103, 2242860, 517048, 1386177, 81873, -215027, 203585, -798131, -349739, 161445, 225474, 2114040, 444137, -474158, 535981]
2890E35981o42281J138589K68342n77966J319230j458161O55447k53382q24536
2881A61263J955546N85173j527971j834430j111656K490028Q27097m12163J02937
2872A235824k44289n40844o28307K68556n94797J394723K875298l781914k89367
2863c05117J413007l77141J586155m88215k625923K320235O02266o04597j6339
2854A504331l21256R01028O15508q00188J155894j294534j770453J203722j57723
2845A036329j88716q58352J345873q76828L28947K58419m31095P28496j78051
2836A165022P7565p52786l40494K92319P19988o5933k168328J970835p3807Q58724
2826A683105j836179N19455q6310j846961K555076j489769K027789l00152p6805
$$ y = [535981, -106300, 1032289, 1300631, 722665, 2041895, 583734, 1239181, 985799, 161263, 2116809, 2701982, 1174011, -660419, -1772075, 717953, 1545050, 1132887, 1235824, 991535, 450691, -177616, 90940, -503857, 890866, 3766164, -15750, -305117, 1107890, 730749, 2316904, 1828689, -797234, 1523001, 2125267, 1520670, 1504331, 1183075, 2084103, 2699611, 1899423, 3055317, 1760783, -9670, 1194052, 1036329, 847613, -10739, 1335134, 458306, 787253, 1045672, 614577, 1343073, 1165022, 1242587, 489801, 149307, 441626, 1161614, 1095681, -1072647, 898188, 824381, 1683105, -153074, 366381, 280071, -1566890, 988186, -501583, 1526206, 1226054, 1149249]
2817A149249k095176J408208J627347q34808o78706J659392k736529J560784j078691
2808a8930n82669M72795J239853l30677k46649n00517r46161J955756Q38537q44722
2798A036616n60438J521959k96396k325687K55785j041559J633716K91100o99495
2789a84399N41581N66631n11743J099571m98722K03477j015496j08448L39810
2780D32262K719119j603938r74916Q97605n69395j519896K836555k080443o59316
2771e22363P84073j277760J875458J233118k976658J613626L75647o01934j148811
2762f45604K477929j401555j346937L93427o2095J293529O388P23770r06099p76435
2752b43682J71561J841598j735613r98181M99135q55635J066329J466445j700725
$$ y = [1149249, -945927, 462281, 2089628, 1254820, 576114, 2235506, -501023, 1059761, -18930, -601599, -128804, 1111049, 780372, 533723, 33206, -912955, 1042801, 1881338, 1036616, 476178, 1998137, 1701741, -623946, -368161, -1409720, 223996, 515096, -184399, 357182, 923813, 412070, 1511641, 1012919, 1216396, 200900, 92452, 432262, 3151381, 1547443, 572527, 1470132, 900737, -619159, 2217396, 136953, -522363, 261710, -1016050, 859408, 2092526, -884132, 729494, 1105141, 503207, -645604, 1832325, 430770, -916167, -522740, -584835, 708694, 715082, 1438852, 532753, -243682, -72121, 1769477, 33864, -964317, -465182, -1320817, -254488, 1211957, -488768]
2743d88768K7330j05817P03687P24824J095045m00778l081404K58602k49185J789569
2733B73105M35980J103209j971555m24790M47251k94775Q46133p2860K06368J38856
2723F86922l91698k76710N17822p96120P2768J198068j003822J43026P14552k524474
2713a659666J236832k16234L973J429167n62552M64976L6934k699489R72810L702687
2703B709438l36356k365512q2227j589666J841767o42360Q15716j553781l61755
2694a564736J481130o37417J214296L50934J99691j018944k71255J012802L28739
2685A095240K16304j534470o93120Q77699K716030j246941o65693j708006P43123
2676a99834J881585k520425Q92966j098939K052936J925774j012762j356835k013669
$$ y = [-488768, -461438, -567255, 136432, 861256, 1956301, 1555523, -1525881, -1267279, -1516464, 273105, 709085, 1812294, -159261, -584051, -136800, -431575, 414558, 341698, 548066, 686922, 295224, 18514, 536336, -259784, -187016, 1011052, 7230, 150256, 864808, -1659666, -422834, -639068, -635095, 794072, 231520, 696496, 733430, -1966059, -993249, 2709438, 2373082, 7570, -74657, -1664323, 177444, -464916, 350800, -1202981, -1564736, -83606, -721023, 493273, 844207, 1043898, 24954, -246301, 766501, 1095240, 1311544, -222926, -916046, -38347, 2677683, 1430742, 765049, -942957, -199834, 1681751, -838674, 54292, -1044647, 1008289, 2934063, 1921301, 564466, -1449203]
2667a449203L547073n32506j631927J067866j752051J915822k02254j172464K07169
2658b475J848455j80223o22454l21719r20728J344475j342624j080982Q71385
2649d06890K715777j265084o94420r12623M19539K481329r09130k075012K88246
2640c58268J118558N31300l76881k918053J349020J166918J106317j637268j543761
2631a562118L00396J862329N71756j131106j117130K591885q68054k04663J878244
2622B321539k726540N5812K161431J74739j746680J495223l789343K213004j42046
2613A7139J601497j497115J703026k100133R25799L09096K48518j802365l45745
2604i40283J777972P60903p11763r48508J995425j651484N5634M46520o85090
$$ y = [-1449203, 2097870, 1565364, -66563, 1001303, -750748, 1165074, 962820, -209644, -2475, 1845980, 1665757, 1043303, 721584, -199144, 1145331, -197293, -1278275, -406890, 2308887, 1043803, 349383, -563240, -143701, 2337628, 1428498, -646514, -358268, 760290, 1291590, 914709, -2003344, -654324, 512594, 1618911, -18357, -1562118, -1261722, 600607, 1172363, 41257, -1075873, 1516012, 647958, 443295, 2321539, -405001, -349189, 1812242, 1986981, 240301, 1735524, -2053819, 159185, 17139, 1618636, 121521, 1824547, -275586, 650213, 959309, 1207827, -594538, -940283, 837689, 1598592, 886829, -61679, 1933746, 282262, 337896, 784416, 99326]
2595I9326R02977p94415r5325J624626j910160Q70643L5452R98595j678659k18887
2585a65827J063624m42100J425299n84022k038269K831393p46283L65986n05991
2576A203810k818499J214028p67502K953836k148435j569132l08806M849768j214648
2567A394420J23251j644726P95868Q42843k810428J901855q24391J470457j161352
2558H7797K11084K75716J43948j247332R47395j120812J483687k16439M01197
2549I66241l60398j271304J498059J472180j277954j647700O00861J459233j178459
2540B60759j823352Q25273k97049L262448k021064j771341J878837j015j343955
2531a030459L162921k392448n47552N5126P45416j58507J58688m14700M88748
$$ y = [99326, 1002303, 207888, 112563, 1737189, -172971, 697672, 733124, 1731719, 53060, -165827, 897797, 455697, 1880996, 1296974, -741295, 2090098, 1343815, 1709801, 1203810, -1614689, -400661, -1168163, 1785673, -362762, -1931894, -2240700, 2609068, 1394420, 1517671, -127055, 668813, 1511656, -1298772, 603083, -221308, 1249149, 87797, 298881, 574597, 718545, -528787, 418608, -702204, 781483, 565044, 966241, 605843, -665461, 832598, 2304778, 1026824, -620876, -20015, 1439218, 260759, -1562593, -737320, -1034369, 2228079, 207015, -1564326, 314511, 313496, -1030459, 2132462, -259986, -807538, -752412, -6996, -165503, -6815, -421515, 67233]
2522F7233r4679Q52623j88275J446342k668159K091932L98610M56324j025804
2513A336147q96349O66159N88434j421973M2177J338440r57355J482258j405165
2504G72773J71569k413979J262002J539318q43793K45420K68338K71935k52481
2495A021102O16461N5720p66333L34365q12785j495997O12007R26577k7852m43706
2485A9559j90879M45497J170269n11235j645807J711981k349368K795113k63988
2476A181142j568640J217102M79142Q06370o53316r30149R21890o44789R2629
2467I01381k79222j668925K69920K103052j074115O77440M10054m99806J027430
2458A867209j591061J097999r56555n18201O14786J197719k07702j142812J354530
$$ y = [67233, -27446, 825177, 636902, 2083244, -584915, 1507017, 1905627, 2361951, 1336147, 439798, 1105957, 1694391, 272418, 314595, 1653035, 695680, 2177938, 772773, 944342, -1469637, -207635, 1331683, 487890, 733310, 1001648, 1273583, 1021102, 1637563, 1693283, 926950, 1261315, 448530, -1047467, -435460, 491117, 463265, 19559, -171320, 274177, 1444446, 933211, -712596, 999385, -1349983, 1445130, 1181142, -387498, 829604, 1308746, 2115116, 1461800, 531651, 1453541, 808752, 901381, 622159, -1046766, -776846, 1326206, 252091, 929531, 1339585, 839779, 1867209, 276148, 1374147, 417592, -100609, 514177, 1711896, 1504194, 361382, 1715912]
2449A715912j883099K225622k038036M96605N94478l01022j592396J026003j405602
2440a161535Q85452L98136L49731j67319L16209J167606j448093k201535K320503
2431D59155J15925J37160k90189p51590J698323j359344j297923K875139l453499
2422a866843K930116J709277k956816K128249j003786n30695K36602j204770O88164
2413A29498J732690j680425K45014o22993l50016M86384j1448j997J086497m86455
2403E26749j93112J40526M6432l58968o28473M18727K63625m13205J420878j563598
2393c40419j26001m07193R17953R37516p82734m36507O6377J279474j008290J418800
2383A518976j827870J093125K60610K4804j089951J136402j002316J433648j869615
$$ y = [1715912, -167187, 2058435, 20399, 517004, 1111482, 810460, -781936, 244067, -1161535, -276083, 122053, 471784, 304465, 620674, 1788280, 340187, -1861348, 459155, 575080, 712240, 422051, -329539, 1368784, 9440, -1288483, 1586656, -1866843, 1063273, 2772550, -184266, 1943983, 940197, 409502, 646104, -558666, 129498, 1862188, 181763, 426777, -196216, -546232, -59848, -71296, -73293, 1013204, 526749, 333637, 474163, 520595, 161627, -466846, -48119, 215506, -197699, 1223179, -340419, -466420, -873613, 44340, 981856, 199122, -237385, -171008, 1108466, 100176, 1518976, -308894, 784231, 1044841, 1069645, -20306, 1116096, 113780, 1547428, -322187]
2374c22187q3841J473988j344841J090178j83711j700115J442094q17709O59628
2365B13484L11927O87580m0162l70949J25200K84416m15457M193p84784k89126
2355b73678J065847J60795J737136m182119J555503m9176K058919j214159N10175
2346A369243k064561J082673J153982j527461J128444j65843R8726p55131Q4960
2337D05032n06338K128573k374672J216093q55175k07125J041773J40226k209420
2328a221033N87827M19119L58896R95612j619686J686609K53009j521226J386298
2319A325425M17555j562155j081664j81772J339089p4801j391840J193310M51677
2310D34824L00131k286387J627710J191678k194360J129256j307970n27929J832546
$$ y = [-322187, -406028, 1067960, -276881, 813297, 629586, -1070529, 371565, -446144, 213484, 525411, 1212991, 1172829, 801880, 927080, 1211496, 796039, 800232, 15448, -273678, 792169, 952964, 2690100, -1492019, 63484, 14308, 2073227, 859068, 1369243, -695318, 387355, 1541337, 13876, 1142320, 976477, 1075203, 320072, 405032, -101306, 2027267, -347405, 868688, 13513, -193612, 848161, 988387, -1221033, -633206, -214087, 144809, 1140421, -479265, 1207344, 1460353, -60873, 1325425, 1742980, 180825, -900839, -1082611, 256478, 181677, -1210163, -16853, 434824, 734955, -1551432, 76278, 1267956, -926404, 202852, -1105118, -1633047, 199499]
2301A99499L95195j132552J958277j039445N71633j319771m71494J156124j067477
2292g50011R9382J8899J391286k442924L087745k403383J363586p98339L27451
2283a06308q4223q8598J371857r97762o35684O56109K206423J417118j979225
2274A759707p23442l58066j173532P26376L91443k107823J483279J099131O10400
2265A707473k802804K092315L04916j404206N93981P69273N66288j845220R85335
2256I67351o96995m11911Q41358J674494j056547l26216j529089j362216K039571
2247A39800J091739Q58378j843503J64582O8604j38960q49554K818029j986498
2238C22617j414685K197557q07153J354804k124487K3578m188J036842R79439
$$ y = [199499, 594694, -537858, 1420419, 380974, 952607, -367164, -838658, 317466, -750011, -650629, -631730, 759556, -1683368, 1404377, -999006, 364580, -433759, -106308, -190531, -279129, 1092728, 94966, -540718, 115391, 2321814, 3738932, 1759707, 1036265, 678199, -495333, 231043, 622486, -1485337, -2058, 1097073, 1707473, -1095331, 996984, 1301900, -102306, 491675, 1260948, 1827236, -17984, 967351, 270356, -141555, 699803, 2374297, 1317750, 991534, -537555, -1899771, 139800, 1231539, 2089917, 246414, 410996, 479600, 340640, -508914, 2309115, 322617, -1092068, 1105489, 298336, 1653140, -471347, -447769, -451957, 584885, 1564324]
2229A564324r38524p00898K06603J340496o76438J756786k378864K443037k625311
2220h789P3778j325015L00215J897007j599313N77305R96042R20928m22497k392011
2210i82350R78380k9966P92922j28965p0110Q02516j118459j8083O78717j419063
2200e14461P09478P83448p49r50259J20625L25914k8927J068587j721091M6497
2190a60938R45157O67728j118106o73656K81652K57941O52912m10496M271729
2181D713923n023416J493492j115151J575727j115767N44520j984467N20031J550483
2172A159375m42282N07294k873328J441743O83902K2210p35290N400q2138O4813
2162b48301R79327j278830O79183r21454Q61313j471163m16149j48602K611567
$$ y = [1564324, 625800, -75098, 131505, 1472001, 795563, 2552349, 173485, 2616522, -8789, 64989, -1260026, -959811, 937196, -662117, -84812, 911230, 1832158, 1409661, -982350, -3970, -33936, 758986, 630021, 559911, 1362427, 243968, 225885, 904602, -514461, 195017, 978465, 977716, 27457, 148082, 473996, 445069, 1513656, -207435, -160938, 784219, 1451947, 333841, -339815, -58163, 199778, 852690, 442194, 4713923, -309493, 1183999, 68848, 1644575, 528808, 1073328, -911139, -391108, 1159375, 717093, 1224387, -1648941, -207198, 476704, 498914, -236376, -230976, -313114, -248301, 731026, -547804, 131379, -790075, 71238, -1399925, -1816074, -1964676, 646891]
2153F46891j492627n36301M07736K40048K902110j75692j697273j277879N24187
2144d58800j65286n61880O46284P49846P2515K2352M93262j363858J760027n66286
2134F28176L9304k282518J123375J025458j66798k39070m28671n3751J8676J604409
2124A268590j261047j232211n85111M32073m72991J594908J827702k564591K025120
2115A032442j636918q73588J364987K04769q90295r17496J597479k20627m7296
2106c86543P66712q78916J516684k97277Q4666j16783j243884N63246j03936o6123
2096a62154P57812q9862K533475k205186m0774o40326J810825j317630m21549
$$ y = [646891, -845736, -1382037, -974301, -734253, 2167857, 1992165, 294892, -982987, -458800, -624086, -1185966, -539682, 210164, 282679, 305031, 798293, -565565, 1194462, 628176, 667480, -1615038, -491663, 533795, 366997, 127927, -300744, -354495, -335819, 1268590, 7543, -1224668, -1809779, -1377706, -1850697, -255789, 1571913, -992678, 1032442, -604476, -1478064, -113077, 91692, -798603, -1716099, -118620, -339247, -386543, 380169, -498747, 1017937, 720660, 805326, 688543, -555341, 7905, -96031, -162154, 595658, 505796, 3039271, 834085, 793311, 152985, 1963810, 646180, 224631]
$$ [...]
##END NTUPLES=NMR SPECTRUM
##END=
