##TITLE=abcd
##JCAMPDX= 6.0         $$ Bruker NMR JCAMP-DX V2.0
##DATA TYPE= NMR SPECTRUM
##DATA CLASS= NTUPLES
##ORIGIN= UXNMR, Bruker Analytische Messtechnik GmbH
##OWNER= root
$$ XWIN-NMR		Version 3.5
$$ Mon Aug 24 17:37:28 2026 Russian Standard Time (UT+4h)  servis@DPX200
##.OBSERVE FREQUENCY= 200.131235884673
##.OBSERVE NUCLEUS= ^1H
##.ACQUISITION MODE= SIMULTANEOUS
##.ACQUISITION SCHEME= undefined
##.AVERAGES= 24
##.DIGITISER RES= 18
##SPECTROMETER/DATA SYSTEM= spect
##.PULSE SEQUENCE= zg
##.SOLVENT NAME= CDCl3
##.SHIFT REFERENCE= (INTERNAL, CDCl3, 0, 16.4885)
##AUDIT TRAIL= $$ (NUMBER, WHEN, WHO, WHERE, WHAT)
$$ ##TITLE= Audit trail, XWIN-NMR		Version 3.5
$$ ##JCAMPDX= 5.01
$$ ##ORIGIN= Bruker BioSpin GmbH
$$ ##OWNER= servis
$$ F:\spectra/data/av/nmr/H1/1/pdata/1/auditp.txt
$$ ##AUDIT TRAIL=  $$ (NUMBER, WHEN, WHO, WHERE, WHAT)
(   1,<2026-08-24 17:36:55.01 +0400>,<servis>,<DPX200>,
      <created by zg, POWCHK disabled, PULCHK disabled
       terminated by command 'halt'
       configuration hash MD5:
       00 E9 B6 7A A2 85 ED C7 34 08 36 98 17 FE 4E 26
       data hash MD5: 32K
       7B 4A E4 31 EB A6 8F 43 38 2C 98 D7 69 7B 73 80>)
(   2,<2026-08-24 17:37:08.73 +0400>,<servis>,<DPX200>,
      <Start of raw data processing
       efp BC_mod = 2 LB = 0.05 FT_mod = 6 PKNL = 1 PHC0 = -415.9518 PHC1 = 3.101563 SI = 16K 
       data hash MD5: 16K
       FA E5 AD 6F 3D 45 DA 4A C6 81 BC E3 F2 D4 68 BC>)
$$ ##END=
$$ 
$$ hash MD5
$$ 23 70 63 FC 22 87 F9 0B B1 3F 59 B2 18 7B 9F 03
##$RELAX= 
##$RELAX= 
##$RELAX= 
##$RELAX= 
##$RELAX= 
##$RELAX= 
##$RELAX= 
##$RELAX= 
$$ Bruker specific parameters
$$ --------------------------
##$DU= <F:\spectra>
##$EXPNO= 1
##$NAME= <H1>
##$PROCNO= 1
##$TYPE= <nmr>
##$USER= <av>
##$AMP= (0..31)
100 100 100 100 100 100 100 100 100 100 100 100 100 100 100 100 100 100 
100 100 100 100 100 100 100 100 100 100 100 100 100 100 
##$AQSEQ= 0
##$AQ_mod= 1
##$AUNM= <au_zg>
##$AUTOPOS= <>
##$BF1= 200.13
##$BF2= 200.13
##$BF3= 200.13
##$BF4= 200.13
##$BF5= 500.13
##$BF6= 500.13
##$BF7= 500.13
##$BF8= 500.13
##$BYTORDA= 1
##$CFDGTYP= 0
##$CFRGTYP= 5
##$CHEMSTR= <none>
##$CNST= (0..31)
1 1 145 1 1 1 1 1 1 1 1 1 1 1 1 1 1 1 1 1 1 1 1 1 1 1 1 1 1 1 1 1 
##$CPDPRG= <>
##$CPDPRG1= <>
##$CPDPRG2= <>
##$CPDPRG3= <>
##$CPDPRG4= <mlev>
##$CPDPRG5= <mlev>
##$CPDPRG6= <mlev>
##$CPDPRG7= <mlev>
##$CPDPRG8= <mlev>
##$CPDPRGB= <>
##$CPDPRGT= <>
##$D= (0..31)
0 2 0 0 0 0 0 0 0 0.06 0 0 0 0 0 0 0.0002 0 0 0 0 0 0 0 0 0 0 0 0 0 0 
0 
##$DATE= 1787578614
##$DBL= (0..7)
120 120 120 120 120 120 120 120 
##$DBP= (0..7)
150 150 150 150 150 150 150 150 
##$DBP07= 0
##$DBPNAM0= <>
##$DBPNAM1= <>
##$DBPNAM2= <>
##$DBPNAM3= <>
##$DBPNAM4= <>
##$DBPNAM5= <>
##$DBPNAM6= <>
##$DBPNAM7= <>
##$DBPOAL= (0..7)
0.5 0.5 0.5 0.5 0.5 0.5 0.5 0.5 
##$DBPOFFS= (0..7)
0 0 0 0 0 0 0 0 
##$DE= 6
##$DECBNUC= <off>
##$DECIM= 32
##$DECNUC= <off>
##$DECSTAT= 4
##$DIGMOD= 1
##$DIGTYP= 9
##$DL= (0..7)
0 120 120 120 120 120 120 120 
##$DP= (0..7)
$$ [...]
##$SUBNAM4= <"">
##$SUBNAM5= <"">
##$SUBNAM6= <"">
##$SUBNAM7= <"">
##$SUBNAM8= <"">
##$SUBNAM9= <"">
##$SW= 20.6817932712277
##$SWIBOX= (0..15)
0 0 3 0 0 0 0 0 0 0 0 0 0 0 0 0 
##$SW_h= 4139.07284768212
##$TD= 32768
##$TD0= 1
##$TE= 0
##$TE2= 300
##$TE3= 300
##$TEG= 300
##$TL= (0..7)
0 120 120 120 120 120 120 120 
##$TP= (0..7)
150 150 150 150 150 150 150 150 
##$TP07= 0
##$TPNAME0= <>
##$TPNAME1= <>
##$TPNAME2= <>
##$TPNAME3= <>
##$TPNAME4= <>
##$TPNAME5= <>
##$TPNAME6= <>
##$TPNAME7= <>
##$TPOAL= (0..7)
0.5 0.5 0.5 0.5 0.5 0.5 0.5 0.5 
##$TPOFFS= (0..7)
0 0 0 0 0 0 0 0 
##$TUNHIN= 0
##$TUNHOUT= 0
##$TUNXOUT= 0
##$USERA1= <user>
##$USERA2= <user>
##$USERA3= <user>
##$USERA4= <user>
##$USERA5= <user>
##$V9= 5
##$VALIST= <valist>
##$VCLIST= <CCCCCCCCCCCCCCC>
##$VD= 0
##$VDLIST= <DDDDDDDDDDDDDDD>
##$VPLIST= <PPPPPPPPPPPPPPP>
##$VTLIST= <TTTTTTTTTTTTTTT>
##$WBST= 1024
##$WBSW= 30
##$XGAIN= (0..3)
0 0 0 0 
##$XL= 0
##$YL= 0
##$YMAX_a= 264642
##$YMIN_a= -717648
##$ZGOPTNS= <>
##$ZL1= 120
##$ZL2= 120
##$ZL3= 120
##$ZL4= 120
##$ABSF1= 0
##$ABSF2= 0
##$ABSG= 0
##$ABSL= 0
##$ALPHA= 0
##$AQORDER= 0
##$ASSFAC= 0
##$ASSFACI= 0
##$ASSFACX= 0
##$ASSWID= 0
##$AUNMP= <proc_1d>
##$AZFE= 0.1
##$AZFW= 0.1
##$BCFW= 0
##$BC_mod= 2
##$BYTORDP= 0
##$COROFFS= 0
##$CY= 18.4799938201904
##$DATMOD= 1
##$DC= 0
##$DFILT= <>
##$DTYPP= 0
##$F1P= 9.9274215381318
##$F2P= -0.165520771350173
##$FCOR= 1
##$FTSIZE= 16384
##$FT_mod= 6
##$GAMMA= 0
##$GB= 0
##$INTBC= 1
##$INTSCL= 4.127829e-11
##$ISEN= 128
##$LB= 0.05
##$LEV0= 0
##$LPBIN= 0
##$MAXI= 10000
##$MC2= 0
##$MEAN= 0
##$ME_mod= 0
##$MI= 50
##$NCOEF= 0
##$NC_proc= -6
##$NLEV= 6
##$NOISF1= 3.799351
##$NOISF2= 2.8
##$NSP= 0
##$NTH_PI= 0
##$NZP= 0
##$OFFSET= 16.48848
##$PC= 4
##$PHC0= -415.9518
##$PHC1= 3.101563
##$PH_mod= 1
##$PKNL= yes
##$PPARMOD= 0
##$PSCAL= 4
##$PSIGN= 0
##$REVERSE= no
##$SF= 200.130005582386
##$SI= 16384
##$SIGF1= 3
##$SIGF2= 2
##$SINO= 400
##$SIOLD= 16384
##$SREGLST= <1H.CDCl3>
##$SSB= 0
##$STSI= 16384
##$STSR= 0
##$SW_p= 4139.07284768211
##$SYMM= 0
##$S_DEV= 0
##$TDeff= 32768
##$TDoff= 0
##$TI= <>
##$TILT= no
##$TM1= 0
##$TM2= 0
##$TOPLEV= 0
##$USERP1= <user>
##$USERP2= <user>
##$USERP3= <user>
##$USERP4= <user>
##$USERP5= <user>
##$WDW= 1
##$XDIM= 16384
##$YMAX_p= 293365287
##$YMIN_p= -982138
$$ End of Bruker specific parameters
$$ ---------------------------------
##NTUPLES= NMR SPECTRUM
##VAR_NAME=  FREQUENCY,     SPECTRUM/REAL,   SPECTRUM/IMAG
##SYMBOL=    X,             R,               I
##VAR_TYPE=  INDEPENDENT,   DEPENDENT,       DEPENDENT
##VAR_FORM=  AFFN,          ASDF,            ASDF
##VAR_DIM=   16384,         16384,           16384
##UNITS=     HZ,            ARBITRARY UNITS, ARBITRARY UNITS
##FACTOR=    0.252644378177508, 1,           1
##FIRST=     3299.83951724647, 0,            0
##LAST=      -839.233330435636, 0,           0
##MIN=       -839.233330435636, -982138,     0
##MAX=       3299.83951724647, 293365287,    0
$$ Real data points
##PAGE= N=1
##DATA TABLE= (X++(R..R)), XYDATA
$$ [...]
7621F780696j14140k31944l25300l45864j64711R6068K02448Q86701J388613J874890
7611A0047457J898424Q19564j40019m10415o80674p29594j87367M17275J164383
7602A2199034J220067N38077n19659m13674j259319j136889j218681j064147n12726
7593G832083l09469O03927J446783J770494J259163N98881k14568o69915j035103
7584A1282276o43730j82262L83510J216560J149013J45700m55564j048521j288068
7575A0558914j366347j036149j296082o98757m29993j2229K10425L39174K75262
7566F544218l5804j75279l03673m59580M0223k97526K93867K45781J62164k03701
7556E810690P102m07426m99258l34178l56207l33188k80200l69365j02615j2206
$$ y = [6780696, 6666556, 6434612, 6109312, 5763448, 5598737, 5694805, 5897253, 6783954, 8172567, 10047457, 11945881, 12765445, 12625426, 12215011, 11534337, 10804743, 10617376, 11034651, 12199034, 13419101, 13957178, 13437519, 13023845, 11764526, 10627637, 9408956, 8344809, 7832083, 7522614, 8126541, 9573324, 11343818, 12602981, 13201862, 12987294, 12317379, 11282276, 10638546, 10456284, 10839794, 12056354, 13205367, 13351067, 12895503, 11846982, 10558914, 9192567, 8156418, 6860336, 6161579, 5731586, 5719357, 5929782, 6268956, 6544218, 6508414, 6333135, 6029462, 5569882, 5610105, 5312579, 5606446, 5852227, 6014391, 5810690, 5817792, 5410366, 4911108, 4576930, 4220723, 3887535, 3607335, 3237970, 3135355, 3123149]
7546C123149K8255k99910r8641k21402J0079L349j30473j11994n9658L14506k59174
7535B298086N4568J21279O9625O3972Q9920J91427J25586J46885J01196l10999
7525B951545k35194J15300j69532j18153q6459j03062k49943K9685J69274j10621
7515B192840r0717J62897J33869L5477J64573m7138L24193M2169O0621L8470p7361
7504B939893o7486j51545k08201Q3022l63633r2937R6598j27312l21814K27912
7494B014497M5967n7350j74386J63734k0803Q9386J66672R8925m855J06670k37754
7483B190703K5025K8829q6599m9196k37424J13243n6281l5430J076Q2566L631
7472A980143M2578k45845J27812R3090k6406k79812J53102M472j35799P5546l9816
$$ y = [3123149, 3151404, 2851494, 2752853, 2531451, 2541530, 2544879, 2414406, 2302412, 2242754, 2557260, 2298086, 2352654, 2473933, 2543558, 2607530, 2697450, 2888877, 3014463, 3161348, 3262544, 2951545, 2716351, 2831651, 2662119, 2543966, 2457507, 2354445, 2104502, 2134187, 2303461, 2192840, 2102123, 2265020, 2398889, 2434366, 2598939, 2551801, 2875994, 2918163, 2978784, 3017254, 2939893, 2872407, 2720862, 2512661, 2595683, 2232050, 2139113, 2235711, 2108399, 1786585, 2014497, 2060464, 2003114, 1828728, 1992462, 1971659, 2061045, 2227717, 2326642, 2321787, 2428457, 2190703, 2215728, 2244557, 2157958, 2108762, 1871338, 1984581, 1928300, 1892870, 1893946, 1976512, 1980143, 2022721, 1776876, 1904688, 1997778, 1971372, 1691560, 1844662, 1849134, 1713335, 1788881, 1749065]
7461A749065J85870J49835j51638j01582J84492r106J98021k50303J6536J69479
7451B140669J7519r1552m42J1830k0141K5549l1598N8195n693K66459j01954k08000
7439B060841P8788J30958j8514o002P0647j4941J61096k63491R5188j88482K90808
7428B396896j72846J76506P4873r4718J88150m5500m5253N2095m6791R2391L8272
7417B614075p6542J14135k5898K45667n683L3920L7449Q4316n7237Q1689p4809
7406B971082J65859J28343j74399K23422m6071N2046j1180K03620J38254J5911
7396C666887Q5099J55911R0106N8486L90321J80848J11436L69196M55473P09605
7386F273368M06199P11181J68622K56788K81190K79320J67185M32008J99769r5541
$$ y = [1749065, 1934935, 2084770, 1933132, 1831550, 2016042, 2006936, 2204957, 1954654, 1971190, 2140669, 2158188, 2066636, 2066194, 2078024, 2057883, 2083432, 2051834, 2110029, 2104336, 2370795, 2268841, 2060841, 2139629, 2270587, 2252073, 2246071, 2316718, 2301777, 2462873, 2199382, 2294570, 2106088, 2396896, 2224050, 2400556, 2475429, 2380711, 2568861, 2523361, 2478108, 2530203, 2483412, 2575803, 2614075, 2537533, 2651668, 2625770, 2871437, 2865754, 2899674, 2937123, 3021439, 2964202, 3045891, 2971082, 3136941, 3265284, 3090885, 3314307, 3268236, 3320282, 3309102, 3512722, 3650976, 3666887, 3751986, 3907897, 3998003, 4056489, 4446810, 4627658, 4739094, 5108290, 5563763, 6273368, 6679567, 7390748, 7559370, 7816158, 8097348, 8376668, 8543853, 8975861, 9175630, 9080089]
7376I080089m2332l11966k23607R2689o9894k08339M14043L29817P36067J018044
7366A0814611J072793J502381J410634Q83162J0762p57717r15124j200928j371753
7357A1448821j045223r25542o31940l12727r1904k6859L63333K63793O55911R60241
7347A0657904J672195K067761K237176J718022J398200J251438J2366p74135j312145
7338A8928782j726417k109042j674386j424585p74955j038639m11720r6648j04802
7329I567588J20058L26435L75258J005250J561364K062229K036133J451876O02511
7320A9108702K35631k86353m91963m58032L26827J432257J964690J434623K63560
7311B3529942n28858j418963j542864j663142j702502j117217p86125k47298K5870
$$ y = [9080089, 9037757, 8725791, 8502184, 8594873, 8524979, 8316640, 8730683, 9060500, 9796567, 10814611, 11887404, 13389785, 14800419, 15683581, 15694343, 14936626, 14021502, 12820574, 11448821, 10403598, 9478056, 8846116, 8533389, 8441485, 8414626, 8777959, 9041752, 9697663, 10657904, 12330099, 14397860, 16635036, 18353058, 19751258, 21002696, 21015062, 20240927, 18928782, 17202365, 15093323, 13418937, 11994352, 11219397, 10180758, 9769038, 9672390, 9567588, 9687646, 10014081, 10389339, 11394589, 12955953, 15018182, 17054315, 18506191, 19108702, 19344333, 19057980, 18566017, 18107985, 18434812, 19867069, 21831759, 23266382, 23529942, 23001084, 21582121, 20039257, 18376115, 16673613, 15556396, 14770271, 14522973, 14548843]
7302A4548843O57101O94455O91444P17517M49553M70132J250970K190636N144677
7293B6815328Q097168Q528401N854403N93890j755310l811718n237274n275397
7285C3809491m921330l901447k807501k478522j285630n03894o2381K36350O7312
7276A8152448O59592Q47694J666120K885550O259980Q801710Q417227M283373
7268E1973694m35067k343157n060322n410215n730469n131586l849105l533007
7260B0480766k292985j655864q66606o53376n06683k56750j33436j89312L49895
7251A4275649J099795J976894K606943K145176O50503o38846j268315j807384
7243A9040415k008004k212260j621857j699506j005131r30345n74865o44498k80949
$$ y = [14548843, 15205944, 15900399, 16591843, 17309360, 17758913, 18229045, 19480015, 21670651, 26815328, 34912496, 43440897, 49295300, 49889190, 48133880, 44322162, 39084888, 33809491, 28888161, 24986714, 22179213, 19700691, 18415061, 17911167, 17848786, 18085136, 18152448, 18812040, 19659734, 21325854, 24211404, 30471384, 39273094, 47690321, 51973694, 51538627, 49195470, 44135148, 38724933, 32994464, 27862878, 24013773, 20480766, 18187781, 16531917, 15665311, 15011935, 14505252, 14248502, 14115066, 13925754, 14275649, 15375444, 17352338, 19959281, 22104457, 22754960, 22116114, 20847799, 19040415, 17032411, 14820151, 13198294, 11498788, 10493657, 9563312, 8988447, 8343949, 8063000]
7234H063000k65043k48716j11803k16881l26067j59684l27850k07527j21959r7824
7224E979646l48622J26K6988j30362j20966k19248j34749l5705J4626j35732k32159
7213D663843R6430k1886n5725j64924M1514J3768j52583j00737l2514P4p0806
7202D216454L98608l10446k92404O5738k176j45808j19124o6661J47998j03989
7192C788190P6653k44648Q9936J07894Q9280j43216o7460M4383J59401k01256
7182C699157M5458m2407P7568j44715p3208M5557n2989j1350Q0327p8209K7947
7171C573136J04759m2387M9264M9674K1550m8840P6559j38817J52355L5525o2990
7160C769788P1616j7727J02334k71792J36329J6918J63662q658r3610J63339K4692
$$ y = [8063000, 7797957, 7549241, 7437438, 7220557, 6894490, 6734806, 6406956, 6199429, 6077470, 5979646, 5631024, 5631150, 5658138, 5527776, 5406810, 5187562, 5052813, 5017108, 5031734, 4896002, 4663843, 4760273, 4738387, 4682662, 4517738, 4559252, 4573020, 4420437, 4319700, 4287186, 4287260, 4216454, 4615062, 4304616, 4012212, 4077950, 4075774, 3929966, 3810842, 3744181, 3892179, 3788190, 3864843, 3620195, 3710131, 3818025, 3907305, 3764089, 3696629, 3741012, 3900413, 3699157, 3744615, 3702208, 3779776, 3635061, 3561853, 3607410, 3554421, 3543071, 3623398, 3545189, 3573136, 3677895, 3635508, 3684772, 3734446, 3755996, 3707156, 3783715, 3644898, 3797253, 3832778, 3769788, 3841404, 3823677, 3926011, 3654219, 3790548, 3807466, 3971128, 3962470, 3868860, 4032199, 4056891]
7149D056891O5342J17289l2116Q7428K2552N4927J13673N0921J8152l8002q4441
7138D432616K03602J48645p9273q8057L04800J43322j6727J26605j73442L17407
7128E319498l4251L57009j35542K27885K26680n3584J83509Q1694J90638K90413
7118F653949K2900J61887K71489J00710K77916K06074K24139K90366L83574L60360
7108H953364L16611N00153L60923P58792O02602Q37281J001062Q89984J417836
7099A5638608J505654K193187K628181L303171M329179N629361N710530N026687
7091D5964558L935167J771923M35554j452210k242998k798491k598583k458104
7083D0556816j945625j354074m06668M84553J709315L314101N099835O933440
$$ y = [4056891, 4122233, 4239522, 4207406, 4294834, 4317386, 4372313, 4485986, 4536907, 4555059, 4517057, 4432616, 4636218, 4784863, 4705590, 4617533, 4922333, 5065655, 5048928, 5175533, 5002091, 5319498, 5285247, 5642256, 5506714, 5734599, 5961279, 5907695, 6091204, 6172898, 6363536, 6653949, 6676849, 6838736, 7110225, 7210935, 7488851, 7694925, 7919064, 8209430, 8593004, 8953364, 9269975, 9770128, 10131051, 10889843, 11492445, 12329726, 13330788, 14220772, 15638608, 17144262, 19337449, 21965630, 25268801, 29597980, 35227341, 40937871, 45964558, 49899725, 51671648, 52107202, 50654992, 48411994, 45613503, 43014920, 40556816, 38611191, 37257117, 36850449, 37335002, 39044317, 42358418, 47458253, 54391693]
7075E4391693P962652P894151P118118N543227K979935Q73809j704218m208172
7067H0851195o132820o913736p066705o808137n575223m536492l096043k178359
7059C8543680o49050M56037J491465K751746L483579M199511M132580K732922
7051E7142470R75921j819032l332697m577322n183158n653800n214350m410579
7043B7927453l951083l166622k435522j993622j429470j098516r31681j033440
7035A1887497q97148n12027n05281m82729m22888m00354k75083m19910k57383
7026G714694j49259l20860l47287j30650k14105k03981j49382j95452q0908j4333
7016E908477r6584l27569K6946j06860j95016n8518m0523k02769k01777M9036
$$ y = [54391693, 62354345, 70248496, 77366614, 82909841, 85889776, 86763585, 85059367, 80851195, 74718375, 67804639, 60737934, 53929797, 48354574, 43818082, 40722039, 38543680, 37894630, 38350667, 39842132, 42593878, 46077457, 50276968, 54409548, 57142470, 58118391, 56299359, 52966662, 48389340, 43206182, 37552382, 32338032, 27927453, 23976370, 20809748, 18374226, 16380604, 14951134, 13852618, 12920937, 11887497, 10990349, 10478322, 9973041, 9490312, 9067424, 8667070, 8391987, 7972077, 7714694, 7565435, 7244575, 6897288, 6766638, 6552533, 6348552, 6199170, 6003718, 5922810, 5908477, 5811893, 5484324, 5511270, 5404410, 5209394, 5150876, 5110353, 4907584, 4705807, 4754843]
7006D754843j30566n7372j61564r5977j53721j7872K0176j34780J10967N6348
6996D190482k58176J12870j6354j14991J96609j55356O0692M9221J52675k20119
6986C997553q0264R6075k63008N5965p2706j32499m4945j21082Q6520o8685K12539
6975C665463j28260j66852Q9022k318J79642j02054K8478o8780Q1672R8491j38015
6964C536489L757j52811m3625P6365j86680J79859j48234j65053j4940J5620J53491
6953C254238j98706K57672k09983K96086J20106J16964j36634J68715K3085J76959
6943C868502r8675m692l3114J4830l03315L5708l10134j01898R7139l11161M3074
6932B896264k20093J37751j21120j8588k1830L5739p925l7009K6716q139J1859
$$ y = [4754843, 4624277, 4566905, 4405341, 4309364, 4155643, 4137771, 4157947, 4023167, 4134134, 4190482, 3932306, 4045176, 4028822, 3913831, 4110440, 3955084, 4015776, 4064997, 4217672, 3997553, 3917289, 4013364, 3750356, 3806321, 3733615, 3601116, 3556171, 3435089, 3521609, 3452924, 3665463, 3537203, 3370351, 3459373, 3457055, 3636697, 3534643, 3563121, 3494341, 3576013, 3674504, 3536489, 3540246, 3387435, 3343810, 3420175, 3233495, 3413354, 3265120, 3100067, 3085127, 3100747, 3254238, 3055532, 3313204, 3103221, 3399307, 3519413, 3636377, 3499743, 3668458, 3691543, 3868502, 3769827, 3765135, 3732021, 3746851, 3443536, 3479244, 3169110, 3067212, 3164351, 2853190, 2896264, 2676171, 2813922, 2692802, 2674214, 2652384, 2688123, 2680198, 2643189, 2669905, 2661766, 2673625]
6921B673625J27263O8917j33035K1139R4224L368P7625M7214m3873P1258N3934
6910C061659p5320L6566k0495j51438q6977K74r0113j16751L11327k79895j39748
6899B449089K8937Q8752P5465m8051q2409L1185k3179q0609K60685L0934m4621
6888B686178M8530k47335L522j16771j5926j39379o9841o9716l3030l9635k25762
6877A780835Q1492J56668p1593K45628k01012J5883J85427P1313J11767Q3982
6867B460390L3326j74915J59026o1078J5847q3849k09044j4277l90j67226k1718
6856A936092n5271K05627k8281p1717N4699L5806O4384L7262j70897J82393K4686
6845B214783n6519K59455j3584P1562J02090J0499K98564o3556m7838O9685l416
$$ y = [2673625, 2800888, 2869805, 2736770, 2757909, 2852133, 2855501, 2933126, 2980340, 2936467, 3007725, 3061659, 2986339, 3022905, 3002410, 2850972, 2763995, 2764269, 2674156, 2557405, 2868732, 2588837, 2449089, 2478026, 2566778, 2642243, 2594192, 2511783, 2542968, 2519789, 2439180, 2699865, 2730799, 2686178, 2734708, 2487373, 2490895, 2374124, 2358198, 2218819, 2148978, 2079262, 2046232, 2006597, 1780835, 1862327, 2018995, 1947402, 2193030, 1992018, 2007901, 2193328, 2264641, 2376408, 2460390, 2493716, 2318801, 2477827, 2416749, 2432596, 2348747, 2139703, 2125426, 2125036, 1957810, 1936092, 1880821, 2086448, 2058167, 1986450, 2041149, 2076955, 2141339, 2178601, 2007704, 2190097, 2214783, 2158264, 2417719, 2404135, 2475697, 2577787, 2588286, 2886850, 2823294, 2775456, 2845141, 2841725]
6834B841725j22540m1979P9725K3814J2299J91288J60046J91818J10299Q7554
6824C534049N87858O24889P84694O60845P73425M89705L36237k13805k88628l91116
6814F898153o24857k71502m56612j52616k38108k07106l73453j5709J28869J6214
6804D703273j22266J62892o5299L14243K39058N66704O40440O98766J209245J509736
6794I856792K416497L264184K750948J769122K17439n41871j410158k159115k089589
6785A4074249j903375j783756j338526j010134n74266o10023j11604l54263j68996
6776F219306j85357Q9089O7302J89308K43236M12793N23468Q33564R56889J309513
6766A0659111K481368L168034K897863J879679L53274r56577j446652k116084
$$ y = [2841725, 2719185, 2677206, 2756931, 2780745, 2793044, 2984332, 3144378, 3336196, 3446495, 3534049, 4121907, 4746796, 5531490, 6192335, 6965760, 7455465, 7791702, 7577897, 7289269, 6898153, 6273296, 6001794, 5545182, 5392566, 5154458, 4947352, 4573899, 4558190, 4687059, 4703273, 4581007, 4743899, 4678600, 4992843, 5231901, 5798605, 6439045, 7137811, 8347056, 9856792, 12273289, 15537473, 18288421, 20057543, 20274982, 19733111, 18322953, 16163838, 14074249, 12170874, 10387118, 9048592, 8038458, 7464192, 6854169, 6742565, 6388302, 6219306, 6033949, 6123038, 6190340, 6379648, 6622884, 7035677, 7559145, 8392709, 9349598, 10659111, 13140479, 16308513, 19206376, 21086055, 21439329, 20482752, 19036100, 16920016]
6758A6920016k232611k204557j775375j482585j232209p25163l65071n00260l03192
6749F098993k34893p2373n5231k08106l18386o8410J67052K497K05248L36117
6739E852508M62653Q03089Q39573O94058O18160k8343j28608o39541o26823o17729
6729G228997p03611n71354l86592m14382m64560j06939j47381k35642j33143q4070
6719C981323o1390n8677j96873j49904O028p7005j15708J3311J21214k9155R4831
6708C527995L804p1794j1916R499J81357K98343J36403K76120L93592K65518N13706
6697E522627O2446l17009n6043q4383l35375m09250n1946k09632q4974r7926O5237
6686D003772N6034n9403j16338Q9625K6374j41212J51571J55036J2042L86370
$$ y = [16920016, 14687405, 12482848, 10707473, 9224888, 7992679, 7267516, 6902445, 6402185, 6098993, 5864100, 5791727, 5736496, 5528390, 5210004, 5141594, 5308646, 5311143, 5516391, 5852508, 6315161, 7118250, 7957823, 8651881, 9270041, 9241698, 9113090, 8473549, 7846726, 7228997, 6525386, 5954032, 5567440, 5153058, 4688498, 4581559, 4434178, 4198536, 4065393, 3981323, 3919933, 3861256, 3664383, 3514479, 3520507, 3443502, 3327794, 3341105, 3462319, 3433164, 3527995, 3531799, 3460005, 3448089, 3457588, 3638945, 3937288, 4073691, 4349811, 4743403, 5008921, 5522627, 5585073, 5268064, 5212021, 5127638, 4792263, 4383013, 4331067, 4121435, 4036461, 3938535, 4003772, 4059806, 4000403, 3884065, 3973690, 4000064, 3858852, 4010423, 4165459, 4177501, 4563871]
6676D563871Q5440M29021M86641O50381J011761J186402Q76291L26733j15992
6667I500549m70409n86681j052060o70668n98562m27962m67531j73337j93342
6658D859997L8675j47530J84822j89157J15160P8082J59076P9647K38176Q9818
6648E506766J68182K85822K51201O75493R92605J154597J102606K12255j85098
6639A0164429m26706n01273r11615p58405o80621m74163n08499j30579j58l46624
6629E425786Q1267j57235J25381J85013K08673L61497M55169L76276K84479P6810
6619G423116J36200J12101N6674N59076N60355O90583J033323J037804L66420
6610A1975652O5666l38498m70680q11360r21235m96794n52574l43577k91740k47211
$$ y = [4563871, 4649311, 5078332, 5564973, 6215354, 7227115, 8413517, 9289808, 9616541, 9500549, 9030140, 8443459, 7391399, 6720731, 6122169, 5694207, 5226676, 5053339, 4859997, 4898672, 4751142, 4935964, 4746807, 4861967, 4940049, 5099125, 5178772, 5416948, 5506766, 5674948, 5960770, 6211971, 6887464, 7880069, 9034666, 10137272, 10349527, 10164429, 9737723, 9236450, 8324835, 7566430, 6885809, 6411646, 5903147, 5772568, 5772410, 5425786, 5507053, 5349818, 5475199, 5660212, 5868885, 6230382, 6685551, 7061827, 7346306, 7423116, 7559316, 7671417, 7728091, 8287167, 8847522, 9538105, 10571428, 11609232, 11975652, 12041318, 11702820, 11232140, 10420780, 9499545, 9002751, 8450177, 8106600, 7814860, 7567649]
6600G567649j7232Q2425J29049L66376K28859N88999N07460L2761o7437j24242
6590I294667j77937J13420n9670L14627J103934K209942K534675K168907R13218
6581A8415783m19088j181717j788708j956353j702688j386102j490922r92746
6573G497459p31684m55428j50984R7365j77457J78297J26080o003L8897l7755
6563F378787J91289P5589K7255L75935M62374R77492K332814K809270K694147
6554A6324952J273388K5394r11579j546291k044161j927854j605718j265622j211476
6545G111033p00069m82487k93858k05823r1600j59112q0661J63475j28831K9221
6535E161288j29206J55623Q916l5249M07694K63688O45166R45178J093704M84298
$$ y = [7567649, 7550417, 7632842, 7761891, 8128267, 8357126, 8946125, 9453585, 9486346, 9418909, 9294667, 9116730, 9230150, 9170480, 9485107, 10589041, 12798983, 15333658, 17502565, 18415783, 17996695, 16814978, 15026270, 13069917, 11367229, 9981127, 8490205, 7497459, 6765775, 6310347, 6159363, 6256728, 6079271, 6257568, 6383648, 6377645, 6416542, 6378787, 6570076, 6645665, 6672920, 7048855, 7511229, 8488721, 10821535, 13630805, 16324952, 17598340, 17623734, 16712155, 15165864, 13121703, 11193849, 9588131, 8322509, 7111033, 6410964, 5928477, 5634619, 5428796, 5337196, 5178084, 5097423, 5260898, 5132067, 5161288, 5032082, 5187705, 5196621, 5161372, 5569066, 5832754, 6477920, 7423098, 8516802, 9001100]
6525I001100L49551p6988n24668o43547n74305o19875l46423m78191l26683j83069
6515E576902r495r7634J91338j56166m3300j50975L25680o1036J42482j19254
6505E598542p0071J82878J05251j46749J47784j5790l2642J83053n195L0225K18629
6494F195915n4755m5850O9184J37728j22895K58054K21826j6120L1185K99909
6484F974181M5276K31789r9879K08872P1302j4361O1231J91439j03825Q361J14492
6473G688878K13960o8335L36001L39538L55360M54217r4720K24124L9098J90546
6463I678667k01080K92945J97025j16694N52810K66782O95216N27860K66732K12609
6453A2372872L85520L94465P56871R23998J308943J428970R16561J15692J75803
$$ y = [9001100, 9350651, 9273663, 8748995, 8105448, 7531143, 6911268, 6564845, 6086654, 5759971, 5576902, 5567407, 5469773, 5661111, 5504945, 5461645, 5310670, 5636350, 5575314, 5717796, 5598542, 5528471, 5711349, 5816600, 5669851, 5817635, 5801845, 5769203, 5952256, 5947061, 5977286, 6195915, 6141160, 6095310, 6164494, 6302222, 6179327, 6437381, 6659207, 6643087, 6674272, 6974181, 7019457, 7251246, 7151367, 7360239, 7431541, 7417180, 7478411, 7669850, 7566025, 7574386, 7688878, 7902838, 7834503, 8170504, 8510042, 8865402, 9319619, 9224899, 9449023, 9488121, 9678667, 9477587, 9770532, 9967557, 9850863, 10403673, 10670455, 11365671, 11893531, 12160263, 12372872, 12758392, 13152857, 13909728, 14833726, 16142669, 17571639, 18488200, 18603892, 18779695]
6444A8779695k95996M3082J75783M57931O68961J79385j3163J97878J94296j087
6434B0386765L86310P94825J302317J430835K088387K054738J697284J825264
6426C1966725J318366K231497K547227L872148N894815Q383772Q791802P808259
6418G2814611N298163L220987J060678q16860j726996k087062j672612j162502
6410G4928407n99633o8739O68309K174488M172676O081074Q381339R231897Q847218
6401A13817036O672856M477613K141117J51167j345246k506734l615047l428088
6393A16364674k381360k285345l761757o053689n748292o098906n365325l455624
6385H1214376r67827K685731O122117Q441143Q994001Q386358Q920687R791171
$$ y = [18779695, 18483699, 18526781, 18702564, 19160495, 19829456, 20008841, 19995678, 20193556, 20387852, 20386765, 20773075, 21567900, 22870217, 24301052, 26389439, 28444177, 30141461, 31966725, 33285091, 35516588, 38063815, 41935963, 47830778, 56214550, 65006352, 72814611, 78112774, 81333761, 82394439, 81577579, 79850583, 77763521, 76090909, 74928407, 74328774, 74260035, 74928344, 77102832, 81275508, 87356582, 95737921, 104969818, 113817036, 120489892, 124967505, 127108622, 127259789, 125914543, 123407809, 119792762, 116364674, 113983314, 111697969, 107936212, 101882523, 96134231, 90035325, 84670000, 81214376, 80246549, 82932280, 89054397, 97495540, 106489541, 114875899, 123796586, 133587757]
6377A33587757R973902J0158699P010706J979359m791321j0225235j3471233j5337002
6369A18885632j5038730j3731678j1027039q123765n891774l354159k881509l133829
6361E5703149k899232k446384k722104j569076o44600J995835M346262N470305
6353E7234155N244559L116914K467883L271444K775296K882778J905745m07277
6345G8491497k763297n664223o329574p221365o896487o266951n437001m186789
6337C3725810l346851k493722j926206j570615j470070r39313j174778p17434
6329B0086821m75366K73778Q72930J285337Q11906j34300o77527j137202j570706
6320A9335671j409082j513816j440508q09736j018467p28484o79550l61825k80210
$$ y = [133587757, 143561659, 153720358, 160731064, 162710423, 157919102, 147693867, 134222634, 118885632, 103846902, 90115224, 79088185, 70964420, 65072646, 61718487, 58836978, 55703149, 52803917, 50357533, 47635429, 46066353, 45421753, 47417588, 51763850, 57234155, 62478714, 65595628, 68063511, 71334955, 74110251, 76993029, 78898774, 78491497, 75728200, 70063977, 63734403, 56513038, 49616551, 43349600, 37912599, 33725810, 30378959, 27885237, 25959031, 24388416, 22918346, 21979033, 20804255, 20086821, 19611455, 19885233, 20758163, 22043500, 22855406, 22721106, 22043579, 20906377, 19335671, 17926589, 16412773, 14972265, 14162529, 13144062, 12415578, 11736028, 11374203, 11093993]
6311A1093993l01566p1627m20579j63554j22662k96543j78780j27743m7980j22534
6301I240425J20831n0021k55085O615J84609K79998K97952N71568R65353Q45640
6291A2207885L90430P799n67569o25438p00909n29796p67257m64116l84954j28744
6281H437331k34126j544k10604J08046j53470N6040j73438N1727n1179K63960
6271H092743Q8249K52835M99063N93220J276292K682498L540897K916371J043000
6262B0985168n01527r01627j543592j810351k135987j471165j162732j235315
6254A0222872p52820l06962m76621R8585p959L7702p8629O3253K33121L89238
6244I421780P76084O65177R92524J209707J302245J775931L295321M018517L134118
$$ y = [11093993, 10792427, 10720800, 10300221, 10136667, 10014005, 9717462, 9538682, 9410939, 9362959, 9240425, 9361256, 9311235, 9056150, 9062765, 9247374, 9527372, 9825324, 10396892, 11362245, 12207885, 12598315, 12606114, 12038545, 11413107, 10712198, 10182402, 9415145, 8951029, 8566075, 8437331, 8203205, 8201661, 7991057, 8099103, 7945633, 8001673, 7828235, 7879962, 7828783, 8092743, 8180992, 8433827, 8932890, 9526110, 10802402, 13484900, 17025797, 19942168, 20985168, 20483641, 19582014, 18038422, 16228071, 14092084, 12620919, 11458187, 10222872, 9470052, 9163090, 8686469, 8785054, 8777095, 8814797, 8736168, 8799421, 9032542, 9421780, 10197864, 10863041, 11855565, 13065272, 14367517, 16143448, 19438769, 23457286, 26591404]
6235B6591404J871503M96414m75862j904092k403420k961644k537317k258529
6227A6418457k046773j424134j277141n34188l39460j39523j27330J87304K35548
6218A0952760P52848P88171J287252J817045J732287J883788J964388J784320
6210B2962859J734120K096404K864635M049059M284679K135328l76580k160561
6202C7589943l089948m027487l616141l623805k413845j494575n18037m77287
6194A8328818l25636p33485m12037o31445n02310k4371Q06744R83127J366284
6185A8855689J396171J266155J303384O74583R52620K591320M286164N194622
6177C6520708L651748P68939p98777j904143l159971l814492l027210j680808
$$ y = [26591404, 28462907, 28959321, 28483459, 26579367, 24175947, 21214303, 18676986, 16418457, 14371684, 12947550, 11670409, 11136221, 10796761, 10657238, 10529908, 10717212, 10952760, 11705608, 12493779, 13781031, 15598076, 17330363, 19214151, 21178539, 22962859, 24696979, 26793383, 29658018, 33707077, 37991756, 40127084, 39750504, 37589943, 34499995, 30472508, 26856367, 23232562, 20818717, 19324142, 18806105, 18328818, 18003182, 17269697, 16857660, 16226215, 15723905, 15699534, 16506278, 17489405, 18855689, 20251860, 21518015, 22821399, 23495982, 24448602, 27039922, 31326086, 36520708, 40172456, 40941395, 40142618, 38238475, 35078504, 31264012, 28236802, 26555994]
6169B6555994K12698J028078J091549k78870j348248j986298k425117k681449
6161B0168337k055361j646385j103361q67167k40117j84857L24495j4450M57788
6152A4838922J017890J691719K550653J817513J208662L30080r2281p11569j287490
6143B1364099q88351l2028J541765K478532J875994k12344j419991j913205k507088
6134B0287383k680836k584275k129359j626259j256045j114844n90266k92135
6126H013364k21517l45089K6447K65805J23609M53898L34494L94182K43278j29598
6116I158873j4562L8972L88692O83170J027229M66853l1902m24651o39440r35135
6106I718099q10641r02402p93528m85798m83135k65821l15625j51802l6597k26321
$$ y = [26555994, 26768692, 27796770, 28888319, 28609449, 27261201, 25274903, 22849786, 20168337, 18112976, 16466591, 15363230, 14496063, 14255946, 14071089, 14395584, 14381134, 14838922, 15856812, 17548531, 20099184, 21916697, 23125359, 23455439, 23363158, 22651589, 21364099, 20475748, 20443720, 21985485, 24464017, 26340011, 26127667, 24707676, 22794471, 20287383, 17606547, 15022272, 12892913, 11266654, 10010609, 8895765, 8305499, 8013364, 7791847, 7446758, 7473205, 7739010, 7862619, 8316517, 8651011, 9045193, 9288471, 9158873, 9144311, 9183283, 9571975, 10255145, 11282374, 11749227, 11717325, 11292674, 10653234, 9718099, 8907458, 8005056, 7211528, 6725730, 6242595, 5976774, 5661149, 5509347, 5472750, 5246429]
6096E246429J61258k19103o6809p4098k16889j3120Q200l8604J14282j47447J01166
6085D855265Q7311k76842J45388k7317m6068n7174j14203M6141K1996p8416K4696
6074D580777J79022m4215p14q8466J67030m0631k9814m2783L11725j27415M6517
6063D911033M5318J36326l3578j5126p6178k7130j16237O4306k32739P0541R6081
6052D822617L4764L3473J57626k02003J09606O4267K25372k03518J43017k5999
6042E159222Q785J19706o829K3815j14920K18374O8076P8467r8084J27213n6821
6031E527004K51634j71502k7102K33866J10333L9882J26113Q4481J23753P5743
6021F374205J64682J28095J04345O4944K04048R9582o3951K94303m9149K53171
$$ y = [5246429, 5407687, 5188584, 5121775, 5047677, 4830788, 4817668, 4825868, 4787264, 4901546, 4754099, 4855265, 4942576, 4665734, 4811122, 4783805, 4737737, 4680563, 4566360, 4612501, 4634497, 4556081, 4580777, 4759799, 4715584, 4714870, 4626404, 4793434, 4752803, 4722989, 4680206, 4991931, 4864516, 4911033, 4956351, 5092677, 5059099, 5043973, 4967795, 4940665, 4824428, 4888734, 4655995, 4726536, 4822617, 4857381, 4890854, 5048480, 4846477, 4956083, 5020350, 5245722, 5042204, 5185221, 5159222, 5168007, 5287713, 5280884, 5304699, 5189779, 5408153, 5476229, 5554696, 5456612, 5583825, 5527004, 5778638, 5607136, 5580034, 5813900, 5924233, 5964115, 6090228, 6174709, 6298462, 6374205, 6538887, 6666982, 6771327, 6836271, 7040319, 7139901, 7075950, 7370253, 7321104, 7574275]
6011G574275j57349O45276k00317L39088n8981J92402O9151K89064J8949J54042
6001H865600M46315K07917K20701J15397K41457M70771K55285J84445L71884M30194
5991A1809966K49402K60923M11905M67333N50370L84670P40465O27036P30296
5982A6232366O92376R41147J340087J029721J432304J864557J928894K443085
5974B7904537K956832L526112M615555N407351O405284P537550R373348R835486
5966G7562055Q709235O468108L007665m76419l458176n579373p307456o922556
5958G2003083o557259o194614m941982l560037k919170j899526r05937k23128
5950D4801430M08945Q65473J801975K594250L556636M562102O142824P912140
$$ y = [7574275, 7416926, 8062202, 7861885, 8200973, 8141992, 8334394, 8403545, 8692609, 8711558, 8865600, 9311915, 9519832, 9740533, 9855930, 10097387, 10568158, 10823443, 11007888, 11379772, 11809966, 12059368, 12320291, 12732196, 13199529, 13749899, 14134569, 14875034, 15502070, 16232366, 16924742, 17865889, 19205976, 20235697, 21668001, 23532558, 25461452, 27904537, 30861369, 34387481, 39003036, 44410387, 50815671, 58353221, 67726569, 77562055, 86271290, 92739398, 95747063, 95270644, 91812468, 86233095, 78925639, 72003083, 65445824, 59251210, 54309228, 50749191, 47830021, 45930495, 45024558, 44801430, 45210375, 46075848, 47877823, 50472073, 54028709, 58590811, 64733635, 72645775]
5942G2645775J0575293J4127030J7498361J9290528J7306462J2614911O755644
5935A70814004N13727n501999r712829j2284664j3907090j3675351j3035598j1740149
5927I1470051j0204047q283690o626103n257958m106275l007783k084856j271119
5919E0628220r13108J68544R49282J550837K564926L566742N168680O169039O934288
5910G6787450O496467N891058L226821J299932q04305k579307m100363n041845
5902H1175908n353511n837076n663724n295208n192873m579492m058055l414846
5894D1781123l042371k314312j867129j637499j376068r15884p07078o29272n33647
5885B8757863m93928k43833j87260J67542o6069K61977j57432q5262J10620n8608
$$ y = [72645775, 83221068, 97348098, 114846459, 134136987, 151443449, 164058360, 170814004, 171327731, 165825732, 156112903, 143828239, 129921149, 116245798, 103210200, 91470051, 81266004, 72982314, 66356211, 61098253, 56991978, 53984195, 51899339, 50628220, 49715112, 49883656, 50832938, 52383775, 54948701, 58515443, 63684123, 69853162, 76787450, 83283917, 89174975, 92401796, 93701728, 92897423, 90318116, 86217753, 81175908, 75822397, 69985321, 64321597, 59026389, 53833516, 49254024, 45195969, 41781123, 38738752, 36424440, 34557311, 32919812, 31543744, 30627860, 29920782, 29291510, 28757863, 28263935, 28020102, 27832842, 28000384, 27934315, 28196292, 28038860, 27953598, 28064218, 28005610]
5875B8005610j90364l35819m27688n40889p67558n76579q71040o46964o91488
5866B2957221q26357n41778o64996o87389l95131k75777k14476k07696O672k32597
5856A8917696K59190L7175Q0833J60503N09990K25608L40166L57900L08763M08425
5846B1606249J87511M37945K74802J4372P8012j56379k40911m03730k61995p26218
5836B0809658m60971k27966l60862J7418q6758k20961K94122J95179M34076O07967
5826B1000902M83962Q38958Q47701J194015J350879J476160J774420J878524J729252
5817C2574773K118326K144789J847441J622702J574190J278220J039569N69582
5809D4769592N87609M35945J04473L53076K75347L76312N42773P40140J098055
$$ y = [28005610, 27815246, 27479427, 27051739, 26510850, 25743292, 25166713, 24295673, 23648709, 22957221, 22130864, 21589086, 20924090, 20236701, 19841570, 19565793, 19351317, 19143621, 19150293, 18917696, 19176886, 19214061, 19294894, 19455397, 19965387, 20190995, 20531161, 20889061, 21197824, 21606249, 21793760, 22231705, 22506507, 22520879, 22598891, 22442512, 22201601, 21797871, 21535876, 20809658, 20348687, 20120721, 19759859, 19777277, 19690519, 19469558, 19763680, 19958859, 20392935, 21000902, 21484864, 22323822, 23171523, 24365538, 25716417, 27192577, 28966997, 30845521, 32574773, 34693099, 36837888, 38685329, 40308031, 41882221, 43160441, 44200010, 44769592, 45357201, 45793146, 45897619, 46250695, 46526042, 46902354, 47445127, 48185267, 49283322]
5800D9283322J371232J552587J879863K385423K407426K533079K442525K219926
5792F6075383K170917J694659J101620L93995j08223p75048j312966j765438k216430
5783F5258469k556445k996733k581565k744223j998346k278725j798077j042852
5775D7261503r34814m46447m8440J55324L50458K10698O63130L30060K47273P3309
5765D7862054l05404l74221p67782r51675j159905j497019j629243j175401j532312
5756C8469092j486860j331162j197766j105721j138462o58647p65053n66228m22551
5747B9796642m53083l70384n02076o3065j94541k28207k07576O4480k62898R8319
5737B7677611l4566m9666J46343N4694J25305J89986p3013L2581K7465k80513
$$ y = [49283322, 50654554, 52207141, 54087004, 56472427, 58879853, 61412932, 63855457, 66075383, 68246300, 69940959, 71042579, 71436574, 71328351, 70553303, 69240337, 67474899, 65258469, 62702024, 59705291, 57123726, 54379503, 52381157, 50102432, 48304355, 47261503, 46326689, 45880242, 45831802, 45987126, 46337584, 46548282, 47211412, 47541472, 47788745, 47862054, 47556650, 47182429, 46414647, 45462972, 44303067, 42806048, 41176805, 40001404, 38469092, 36982232, 35651070, 34453304, 33347583, 32209121, 31550474, 30785421, 30219193, 29796642, 29343559, 28973175, 28471099, 28408034, 28213493, 27985286, 27777710, 27842190, 27579292, 27677611, 27643045, 27593379, 27739722, 27794416, 27919721, 28109707, 28036694, 28069275, 28096740, 27816227]
5727B7816227j51615k02165p8396k93156k78020m72351m90584l19849n55837l68469
5717B4605785k92651n82909l52762o99652k32919j50012n19733j11561j63816
5708B1499770k76641k28465k78912m7458k31128k49894k28563l38770n09543m25049
5698A8685347l36113m29771n60475n01707k50015m16478k75130n48173j47846
5689A5219639j19060l0224l14117o8887n671l74934l48970r3271q623J20234l04176
5678A3671940K33059j12338J04641j55774n8841r1012J2094k42927o7882q8030
5668A3204930j81526k25050r7080k06592Q1254k21206K47223p284n3625K77200
5658A2818244j36165J54416J50079Q2949j6333J56050J05662q6837L2738j31027
$$ y = [27816227, 27664612, 27462447, 27384051, 27090895, 26812875, 26340524, 25849940, 25530091, 24974254, 24605785, 24313134, 23730225, 23377463, 22677811, 22444892, 22294880, 21775147, 21663586, 21499770, 21223129, 20994664, 20715752, 20668294, 20437166, 20187272, 19958709, 19619939, 19110396, 18685347, 18349234, 17919463, 17358988, 16857281, 16607266, 16190788, 15915658, 15367485, 15219639, 15100579, 15070355, 14756238, 14687351, 14681680, 14306746, 13957776, 13864505, 13855882, 13976116, 13671940, 13904999, 13792661, 13897302, 13741528, 13682687, 13591675, 13603769, 13360842, 13292960, 13204930, 13023404, 12798354, 12701274, 12494682, 12575936, 12354730, 12601953, 12594669, 12541044, 12818244, 12682079, 12836495, 12986574, 13069523, 13053190, 13209240, 13314902, 13228065, 13260803, 13129776]
5648A3129776k13796q0719J98581n2561k00431l16649J98461l64109j10083k74371
5638A1914099j77010k09164k52124o7355j28844j66007Q402N806K36153p5417
5628A1088539L15156J20413J66499J27834L28536J54719J27512J824L0037p3408
5618A2387661j62834n04902l18197k01551n13022k86361m10759k64541k03293
5609I522201l69098J4380j17981j52987j331q5448J58318k9645J18414o951K37579
5598I287451J61867R0297O0607L37256J00780J87240J07437n5140K490Q1657j11289
5587A0250653K1905j68037J01516j04419n2209L1252q8209L21531m6545L64555
5577A0631993K74687K62273K02849Q78855M88743J023706R08895N87069N24589
$$ y = [13129776, 12915980, 12835261, 13033842, 12981281, 12780850, 12464201, 12662662, 12298553, 12188470, 11914099, 11737089, 11527925, 11275801, 11208446, 11079602, 10913595, 10921997, 10927803, 11163956, 11088539, 11403695, 11524108, 11690607, 11818441, 12146977, 12301696, 12429208, 12431032, 12461069, 12387661, 12224827, 11719925, 11401728, 11200177, 10687155, 10400794, 9990035, 9725494, 9522201, 9153103, 9167483, 9049502, 8896515, 8895184, 8809736, 8968054, 8938409, 9056823, 9049872, 9287451, 9449318, 9539615, 9600222, 9937478, 10038258, 10225498, 10332935, 10277795, 10280285, 10361942, 10250653, 10272558, 10104521, 10206037, 10101618, 10049409, 10080661, 9992452, 10313983, 10267438, 10631993, 10906680, 11168953, 11371802, 12250657, 12739400, 13763106, 14672001, 15259070, 15783659]
5568A5783659O57306P08372N58726O23131J248245J510426J707373K010165J946515
5559B6753918K533028K083323K356658J801009J510677Q27131J09404j50170n58079
5550C7266899j254941j056974j365122j242359j301511r28139o22818l80411l06319
5541B8808305J55684K96993O35922Q91720J433053J593065K114875K570789L328271
5532D1828677L553950L880754M338341M235653L793181L500021K572312J507670
5524F9210559K05496p26354j912947k584282l580088l781915l763492m054766
5516D9012211l598651l245456k786770k175165k056016j217450j049770o19755
5508C2263178m61539Q6151M88098Q40867P84787J646622J566729K022526K137451
$$ y = [15783659, 16440965, 17149337, 17708063, 18331194, 19579439, 21089865, 22797238, 24807403, 26753918, 29286946, 31370269, 33726927, 35527936, 37038613, 37865744, 37975148, 37824978, 37266899, 36011958, 34954984, 33589862, 32347503, 31045992, 30117853, 29495035, 29114624, 28808305, 28963989, 29260982, 29896904, 30788624, 32221677, 33814742, 35929617, 38500406, 41828677, 45382627, 49263381, 53601722, 57837375, 61630556, 65130577, 67702889, 69210559, 69416055, 68689701, 66776754, 64192472, 60612384, 56830469, 53066977, 49012211, 45413560, 42168104, 39381334, 37206169, 35150153, 33932703, 32882933, 32263178, 31801639, 31887790, 32375888, 33216755, 34001542, 35648164, 37214893, 39237419, 41374870]
5499D1374870K092356K056060J581898R49073N1062o45893j287898j937521k325846
5490D1908161k633650k922606k581143k490983k515553k012576j877750j482642
5482B3391258j245146j207858q43774o97444p14490o02725m15031k08724m47069
5473A7008997k22530l42252k09750k26962j26982j5583k26592O9340j08360n9732
5463A5539594R7660j7570k33294R7399j13212j64019J20147O4260j32391k09196
5453A5049378n2058J7114k80454J85093j36106k31062j17758q2257j56798j13330
5443A4081762j01183j61571j27949J465j02749j98393r4646k41642j63602k63161
5433A2628331j24166j14723j74615q0537m66019Q125l35807l56617m2885j88936
$$ y = [41374870, 43467226, 45523286, 47105184, 48054257, 48105319, 47459426, 46171528, 44234007, 41908161, 39274511, 36351905, 33770762, 31279779, 28764226, 26751650, 24873900, 23391258, 22146112, 20938254, 20094480, 19397036, 18682546, 18079821, 17664790, 17456066, 17008997, 16786467, 16444215, 16234465, 16007503, 15880521, 15864938, 15638346, 15707686, 15599326, 15539594, 15637254, 15619684, 15386390, 15483789, 15370577, 15206558, 15326705, 15390965, 15258574, 15049378, 14997320, 15014434, 14733980, 14919073, 14782967, 14551905, 14434147, 14351890, 14195092, 14081762, 13980579, 13819008, 13691059, 13692524, 13589775, 13391382, 13296736, 13055094, 12891492, 12628331, 12504165, 12389442, 12214827, 12134290, 11668271, 11676396, 11340589, 10983972, 10941087, 10752151]
5423A0752151j96439q8968n4302k96412m184q2170M6295p2816L6320R3823J87156
5412A0320454J23174L70756K20111J57750L54473L20807L70091K64973J58571
5403A2661160q3774N154l35239n85133k49892l18654j14484m25697l85695O653
5393A0174399k35709L1832p9502j60784J59365J185R3145n1183K37920l5445Q9794
5382A0225017N0344K2078P5602k48414L51693j18042J2677p6881J7942j59773
5372A0152243k4389R531k93181q8674j27326o488l7292n6970q1220k15124K02037
5361I433147j79397j0218j3058j7783K11557k23691Q0122J10988j38794J91898
5351I444771j72424R206M1532J13407R6623k25704L18094M8709o0113Q3091K09158
$$ y = [10752151, 10555712, 10466744, 10412442, 10116030, 10111846, 10029676, 10075971, 10003155, 10039475, 10133298, 10320454, 10443628, 10814384, 11034495, 11192245, 11546718, 11867525, 12237616, 12502589, 12661160, 12577386, 12582540, 12247301, 11662168, 11412276, 11093622, 10979138, 10553441, 10167746, 10174399, 9938690, 9970522, 9891020, 9730236, 9889601, 9890786, 9983931, 9932748, 10170668, 10135223, 10225017, 10275361, 10297439, 10373041, 10124627, 10476320, 10358278, 10370955, 10294074, 10312016, 10152243, 10127854, 10137385, 9844204, 9755530, 9628204, 9621716, 9584424, 9527454, 9446234, 9231110, 9433147, 9253750, 9243532, 9230474, 9212691, 9424248, 9200557, 9280679, 9391667, 9252873, 9444771, 9272347, 9281553, 9323085, 9436492, 9533115, 9307411, 9625505, 9674214, 9614101, 9697192, 9906350]
5340I906350K63379K57203J36601Q7954N59511j569M92904K65466M58031L37636
5330A2763466M56957N05906P25825N74818R82144O35447J174977J081231J329564
5321B0230335J365340J641413J737716J767297J971398J719861J747972J534233
5313C3715565J630038J126194R58091M71728P85436R6505K13729J43946j60977
5304C8980255M63880m3132M69838P02882J082198J390718J705695K020886K565440
5295D9338660K554178L088806K961169K927327L004490K443277J809504J371153
5287F9498564Q56025k79348p20520j301034j984933k198844k136307k542385k161604
5278E7029614k283173j891625j663356j260620j020445r31507m77560n07077l86648
$$ y = [9906350, 10169729, 10426932, 10563533, 10651487, 11210998, 11209429, 11702333, 11967799, 12425830, 12763466, 13220423, 13726329, 14452154, 15026972, 16009116, 16644563, 17819540, 18900771, 20230335, 21595675, 23237088, 24974804, 26742101, 28713499, 30433360, 32181332, 33715565, 35345603, 36471797, 37429888, 37901616, 38687052, 38783557, 38997286, 39141232, 38980255, 39444135, 39401003, 39870841, 40573723, 41655921, 43046639, 44752334, 46773220, 49338660, 51892838, 54981644, 57942813, 60870140, 63874630, 66317907, 68127411, 69498564, 70354589, 70075241, 69354721, 68053687, 66068754, 63869910, 61733603, 59191218, 57029614, 54746441, 52854816, 51191460, 49930840, 48910395, 47978888, 47501328, 46994251, 46607603]
5269D6607603l09910l33491o08686o18627j012618j024478j765482j787119j853535
5260C7293657k033566k304110j997288k122826k178964j813624j734796j626629
5252B1481854j375789j287375j038825r38865q81177q52474o55576n61599n91822
5243A3298352m93168j99545l21989n75410k13432m83654r5553k39344k22044k13878
5233A0240335l19794j32631k41745l9317j39118j82018o2334j93722j20428j30448
5223H678780k06694j69314p3151p2023o0360j60450K02109j61983l3842n7847
5213G885225l7887l72930j20175j94199j14949m02357m0236j23031k30169M6603
5203F295895k70143m4539r7314J6781k70443J66615j23126K465n6711J04298O7078
$$ y = [46607603, 46297693, 45964202, 45355516, 44736889, 43724271, 42699793, 40934311, 39147192, 37293657, 35260091, 32955981, 30958693, 28835867, 26656903, 24843279, 23108483, 21481854, 20106065, 18818690, 17779865, 16841000, 15959823, 15107349, 14451773, 13890174, 13298352, 12805184, 12605639, 12283650, 11708240, 11494808, 11011154, 10915601, 10676257, 10454213, 10240335, 9920541, 9787910, 9546165, 9506848, 9367730, 9185712, 9123378, 8929656, 8809228, 8678780, 8472086, 8302772, 8229621, 8157598, 8097238, 7936788, 8138897, 7976914, 7943072, 7885225, 7847338, 7474408, 7354233, 7160034, 7045085, 6642728, 6602492, 6479461, 6249292, 6295895, 6025752, 5981213, 5883899, 5900680, 5630237, 5796852, 5673726, 5676191, 5619480, 5723778, 5790856]
5192E790856J64537M47015k37948J6993k50427j75381j41877k39578m7784n6381
5182E270025j12536k30676q9189j82159k58858O1177O0565j27665j72614n1215
5172D166855J13695j62919j5944O6691O6390p4088P7218p5085P7893l4565j33213
5161D072928p8795P23J33008o1691K9508P6600n6989J76752P9959l18533J47423
5150D200893K09179M113k05113L39680k17597J87733K661J03570p5932p0269K58504
5139D737422J11284k12378L27645n0254K65577j52745J05430p7043J16522K50122
5129E421582r2532J45767J86957j40858L12540P1279K54134j24206K18610J4400
5119F267673n8838L13392K43336j4376J75333K30383J37803J52874J56265L93439
$$ y = [5790856, 5955393, 6402408, 6164460, 6181453, 5931026, 5755645, 5613768, 5374190, 5326406, 5270025, 5157489, 4926813, 4837624, 4655465, 4396607, 4457784, 4518349, 4390684, 4218070, 4166855, 4280550, 4117631, 4101687, 4168378, 4234768, 4160680, 4237898, 4162813, 4240706, 4206141, 4072928, 3994133, 3994856, 4127864, 4066173, 4095681, 4172281, 4115292, 4292044, 4372003, 4053470, 4200893, 4410072, 4414185, 4209072, 4548752, 4331155, 4518888, 4521549, 4625119, 4549187, 4478918, 4737422, 4848706, 4636328, 4963973, 4913719, 5179296, 5026551, 5131981, 5054938, 5171460, 5421582, 5329050, 5474817, 5661774, 5520916, 5833456, 5904735, 6158869, 6034663, 6253273, 6267673, 6208835, 6522227, 6765563, 6751187, 6926520, 7156903, 7294706, 7447580, 7603845, 7997284]
5109G997284K69713K75962N05990J29774O82325L57026N06224N94769J082595
5100A2401662P54486J018588J196347J170261J153895J226380P25532O37433J42799
5091B0427383j98064k32645l70137l40895n29112j40980l88042N8093L1924K06411
5081A8523936L62911N54711N04297O59873P68850J233553J424439J823866K259840
5072B8116276L217816N396760P402558P622879N779419K671737L045282M26678
5064F3679405l89533j273566j757850j787095j209196N57333J591647J019736
5056F0430881k025401k813650l181978m045506l658908l029703k386152j326618
5048C7962965j264656l32181N07434R12453J499321K481828K750795L821273M137829
$$ y = [7997284, 8266997, 8542959, 9048949, 9178723, 9861048, 10218074, 10724298, 11319067, 12401662, 13156148, 14174736, 15371083, 16541344, 17695239, 18921619, 19647151, 20284584, 20427383, 20229319, 19996674, 19626537, 19285642, 18756530, 18615550, 18227508, 18285601, 18317525, 18523936, 18886847, 19441558, 19945855, 20605728, 21374578, 22608131, 24032570, 25856436, 28116276, 31334092, 36730852, 44133410, 51756289, 57535708, 60207445, 63252727, 63679405, 63289872, 62016306, 60258456, 58471361, 57262165, 57819498, 59411145, 60430881, 58405480, 55591830, 52409852, 48364346, 44705438, 41675735, 39289583, 37962965, 36698309, 36366128, 36873562, 37786015, 39285336, 41767164, 44517959, 48339232, 52477061]
5039E2477061M427731M483952L690481L465410K689257J342471R5267j197289
5031G1474341k504196l355752l908999m082030l954880l574398l535156k518274
5023D4040656k480237k039198j349649j234672o46302o48161n11136j28699K60150
5014C5262752L51422P56256J128047J466806J727471K326194K519422K768310
5006D8306680K329429J919704O84298N471j166750j704753k484835k932810k801661
4997D2154773k560393k579206k459464j876586j703798j493635j107922q09731
4989B7564038r90039q43721n90673l70087l84520k50106o8346j87645R7469K79467
4979B4255837K33738O60661N08367P46921O97889J13491K47057j06924o52353
$$ y = [52477061, 56904792, 61388744, 65079225, 68544635, 71233892, 72576363, 72671630, 71474341, 68970145, 65614393, 61705394, 57623364, 53668484, 50094086, 46558930, 44040656, 41560419, 39521221, 38171572, 36936900, 36290598, 35642437, 35131301, 35002602, 35262752, 35614174, 36370430, 37498477, 38965283, 40692754, 43018948, 45538370, 48306680, 50636109, 52555813, 53240111, 53245582, 52078832, 50374079, 47889244, 44956434, 42154773, 39594380, 37015174, 34555710, 32679124, 30975326, 29481691, 28373769, 27564038, 26573999, 25730278, 25139605, 24769518, 24384998, 24134892, 24066546, 23878901, 23976370, 24255837, 24489575, 25150236, 25658603, 26405524, 27103413, 27216904, 27463961, 27357037, 26704684]
4970B6704684l54850r83475o56625q83745p49478n47405o17154m00377k30421
4961B1281154l12485l14042k205N3129L2080K71356N13839L87145Q57855J031167
4951B3798993J498489J566416J755473J868962K164062K957971L822319M937445
4943D4370130O561974J0095328J8495747L4519089N1718455N0621037K9594090
4936B45975850Q72314j0429893k4320122k6916234k4816695j7594156r634524
4929A33136540j0337845j3498992j2159644j1302732j2271824j1774947j0318820
4922E1471736q273662o681619n617811l744752k532689j729601j542296j214585
4914B0134721j006965j047014o27394q61764m90246m35456p37318n06417m46113
$$ y = [26704684, 26349834, 25366359, 24709734, 23825989, 23076511, 22529106, 21911952, 21511575, 21281154, 20968669, 20654627, 20652422, 20705551, 20737631, 21008987, 21522826, 21909971, 22767826, 23798993, 25297482, 26863898, 28619371, 30488333, 32652395, 35610366, 39432685, 44370130, 50932104, 61027432, 79523179, 114042268, 165760723, 216381760, 245975850, 246848164, 236418271, 212098149, 185181915, 160365220, 142771064, 133136540, 122798695, 109299703, 97140059, 85837327, 73565503, 61790556, 51471736, 43198074, 36516455, 30898644, 27153892, 24621203, 22891602, 21349306, 20134721, 19127756, 18080742, 17453348, 16591584, 16101338, 15665882, 14928564, 14422147, 13976034]
4905A3976034l08592o76368l40145k42393k58467m64456j55252m64946k66662
4896A0798753o9525k04771j85608l04112l17045j99349k4651j81392k61596j21830
4886H928874J99023n13089J04709j08072k20380j67535Q9143k85854k18669r9802
4876G708348L1545l6039k27219L0924k71397K10981j10299k1450J6352n1956r2494
4865G187296j2572J6324N0126Q4344k70443o1332j4751N5444J5454Q8626o0847
4854G077669Q2530K40433j45677J70446q6764K08920L5961m5927j2520J30294
4844G655365p773J73427r9301K18963O5357J13477K8653J08371L12934R3854J34567
4833H797894Q9690J62823J18811J34287K12327L78371J01312M22400K27218J91079
$$ y = [13976034, 13667442, 12991074, 12650929, 12408536, 12150069, 11685613, 11530361, 11065415, 10798753, 10729228, 10524457, 10338849, 10034737, 9717692, 9518343, 9493692, 9312300, 9050704, 8928874, 9127897, 8614808, 8719517, 8611445, 8391065, 8223530, 8312673, 8026819, 7808150, 7708348, 7739893, 7703854, 7476635, 7507559, 7236162, 7447143, 7336844, 7315394, 7331746, 7279790, 7187296, 7174724, 7191048, 7241174, 7325518, 7055075, 6993743, 6978992, 7034436, 7049890, 7138516, 7077669, 7160199, 7400632, 7254955, 7425401, 7338637, 7547557, 7583518, 7537591, 7525071, 7655365, 7647592, 7821019, 7721718, 7940681, 8006038, 8119515, 8148168, 8256539, 8569473, 8663327, 8797894, 8887584, 9050407, 9169218, 9303505, 9515832, 9894203, 9995515, 10417915, 10645133, 10836212]
4823A0836212L36387M05781L34564M64566M75812L95948O90426N05510M21402
4814A4866608P54117O57175K50491P77997O23445L88250N95673P08792L63075
4805A9985623N76225O04195R62938M36057O27419R12756N68552Q32212P54957
4796B6260934Q54521N44460O18270O76506Q13915P40144R15052R31671J074385
4787C3429858J249110J006966J352813J347091J552835J556573J634470J681836
4779D4811552J654758J878056K184748J642671K134360J790783J832541J586133
4771E9515602J747355J481288J307786J532292J271100J248318J270378J248903
4763G0623022J379003J744099J824269J907948K484940L095202L320737L807171
$$ y = [10836212, 11172599, 11578380, 11912944, 12377510, 12853322, 13249270, 13939696, 14445206, 14866608, 15620725, 16277900, 16528391, 17306388, 17929833, 18318083, 18913756, 19622548, 19985623, 20561848, 21166043, 22128981, 22565038, 23192457, 24105213, 24673765, 25505977, 26260934, 27115455, 27659915, 28278185, 28954691, 29768606, 30508750, 31423802, 32355473, 33429858, 34678968, 35685934, 37038747, 38385838, 39938673, 41495246, 43129716, 44811552, 46466310, 48344366, 50529114, 52171785, 54306145, 56096928, 57929469, 59515602, 61262957, 62744245, 64052031, 65584323, 66855423, 68103741, 69374119, 70623022, 72002025, 73746124, 75570393, 77478341, 79963281, 83058483, 86379220, 90186391]
4755I0186391M202756M421913M596256M452498L753669L023213K267031J143947
4747A18047674O95058P4642n15328n10647q73499p62316q11511n42740o98504
4738A14102829o07396n59082n09943p67409j60221n37410n0850m1475M19614K95087
4728A11583744L85383J0577m45270j386903k098412k983647l874793m252361m462860
4719I2475458m352270m379428l920296l723739l116428l056603k384862j926262
4711F5615570j684891j603241j369617j124060j362626j145676j084272r83520
4703E5257667j255926r00005j436987j598695j619995j606425j761238j980209
4695D3098187j417949j744498j593705j298785j173215j372554j416030r48967
$$ y = [90186391, 94389147, 98811060, 103407316, 107859814, 111613483, 114636696, 116903727, 118047674, 118742732, 118817374, 118302046, 117791399, 116917900, 116155584, 115344073, 114801333, 114102829, 113495433, 112936351, 112426408, 111658999, 111498778, 110961368, 110910518, 110869043, 111288657, 111583744, 111969127, 111979704, 111534434, 110147531, 108049119, 105065472, 101190679, 96938318, 92475458, 88123188, 83743760, 79823464, 76099725, 72983297, 69926694, 67541832, 65615570, 63930679, 62327438, 60957821, 59833761, 58471135, 57325459, 56241187, 55257667, 54001741, 53101736, 51664749, 50066054, 48446059, 46839634, 45078396, 43098187, 41680238, 39935740, 38342035, 37043250, 35870035, 34497481, 33081451, 32132484]
4687C2132484r32868j064853n81826q19360l53468l37149k13938l19110p90870
4678B6719042n57184n72280r23284q75242o71985r07847p02937n14720r66584
4669B0026979o19496l31470q92274n63186p01252l31205o62176l58290o63091
4660A4904539l39530m54771o01806k13966o08693k31438n15605k29777m12828
4651A1296125k82818j61742l63741j99852k43620k80859k21005l9895j7226l28527
4641I156840M6128l50824j44148j65176M470j25143J28743j3567J28192j18384
4631H547131k33032l22051k28364l41147j43326j75306l70711j47093l1106j30873
4621F424122L5434l00778k1264N8653l04873p9267O8219Q8074K90958r5330L51671
$$ y = [32132484, 31199616, 30134763, 29552937, 28733577, 28380109, 28042960, 27829022, 27509912, 26719042, 26161858, 25589578, 24666294, 23791052, 23119067, 22211220, 21508283, 20993563, 20026979, 19407483, 19076013, 18183739, 17620553, 16919301, 16588096, 15925920, 15567630, 14904539, 14565009, 14110238, 13508432, 13294466, 12685773, 12454335, 11938730, 11708953, 11296125, 11013307, 10851565, 10487824, 10287972, 10044352, 9763493, 9542488, 9502593, 9485367, 9156840, 9202968, 8852144, 8707996, 8542820, 8547290, 8422147, 8550890, 8537323, 8665515, 8547131, 8314099, 7992048, 7763684, 7422537, 7279211, 7103905, 6733194, 6586101, 6554995, 6424122, 6459556, 6158778, 6137514, 6196167, 5891294, 5812027, 5880246, 5968320, 6259278, 6163948, 6515619]
4610F515619l55476J16452m31121p8768l98480n2493k11099k82585J37219k78757
4600D680511j7783K53497k54741j35728j6266j68207J0071j08540j4984j28080
4590D099750N2562j05151j36671J70419k2021m9942M2922n2078j54626J79287
4580D024451L8379j67382j2808O3751j01724J12676j89579P3496r3338o9564O1662
4569C740020k19677J59058J04174q8553J94791o3289j04135N9585N5851J90598
4559D028423R8725J30594j80575k0858J70135K535o2976L4319j10225P289N4588
4548D151974j64791n6945j95165J28434j00089L7642N4015r2584R4702J83184
4538D040377P3986J26290R5760Q2906L4317L45364J8249L19552J29677O3748J2180
$$ y = [6515619, 6160143, 6276595, 5845474, 5766706, 5368226, 5315733, 5104634, 4822049, 4959268, 4680511, 4662728, 4916225, 4661484, 4525756, 4509490, 4341283, 4351354, 4242814, 4227830, 4099750, 4152312, 4047161, 3910490, 4080909, 4058888, 4008946, 4051868, 3999790, 3845164, 4024451, 4062830, 3895448, 3882640, 3946391, 3844667, 3957343, 3767764, 3841260, 3747922, 3678358, 3740020, 3520343, 3679401, 3783575, 3695022, 3889813, 3826524, 3722389, 3781974, 3837825, 4028423, 4127148, 4257742, 4077167, 4056309, 4226444, 4228979, 4166003, 4200322, 4090097, 4097386, 4151974, 3987183, 3930238, 3735073, 3863507, 3763418, 3801060, 3855075, 3762491, 3857193, 4040377, 4114363, 4240653, 4336413, 4419319, 4453636, 4799000, 4817249, 5136801, 5266478, 5330226, 5342406]
4527E342406k9111k95517j13917J84766q7590J88015r9369n0239o4693J71819
4517E146570K1598J44309n8834K7036J05421K58815Q590l1487L16918j23729L81871
4506F197078J7235J93M58988L41748K17386J85079K34013K82779K52918K32707
4496H420124L36011M18053M74918Q07240J176708J644007K383087L238702L309737
4487B2208587K369593J121333m93524j162136j899535k249052k060717j754207
4479A6080342j484572j018283p59344l92142j76830M6813J25104K85048J84068
4470A2890204M12863L50312M57308P58788R59241J251832J537968K803731N008906
4461B6431153O718032P607689N335933J718223q82558k999325m358018m862276
$$ y = [5342406, 5313295, 5017778, 4903861, 5088627, 5001037, 5189052, 5089683, 5039444, 4974751, 5146570, 5168168, 5312477, 5253643, 5280679, 5386100, 5644915, 5653505, 5622018, 5938936, 5815207, 6197078, 6214313, 6214506, 6673494, 7015242, 7232628, 7417707, 7651720, 7934499, 8187417, 8420124, 8756135, 9174188, 9649106, 10456346, 11633054, 13277061, 15660148, 18898850, 22208587, 24578180, 25699513, 25205989, 24043853, 22144318, 19895266, 17834549, 16080342, 14595770, 13577487, 12818143, 12426001, 12249171, 12295984, 12421088, 12706136, 12890204, 13303067, 13653379, 14110687, 14869475, 15828716, 17080548, 18618516, 21422247, 26431153, 33149185, 40756874, 46092807, 47811030, 46928472, 43929147, 39571129, 34708853]
4453C4708853m772684m133848l194949k717476j641836r31164l24832l38279k18408
4444A6435377K6700j28283k4196K194J20441K61880L27547O30005Q91107J500482
4434B0043254K285534L109228L128690K509163J057922N6226q89045j729169j689583
4425B7882220j748500j501932j237598n11256k58394l9391M51203O38342P97529
4416B4472223Q05231J293119K682274N343684Q815691R701747O832529J256273
4408F1202771j283920l063094m279843m678845l911736l280716k501228k191948
4400C6011441j226876l45311L9559N56614J059619J575288K379875L031078M757431
4391D7838718P473863J1401862J2906430J0762284P150351P106874J3446471K8089665
$$ y = [34708853, 29936169, 25802321, 22607372, 19889896, 18248060, 17316896, 16992064, 16653785, 16435377, 16462077, 16333794, 16309598, 16311792, 16432233, 16694113, 17021660, 17651665, 18542772, 20043254, 22328788, 25438016, 28566706, 31075869, 32133791, 32190017, 31300972, 29571803, 27882220, 26133720, 24631788, 23394190, 22882934, 22624540, 22585149, 23036352, 23674694, 24472223, 25277454, 26570573, 29252847, 34596531, 43412222, 53113969, 59946498, 61202771, 59918851, 56855757, 52575914, 47897069, 43985333, 40704617, 38203389, 36011441, 34784565, 34439254, 34478813, 35035427, 36095046, 37670334, 40050209, 43081287, 47838718, 55312581, 66714443, 79620873, 90383157, 97533508, 104640382, 118086853, 146176518]
4383A46176518M5904684M6576677K6986318j528431j2669293k4789704k9010529
4376A97646240l0418252k8649318k2675382j7872927j3355105p752635l971431
4369G2951190j795305l42812J147316K758778M797976R447697K0146085L9853554
4361A48964479N8215760N5957253L0227795l29738j3158673k7688446l3636479
4354B18551951l4813558l0856570k1392651j2602681l997399J193507q51869m441292
4346A10789438o085811q410055r064856p978698o393862l503680M36955N353830
4338G5143261O481861L975019o26229j821427l389244k365373q13779K54723K440939
4329G9279751M945259O558027L410301j745857m006532n290504o424774n100339
$$ y = [146176518, 192081202, 238657879, 265644197, 264115766, 251446473, 226656769, 197646240, 167227988, 138578670, 115903288, 98030361, 84675256, 76922621, 72951190, 71155885, 70813073, 71960389, 74719167, 79517143, 88964840, 109110925, 148964479, 207180239, 263137492, 293365287, 293035549, 279876876, 252188430, 218551951, 183738393, 152881823, 131489172, 118886491, 114889092, 116082599, 115230730, 110789438, 104703627, 96293572, 87228716, 79250018, 72856156, 69352476, 69789431, 75143261, 81625122, 85600141, 84973912, 83152485, 79763241, 77397868, 76584089, 76838812, 79279751, 84225010, 90783037, 94193338, 92447481, 88440949, 83150445, 76725671, 71625332]
4321G1625332k985380J0783K795101M118598N117149N158851N069321M487536
4313I5397291P121029J5268784J9113261J4545952K405260o181676r365935j2068502
4305A26235464r490257n374785k290631k934159o269729m776519n900956m992398
4297H4206030m484282l704740j699246m62829J859891O011223J0543042J2562377
4289A04831466J2587808J0942319J1000987Q521257J3259569L0107000L7344996
4282B28595402K8162860J800616j5964167k1128192l0058330k8912730k6579560
4275A35915899k1132916j6258010j4999957j0427701o752618n083823m621790
4268E6639084l883409k503464j762953p16320J489685M183431N814615N903867
$$ y = [71625332, 68639952, 68650735, 71445836, 75564434, 80681583, 85840434, 90909755, 95397291, 102518320, 117787104, 136900365, 151446317, 153851577, 147669901, 138303966, 126235464, 116745207, 111370422, 109079791, 106145632, 99875903, 95099384, 89198428, 84206030, 79721748, 76017008, 74317762, 73854933, 75714824, 81726047, 92269089, 104831466, 117419274, 128361593, 139362580, 147883837, 161143406, 191250406, 228595402, 256758262, 258558878, 242594711, 221466519, 191408189, 162495459, 135915899, 114782983, 98524973, 83525016, 73097315, 66344697, 61260874, 56639084, 52755675, 50252211, 48489258, 47772938, 49262623, 53446054, 59260669, 65164536]
4260F5164536N072623N167859M348941O862439J3863426J7138549J2607795n8279
4252A30167889q045783j1187325j5039042j5542334j4788396j2198384r709871
4245D3656754p915997n552449l326784k231570j760429j470733j246476j293286
4237A8859030p54830o69970p63621n37114m59240o90853m97771o60867n33431
4228A3291333n83012m07615m48008k23092l21313k97767n45072l50475l78752
4219I736227k15673k49362m46472k07788j81225o6746l80928q3483k64479k59958
4209G380113m0770k35013J6611l68838J26152k69414k42504k20362k9069k20226
4199E896680j49945k31391k10249q0155j37387O1925k41903p5642j15178q2334
$$ y = [65164536, 70237159, 75405018, 79753959, 86616398, 100479824, 117618373, 130226168, 130167889, 122122106, 110934781, 95895739, 80353405, 65565009, 53366625, 43656754, 35740757, 30188308, 26861524, 24629954, 22869525, 21398792, 20152316, 18859030, 18104200, 17434230, 16670609, 16133495, 15674255, 14983402, 14485631, 13824764, 13291333, 12708321, 12300706, 11852698, 11629606, 11308293, 11010526, 10465454, 10114979, 9736227, 9520554, 9271192, 8824720, 8616932, 8435707, 8368961, 7988033, 7904550, 7640071, 7380113, 7339343, 7104330, 7120941, 6752103, 6878255, 6608841, 6366337, 6145975, 6116906, 5896680, 5746735, 5515344, 5305095, 5224940, 5087553, 5149478, 4907575, 4831933, 4716755, 4634421]
4189D634421n7207k50033j8558k75026J47113j95096j29424l1930j49594R0889
4179C765555j05571j29888O7627k08927k16546R0754k968k53058k522k63698r0072
4168B650686J36155j03022q2971k1559N0903q6223k56480Q4622Q613j87471K47243
4157B440496P5775j34780n1517j5799l0075k28287J8092k10264j9506l772j67532
4146A672831O7445J1592k45702N6137r3735Q5615j587k1354j9154j5436j07813
4135A388839m0215J62447O320n7603K80531J57395P2527J49989P0288P7858j4208
4124B254168j88478j76565j19673j22655k96266l7751L0633l84293J08857j31812
4114I36165R2369j37154K9481J43847m0622m3779K35396K23428J61851K91651
$$ y = [4634421, 4577214, 4327181, 4308623, 4033597, 4180710, 3985614, 3856190, 3824260, 3674666, 3765555, 3659984, 3530096, 3597723, 3388796, 3172250, 3263004, 3260036, 3006978, 3004456, 2740758, 2650686, 2786841, 2683819, 2600848, 2579289, 2630192, 2543969, 2287489, 2372111, 2380724, 2193253, 2440496, 2516271, 2381491, 2329974, 2314175, 2284100, 2055813, 2073905, 1863641, 1844135, 1840363, 1672831, 1740276, 1751868, 1506166, 1562303, 1468568, 1554183, 1552596, 1531242, 1512088, 1496652, 1388839, 1348624, 1511071, 1517391, 1459788, 1740319, 1897714, 1970241, 2120230, 2190518, 2268376, 2254168, 2065690, 1889125, 1769452, 1646797, 1350531, 1312780, 1343413, 959120, 1067977, 936165, 1028534, 891380, 920861, 1064708, 1024086, 980307, 1215703, 1439131, 1600982, 1892633]
4104A892633J141r7352J355Q157j92761k09103p4027k83578M6224j48218N4655
4093I99126L1378p0153j37288q3434O4606j47575p7553L9087N462J33637p5243
4082F82050K06306k56052J26783m820J67648k05229M7439J5681p7047J25353k21739
4071F06373P0395l9227K6721K29853j76872m4476J44957j25408J38517k1032K16599
4060A026400R6210j2066R544M5886M9848k88775m3133P7348n6630r9868j4220
4049G90544J3523J0418o1337q0928j55853J51229M4082j62890P4357J18468O0963
4038H02576J54921O5947J06924J6691J32332K60327J41759K76729p418K9413k00635
4027A779566r3867r9398k09583m3750l9353J07459k24773P7147M5350j60436l5448
$$ y = [1892633, 1893774, 1796422, 1797777, 1805934, 1613173, 1404070, 1330043, 1046465, 1092689, 944471, 999126, 1030504, 960351, 823063, 739629, 804235, 656660, 579107, 618194, 623656, 757293, 682050, 888356, 632304, 759087, 754267, 921915, 716686, 764125, 779806, 702759, 828112, 606373, 676768, 637541, 664262, 894115, 717243, 672767, 817724, 692316, 830833, 809801, 1026400, 1122610, 1110544, 1120088, 1165974, 1215822, 927047, 883914, 961262, 904632, 804764, 790544, 804067, 814485, 753148, 672220, 516367, 667596, 711678, 548788, 623145, 741613, 802576, 957497, 1023444, 1130368, 1147059, 1279391, 1539718, 1681477, 1958206, 1950788, 1980201, 1779566, 1685699, 1586301, 1376718, 1332968, 1293615, 1401074, 1176301, 1253448, 1298798, 1138362, 1102914]
4016A102914m1007J66905o1695q5583K41653j71168N8151J98779J0166K43555
4006A662670j31728K35167K5046L41017K5926K48100l7056O8811K9490j10584
3996B356859j68014M43k80886k1338k71176j03458j70669P7091n8166k18546R7148
3985A239288j27130J50783Q0670L3209k9473P6544J42582o0442J23394O5369j20226
3974A574568P3723K2667k2704N2759q1492k45813j27680l5551l2426j81856J11907
3963A108102j6200j75546J47317m12356K28596P5434p2951J24801k17125J00657
3953H90729j44866Q0501k26831J0243l5432j07856Q3641j96095N1818m2839R708
3942C72721j9779j63774j54240L1862N8641j7270O4167j08657o5753M4313M2225
$$ y = [1102914, 1061907, 1228812, 1167117, 1081534, 1323187, 1152019, 1210170, 1408949, 1419115, 1662670, 1530942, 1766109, 1791155, 2132172, 2158098, 2406198, 2369142, 2437953, 2467443, 2356859, 2188845, 2189288, 1908402, 1887064, 1615888, 1512430, 1341761, 1418852, 1360686, 1142140, 1239288, 1112158, 1262941, 1343611, 1376820, 1347347, 1423891, 1566473, 1506031, 1629425, 1694794, 1574568, 1648291, 1670958, 1648254, 1701013, 1619521, 1373708, 1246028, 1210477, 1178051, 996195, 1108102, 1091902, 916356, 1063673, 651317, 879913, 955347, 882396, 1007197, 790072, 890729, 745863, 826364, 599533, 609776, 574344, 466488, 550129, 354034, 405852, 363013, 372721, 352942, 189168, 34928, 66790, 125431, 108161, 172328, 63671, -2082, 42231, 84456]
3931H4456o4140m2490P5440j08357r0898J18830l2748k47855J84313N8774l2664
3920i7339r4786J62339k58324J82696N3598k3371j92004N9049q0504J07315q2561
3909b63892j9817N0716J84042p4437k07339J25220J15943j40976j35415r024j19119
3898d94098L5173J94828l3165r2487K13111j16895o8785P9469m7174J25576j38413
3887c42860j75940J71382q3015J43139j61043K9067O5644J7339j241j09727J74245
3876b73010r0238Q9630k81564L9727J10674q3838K998J7602r8162Q3444Q3076
3865c99661m1870P0861n1801N1713j54885K08322j06832N0508j28219L5618M4404
3854d21842L2873j37495k9228n163Q4986j0853n8170m6793J44465j23599Q8260
$$ y = [84456, 20316, -22174, 53266, -55091, -145989, -27159, -59907, -307762, -123449, -64675, -97339, -192125, -29786, -288110, -105414, -51816, -75187, -267191, -208142, -288646, -181331, -263892, -283709, -232993, -48951, -123388, -330727, -205507, -89564, -230540, -365955, -374979, -494098, -458925, -264097, -297262, -389749, -176638, -293533, -362318, -282849, -330023, -204447, -342860, -518800, -347418, -430433, -287294, -448337, -419270, -353626, -336287, -337528, -447255, -273010, -363248, -273618, -555182, -515455, -404781, -488619, -485621, -468019, -566181, -482737, -399661, -441531, -370670, -422471, -370758, -525643, -317321, -424153, -373645, -501864, -466246, -421842, -388969, -526464, -555692, -560855, -475869, -486722, -544892, -591685, -447220, -570819, -482559]
3843d82559q4454j25439J45764M3905r469N7057R770l7360J33168k30467O6442
3832e13642o403J82631j70584J13312k60906J99252p0916M6665j1054j4306J32946
3821c73005k58146j9397n7988R6317J11738J72315j45438n8300j5335J3300J4067
3810e19872r5751J41782Q6369j4304k87052J36915k37145J99575Q8387j9341J30739
3799c89698j15650k4166J3456R1941k3374j23071Q0591l7525J49995j51330p8373
3788f07204k4702m8136p959K84286k36883k8456p0750r677J35670K9237R9811
3777d84763l148j51941N8645j2947m9800J4606J44329j38280R0524j85954N6135
3766f62594J11482j7122m7840p3286Q6152L2478p127R3895j66858M8643P5773
$$ y = [-482559, -567013, -692452, -546688, -502783, -512252, -455195, -445425, -482785, -349617, -580084, -513642, -520045, -337414, -507998, -394686, -655592, -456340, -527256, -480591, -491645, -505951, -373005, -631151, -650548, -708536, -612219, -500481, -328166, -473604, -531904, -547239, -533939, -519872, -615623, -473841, -387472, -401776, -688828, -551913, -789058, -589483, -501096, -520437, -389698, -505348, -529514, -516058, -424117, -447491, -570562, -489971, -527496, -377501, -528831, -607204, -631906, -680042, -688001, -403715, -640598, -669054, -739804, -749481, -613811, -584574, -484763, -487911, -639852, -581207, -594154, -643954, -629348, -485019, -623299, -532775, -718729, -662594, -551112, -568234, -616074, -689360, -603208, -570730, -577857, -483962, -650820, -602177, -526404]
3755e26404k29759K61780o5307R4309m8332n0166O9456p5620q5469J6170m6089
3744f85431M8992j870o5058J99455j28648n5094P6144J05796n8259J7557m4527
3733e90943J9607N3580m3857m2169M4777L3814j07715R6467j03044p0905N7532
3722f52856P3730k2122J84820J3631j84724M9850O6323L3941L5771k29179L1814
3711e99001M4658l549J11947o371j9219K2631r549k05334J2311L25766j43261
3700d68971k73080J34930J60737r2159K06800k40718p7576P7819o7187r7643J36110
3689f00938Q1760K7468K4180j31346J39978n7853j21280R8905j56174J49413p0897
3678f16784J55930o3696j49387Q1281q5589J00033j03904O4261J9007K3233n7486
$$ y = [-526404, -756163, -494383, -559690, -465381, -513713, -563879, -494423, -570043, -655512, -639342, -685431, -636439, -638309, -703367, -503912, -632560, -687654, -611510, -505714, -563973, -546416, -590943, -571336, -517756, -561613, -603782, -559005, -525191, -632906, -536439, -639483, -710388, -652856, -579126, -601248, -416428, -402797, -587521, -537671, -471348, -437407, -401636, -630815, -599001, -554343, -557892, -445945, -452316, -471535, -448904, -458453, -663787, -651476, -325710, -468971, -742051, -607121, -446384, -538543, -331743, -572461, -650037, -572218, -639405, -737048, -600938, -519178, -491710, -467530, -598876, -458898, -516751, -638031, -539126, -695300, -545887, -616784, -460854, -524550, -673937, -592656, -678245, -578212, -682116, -617855, -598848, -575615, -633101]
3667f33101N6049k7859K9562L7767l15895M13258k53156J27177j04631J93747
3657d77082M9959j90800M5666q9188K41870j52605j2383K716j1788r6420J76580
3646e13475N4187j874k59693J28545n5722M1527l5000o6250J53190N6249N0232
3635d48084p3947j2763J47896r7887p9899k2136j63436J32180J02141k00474P7589
3624f38820J99580n7615j36314R0489M2067l0298O6797j42621Q1077j72986J47962
3613e50682j3278j3729K0262L0914k8564L8419j31323j01590K56688K5847j0650
3602d77686J0318P9497j84329k8228K1419J16609k5984k12827J84965j27588L5960
3591f07874J61546k44851J44936m031n6659M4423Q506J3456m8446k3089j3820
$$ y = [-633101, -577052, -604911, -575349, -537582, -853477, -440219, -693375, -566198, -670829, -477082, -427123, -617923, -572257, -661445, -419575, -572180, -584563, -581847, -593635, -690055, -513475, -459288, -461162, -720855, -592310, -648032, -606505, -641505, -707755, -554565, -498316, -448084, -522031, -534794, -386898, -484785, -564684, -586820, -750256, -618076, -515935, -716409, -638820, -439240, -496855, -633169, -542680, -500613, -530911, -464114, -606735, -525658, -698644, -550682, -563960, -577689, -557427, -526513, -555077, -516658, -647981, -749571, -492883, -467036, -477686, -467368, -387871, -572200, -600428, -579009, -462400, -488384, -701211, -516246, -643834, -607874, -446328, -691179, -546243, -550274, -606933, -562510, -554004, -540548, -588994, -612083, -625903]
3580f25903m4910k6432K26489l7108j39944R5884j42069J64976j00488m3681K77294
3569c95892j04061p9348P1561p810L3094j11424N9595M0759r0686O6736o892M0278
3557d84090O0778j27583N4762p9248j81390K35178P7632j32790J14173q9826M3494
3546e08910r9223J03171j24081R4633J3377j00652Q7941m8038O0801O6256m1237
3535d95962J429J97250O1498k51149J57497m5005j86935Q9920K7667r9071J14503
3524d28358o8045o8993l9112J28176k6996n4856J09128Q1120j89205K8315J62845
3513c65981p3181j52993J1742L418j08161J22509J01868j16365L193p6245J43792
3502e06404k07444L53587j37725M4504j11637M1511r8269K02872k35285K45195
$$ y = [-625903, -670813, -697245, -470756, -507864, -647808, -551924, -693993, -529017, -629505, -673186, -395892, -499953, -579301, -507740, -515550, -482456, -593880, -534285, -493526, -584212, -517476, -524368, -484090, -423312, -550895, -496133, -575381, -756771, -521593, -443961, -576751, -462578, -552404, -508910, -608133, -504962, -629043, -534410, -521033, -621685, -533744, -581782, -520981, -454725, -495962, -494533, -297283, -235785, -486934, -329437, -374442, -561377, -471457, -443790, -542861, -428358, -496403, -565396, -604508, -476332, -503328, -558184, -449056, -367936, -557141, -528826, -365981, -439162, -592155, -580413, -576995, -685156, -562647, -460779, -577144, -573951, -650196, -506404, -713848, -360261, -497986, -453482, -565119, -523608, -621877, -419005, -654290, -409095]
3492d09095k4399q8903j08237J05285J91396k72276J96550j02010K253k8462l9131
3481e77029J22957n7892k628J21450o1997m2271R2940j45087R5580N7287m8085
3470d44775m0458J77991k84227J44993P9726j95020J0381R8565j396j6258j1175
3459d81653l0883M2444M5567r6577J14001j42558Q2106O9148q4456N2925p4273
3448e04209n2509J71982n6166K1849J1829n8587P9742r7305J905j513R8616J02521
3436b81845o5405P6007m7675N3844j15035O9579j09901J78328j84822L0719J09509
3425b86697l5049q0090J23998q281q1000K2001j40875K22309P9772r9255p6339
3414c59506L29J11080l8780j8839O2647q2494k0558L3945l2593p2175m4188K11078
$$ y = [-409095, -433494, -522397, -630634, -525349, -333953, -606229, -409679, -511689, -509436, -537898, -577029, -454072, -511964, -514592, -393142, -455139, -497410, -404470, -549557, -453977, -396690, -444775, -485233, -307242, -591469, -446476, -366750, -561770, -551389, -452824, -454220, -470478, -481653, -512536, -470092, -424525, -521102, -407101, -549659, -467553, -398405, -482861, -429936, -504209, -556718, -384736, -440902, -419053, -407224, -465811, -386069, -483374, -481469, -482982, -384366, -281845, -347250, -271243, -318918, -265074, -380109, -310530, -420431, -242103, -426925, -396206, -286697, -321746, -401836, -277838, -286119, -367119, -345118, -485993, -263684, -183912, -283167, -359506, -359177, -248097, -286877, -305716, -243069, -325563, -346121, -312176, -344769, -416944, -461132, -250054]
3402b50054q132n6748O3246m1452N2921l9671J94925r4646n3588J24740m5673
3391a54132q6063K00055j57342J48484m1577L8355j72897l2871L52651n5885p7702
3380c8924J97454q8654J15729J57874r2986N2349K76318R6585J0198l3449K2765
3369F75259R9065n6256j4704K64161L54544K61969R58750J294253J811496J321216
3359F969753P71084k198o67772p85898j380794j030234j074946n76040o17821
3350A605134l80122j36215j85329p5996o0334O9949j66453j06224n1748L3891
3340E46553K3218M4767r9811j45582n4617J62525j97922J10809r1822J07397M4310
3329D49825j58123J01280K52514j72509R9439q7103J43533M7915k5933J76606
$$ y = [-250054, -258186, -314934, -251688, -293140, -240219, -279890, -84965, -179611, -233199, -108459, -154132, -240195, -40140, -197482, -48998, -90575, -52220, -225117, -257988, 94663, 38778, -38924, 158530, 69876, 185605, 343479, 250493, 302842, 579160, 675745, 685943, 652494, 675259, 774324, 718068, 703364, 967525, 1322069, 1584038, 2542788, 3837041, 5648537, 6969753, 7740837, 7738639, 7070867, 6284969, 4904175, 3873941, 2798995, 2222955, 1605134, 1225012, 1088797, 903468, 827472, 767138, 837087, 670634, 564410, 512662, 546553, 569771, 614538, 514727, 369145, 314528, 477053, 279131, 389940, 298118, 405515, 449825, 291702, 392982, 645496, 472987, 572426, 485323, 628856, 676771, 650838, 827444]
3319H27444j8812K27173K49120J45843M2753N85710Q5707J73071L24930J64439
3309B807378L62068M34476O54885J049220J717837M643393P456991P806786M546755
3300C1479789q95233j031261m360089m501179m505955m100503l018003k420297
3292F647269j910844j191629l45911j19656k76863j32360k42887m01075k90221
3283A735823j43193l51013p5684n2205j11641r299k60921R9977k88023J76411
3273G20232k31727q4480j08808J26070o1687p3310j6147j13954Q648L6848m9038
3262A52647n9094J37163j9870p3306j69783K55749P825k30294J39352j98269P626
3251e0254Q0283k2384n6939q7124P8950k8706R4628n1588k09506P8632r339j65655
$$ y = [827444, 808632, 1035805, 1284925, 1430768, 1473521, 2059231, 2144938, 2318009, 2642939, 2807378, 3169446, 3603922, 4258807, 5308027, 7025864, 11669257, 19126248, 26933034, 31479789, 30584556, 29553295, 25193206, 20692027, 16186072, 12085569, 9067566, 6647269, 4736425, 3544796, 3198885, 3079229, 2802366, 2670006, 2427119, 2026044, 1735823, 1592630, 1241617, 1165933, 1113728, 1002087, 992788, 731867, 831844, 543821, 720232, 488505, 404025, 295217, 421287, 359600, 286290, 270143, 156189, 164837, 201685, 152647, 93553, 230716, 210846, 137540, -32243, 223506, 231331, 1037, 140389, -57880, -50254, 30029, 7645, -49294, -136418, -57468, -86174, 8454, -43134, -252640, -174008, -183347, -349002]
3239c49002P7707J36259j00445M138J96244l72968K17710m3309n6600l715j43165
3228d37146N3355N5693n678M0223R1829r4981q9987J13798p9312K66937k25437
3217c10706N5574j15444p2363J42764j02044J68310n6233q1463l3712J48854J6376
3206b40087k41288P2990J67289j20955K4235n4561N5472j48788Q9816j77524J45240
3195d28161k066r3741J64720K807l516r9661Q0497j84246L7269J22915k3023o9578
3183d95784J17820k00972K31517j72098j39140K34018J8583o0541P407N6980Q8500
3172c13710k56486J93613k83808J67601J55311o4397j47666L2488j3874J74927
3162c56001j38105j61787M5231P9048J52728k82912l28R4756N2348j5800J00455
$$ y = [-349002, -271295, -135036, -235481, -231343, -35099, -408067, -190357, -233666, -290266, -293981, -437146, -383791, -328098, -333776, -293553, -201724, -296705, -386692, -272894, -352206, -85269, -310706, -255132, -370576, -442939, -300175, -402219, -233909, -290142, -371605, -405317, -256463, -240087, -481375, -408385, -241096, -362051, -337816, -392377, -336905, -485693, -395877, -573401, -428161, -430227, -523968, -359248, -356441, -359957, -459618, -379121, -563367, -526098, -403183, -426206, -495784, -377964, -578936, -347419, -519517, -658657, -424639, -406056, -466597, -459190, -402210, -313710, -570196, -376583, -660391, -492790, -337479, -401876, -549542, -517054, -530928, -356001, -494106, -655893, -610662, -531614, -378886, -661798, -662126, -567370, -515022, -530822, -430367]
3151d30367j23707K10970j28465N6642p6680P0035q6812q986j2507L3212q8956
3140e85621J6051R3785o5798j10541L6666M8556Q9905m5051M3680K8688j10250
3129e59930O9374q1315K29894r0511p3134o1892J33539j61446J9289k981K36420
3118c42693j79372Q01o4535P5629o5351J50413l6528J5249L7322q4853q4852L9092
3106e39678P0537p5443J1956J06174k787j67364J2858K51076j49828m0987o1875
3095e85361o8251L38920j13909j83917O2393R9936j15560J05472m549j13851P3044
3084e05633j63903Q190J83599K5325l8237j12683Q3703L2317n5310q272N4138
3073d96766p4462O6614O0219r9732J58562m7617k9059O2282Q9689j47403l1429
$$ y = [-430367, -554074, -343104, -471569, -414927, -491607, -421572, -508384, -517370, -529877, -496665, -585621, -569570, -475785, -541583, -652124, -615458, -566902, -476997, -522048, -478368, -449680, -559930, -490556, -571871, -341977, -432488, -505622, -567514, -433975, -595421, -576132, -579113, -342693, -522065, -521264, -585799, -510170, -575521, -425108, -461636, -446387, -409065, -493918, -578770, -539678, -469141, -544584, -532628, -426454, -429241, -596605, -583747, -332671, -482499, -523486, -585361, -653612, -314692, -428601, -612518, -550125, -450189, -565749, -460277, -464826, -578677, -505633, -669536, -661346, -477747, -452422, -490659, -603342, -519639, -487322, -542632, -550904, -496766, -571228, -504614, -444395, -544127, -385565, -433182, -462241, -399959, -310270, -457673, -489102]
3062d89102J58328l7271J47414k35447N1970j01896J11120j04488o5183O9135
3052d95420Q9090k10690P4076m5693Q566p077J754J41775o4319k7439j06347L9118
3040f02606N6844L933J14082j77243M8914P4469q6237Q2663l6305n9737Q1554
3029d99669r0051Q939p4149r5658K76059j89208R8339j61086J25744M1402J11520
3018d47818k85442K22558j7235P0012l9324j33644L9125L2201n504j09567K03162
3007d71476j9692O7904n3047j99186K26113k06662K85726O051k25189R100P3716
2996e06642j95958L14740l65754L19264r5728r4206J46317M6250j20076k9384
2986e81177K21284j33788q0206J49186j32857L1629N2370m9157m0231J03907j10187
$$ y = [-489102, -330774, -368045, -220631, -456078, -404108, -506004, -394884, -499372, -564555, -495420, -406330, -617020, -542944, -588637, -580071, -587148, -585394, -443619, -507938, -535377, -641724, -602606, -545762, -541829, -427747, -604990, -556076, -481607, -567844, -485181, -521486, -581223, -499669, -589720, -580781, -654930, -750588, -474529, -663737, -565398, -726484, -600740, -559338, -447818, -733260, -510702, -527937, -457925, -497249, -630893, -591768, -559567, -565071, -674638, -471476, -491168, -423264, -476311, -675497, -449384, -656046, -370320, -364269, -589458, -580358, -506642, -702600, -387860, -753614, -434350, -530078, -624284, -477967, -431717, -551793, -581177, -359893, -493681, -573887, -424701, -557558, -525929, -473559, -522716, -562947, -459040, -569227]
2975e69227N7790j29970R5769L2463Q5451k06224l283J67524K582q0527k34809
2964g82461J12555J94777j59077l2363k945J54378J7061p6787q1081J55659K345
2953d97939r2599k718J35144k3029M7505n6458m8719P5035O7602o1501j15348
2942e73025R1920K5565J1810o3j58598K4993Q7197m8440J04356R0559M072k07112
2930e46766J02385j29176K26791o065j79815P653O5586j24296n929J63984j47812
2919e73460J59443k72455K34426j48928q738Q9265J22843o5573J482K9828m5785
2908d77652R2493j09616m6070p2480J5281J23435P0145k44552J13667j71457O5387
2897f41419J34346J59460k63988K26161j05609p3622P6973j17241J17197N5665
$$ y = [-569227, -511437, -641407, -545638, -513175, -427724, -633948, -637231, -469707, -467125, -547652, -782461, -669906, -475129, -634206, -666569, -669514, -515136, -498075, -574862, -655943, -500284, -497939, -590538, -593256, -458112, -481141, -433636, -490094, -538813, -463778, -396176, -457677, -573025, -481105, -455540, -443730, -443793, -602391, -577398, -490201, -538641, -434285, -343726, -339654, -546766, -444381, -573557, -346766, -352831, -532646, -524993, -459407, -583703, -589632, -425648, -573460, -414017, -686472, -452046, -600974, -609712, -520447, -397604, -463177, -461695, -431867, -477652, -385159, -494775, -540845, -613325, -598044, -474609, -404464, -649016, -535349, -706806, -641419, -507073, -347613, -611601, -385440, -491049, -564671, -487698, -604939, -487742, -432077]
2887d32077p1800J34342j93047k533j17425K80151j40556P0696k30652K35476
2877d67425j13027M9246k6657O769J28776j12695J19911m8994o9159k7454J12576
2866d48133l5999r3535L3786R1349k21160K03395R8475k50710M8983o100M1J42334
2854d37274j73740J01901L4551R5482m8953j38884P6132j57944N5812J00877m9059
2843e41099l2734o7908J71668P2494j69268J26198l4226P950J18157j85381O7543
2832d66606q093l8078j36936J47595L3711N3791j83799J27071O4164r1838r5601
2821e94619J52486k42752L3944L20327j61134l5291m5669J9529M7725K0472k6960
2810e11942n5680r2311n5891L65848k06k6046j77895J21757j58503j5956J39079
$$ y = [-432077, -503877, -369535, -562582, -565115, -682540, -402389, -542945, -472249, -702901, -467425, -580452, -531206, -557863, -551094, -422318, -535013, -415102, -464096, -533255, -560709, -448133, -484132, -577667, -543881, -452532, -673692, -470297, -371822, -622532, -573549, -579649, -579608, -437274, -611014, -509113, -474562, -379080, -428033, -566917, -490785, -648729, -592917, -492040, -541099, -573833, -641741, -470073, -397579, -566847, -440649, -474875, -466925, -348768, -534149, -466606, -474699, -512777, -649713, -502118, -468407, -414616, -598415, -471344, -407180, -499018, -594619, -442133, -684885, -650941, -330614, -491748, -527039, -572708, -553179, -505454, -484982, -511942, -567622, -659933, -715824, -349976, -350182, -376228, -554123, -432366, -590869, -606825, -467746]
2799d67746n899n88j6200K2938k1890n2804K1056n3885J74519j45669o0437O9662
2787e36943J5924o6271J77322k81478N170J90853j32230J64591p8297J39815j03074
2776e04618j2690J04458j72191R6341P1205r7887M2067N1206j67122M2937J9249
2765e27045O112Q4287k09437L22049j3191j22947j64894K6080Q6624R1513M3434
2754c77415k27974j1222N0818N1215j10708J62791j10378J63310k52324L1455
2744f30432J25387j16714L1917N1361j3073P771J31836k23976J92966J2745j01534
2733e31746m6725J79980P5287q7555o2339J29595j3535k7378k8018N2972j60729
2722e20191l0985o740J6274Q0712n9701J46498j21143K5705j44578O8914J30600
$$ y = [-467746, -473645, -474233, -490433, -467495, -489385, -542189, -521133, -575018, -400499, -546168, -606605, -536943, -521019, -587290, -409968, -691446, -686276, -495423, -627653, -463062, -541359, -401544, -504618, -517308, -412850, -585041, -488700, -417495, -515382, -473315, -422109, -589231, -546294, -527045, -520933, -436646, -646083, -324034, -337225, -460172, -625066, -598986, -512362, -420849, -377415, -605389, -616611, -565793, -514578, -625286, -462495, -572873, -409563, -661887, -630432, -505045, -621759, -589842, -538481, -551554, -543783, -411947, -635923, -442957, -430212, -531746, -578471, -398491, -323204, -410759, -473098, -343503, -357038, -384416, -412434, -359462, -520191, -551176, -557916, -541642, -460930, -520631, -374133, -495276, -469571, -614149, -545235, -414635]
2711d14635m2019P9768j49500Q4656k254J07519k21023J22097k15158Q4622J23596
2700d42331J40175j06313K6922p89j36539J75646q9599j7643k54613R0020K42775
2689c72289j72896O4499m5127J34679l0136p7019L0230q4805J43339j61734J32052
2678d39207k41875K46629k2601l00779K05157L3080j43461K18434N8373j66808
2668e53058O5800n2098o07m3702Q7668M4378o4512p6317M3177J02617j1265j72904
2656f30823J44673P9751O4166m2284k04850J86763L6703j29147l3587Q3340r3096
2645e38391j93684K89999j7606j74829m77J97065m9125m4698M7270m6940n7326
2634e88742J56801j67676k1510J76183Q7596k11702m9882j6273J32580j09679
$$ y = [-414635, -456654, -376886, -526386, -441730, -443984, -336465, -557488, -435391, -650549, -565927, -442331, -302156, -408469, -381547, -382336, -518875, -343229, -432828, -450471, -705084, -615064, -372289, -545185, -480686, -525813, -391134, -421270, -498289, -468059, -552864, -409525, -571259, -439207, -681082, -434453, -457054, -757833, -552676, -519596, -663057, -444623, -386250, -553058, -487258, -539356, -539963, -583665, -495997, -451619, -516131, -592448, -549271, -446654, -457919, -630823, -486150, -406399, -342233, -384517, -589367, -402604, -365901, -495048, -528635, -445295, -538391, -732075, -442076, -459682, -634511, -634988, -437923, -487048, -531746, -484476, -531416, -588742, -431941, -599617, -621127, -444944, -357348, -569050, -618932, -635205, -502625, -612304]
2624f12304Q62J98625P2189j34802p0074N2279R2579k09913m6770K99027k11003
2613e69305R5926m1815j56150J38838N3320K434k3494k2095m6351J12528J5013
2602d41151J4269j05113j22142R9004j63680P7876K28883o3173o0579n6628j3783
2591f06217J43981J58545j95574N8520N01O007M8172j68632j05622J19712N4256
2580d86351p3279j080o0636J7481m2504K26998j801L4235k16092J12082j12222
2569f03169K67127k10190L1636Q3977k01347J85385j22513J2819J03910j49547
2559f01912P0382j7504K1422P0506j41378O8898r4539J11252K7617j63266J61198
2548d87324k16310J38197J03923j59812r168K02331o1599J21909j77543K6412
$$ y = [-612304, -611442, -412817, -340628, -475430, -545504, -493225, -400646, -610559, -657329, -358302, -569305, -473379, -515194, -671344, -532506, -479186, -476752, -500246, -522341, -568692, -456164, -441151, -426882, -531995, -654137, -555133, -718813, -640937, -412054, -475227, -535806, -592434, -606217, -462236, -303691, -499265, -440745, -440244, -434237, -386065, -554697, -660319, -540607, -486351, -559630, -560710, -621346, -603865, -646369, -419371, -421172, -386937, -603029, -490947, -603169, -336042, -546232, -514596, -430619, -631966, -446581, -569094, -556275, -452365, -601912, -531530, -549034, -527612, -457106, -598484, -529586, -624125, -512873, -485256, -648522, -487324, -703634, -565437, -461514, -621326, -630494, -428163, -489762, -367853, -545396, -518984]
2538e18984r6122K4696n9102K54536j57008M542J18986L088j87881J20762J63081
2527c29406j31557r8984M1712J0574J72975j39750k12501R2169N9500L8761K9749
2516d66758k2803k08938K08133j75888J13641O8575l8862Q7190N1192j48494N7753
2505d75259p6881K574L8663K4790k7262M5124K5475J4005p0379j38497P4202j06874
2493f70319J63425Q2026J6772j15773P3804l8693j19109J01488K8144l1354N2076
2482d57513k2508n4034L5602r7440M367n4115K11748r4742N0552k0932j43610
2471f42625J85410j10876Q7094J09301j83451m0635K17646j58712L8226P418p086
2460d98290K6104j91753J45269p1202R7754q7595j37708L19710j58533Q8697j42055
$$ y = [-518984, -615106, -590410, -649512, -394976, -551984, -547442, -428456, -425368, -613249, -492487, -329406, -460963, -559947, -518235, -507661, -334686, -474436, -686937, -594768, -535268, -496507, -466758, -489561, -698499, -490366, -666254, -552613, -484038, -522900, -435710, -384518, -533012, -475259, -552140, -549566, -510903, -486113, -513375, -468251, -442776, -428771, -499150, -637647, -563445, -670319, -506894, -424868, -408096, -523869, -450065, -488758, -607867, -506379, -478235, -509589, -457513, -480021, -534055, -498453, -595893, -591526, -645641, -433893, -528635, -478083, -499015, -642625, -457215, -568091, -480997, -371696, -555147, -595782, -378136, -536848, -498622, -491204, -498290, -472186, -663939, -518670, -589872, -492118, -579713, -717421, -397711, -556244, -467547, -609602]
2449f09602J74418o2210N0196n9253O8098q7610j17173Q5231L9941K4789j19294
2438f12469P8104R0034j50828K02518k32536J24931p2210P9790j16004J0272J71870
2427d26528j41195n4185K02104j69522N2618L9964j7648K24248j41843o2523j09906
2416f04416P9371N9389j14826J22034q3010q3800R6172k9533J70594r1936l5017
2405e14978p1283K12577k09419k1325J6623P4912j70750J82221j42679J30417
2395e13684r6726J11443R0180q802L4384j41280Q9090j12507J8097j48832J25593
2384e53044j48831K75959m5181L2226n3908N767P8407j74003J08187k92844J23100
2373f44165J05770J30046k59046J68886O1763j13559J38677j32277l5855r464
$$ y = [-609602, -435184, -497394, -447198, -506451, -438353, -525963, -643136, -557905, -517964, -493175, -612469, -534365, -444331, -595159, -392641, -625177, -500246, -572456, -492666, -608670, -598398, -426528, -567723, -621908, -419804, -589326, -536708, -496744, -514392, -290144, -431987, -494510, -604416, -525045, -465656, -580482, -458448, -541458, -625258, -529086, -558619, -388025, -479961, -514978, -586261, -373684, -583103, -604428, -587805, -512893, -683643, -501422, -644101, -513684, -610410, -498967, -408787, -417589, -383205, -524485, -435395, -547902, -529805, -678637, -553044, -701875, -425916, -471097, -438871, -492779, -487012, -408605, -582608, -474421, -767265, -644165, -538395, -408349, -667395, -498509, -436746, -550305, -411628, -543905, -579760, -589224]
2363e89224O4210R6103j78233N7981j8903M297L422q6331K35887j45091N9757
2352d96125L7755q1736j9992J35215j32762N2008P9965q3772j84667J99020j03082
2341e98173Q8676M4996n2690J45674J02966p5611j16001n0859J54178K3370p1715
2330d05189n9558o8014l0044j6070L404J47398N5816m8330J2049k08848K14418
2319d02968j2351O3108n9900l4151j64976J95215k30454K13771q5900L2349R6161
2308c90096M8717j19414p5506M3862j7014K15720j67958N5278l9640k8370P7471
2297c96950k04431J23483n1621O7586j6986R5242m2716j6347n3427o3745O263
2286e53649O6131K0728o8126l9593J08585j52391Q0488L3268P7179j44032Q4600
$$ y = [-589224, -525014, -428911, -607144, -549163, -568066, -563769, -560347, -646678, -410791, -555882, -496125, -458370, -540106, -560098, -424883, -557645, -505637, -425672, -509444, -694111, -495091, -598173, -509497, -464501, -517191, -371517, -268551, -344162, -460163, -511022, -356844, -333474, -405189, -464747, -532761, -562805, -578875, -575471, -428073, -372257, -420587, -408538, -617386, -402968, -415319, -352211, -412111, -446262, -611238, -416023, -646477, -432706, -518606, -486257, -390096, -341379, -460793, -536299, -492437, -509451, -293731, -461689, -406411, -446051, -474421, -396950, -601381, -477898, -529519, -461933, -478919, -383677, -426393, -442740, -496167, -559912, -553649, -487518, -466790, -534916, -574509, -465924, -618315, -537827, -504559, -427380, -571412, -486812]
2275d86812J08025n681r1617M85k5256P4147j52443J19895m9790L0700j19855
2264e98202j30858L29665j26419O4543n5231J46488j16880J24479j62509L5050
2254d89874r4167J07754l5943M9467N0239k22514J44727j981l2855o8271P6888
2243e16530j3825q1524K9711k4696K59073j42755O7583j03882J05268o1963N4308
2232d29232N9684k609k64158K67709k06325n917K87165k15645M4873R6889n8561
2221d26127j2785J52734j74594J67203k34678j56597K78194q3424J14657J0442
2211c64975r2296k7316j09498l8637M3343N1208O7135l0060M3031n6427p0805
2200e85297J26655l4087k6717r6946m4534J72122j9737J35951j16506P6746r6477
$$ y = [-486812, -378787, -384468, -476085, -475600, -500856, -426709, -579152, -459257, -509047, -478347, -598202, -729060, -399395, -525814, -461271, -516502, -370014, -486894, -362415, -524924, -489874, -584041, -476287, -512230, -462763, -412524, -635038, -490311, -492292, -525147, -593418, -516530, -530355, -611879, -582168, -606864, -347791, -490546, -422963, -526845, -421577, -483540, -429232, -369548, -372157, -636315, -368606, -574931, -580848, -293683, -509328, -464455, -367566, -426127, -438912, -286178, -460772, -293569, -528247, -684844, -406650, -490074, -375417, -364975, -457271, -484587, -594085, -632722, -589379, -538171, -471036, -501096, -458065, -514492, -585297, -458642, -492729, -519446, -616392, -660926, -488804, -508541, -372590, -489096, -412350, -508827]
2189e08827P3398p5585M2236l4690j37178J68210j38989J69231P3397p4589J8890
2178d24496q5060O8591j4005j13606J9970k13313L08022j06590L4187j41m6027
2167e72468M2652N5555j2316j14031J15818j22191J82699n0150j3846O4872M2895
2156c80511K385N033p7101J08426j06239k7534K1665k08033J92614R2374K1148
2145c55773j68377P3860Q8241j16251k6504N7313k2136r1300O1875N9135K4740
2134d15177r173j42996N4368J11035j35803O0101O5038p6942N1264j15945J16262
2123d37968J8935j9633J1005k0024j4963j09536j6160J48927j31122J55614J23542
2112b91383k60534j09731J14854j3439J7667K6790K5906j25185L710J22280k9630
$$ y = [-508827, -435429, -511014, -468778, -503468, -640646, -472436, -611425, -442194, -368797, -443386, -424496, -509556, -440965, -454970, -568576, -548606, -761919, -453897, -560487, -526300, -526441, -572468, -529816, -474261, -486577, -600608, -484790, -606981, -424282, -474432, -488278, -423406, -380511, -378126, -373093, -450194, -341768, -448007, -475541, -453876, -661909, -469295, -376921, -355773, -524150, -450290, -362049, -478300, -504804, -447491, -469627, -560927, -499052, -439917, -415177, -424350, -567346, -512978, -401943, -537746, -477645, -412607, -489549, -438285, -554230, -437968, -419033, -438666, -427661, -447685, -462648, -572184, -588344, -439417, -570539, -414925, -291383, -551917, -661648, -546794, -560233, -542566, -515776, -489870, -615055, -611345, -489065, -518695]
2101e18695p9309Q9026L2057j4382K7957j2980j33621M8600J22665k8793j6766
2090d84241M306p0899J53889j33091M7119n4379J16531L0706k37506K72214j84460
2079e39811L810j01069J17349k8145J37826j42245J21572o6788k7905R3414j08991
2068e40983J40452M785j922l4745m0716p7289J12009M4173J91015m06002K7046
2057e82177J62643j36179J30394j72698Q7060J15790j07177n0544J79626k55599
2047f28861J24282N5736p3802l9618r8552J34932N8637k04950K91887J0164r6179
2036d66324j18521J95247j46532P8249K39099k46011n2839J19023j23864J03304
2026d19169j03158J70310j51696q5781J02333L1350l3746k078l2380k2199M7111
$$ y = [-518695, -598004, -508978, -476921, -491303, -463346, -476326, -609947, -561347, -438682, -467475, -484241, -479935, -550834, -396945, -530036, -482917, -537296, -420765, -390059, -627565, -355351, -539811, -536001, -637070, -519721, -547866, -410040, -552285, -430713, -497501, -525406, -431992, -540983, -400531, -395746, -397668, -432413, -473129, -550418, -438409, -394236, -203221, -609223, -582177, -419534, -555713, -425319, -598017, -510957, -395167, -502344, -552888, -373262, -628861, -504579, -448843, -522645, -562263, -660815, -525883, -467246, -672196, -380309, -370145, -466324, -584845, -389598, -536130, -457881, -218782, -464793, -517632, -398609, -522473, -419169, -522327, -352017, -503713, -589494, -487161, -455811, -489557, -491635, -524015, -546214, -499103]
2015d99103J14335k78428Q9273J78401J67608j51726r2375O2052k4855j39403
2005e74221j73365K02582J4301K29920j15420Q7614j94108J16858M9876n718n432
$$ y = [-499103, -384768, -663196, -573923, -395522, -227914, -379640, -472015, -409963, -434818, -574221, -747586, -545004, -530703, -300783, -416203, -328589, -522697, -405839, -355963, -361681, -367113]
$$ [...]
##END NTUPLES=NMR SPECTRUM
##END=
