##TITLE=abcd
##JCAMPDX= 6.0         $$ Bruker NMR JCAMP-DX V2.0
##DATA TYPE= NMR SPECTRUM
##DATA CLASS= NTUPLES
##ORIGIN= UXNMR, Bruker Analytische Messtechnik GmbH
##OWNER= root
$$ XWIN-NMR		Version 3.5
$$ Fri Mar 13 18:28:58 2026 Russian Standard Time (UT+4h)  servis@DPX200
##.OBSERVE FREQUENCY= 200.131235884673
##.OBSERVE NUCLEUS= ^1H
##.ACQUISITION MODE= SIMULTANEOUS
##.ACQUISITION SCHEME= undefined
##.AVERAGES= 32
##.DIGITISER RES= 18
##SPECTROMETER/DATA SYSTEM= spect
##.PULSE SEQUENCE= zg
##.SOLVENT NAME= CDCl3
##.SHIFT REFERENCE= (INTERNAL, CDCl3, 0, 16.4885)
##AUDIT TRAIL= $$ (NUMBER, WHEN, WHO, WHERE, WHAT)
$$ ##TITLE= Audit trail, XWIN-NMR		Version 3.5
$$ ##JCAMPDX= 5.01
$$ ##ORIGIN= Bruker BioSpin GmbH
$$ ##OWNER= servis
$$ F:\spectra/data/av/nmr/H1/1/pdata/1/auditp.txt
$$ ##AUDIT TRAIL=  $$ (NUMBER, WHEN, WHO, WHERE, WHAT)
(   1,<2026-03-13 18:26:06.59 +0400>,<servis>,<DPX200>,
      <created by zg, POWCHK disabled, PULCHK disabled
       configuration hash MD5:
       00 E9 B6 7A A2 85 ED C7 34 08 36 98 17 FE 4E 26
       data hash MD5: 32K
       F4 64 F5 96 1A 14 2F 7C 59 DD 05 66 FC A9 7D 7B>)
(   2,<2026-03-13 18:28:36.03 +0400>,<servis>,<DPX200>,
      <Start of raw data processing
       efp BC_mod = 2 LB = 0.05 FT_mod = 6 PKNL = 1 PHC0 = -254.5951 PHC1 = -0.898437 SI = 16K 
       data hash MD5: 16K
       1D 09 3F 89 93 0C A2 40 F3 CB 25 A5 07 D0 9A 5B>)
$$ ##END=
$$ 
$$ hash MD5
$$ 46 13 02 DA 68 83 C7 96 7F C0 9F F5 36 85 E2 51
##$RELAX= 
##$RELAX= 
##$RELAX= 
##$RELAX= 
##$RELAX= 
##$RELAX= 
##$RELAX= 
##$RELAX= 
$$ Bruker specific parameters
$$ --------------------------
##$DU= <F:\spectra>
##$EXPNO= 1
##$NAME= <H1>
##$PROCNO= 1
##$TYPE= <nmr>
##$USER= <av>
##$AMP= (0..31)
100 100 100 100 100 100 100 100 100 100 100 100 100 100 100 100 100 100 
100 100 100 100 100 100 100 100 100 100 100 100 100 100 
##$AQSEQ= 0
##$AQ_mod= 1
##$AUNM= <au_zg>
##$AUTOPOS= <>
##$BF1= 200.13
##$BF2= 200.13
##$BF3= 200.13
##$BF4= 200.13
##$BF5= 500.13
##$BF6= 500.13
##$BF7= 500.13
##$BF8= 500.13
##$BYTORDA= 1
##$CFDGTYP= 0
##$CFRGTYP= 5
##$CHEMSTR= <none>
##$CNST= (0..31)
1 1 145 1 1 1 1 1 1 1 1 1 1 1 1 1 1 1 1 1 1 1 1 1 1 1 1 1 1 1 1 1 
##$CPDPRG= <>
##$CPDPRG1= <>
##$CPDPRG2= <>
##$CPDPRG3= <>
##$CPDPRG4= <mlev>
##$CPDPRG5= <mlev>
##$CPDPRG6= <mlev>
##$CPDPRG7= <mlev>
##$CPDPRG8= <mlev>
##$CPDPRGB= <>
##$CPDPRGT= <>
##$D= (0..31)
0 2 0 0 0 0 0 0 0 0.06 0 0 0 0 0 0 0.0002 0 0 0 0 0 0 0 0 0 0 0 0 0 0 
0 
##$DATE= 1773411966
##$DBL= (0..7)
120 120 120 120 120 120 120 120 
##$DBP= (0..7)
150 150 150 150 150 150 150 150 
##$DBP07= 0
##$DBPNAM0= <>
##$DBPNAM1= <>
##$DBPNAM2= <>
##$DBPNAM3= <>
##$DBPNAM4= <>
##$DBPNAM5= <>
##$DBPNAM6= <>
##$DBPNAM7= <>
##$DBPOAL= (0..7)
0.5 0.5 0.5 0.5 0.5 0.5 0.5 0.5 
##$DBPOFFS= (0..7)
0 0 0 0 0 0 0 0 
##$DE= 6
##$DECBNUC= <off>
##$DECIM= 32
##$DECNUC= <off>
##$DECSTAT= 4
##$DIGMOD= 1
##$DIGTYP= 9
##$DL= (0..7)
0 120 120 120 120 120 120 120 
##$DP= (0..7)
150 150 150 150 150 150 150 150 
##$DP07= 0
$$ [...]
##$SUBNAM4= <"">
##$SUBNAM5= <"">
##$SUBNAM6= <"">
##$SUBNAM7= <"">
##$SUBNAM8= <"">
##$SUBNAM9= <"">
##$SW= 20.6817932712277
##$SWIBOX= (0..15)
0 0 3 0 0 0 0 0 0 0 0 0 0 0 0 0 
##$SW_h= 4139.07284768212
##$TD= 32768
##$TD0= 1
##$TE= 0
##$TE2= 300
##$TE3= 300
##$TEG= 300
##$TL= (0..7)
0 120 120 120 120 120 120 120 
##$TP= (0..7)
150 150 150 150 150 150 150 150 
##$TP07= 0
##$TPNAME0= <>
##$TPNAME1= <>
##$TPNAME2= <>
##$TPNAME3= <>
##$TPNAME4= <>
##$TPNAME5= <>
##$TPNAME6= <>
##$TPNAME7= <>
##$TPOAL= (0..7)
0.5 0.5 0.5 0.5 0.5 0.5 0.5 0.5 
##$TPOFFS= (0..7)
0 0 0 0 0 0 0 0 
##$TUNHIN= 0
##$TUNHOUT= 0
##$TUNXOUT= 0
##$USERA1= <user>
##$USERA2= <user>
##$USERA3= <user>
##$USERA4= <user>
##$USERA5= <user>
##$V9= 5
##$VALIST= <valist>
##$VCLIST= <CCCCCCCCCCCCCCC>
##$VD= 0
##$VDLIST= <DDDDDDDDDDDDDDD>
##$VPLIST= <PPPPPPPPPPPPPPP>
##$VTLIST= <TTTTTTTTTTTTTTT>
##$WBST= 1024
##$WBSW= 30
##$XGAIN= (0..3)
0 0 0 0 
##$XL= 0
##$YL= 0
##$YMAX_a= 156548
##$YMIN_a= -114335
##$ZGOPTNS= <>
##$ZL1= 120
##$ZL2= 120
##$ZL3= 120
##$ZL4= 120
##$ABSF1= 0
##$ABSF2= 0
##$ABSG= 0
##$ABSL= 0
##$ALPHA= 0
##$AQORDER= 0
##$ASSFAC= 0
##$ASSFACI= 0
##$ASSFACX= 0
##$ASSWID= 0
##$AUNMP= <proc_1d>
##$AZFE= 0.1
##$AZFW= 0.1
##$BCFW= 0
##$BC_mod= 2
##$BYTORDP= 0
##$COROFFS= 0
##$CY= 18.4799938201904
##$DATMOD= 1
##$DC= 0
##$DFILT= <>
##$DTYPP= 0
##$F1P= 9.9274215381318
##$F2P= -0.165520771350173
##$FCOR= 1
##$FTSIZE= 16384
##$FT_mod= 6
##$GAMMA= 0
##$GB= 0
##$INTBC= 1
##$INTSCL= 4.127829e-11
##$ISEN= 128
##$LB= 0.05
##$LEV0= 0
##$LPBIN= 0
##$MAXI= 10000
##$MC2= 0
##$MEAN= 0
##$ME_mod= 0
##$MI= 50
##$NCOEF= 0
##$NC_proc= -9
##$NLEV= 6
##$NOISF1= 3.799351
##$NOISF2= 2.8
##$NSP= 0
##$NTH_PI= 0
##$NZP= 0
##$OFFSET= 16.48848
##$PC= 4
##$PHC0= -254.5951
##$PHC1= -0.898437
##$PH_mod= 1
##$PKNL= yes
##$PPARMOD= 0
##$PSCAL= 4
##$PSIGN= 0
##$REVERSE= no
##$SF= 200.130005582386
##$SI= 16384
##$SIGF1= 3
##$SIGF2= 2
##$SINO= 400
##$SIOLD= 16384
##$SREGLST= <1H.CDCl3>
##$SSB= 0
##$STSI= 16384
##$STSR= 0
##$SW_p= 4139.07284768211
##$SYMM= 0
##$S_DEV= 0
##$TDeff= 32768
##$TDoff= 0
##$TI= <>
##$TILT= no
##$TM1= 0
##$TM2= 0
##$TOPLEV= 0
##$USERP1= <user>
##$USERP2= <user>
##$USERP3= <user>
##$USERP4= <user>
##$USERP5= <user>
##$WDW= 1
##$XDIM= 16384
##$YMAX_p= 439835674
##$YMIN_p= -6670630
$$ End of Bruker specific parameters
$$ ---------------------------------
##NTUPLES= NMR SPECTRUM
##VAR_NAME=  FREQUENCY,     SPECTRUM/REAL,   SPECTRUM/IMAG
##SYMBOL=    X,             R,               I
##VAR_TYPE=  INDEPENDENT,   DEPENDENT,       DEPENDENT
##VAR_FORM=  AFFN,          ASDF,            ASDF
##VAR_DIM=   16384,         16384,           16384
##UNITS=     HZ,            ARBITRARY UNITS, ARBITRARY UNITS
##FACTOR=    0.252644378177508, 1,           1
##FIRST=     3299.83951724647, 0,            0
##LAST=      -839.233330435636, 0,           0
##MIN=       -839.233330435636, -6670630,    0
##MAX=       3299.83951724647, 439835674,    0
$$ Real data points
##PAGE= N=1
##DATA TABLE= (X++(R..R)), XYDATA
$$ [...]
8623h80350J360511p74679j422912J120379o54606R44947J277983p05505j288997
$$ -880350 480161 -294518 -1717430 -597051 -1251657 -306710 971273 265768 -1023229
8614a023229R94438j029801J74405L32681n72476M951J278160n36898K96212j168807
$$ -1023229 -28791 -1058592 -884187 -551506 -1123982 -1119031 159129 -377769 -81557 -1250364
8604a250364k58599J683281j578260n39241K705772j260802J465970j370162n75834
$$ -1250364 -1508963 174318 -1403942 -1943183 762589 -498213 967757 -402405 -978239
8595i78239O4303O77080j476877M37758J618035o193m14496j964859K636940q27069
$$ -978239 -913936 -236856 -1713733 -1275975 342060 335867 -78629 -2043488 593452 -233617
8585b33617n05439N29811j015786J406001j413876R66203n60609M35257J127634
$$ -233617 -739056 -209245 -1225031 180970 -1232906 -266703 -827312 -392055 735579
8576G35579j635250m71870n53130L83200N11087J697561p1985j582054K11807
$$ 735579 -899671 -1371541 -1924671 -1541471 -1030384 667177 595192 -986862 -775055
8567g75055q75434J849915m73351j294138J921524q96425q84496P58230R49425
$$ -775055 -1650489 199426 -273925 -1568063 353461 -542964 -1427460 -669230 280195
8558B80195j500182L80003m37342J465931N98090m08184p29106q06480P00008
$$ 280195 -1219987 -839984 -1277326 188605 786695 378511 -350595 -1157075 -457067
8549d57067M93630j82798j670000K546539n86130l64283J41327R59536k872637
$$ -457067 36563 -146235 -1816235 730304 144174 -220109 -78782 880754 -1991883
8540a991883K284521o42484J63237J492552r09170J43696J212111k90571L215641
$$ -1991883 292638 -349846 -186609 1305943 396773 540469 1752580 1462009 4677650
8531D677650j1348280L467292L31734J857312l06773k96917N56240Q66558j253871
$$ 4677650 -6670630 -3203338 -2871604 -1014292 -1321065 -1617982 -1061742 -195184 -1449055
8522a449055p69769J542138N13058j23814k12649N78717K29000j950133N42355
$$ -1449055 -2218824 -676686 -163628 -287442 -500091 78626 307626 -1642507 -1100152
8513a100152Q21381J118495j017521l74637m6641n38414N77707m28601k14818
$$ -1100152 -278771 839724 -177797 -552434 -599075 -1137489 -559782 -988383 -1203201
8504a203201Q98091Q13368j621463J231166r44454J378557j252033j286847J964914
$$ -1203201 -305110 508258 -1113205 117961 -826493 552064 -699969 -1986816 -21902
8495b1902n1750j278398M60232M46663r19382J766501p35452r90776Q14819J120325
$$ -21902 -73652 -1352050 -891818 -445155 -1364537 401964 -333488 -1324264 -509445 610880
8485F10880r39992k53154M01806l44527l65769J95169j277698P70473K43968N70626
$$ 610880 -329112 -582266 -180460 -524987 -890756 -695587 -1973285 -1202812 -958844 -388218
8475c88218J47152o73239q81055L08244J671834j937335L71295J746532j532623
$$ -388218 -241066 -914305 -1795360 -1487116 184718 -1752617 -1381322 365210 -1167413
8466a167413R18660L5454j35979r28866p19078K610066n44546j095772p15476
$$ -1167413 -248753 -213299 -349278 -1278144 -1997222 612844 68298 -1027474 -1742950
8457a742950N32775k90342K221847p70730K69790k91591l42731m56367L06503
$$ -1742950 -1210175 -1500517 721330 -49400 220390 -71201 -413932 -870299 -563796
8448e63796j340168J358941o74184l30576Q09706l98187r55250J676868M94914
$$ -563796 -1903964 -545023 -1219207 -1549783 -740077 -1138264 -2093514 -416646 78268
8439G8268l22647j461674Q87832j889557O55191R42666r50246O33393Q88355M14896
$$ 78268 -244379 -1706053 -818221 -2707778 -2052587 -1109921 -2060167 -1426774 -538419 -123523
8429a23523n52530p46731K348710j425972O05336K02609K61664j460011Q53443
$$ -123523 -676053 -1422784 925926 -500046 105290 307899 569563 -890448 -37005
8420c7005j353982j056702J993701j639422J084675j999099K267445n56413p1577
$$ -37005 -1390987 -2447689 -453988 -2093410 -1008735 -3007834 -740389 -1296802 -1368379
8411a368379P68223P14382j368225j831M05954j106081J709733O79134j094535
$$ -1368379 -600156 114226 -1253999 -1255830 -849876 -1955957 -246224 432910 -661625
8402f61625k43269N39735j13342K97100O33430q91481J22178m5360J57843N65489
$$ -661625 -904894 -365159 -478501 -181401 452029 -439452 -317274 -362634 -204791 360698
8392C60698R66499k168487L35322k07655p66268L92994J22419J07254k07513j145920
$$ 360698 1327197 -841290 -505968 -713623 -1479891 -1086897 -964478 -857224 -1064737 -2210657
8382b210657R37493l12598K017690q85748j24697J24402p03531K74067K592165
$$ -2210657 -1273164 -1585762 431928 -453820 -578517 -454115 -1157646 -883579 1708586
8373A708586l536804J37026J36233N98628L71639J13243k62701k374665J134125
$$ 1708586 -1828218 -1691192 -1554959 -956331 -584692 -471449 -734150 -3108815 -1974690
8364a974690J318578Q47708j440553j03247J672607k335821R64810J38148j48533
$$ -1974690 -656112 191596 -1248957 -1352204 320403 -2015418 -1050608 -912460 -1060993
8355a060993J01248M34597r3366n34258p08745Q63611N93269p38720N21133l3457
$$ -1060993 -959745 -525148 -618514 -1152772 -1861517 -997906 -404637 -1143357 -622224 -655681
8345f55681n46901j046305O10995J362275n34415J485350j29557j655535K24252
$$ -655681 -1202582 -2248887 -1637892 -275617 -810032 675318 545761 -1109774 -885522
8336h85522O29201P9854j213179J802909j532600N9691R38947o5233r28833P97436
$$ -885522 -256321 -176467 -1389646 413263 -1119337 -1059646 -120699 -185932 -1114765 -317329
8326c17329P13994J18280m11252J049621k140284m65122J029544n95703M76460
$$ -317329 396665 514945 103693 1153314 -986970 -1452092 -422548 -1018251 -541791
8317e41791j407450n65350K209491j411333J295391j119141J515954m42337j743086
$$ -541791 -1949241 -2514591 -305100 -1716433 -421042 -1540183 -24229 -466566 -2209652
8308b209652J807344q35658K71870L77490J33715j838999J906484j151150O93521
$$ -2209652 -402308 -1237966 -966096 -588606 -454891 -2293890 -387406 -1538556 -845035
8299h45035J01380R13848k750238K693389m65476j007977J199956j579570K300360
$$ -845035 -743655 170193 -2580045 113344 -352132 -1360109 -160153 -1739723 560637
8290E60637k720004K108826l38306l92617O81324l03142j261335M18989J289480
$$ 560637 -2159367 -50541 -388847 -781464 -100140 -403282 -1664617 -1245628 43852
8281D3852r14305p11242J214169j646431J169051N64342J546274j084101p83685
$$ 43852 -870453 -1581695 -367526 -2013957 -844906 -280564 1265710 181609 -602076
8272f02076K34403l62899Q7152k76428P29150k13974l0600K53961J089035j859150
$$ -602076 -367673 -730572 -643420 -919848 -190698 -404672 -435272 -181311 907724 -951426
8262i51426J53139J565779o80251j825201N38126J201460p03389J029946j918236
$$ -951426 -798287 767492 87241 -1737960 -1199834 1626 -701763 328183 -1590053
8253a590053J487657J60041p87457P90977M09745l52849m4414R65669k083627
$$ -1590053 -102396 57645 -729812 61165 470910 118061 73647 1039316 -1044311
8244a044311J477180j094812O01j81640R65089J226142r62338l72361j263573
$$ -1044311 432869 -661943 -661342 -842982 122107 1348249 385911 13550 -1250023
8235a250023m270N48988n58395M42434L90501J003586j177443M03380j486681
$$ -1250023 -1254293 -705305 -1263700 -821266 -430765 572821 -604622 -201242 -1687923
8226a687923r35817K06718J915172n95915j624971J933247J990597r55401o30809
$$ -1687923 -2623740 -2417022 -501850 -1097765 -2722736 -789489 1201108 245707 -385102
8217c85102m02318O88469J27209j48627m1040j782110O90032J495409k055535
$$ -385102 -787420 -98951 28258 -120369 -161409 -1943519 -1253487 241922 -1813613
8208a813613J380033k227537K794701j429133n04171P50082J28861j124104P69254
$$ -1813613 -433580 -2661117 133584 -1295549 -1799720 -1049638 -920777 -2044881 -1275627
8199a275627K268370k211916J208679L036670m634783K961483j397735J7171616
$$ -1275627 992743 -1219173 -10494 3026176 -1608607 1352876 -44859 17126757
8191A7126757j9949478j67298N4572L6116J017153j07912N31731J171882j537270
$$ 17126757 -2822721 -2990019 -2935447 -2899331 -1882178 -1990090 -1458359 -286477 -1823747
8182a823747J973908O1954o29282j169271m14126K368200p12244o1481J305028
$$ -1823747 150161 212115 -417167 -1586438 -2000564 367636 -344608 -406089 898939
8173H98939j319736p12457L84775J02772R0709o79487k475734K955639o36762
$$ 898939 -420797 -1133254 -748479 -645707 -554998 -1234485 -3710219 -754580 -1391342
8164a391342n42054J340940M33729K80610l51991j046947j888499K514095j676975
$$ -1391342 -1933396 -592456 -158727 121883 -230108 -1277055 -3165554 -651459 -2328434
8155b328434J344576J61625J46204p50871r7077J517786p69984p85302J375303
$$ -2328434 -983858 -822233 -676029 -1426900 -1523977 -6191 -776175 -1561477 -186174
8146a86174n49889l70641M04140r11907K339248q29909j93069r84178J138454
$$ -186174 -736063 -1106704 -702564 -1614471 724777 -105132 -298201 -1282379 -143925
8137a43925j439826p86300J611347J76470J202757l20653N1321o00258j504795
$$ -143925 -1583751 -2370051 -758704 -582234 620523 299870 351191 -249067 -1753862
8128a753862K595041k435818J566345k316335J701690J63319o91206j39949L16988
$$ -1753862 841179 -1594639 -28294 -2344629 -642939 -479620 -1170826 -1310775 -993787
8119i93787O55991l29296L8297K20351n22308O31591O25007j099082O47220j604149
$$ -993787 -337796 -667092 -628795 -408444 -930752 -299161 325846 -773236 -126016 -1730165
8109a730165J344170q75395O59295O98071j12872L29455j822170J146258n23296
$$ -1730165 -385995 -1261390 -602095 95976 -16896 312559 -1509611 -363353 -886649
8100h86649N75098q7502N00807R0617l59269j282044O49841J08245j298110M27425
$$ -886649 -311551 -399053 101754 192371 -166898 -1448942 -799101 -690856 -1988966 -1561541
8090a561541Q81141j43423j36196Q97143j408748R40706l16616j34265L13429
$$ -1561541 -680400 -823823 -960019 -62876 -1471624 -530918 -847534 -981799 -668370
8081f68370l94583N01393J224195r59374J3921l99957J54808R01885r96017j6601
$$ -668370 -1062953 -561560 662635 -296739 -282818 -682775 -527967 373918 -622099 -638700
8071f38700M56010M90531j122613J335647p63897O28331j144369o62594J183104
$$ -638700 -182690 307841 -814772 520875 -243022 385309 -759060 -1421654 -238550
8062b38550Q20802k236367J286997j434756J308741J325046k161617J166857M65840
$$ -238550 582252 -1654115 -367118 -1801874 -493133 831913 -1329704 -162847 302993
8053C02993n82597j076147m8240J323430k57181J05119j260475M65539J689200
$$ 302993 -279604 -1355751 -1403991 -80561 -337742 -232623 -1493098 -1027559 661641
8044F61641j171488K67211j44230J320755j925744J859077j423315j58098r1810
$$ 661641 -509847 -242636 -386866 933889 -991855 867222 -556093 -714191 -806001
8035h06001J012234l8924R78398q72737J13466j235926P39167Q6056p73516m06698
$$ -806001 206233 167309 1145707 272970 386436 -849490 -110323 -24267 -797783 -1204481
8025a204481J502482O89285j283669J007637q00442o11106k43546K277408j157106
$$ -1204481 298001 987286 -296383 711254 -89188 -700294 -943840 1333568 176462
8016A76462k60828J021308j495793j50855N86627k09339J496074O2381r64590
$$ 176462 -84366 936942 -558851 -709706 -123079 -332418 1163656 1226037 261447
8007B61447P82099p62121Q48962J226567k521453J029866n89708J03006k104884
$$ 261447 1043546 281425 1130387 2356954 -164499 865367 275659 378665 -1726219
7998a726219J072372J28739l47529n85589J534768n8332L54090R68108q75971
$$ -1726219 -653847 -525108 -872637 -1458226 76542 18210 372300 1340408 464437
7989D64437n26272Q61313K71343j197610Q72321j37099j68343l05182l11462K79409
$$ 464437 -61835 799478 1070821 -126789 745532 608433 440090 134908 -176554 102855
7979A02855N04922O01862l61360r04752M51651L89114k01018j48901j001465J100666
$$ 102855 607777 1209639 848279 -56473 395178 784292 583274 434373 -567092 533574
7969E33574k063468J814913l43426j39426Q96352J865570k232287Q74455k098484
$$ 533574 -1529894 285019 -58407 -197833 698519 2564089 331802 1206257 -892227
7960h92227J640181p36355J155456L18196k091375K491932j788105j037529L96752
$$ -892227 747954 11599 1167055 1485251 -606124 1885808 97703 -939826 -543074
7951e43074O92651J601421p80406m3098O29422k648928J438453N82571l50849
$$ -543074 149577 1750998 970592 927494 1556916 -1092012 346441 929012 578163
7942E78163j65981P72667P21516M72754j702490M76344r7073q99707P03489K03098
$$ 578163 412182 1184849 1906365 2379119 676629 1152973 1055900 156193 859682 1062780
7932A062780r22951J923663m83325p91491n18927o24710K30608J337048j449346
$$ 1062780 139829 2063492 1580167 788676 269749 -354961 -124353 1212695 -236651
7923b36651j33405P43992K09465J450616m23888K85980k385890J98915l02812
$$ -236651 -370056 373936 583401 2034017 1610129 1896109 -489781 -290866 -593678
7914e93678J538130k57447J662827J11551J37361r47305K34554m35417R07681
$$ -593678 944452 687005 2349832 2461383 2598744 1651439 1885993 1450576 2358257
7905B358257j088336l62884J435762j872058J216101L62707N18431j273735K23877
$$ 2358257 1269921 907037 2342799 470741 1686842 2049549 2567980 1294245 1518122
7896A518122L47397j550393J502455k56640K18560J146973P66336k658787N44150
$$ 1518122 1865519 315126 1817581 1560941 1779501 2926474 3692810 1034023 1578173
7887A578173m82967P98278l28168J593495p40674K16665n68857J140289j103543
$$ 1578173 1095206 1893484 1565316 3158811 2418137 2634802 2065945 3206234 2102691
7878B102691J2172L94935J46226N71941m62001r63868k54078P07155Q18612l79806
$$ 2102691 2114863 2509798 2656024 3227965 2765964 1802096 1548018 2255173 3073785 2693979
7868B693979K82643m85715O12271M99420j284258k4428P31882j680338J064639
$$ 2693979 2976622 2490907 3103178 3602598 2318340 2293912 3025794 1345456 2410095
7859B410095P28607N13354r26936J187218l54161M79969k727368N530348m309554
$$ 2410095 3138702 3652056 2725120 3912338 3558177 4038146 1310778 6841126 2531572
7850B531572J088482j447401L66061Q05196o48025j498488J787902N62682j775600
$$ 2531572 3620054 2172653 2538714 3343910 2695885 1197397 2985299 3547981 1772381
7841A772381K241181j874056j015626N39960l39535L83579Q78625J15983K35205
$$ 1772381 4013562 2139506 1123880 1663840 1324305 1707884 2586509 2702492 2937697
7832B937697J15073N99115p84592m0187O74310j246804j59457r42911J795100
$$ 2937697 3052770 3651885 2867293 2827106 3501416 2254612 2095155 1152244 2947344
7823B947344p4393M00185M0478L00365k33758q96653O49758P84806j513420m82747
$$ 2947344 2872951 3273136 3313614 3613979 3380221 2483568 3133326 3918132 2404712 1921965
7813A921965R68624J66222k67849K83115l57743J21324P33459P1317j761589J507928
$$ 1921965 2890589 3056811 2788962 3072077 2714334 2835658 3569117 3640434 1878845 3386773
7803C386773k558928K684538k778512J667878M36542J3358p59287j066988K050011
$$ 3386773 827845 3512383 733871 2401749 2838291 2851649 2092362 1025374 3075385
7794C075385p02823j180226Q56103J17712k58833l27319M72173O3871l83402J64080
$$ 3075385 2372562 1192336 2048439 2166151 1907318 1579999 2052172 2116043 1732641 1896721
7784A896721O60054Q67964r4555k167324K952163k073175N40748k94259q26275
$$ 1896721 2556775 3424739 3330184 1162860 4115023 2041848 2582596 2288337 1462062
7775A462062l12031J873675j802373J476222n12693Q23093k98455k24416q79130
$$ 1462062 1150031 3023706 1221333 2697555 2184862 3007955 2709500 2485084 1605954
7766A605954J432249n04458K66084M4687p98470p83801P97737P99q04960p684
$$ 1605954 3038203 2533745 2799829 2844516 2046046 1262245 2059982 2060781 1255821 1248137
7756A248137M01728j21235J76125k95723J7611O04009n73349r73495Q46375j810813
$$ 1248137 1649865 1528630 1704755 1409032 1426643 2030652 1457303 483808 1330183 -480630
7746d80630J537315m236M66031J054729j266469K39667J98682r73153J431564
$$ -480630 1056685 1052449 1518480 2573209 1306740 1546407 1745089 771936 2203500
7737B203500n76929j272238P85752P58597j152715Q91944j433701J10487J314240
$$ 2203500 1626571 354333 1140085 1898682 745967 1637911 204210 314697 1628937
7728A628937o48121P13195k77799N12818j751764J531298r21843n5592J194840
$$ 1628937 980816 1694011 1416212 1929030 177266 1708564 786721 731129 1925969
7719A925969l189993J705456L93490l05112K34972m85321R85021q13480J044469
$$ 1925969 -1264024 441432 834922 529810 764782 279461 1264482 451002 1495471
7710A495471k431803J348311O27533k522607L971729k097094N29201N24568M64825
$$ 1495471 -936332 411979 1039512 -1483095 2488634 391540 920741 1445309 1910134
7701A910134j519068l83186J22261J222296N97632n27916j919756N79621j74906
$$ 1910134 391066 7880 130141 1352437 1950069 1422153 -497603 82018 -92888
7692i2888p0889K9901O34376o57814m92046J123924J216960n80502j950354L88522
$$ -92888 -163777 -133876 500500 -157314 -649360 474564 1691524 1111022 -839332 -450810
7682d50810J04928M46042l05634L9085J440843J33820k66442N16795j093948o43454
$$ -450810 -345882 100160 -205474 -166389 1274454 1408274 1141832 1658627 564679 -78775
7672g8775J151058r94987O4134n40590N82306l27631o89353P78142J25670q95431
$$ -78775 1072283 77296 141430 -399160 183146 -144485 -833838 -55696 69974 -825457
7662h25457J165259M47191o52256j897486J976074j29307m8938l77762r86388
$$ -825457 339802 786993 134737 -1762749 213325 84018 35080 -342682 -1329070
7653a329070J941653N27043j483290J633974k144260J332117p44052P44993j963204
$$ -1329070 612583 1139626 -343664 1290310 -853950 478167 -265885 479108 -1484096
7644a484096J322890m37822r21243K298699l27480p75512p6853O19726o67389
$$ -1484096 -161206 -599028 -1520271 778428 450948 -324564 -401417 218309 -449080
7635d49080L12652j67124n47209J687368p47343j151634Q23170o3545J585457
$$ -449080 -136428 -303552 -850761 836607 89264 -1062370 -239200 -302745 1282712
7626A282712j495215m4157J2382M63154Q32441k99081j279787n2142l01039k81135
$$ 1282712 -212503 -256660 -244278 218876 1051317 752236 -527551 -579693 -880732 -1161867
7616a161867J21545O91127p45096L44091J784390k075418J379742k33501M7962
$$ -1161867 -1040322 -349195 -1094291 -750200 1034190 -1041228 338514 105013 152975
7607A52975j319698J571747j407327J252704j928006J499412R18988r70758K37993
$$ 152975 -1166723 405024 -1002303 250401 -1677605 -178193 740795 -229963 8030
7598H030j174974n78569J699328P70668j603271J309322O14400j241555n98167
$$ 8030 -1166944 -1745513 -46185 724483 -878788 430534 1044934 -196621 -794788
7589g94788J475968j642078l66715K368753k77793j854114j059909J421605m4150
$$ -794788 681180 -960898 -1327613 1041140 763347 -1090767 -2150676 -729071 -773221
7580g73221Q12999J002315j759664P94607j123860K617182k332088n07891M61102
$$ -773221 39778 1042093 -717571 77036 -1046824 1570358 -761730 -1269621 -808519
7571h08519j266820J333757K91863R26364K039N01745o29977J397380k143225
$$ -808519 -2075339 -741582 -449719 476645 478684 980429 350452 1747832 -395393
7562c95393O57959l39800J51293j91910J94626j303715O34551M30725J464314
$$ -395393 262566 -77234 74059 -117851 76775 -1226940 -592389 -161664 1302650
7553A302650j171448O29117r7942k447722J559142j69135L80869P73155j403966
$$ 1302650 131202 760319 662377 -1785345 -226203 -395338 -14469 758686 -645280
7544f45280O21170J420504j870278J938009m14174K34635m19614j725304q49757
$$ -645280 -24110 1396394 -473884 1464125 1049951 1284586 864972 -860332 -1710089
7535a710089J222045K92357j60230L29235j073925R1296J247395m10929J302437
$$ -1710089 -488044 -195687 -355917 -26682 -1100607 -1009311 238084 -172845 1129592
7526A129592k947247J042929J056256p52677J143348J000275j267537k695898
$$ 1129592 -1817655 -774726 281530 -471147 672201 1672476 404939 -2290959
7518b290959K851871j478793J213874p42820p24357J358512J29774p70704l71793
$$ -2290959 560912 -917881 295993 -446827 -1171184 187328 317102 -453602 -825395
7509h25395k70757O59282K06248l18999j056292R51095k00179r7750M54138j5692
$$ -825395 -1096152 -436870 -230622 -549621 -1605913 -654818 -854997 -952747 -498609 -514301
7499e14301K40709M76109j007871M25820k384277K068177o09990J635552j127193
$$ -514301 -273592 202517 -805354 -379534 -2763811 -695634 -1305624 329928 -797265
7490g97265M61844j92849r18032q07040J366485o12760q451J086375J038868j707308
$$ -797265 -335421 -528270 -1446302 -2253342 -886857 -1499617 -1508068 -421693 617175 -1090133
7480a090133K342339j781692l40547M35701P54026n5996o35726r42344L77478
$$ -1090133 1252206 -529486 -870033 -434332 319694 263698 -372028 -1314372 -936894
7471i36894l9600j18055P84507k98740o39043J825341r38502K49185j653301J147435
$$ -936894 -976494 -1094549 -310042 -608782 -1247825 577516 -360986 -111801 -1765102 -617667
7461f17667j009908q095Q29732O19595r1665M09553N72262k575244R01322Q75333
$$ -617667 -1627575 -1635670 -805938 -186343 -278008 131545 703807 -1871437 -970115 -94782
7451i4782j115825J359602j228166P45337J596048j847918N10898q67647R34661
$$ -94782 -1210607 148995 -1079171 -333834 1262214 -585704 -74806 -942453 -7792
7442g792j134109J101693j413528L66731J819733m12053j373340m71783O24965
$$ -7792 -1141901 -40208 -1453736 -1087005 732728 320675 -1052665 -1524448 -899483
7433h99483P61593l82355l57783J539081p34897j589014J201688p2766q09751
$$ -899483 -137890 -520245 -878028 661053 -73844 -1662858 -461170 -533936 -1343687
7424a343687K007516o96206J93332n34245Q95601j908265K832594j932358k89921
$$ -1343687 663829 -32377 160955 -373290 522311 -1385954 1446640 -485718 -775639
7415g75639Q73996m40609r58652J148868o47713L20859j391915J334414J1268
$$ -775639 98357 -342252 -1300904 -152036 -799749 -478890 -1870805 -536391 -525123
7406e25123N68399J23920j460729O39383Q5927j168089J858023k03479J02090
$$ -525123 43276 167196 -1293533 -654150 -568223 -1736312 121711 -81768 20322
7397B0322J04008k27370k295048K099475R33549j211802O28069m74166K3119J39510
$$ 20322 124330 -103040 -2398088 -298613 634936 -576866 51203 -422963 -399844 -260334
7387b60334n92340L2131J42543M86879m19579k74260M59762O30652r52088Q65661
$$ -260334 -852674 -820543 -678000 -191121 -610700 -884960 -425198 205454 -746634 119027
7377A19027o67126n80133Q03524J772O98700j858453R25523R2434Q49704J33328
$$ 119027 -548099 -1128232 -324708 -322936 375764 -1482689 -557166 -464732 384972 518300
7367E18300J67099k494131J893516l12694J193288r07804q6488M51292o54549
$$ 518300 685399 -1808732 84784 -227910 965378 57574 -28914 422378 -232171
7358b32171m18427q76759M34450R87044l28333P49735j313700P09798L51337K292
$$ -232171 -650598 -1527357 -1092907 -105863 -434196 315539 -998161 -288363 62974 65266
7348F5266J3023p43482r08200L40970m5039j75879K301907N45367j204748j325954
$$ 65266 78289 -665193 -1573393 -1232423 -1277462 -1453341 848566 1393933 189185 -1136769
7338a136769J745921j492575k98946p6898J228688R3118j00992j461543K078491
$$ -1136769 609152 -883423 -1182369 -1259267 -30579 62539 -38453 -1499996 578495
7329E78495n26233o40627R52632j378756P70745J70251k46615J332235O19955
$$ 578495 52262 -588365 364267 -1014489 -243744 -73493 -320108 1012127 1632082
7320A632082k028615N75030j46749m86637M03288o63121L49768j95018Q06528
$$ 1632082 -396533 178497 31748 -454889 -51601 -714722 -364954 -559972 246556
7311B46556k022087K107064R22918k06651k32508j068299N69726o60777J137431
$$ 246556 -1775531 331533 1254451 1047800 815292 -253007 316719 -344058 793373
7302G93373l63872j337331J956128j043555j867658J754252l57014Q24170m20189
$$ 793373 429501 -907830 1048298 4743 -1862915 -108663 -465677 358493 -61696
7293f1696J004116j252231K457875j408640n76573r2653q63447M65351P31347
$$ -61696 942420 -309811 2148064 739424 162851 70198 -793249 -327898 403449
7284D03449o18523K53494r75652k3083J349078j08702J289656k278800P99739
$$ 403449 -215074 38420 -937232 -960315 388763 280061 1569717 -709083 90656
7275I0656Q29626j679230K66011n236O24060j134353J57908J761314n92241P3100
$$ 90656 920282 -758948 -492937 -498173 125887 -1008466 -850558 910756 318515 391615
7265C91615k258282K269493k56845p27075J455290j553360J302334r11034J755611
$$ 391615 -1866667 402826 145981 -581094 874196 -679164 623170 -287864 1467747
7256A467747r30529j027204j33561O3557j30683K161915r87138n03726j8766p2952
$$ 1467747 537218 -489986 -623547 -559990 -690673 1471242 484104 -19622 -38388 -111340
7246a11340P57230k016733Q61258J56591n05587K092404k535376K113727j354885
$$ -111340 645890 -1370843 -509585 -352994 -858581 1233823 -1301553 812174 -542711
7237e42711P94753j81967m91129M70338m11569o91850J816274n90632J2583N47517
$$ -542711 252042 70075 -421054 49284 -362285 -1054135 762139 171507 184090 731607
7227G31607K10650l61602r30250Q00038n99362k76031n62968J069181J084344
$$ 731607 942257 580655 -349595 450443 -148919 -424950 -987918 81263 1165607
7218A165607j650007j481789J898087o2413k41715J178719M94983k346845L96804
$$ 1165607 -484400 -1966189 -68102 -130515 -372230 806489 1301472 -1045373 -648569
7209f48569J923713k273656M21155P66602j435414M14883P5074M75789L7758m71499
$$ -648569 1275144 -998512 -577357 189245 -1246169 -831286 -756212 -280423 -242665 -714164
7199g14164J270851j66032q03898k99552Q67346O95297j860671R73316q8499p7948
$$ -714164 556687 390655 -413243 -712795 154551 849848 -1010823 -37507 -126006 -203954
7189b03954J233558q75456o78378K89929l22131j230239J610295J682993k129158
$$ -203954 1029604 154148 -524230 -234301 -556432 -1786671 -176376 1506617 -622541
7180f22541n5906J855972j211506M80303j305371j12844J586275j731265K88694
$$ -622541 -678447 1177525 -33981 446322 -859049 -971893 614382 -1116883 -828189
7171h28189Q71761j700786Q27123J078330j959487K492111n63333k75588o40435
$$ -828189 43572 -1657214 -830091 248239 -1711248 780863 217530 -58058 -698493
7162f98493J134096M01068q90956j255190M48050J57855J045403k1143r25347
$$ -698493 435603 836671 -54285 -1309475 -861425 -703570 341833 320690 -604657
7153f04657R27598j85180K78544j008079R95380n1063o76597L190747k364368
$$ -604657 322941 137761 416305 -591774 403606 352543 -324054 2866693 502325
7144E02325m45779M72519M14289j61634j031726Q92210K51643j286437K225443
$$ 502325 56546 529065 943354 781720 -250006 642204 893847 -392590 1832853
7135A832853k11816k232541J46022Q03424k46132K82903N9696n32166O91896m55982
$$ 1832853 1621037 -611504 -465482 337942 91810 374713 434409 -97757 594139 138157
7125A38157J550928r0303j692089k99468K97429M97818M84529r86234M45969r49389
$$ 138157 1689085 1598782 -93307 -392775 -95346 402472 887001 -99233 346736 -602653
7115f02653K70957J813694k59167j301461m20546J329715k50447q12940J042497
$$ -602653 -331696 1481998 1222831 -78630 -499176 830539 580092 -232848 809649
7106H09649M12407j424916J615346j255482L03906N97796l74841K90560m45002
$$ 809649 1222056 -202860 1412486 157004 460910 1058706 683865 974425 529423
7097E29423P4683k199412J488900J179174P9318J85660j427194K222386j234991
$$ 529423 604106 -1595306 -106406 1072768 1152086 1337746 -89448 2132938 897947
7088H97947k79860R124N62081J39926k109180J310129O88877o32344k26710p1934
$$ 897947 618087 627211 1189292 1329218 -779962 530167 1219044 586700 359990 288056
7078B88056K647554k030525L45024n57938m00402K87064J172135J02538r09217
$$ 288056 2935610 905085 1250109 692171 291769 578833 1750968 1853506 944289
7069I44289O66649M17164n20938r25829J70956Q67997r76231L19933Q51811O0646
$$ 944289 1610938 2028102 1507164 581335 752291 1620288 644057 963990 1815801 1876447
7059A876447J53217j429379p69540J345562k54686J05952P40042p36295j25472
$$ 1876447 2029664 600285 -169255 1176307 921621 1027573 1767615 1031320 905848
7050I05848J298013m72700J025638p13623r70295J4802R13202L65935p19756M07382
$$ 905848 2203861 1731161 2756799 2043176 1072881 1087683 2000885 2366820 1647064 2054446
7040B054446O88344q04110J417080l5874Q0160k64447J134498j44183k64008J716734
$$ 2054446 2742790 1938680 3355760 3319886 3400046 3135599 4270097 4125914 3861906 5578640
7030E578640m03423P30358K49118O74131L5538L39062P16110J336572j519566
$$ 5578640 5175217 5905575 6154693 6828824 6864362 7203424 7919534 9256106 7736540
7021G736540K204508o47786j527103J175002L50143j01285p33576Q19203m67061
$$ 7736540 9941048 9293262 7766159 8941161 9291304 9190019 8456443 9275646 8808585
7012H808585K829001j829523K83932K28870j293783Q70779M56277j064273L23671
$$ 8808585 11637586 9808063 10091995 10320865 9027082 9897861 10354138 9289865 9613536
7003I613536K38929j73280J765305L67076Q18689J30705K522909K51589j242312
$$ 9613536 9852465 9679185 11444490 11811566 12630255 12760960 15283869 15535458 14293146
6994A4293146j0536J448184M60392K269668L34554m2713j647528L334238m71896
$$ 14293146 14282610 15730794 16191186 18460854 18795408 18752695 17105167 20439405 19967509
6985A9967509k269151j1599L08620L24845m50240l23079q50071N36298j937348
$$ 19967509 17698358 17686759 17995379 18320224 17869984 17546905 16696834 17233132 15295784
6976A5295784j474012L8275n37408n78896j09864j08193l91079p9449M34847q51284
$$ 15295784 13821772 13860047 13322639 12743743 12633879 12525686 12134607 12055158 12490005 11638721
6966A1638721L71153j84932n77951J177482l34706L40756l66075J605612r7265
$$ 11638721 12009874 11824942 11246991 12424473 12089767 12430523 12064448 13670060 13572795
6957A3572795P33426j307831j535815J866083l04257j713504J545352k485927
$$ 13572795 14306221 12998390 11462575 13328658 13024401 11310897 12856249 10370322
6949A0370322o0961J94646n47523O63941k205549p33980J726816j393263m97113
$$ 10370322 10309361 10504007 9956484 10620425 8414876 7680896 9407712 8014449 7517336
6940G517336j532172O83262j861632q85102J573685j219939J325891k272171J402657
$$ 7517336 5985164 6668426 4806794 3921692 5495377 4275438 5601329 3329158 4731815
6931D731815k5579m89733P01828k731654O81688L79999l79458R30588r65551p6322
$$ 4731815 4706236 4216503 4918331 2186677 2868365 3248364 2868906 3799494 2833943 2757621
6921B757621J153501j031267J362657j783882j143522J751267J518318j8987p06504
$$ 2757621 3911122 2879855 4242512 2458630 1315108 3066375 4584693 4565706 3859202
6912C859202Q07826o6351j298201K53259l0633j35310j090513J000530j199312
$$ 3859202 4667028 4600677 3302476 3555735 3525102 3389792 2299279 3299809 2100497
6903B100497J151125Q5447O35688r08996J014860j303598n70938J492087n65436
$$ 2100497 3251622 3337069 3972757 3063761 4078621 2775023 2204085 3696172 3130736
6894C130736Q50834k890689M10343L03817J150834k092654R11567l75166O66802
$$ 3130736 3981570 1090881 1501224 1805041 2955875 863221 1774788 1399622 2066424
6885B066424Q90000k200855N34487J75179K503661p40855l80220k153367J565095
$$ 2066424 2956424 755569 1290056 1465235 3968896 3228041 2847821 694454 2259549
6876B259549O08950J684786m31017p58766j109012j288825J352680k273303J048193
$$ 2259549 2868499 4553285 4122268 3363502 2254490 965665 2318345 45042 1093235
6867A093235j58042J84122J413489j270817Q43175r31124q32147L32440j04751
$$ 1093235 935193 1119315 2532804 1261987 2105162 1174038 341891 674331 569580
6858E69580K98288P93452p95678L50832j45144m59367n73469J263778L58214k037
$$ 569580 867868 1661320 865642 1216474 1071330 611963 38494 1302272 1660486 1658449
6848A658449L45832j540952J426155p28320K89653r13579L35483M47654j465886
$$ 1658449 2004281 463329 1889484 1161164 1450817 537238 872721 1320375 -145511
6839a45511K162661o78958j195747N99303J6043J192760l21389j063811J058461
$$ -145511 2017150 1338192 142445 741748 757791 1950551 1629162 565351 1623812
6830A623812o31509L67994m84986K300246p84936j361298J16925L09543p67512
$$ 1623812 992303 1360297 875311 3175557 2390621 1029323 1146248 1455791 688279
6821F88279P2841K284556j086789n83674p68418P66737l65329R75938N75390J17540
$$ 688279 761120 3045676 1958887 1375213 606795 1373532 1008203 1984141 2559531 2677071
6811B677071M41674J15689o26301M31713j495785K426266l33443J41071k639188
$$ 2677071 3118745 3234434 2608133 3039846 1544061 3970327 3636884 3777955 1138767
6802A138767J353455j00181q30978K241331q36263n6828o95962Q26622n17781
$$ 1138767 2492222 2392041 1561063 3802394 2966131 2909303 2213341 3039963 2522182
6793B522182M58693J561418O84359r52623n8459P11623J988660j262105J27977
$$ 2522182 2980875 4542293 5226652 4274029 4215570 4927193 6915853 5653748 5781725
6784E781725k117506J258506k84219j43652m84470r45092Q44393m26913J600294
$$ 5781725 3664219 4922725 4638506 4494854 4010384 3065292 3909685 3482772 5083066
6775E083066L42284j041203O70921j30676J308202p26017O03594L4271J267030
$$ 5083066 5425350 4384147 5055068 4924392 6232594 5506577 6110171 6144442 7411472
6766G411472J559965J012776K73386Q33618L7451P40368j190482l43742K36691
$$ 7411472 8971437 9984213 10257599 11091217 11128668 11869036 10678554 10334812 10571503
6757A0571503j016827O96221J630281J35828j454031J03990L16269J109453J13188
$$ 10571503 9554676 10250897 11881178 12017006 10562975 10666965 10983234 12092687 12205875
6748A2205875P11686K566477m88347J209799j226250K5828k15334J325413j927552
$$ 12205875 12917561 15484038 14995691 16205490 14979240 15005068 14789734 16115147 14187595
6739A4187595n64770q15958j258124R1680m85057k530302J160078o87480Q94988
$$ 14187595 13622825 12806867 11548743 11640423 11155366 8625064 9785142 9097662 9992650
6730I992650p14147q57970J449250K062111K558586L77874J092237L051406M93718
$$ 9992650 9278503 8420533 9869783 11931894 14490480 14868354 15960591 19011997 19505715
6721A9505715j893767m423207k73691k063135L98719k122868n0763j134614n55211
$$ 19505715 17611948 13188741 12915050 10851915 11250634 9127766 9077003 7942389 7387178
6712G387178K19962J30418M36806k007555j280376J275223P13658n20221j202703
$$ 7387178 7607140 7737558 8174364 6166809 4886433 6161656 6875314 6355093 5152390
6703E152390J407861j845087J846690P19528r12290R06197K02553j307383R59963
$$ 5152390 6560251 4715164 6561854 7281382 6369092 7275289 7477842 6170459 7130422
6694G130422N50644m07198j078632K01743O36880j357657J07204J469738l93691
$$ 7130422 7681066 7273868 6195236 6396979 7033859 5676202 5783406 7253144 6859453
6685F859453k783600K064897J48210j463384J38860J267695K18067j966906L15936
$$ 6859453 4075853 6140750 6288960 4825576 4964436 6232131 6450198 4483292 4799228
6676D799228J89457K080992m608m32472l59612j69353M87365O3564p56627n14864
$$ 4799228 4988685 7069677 7065069 6632597 6272985 6103632 6590997 6654561 5897934 5383070
6666E383070J236935J319985j876566j04679P86186j7447K827J222790j686809
$$ 5383070 6620005 7939990 6063424 5958745 6744931 6727484 6730311 7953101 6266292
6657F266292J145395Q17154j72227j99134k58888j880678K344739p24139K84893
$$ 6266292 7411687 8228841 8056614 7857480 7598592 5717914 8062653 7338514 7623407
6648G623407o3358j163460j879877K978290P27704N77962n07091r26203j301455
$$ 7623407 7560049 6396589 4516712 7495002 8222706 8800668 8293577 7367374 6065919
6639F065919L702815Q1173q62813K520726J813080K967340p18226q55631j427138
$$ 6065919 9768734 9849907 8987094 11507820 13320900 16288240 15570014 14714383 13287245
6630A3287245q40252j181610L09589j584618J221381j705737J818650j398869
$$ 13287245 12446993 11265383 11574972 9990354 11211735 9505998 11324648 9925779
6622I925779p05266K24120J531121o21840O49694q87079R32358O03192J67408
$$ 9925779 9220513 9444633 10975754 10353914 11003608 10116529 11048887 11652079 11819487
6613A1819487l82147J357403j100329K983189J183136M139924N344547O006064
$$ 11819487 11437340 12794743 11694414 14677603 15860739 20000663 25345210 31351274
6605C1351274K929668k421735l283080n563848l247830j709923k034402K48206
$$ 31351274 34280942 31859207 28576127 23012279 19764449 18054526 16020124 16268330
6597A6268330j991952j17564p92097j09549J077408r53552l08449J096127N4264
$$ 16268330 14276378 14158814 13366717 13257168 14334576 13381024 13072575 14168702 14222966
6588A4222966K203471j629215j373260K329493L09364J186488J488871K049068
$$ 14222966 16426437 14797222 13423962 15753455 16062819 17249307 18738178 20787246
6580B0787246J918383M854850O811513N306621k799542l421818l169246l573303
$$ 20787246 22705629 27560479 34371992 39678613 36879071 33457253 30288007 26714704
6572B6714704k634254l465602m08626j676479P10181r16795K48699N62437r64024
$$ 26714704 24080450 20614848 20206222 18529743 19239924 18323129 18571828 19134265 18170241
6563A8170241J917403q72245M49276J6250M75848L13515O20964K79409J386770
$$ 18170241 20087644 19215399 19664675 19680925 20156773 20470288 21091252 21370661 22757431
6554B2757431Q90981m7506P17671J806339J653892K856207l14400l541956L22916
$$ 22757431 23648412 23600906 24318577 26124916 27778808 30635015 30320615 26778659 27101575
6545B7101575j013922p01090l76705P16037K70822q36849N00429J271320j194648
$$ 27101575 26087653 25386563 25009858 25725895 25996717 25159868 25660297 26931617 25736969
6536B5736969p62215J473351K88550j10432J635111K53240J09191O21308J069826
$$ 25736969 24974754 26448105 26736655 26626223 28261334 28514574 28623765 29245073 30314899
6527C0314899j85197K160603J09120p91466Q94007N69359J229868J99879K658730
$$ 30314899 30129702 32290305 32399425 31607959 32501966 33071325 34301193 34501072 37159802
6518C7159802o24494l32683P00278P98515J286522J986248m8606J474480K178155
$$ 37159802 36535308 36202625 36902903 37701418 38987940 40974188 40925582 42400062 44578217
6509D4578217N7591K211826J085319j964664J671426J425957K055041K556508
$$ 44578217 44635808 46847634 47932953 45968289 47639715 49065672 51120713 53677221
6501E3677221k319622K571631J009080K59771p69579K788767L466111r90129J656627
$$ 53677221 51357599 53929230 54938310 55198081 54428502 57217269 60683380 59693251 61349878
6492F1349878o53601K366784J212971J573822k97139O51503J854077J756420o57637
$$ 61349878 60696277 63063061 64276032 65849854 65552715 66204218 68058295 69814715 69157078
6483F9157078L14642L375035j144732K172824P3530p62749J314717L32697o16506
$$ 69157078 69471720 72846755 71702023 73874847 73948377 73185628 74500345 74833042 74216536
6474G4216536J691261l05114J639929o10181L682382j699577J935698j048340
$$ 74216536 75907797 75602683 77242612 76632431 80314813 78615236 80550934 79502594
6466G9502594K284894J119063K046832J11631J744287J206178J13399K29532L94857
$$ 79502594 81787488 82906551 84953383 85065014 86809301 88015479 88128878 88358410 88753267
6457H8753267m88939J959473p30940q09492j055538K59141K615445L79788j737874
$$ 88753267 88264328 90223801 89492861 88683369 87627831 87886972 90502417 90882205 89144331
6448H9144331J048126J407493J438828J516893J360268L741562J271019J960798
$$ 89144331 90192457 91599950 93038778 94555671 95915939 99657501 100928520 102889318
6440A02889318M553343K878621J162169m633j448084l189459j933306l669359
$$ 102889318 107442661 110321282 111483451 111478818 110030734 106841275 104907969 101238610
6432A01238610m118197j562876j828839k710588R68379k021688L83489J282474
$$ 101238610 97120413 95557537 93728698 91018110 91986489 89964801 90348290 91630764
6424I1630764K854659K549132J110412L134863K414183K303328J935177p77972
$$ 91630764 94485423 97034555 98144967 101279830 103694013 105997341 107932518 107154546
6416A07154546j15062J356299k517565q55399l079211p47664k877971J163861
$$ 107154546 107039484 108395783 105878218 105022819 101943608 101195944 98317973 99481834
6408I9481834l5294J272400k028736J594067O43799k491353J106034n22020O22355
$$ 99481834 99446540 100718940 98690204 100284271 100928070 98436717 99542751 99020731 99643086
6399I9643086J354727m2914j284833n80866o79466m025409o05052k133756M8242
$$ 99643086 100997813 100954899 99670066 99089200 98409734 94384325 93779273 91645517 91693759
6390I1693759j201686J349054K690512L034025L122259J962075J312920l070316
$$ 91693759 90492073 91841127 94531639 97565664 100687923 102649998 103962918 100892602
6382A00892602j127021N27015k280556k490790O84204k264782R55286k531676
$$ 100892602 99765581 100292596 98012040 95521250 96205454 93940672 94895958 92364282
6374I2364282L56519k671087j205147j178070m80746J255037j629505K977165
$$ 92364282 92720801 90049714 88844567 87666497 87185751 88440788 86811283 89788448
6366H9788448M3379K896131K695846k35862o29001j365429l644691j090139k286526
$$ 89788448 89831827 92727958 95423804 95187942 94558941 93193512 89548821 88458682 86172156
6357H6172156j589405q93815l42592j393074r98527R80790l94394j174759K430525
$$ 86172156 84582751 83688936 83346344 81953270 80954743 81935533 81541139 80366380 82796905
6348H2796905o88955J953502J44509K302106p52167J064373j60169j726112n31407
$$ 82796905 82107950 84061452 84205961 86508067 85755900 86820273 86660104 84933992 84402585
6339H4402585k359446j327070j549213j349311j446004j677212p7319P52270j629498
$$ 84402585 82043139 80716069 79166856 77817545 76371541 74694329 74617010 75369280 73739782
6330G3739782j397140J430315L19083K988705J929492J949047J158290j001098
$$ 73739782 72342642 73772957 74092040 77080745 79010237 80959284 82117574 81116476
6322H1116476n29207j389195k304734o16634j248572m329358k264957l817138
$$ 81116476 80587269 79198074 76893340 76276706 75028134 70698776 68433819 64616681
6314F4616681m21613j933062q954k322397J015107k044079k11510p88249M07269
$$ 64616681 64195068 62262006 62253052 59930655 60945762 58901683 58690173 57901924 58309193
6305E8309193l3473K10127n58705j316200n63419J214899j614796j929966o93540
$$ 58309193 58275720 58485847 57927142 56610942 56047523 57262422 55647626 53717660 53024120
6296E3024120l72306j489633k130608j018309j761773O47572O9480k163756N80761
$$ 53024120 52651814 51162181 49031573 48013264 46251491 46899063 46968543 44804787 45385548
6287D5385548N18478r19179M44293k351913O14418j26031j016614J2103j049916
$$ 45385548 45904026 44984847 45429140 43077227 43691645 43565614 42549000 42561103 41511187
6278D1511187r0029j07800R58364l0612l89483j576206J182714q15242J4865J050261
$$ 41511187 41421158 41313358 42271722 42241110 41851627 40275421 41458135 40642893 40657758 41708019
6268D1708019K47802O58837k770734Q58653K125466m21837j037563l97529J572696
$$ 41708019 41955821 42614658 39843924 40702577 42828043 42406206 41368643 40971114 42543810
6259D2543810l98613N78854N2Q33945R38563J496841j085793L279186O14102K67298
$$ 42543810 42145197 42724051 42724103 43558048 44496611 45993452 44907659 48186845 48800947 49068245
6249D9068245K995373J093668m78731m30401j017744j282847j600494o54604q12058
$$ 49068245 52063618 53157286 52678555 52248154 51230410 49947563 48347069 47692465 46880407
6240D6880407l47505N28948j001161L71509P54218J54938L152628k594626K269928
$$ 46880407 46532902 47061850 46060689 46432198 47186416 47341354 50493982 47899356 50169284
6231E0169284J104070L079748K893030K514337P38487K118884j179792J87334
$$ 50169284 51273354 54353102 57246132 59760469 60498956 62617840 61438048 61625382
6223F1625382m231308J58616k074501j749953k222577J82835P12444r54288M35888
$$ 61625382 57394074 57552690 55478189 53728236 51505659 51688494 52400938 51446650 51882538
6214E1882538K51034j515882J261591p03901J522507J035101R78075R76830O10138
$$ 51882538 52133572 50617690 51879281 51175380 52697887 53732988 54711063 55687893 56298031
6205E6298031K238416J380066L43757M17824k0293k036682Q050q68250j068655
$$ 56298031 58536447 59916513 60260270 60678094 60657801 58621119 58629169 57760919 56692264
6196E6692264J097308j591249K015108J464335L470818K620198J479112J665071
$$ 56692264 57789572 56198323 58213431 59677766 63148584 65768782 67247894 68912965
6188F8912965R88451j000247m38918j839135r15839p23077j378495J18704J67815
$$ 68912965 69901416 68901169 68462251 66623116 65707277 64984200 63605705 63724409 63892224
6179F3892224j122800k144066r23195P87678l84468m21437N85160J717521K274613
$$ 63892224 62769424 60625358 59702163 60489841 60105373 59683936 60269096 61986617 64261230
6170F4261230K083329J185989L931094K730105R16747j683910l618955m250256
$$ 64261230 66344559 67530548 71461642 74191747 75108494 73424584 69805629 65555373
6162F5555373o25007r92306j134327l430965l34541k629443n86996k651312j678633
$$ 65555373 64930366 63938060 62803733 59372768 59038227 56408784 55821788 53170476 51491843
6153E1491843n70418p26626j328467P04481L367812J041850l32511L74653n56245
$$ 51491843 50921425 50194799 48866332 49570813 52938625 53980475 53647964 54022617 53466372
6144E3466372j943230o45570j872233k310317O70111j522334N10173j006175M06579
$$ 53466372 51523142 50877572 49005339 46695022 47365133 45842799 46352972 45346797 45753376
6135D5753376J865296j518791R38069J21596j077698N97679J30842j677223j959632
$$ 45753376 47618672 46099881 47037950 47159546 46081848 46679527 46810369 45133146 43173514
6126D3173514Q20516k103058N79630l01622J633963q88640L3274J006516o39133
$$ 43173514 43994030 41890972 42470602 42168980 43802943 42914303 42947577 43954093 43314960
6117D3314960J697996k007931J434315J561392r5506K063420p5514Q29565M11608
$$ 43314960 45012956 43005025 44439340 46000732 45905226 47968646 47893132 48722697 49134305
6108D9134305j171391o48479k46992J098010M52315q40299Q50816O66460j662302
$$ 49134305 47962914 47314435 47067443 48165453 48617768 47777469 48628285 49294745 47632443
6099D7632443L49041Q61774J545012J606559p57462J093987J540927R05852J29689
$$ 47632443 47981484 48843258 50388270 51994829 51237367 52331354 53872281 54778133 54907822
6090E4907822J618724j50802J163849J675889J136244P73657K815102J182537
$$ 54907822 56526546 56375744 57539593 59215482 60351726 61125383 63940485 65123022
6082F5123022J602324K424946K73424K450609R85566Q69602J466977J351332J807081
$$ 65123022 66725346 69150292 69423716 71874325 72859891 73729493 75196470 76547802 78354883
6073G8354883P21368K668575P83802J037497K220593O3721J532295M20841M712296
$$ 78354883 79076251 81744826 82528628 83566125 85786718 85850439 87382734 87803575 92515871
6064I2515871j97688J086694R31354K149474J584380R91760L504445J656838L44500
$$ 92515871 92318183 93404877 94336231 96485705 98070085 99061845 102566290 104223128 104567628
6055A04567628P09472J987773p64423L194572L79391J457740p83692n94594J459389
$$ 104567628 105277100 107264873 106500450 109695022 110074413 111532153 110748461 110153867 111613256
6046A11613256P60426O2784l69670j38596l56119k00551P50301k236350l37160
$$ 111613256 112373682 112436466 112066796 111928200 111572081 111371530 112121831 109885481 109548321
6037A09548321O22413j822055R66387j178213L2172j117660J667286j369342k02154
$$ 109548321 110170734 108348679 109315066 108136853 108169025 107051365 108718651 107349309 107147155
6028A07147155K49773J224645N67593o91812j564275N76947J133609o48247P14441
$$ 107147155 107396928 108621573 109189166 108497354 106933079 107510026 108643635 107995388 108709829
6019A08709829K12134J234564J076750L64883L580022J701829N56649O17539k4363
$$ 108709829 108921963 110156527 111233277 111598160 115178182 116880011 117436660 118054199 118029836
6010A18029836J511133j913215k52209j187189k490209o08402m55514j714175
$$ 118029836 119540969 117627754 117375545 116188356 113698147 113089745 112634231 110920056
6002A10920056k099109L33843r69871J672582j026083K017104K085301k82662
$$ 110920056 108820947 109154790 108184919 109857501 108831418 110848522 112933823 112651161
5994A12651161K914893m07935N011256J471245M467404L548711M096374N501481
$$ 112651161 115566054 115158119 120169375 121640620 126108024 129656735 133753109 139254590
5986A39254590P100115N081506M102332M218493L392799L976978n4111O24944
$$ 139254590 146354705 151436211 155538543 159757036 163149835 167126813 167072702 167697646
5978A67697646m14830k057152j531591l17349k341691K45364j862987O67818p78538
$$ 167697646 167282816 165225664 163694073 163376724 161035033 161280397 159417410 160085228 159306690
5969A59306690K161442J736725J224313M255826L210021K970672L808739L062339
$$ 159306690 161468132 163204857 164429170 168684996 171895017 174865689 178674428 181736767
5961A81736767L472264N663106P780302O714097N703111R479334R241922J4035199
$$ 181736767 185209031 190872137 198652439 205366536 211069647 220548981 229790903 243826102
5953B43826102J9614529K2732829L3296916L0138734J5500504m217584j6551984
$$ 243826102 263440631 286173460 319470376 349609110 365109614 360892030 344340046
5946C44340046j8021300j7844860j6090563j0633143p286087o067049l625106
$$ 344340046 326318746 308473886 292383323 281750180 274464093 268397044 264771938
5939B64771938k180276j252560k771934Q58712k897198o47498k149020N45095
$$ 264771938 262591662 261339102 258567168 259425880 256528682 255881184 253732164 254277259
5931B54277259r01889l08567m86903J45788M50558L337330N197577M342277L387218
$$ 254277259 253375370 253066803 252579900 252725688 253176246 256513576 261711153 266053430 269440648
5922B69440648l856288q864429j3031947j2512896p556809j0376026m879213l879690
$$ 269440648 265584360 256719931 243687984 231175088 223618279 213242253 208363040 204483350
5914B04483350m160551N20511l176958k494482j885300j363535k209480j238879
$$ 204483350 200322799 200843310 197666352 195171870 193286570 191923035 189713555 188474676
5906A88474676j630849j307068P40750m18289k0846J235714K930870R13786P482346
$$ 188474676 186843827 185536759 186277509 185859220 185838374 187074088 190004958 190918744 198401090
5897A98401090N717512J2362932K1674377J6968005K063888r156456j6511110
$$ 198401090 204118602 216481534 238155911 255123916 257187804 248031348 231520238
5890B31520238j5168952j3300240r825682o248130o836891l504520k336407k602615
$$ 231520238 216351286 203051046 193225364 186977234 180140343 176635823 174299416 171696801
5882A71696801j246647k807595L14299n91576J573704k155980K7136N94938j988835
$$ 171696801 170450154 167642559 167956858 167365282 168938986 166783006 166810142 167405080 165416245
5873A65416245J360955Q28020j497510p94628Q9953n55885J304953M91594J950615
$$ 165416245 166777200 167605220 166107710 165313082 165403035 164847150 166152103 166643697 168594312
5864A68594312P69728j28077L261797J102935K739373N91906L884128P01502Q70902
$$ 168594312 169364040 169235963 172497760 173600695 176340068 176931974 180816102 181517604 182388506
5855A82388506K312821j241960J724106m1807k224664m227935Q88796k836067
$$ 182388506 184701327 183459367 185183473 185141666 182917002 178689067 179577863 176741796
5847A76741796l149401l327944Q86801j695022o04428p91642j292600K307482
$$ 176741796 173592395 170264451 171151252 169456230 168851802 168060160 166767560 169075042
5839A69075042L47648j85005K483532K208725o54545L457393R05419L019781J465870
$$ 169075042 169422690 169237685 171721217 173929942 173275397 176732790 177638209 180657990 182123860
5830A82123860K936853O52690K131261N89928K195423R46077N948962K827160
$$ 182123860 185060713 185713403 187844664 188434592 190630015 191576092 197525054 200352214
5822B00352214L804353Q417587Q791813R608467M178947m438170o820882q184351
$$ 200352214 204156567 212574154 221365967 230974434 235153381 230715211 223894329 215709978
5814B15709978q728011p302514o725506m061430l795068k485714l256224p72628
$$ 215709978 206981967 199679453 192953947 188892517 185097449 182611735 179355511 178582883
5806A78582883r80914q11024j502083j132862L84042k260390k01658Q79465m063819
$$ 178582883 177601969 176790945 175288862 174156000 174540042 172279652 172077994 172957459 168893640
5797A68893640L08915l550659K68766R15934k031685k183134K0464l612157k1731
$$ 168893640 169202555 165651896 165920662 166836596 164804911 162621777 162642241 159030084 159008353
5788A59008353l475305J0206q07269j91087k073554O9205o38658n03875L47641
$$ 159008353 155533048 155543254 154735985 154544898 152471344 152540549 151901891 151398016 151745657
5779A51745657J209746K08413k71516M049796p31076L165685k838301j489844
$$ 151745657 152955403 153163816 152892300 156942096 156211020 159376705 156538404 155048560
5771A55048560j626768m534840l269798l680865j752398k583494l884302j493457
$$ 155048560 153421792 148886952 145617154 141936289 140183891 137600397 133716095 132222638
5763A32222638k497357r34065j180718j298965p93523j809278j372733P80240
$$ 132222638 129725281 128791216 127610498 126311533 125518010 123708732 122335999 123116239
5755A23116239p53524R26771k253777l85693j77275J4459R9757n03220q70266
$$ 123116239 122362715 123289486 121035709 120650016 120472741 120487200 120586957 120083737 119213471
5746A19213471R71615p26483L42380J406038K60873k181681K929436J35383M98151
$$ 119213471 120185086 119458603 119800983 121207021 121467894 119286213 122215649 122351032 122849183
5737A22849183k066108q84212J944078j390854J0992m09559N86714q73823J507770
$$ 122849183 120783075 119898863 121842941 120452087 120463079 120053520 120640234 119766411 121274181
5728A21274181M23533k044693L57950j252995J017139j605702J803241j481333
$$ 121274181 121697714 119653021 120010971 118757976 119775115 118169413 119972654 118491321
5720A18491321R32690L31358p16949K0769m85724Q97778k002474M04959Q1799
$$ 118491321 119424011 119755369 119038420 119059189 118573465 119471243 117468769 117873728 117955527
5711A17955527p50091l60730p18669J079796k155313K143129l934394J668760
$$ 117955527 117205436 116844706 116126037 117205833 115050520 117193649 113259255 114928015
5703A14928015k307664J09481r13206K41803j603012k90659k155298l43944k7744
$$ 114928015 112620351 112729832 111816626 112058429 110455417 110164758 108009460 107665516 107637772
5694A07637772j610192k214824M10282j084335l20637r96586j654766j97449j730110
$$ 107637772 106027580 103812756 104223038 103138703 102818066 101821480 100166714 99969265 98239155
5685I8239155J110307q35188n38810q51211j085053j106000r63942j94642j206357
$$ 98239155 99349462 98514274 97975464 97124253 96039200 94933200 93969258 93774616 92568259
5676I2568259l118931N65774k18993j525150j19190j382195q43132N54863k841052
$$ 92568259 89449328 90015102 89796109 88270959 88151769 86769574 85926442 86481305 83640253
5667H3640253q23233O6016k88406Q77484l151896n67514R25601k257321k15730
$$ 83640253 82817020 82883036 82594630 83472114 80320218 79752704 80678305 78420984 78205254
5658G8205254k393227J965432j960387K80011l17895j706210k10456j22521m3344
$$ 78205254 75812027 77777459 75817072 76097083 75779188 74072978 73862522 73740001 73696657
5649G3696657j192567J294854j581046j315538j41291L05185q71890p51508Q4903
$$ 73696657 72504090 73798944 72217898 70902360 70761069 71066254 70194364 69442856 69527759
5640F9527759l40433K31070l58167j64347J85311M5479J519875J271041j312575
$$ 69527759 69187326 69418396 69060229 68895882 69081193 69126672 70646547 71917588 70605013
5631G0605013K076888J625981K927885M460268Q184530N880618j164156k986894
$$ 70605013 72681901 74307882 77235767 81696035 89880565 95761183 94597027 91610133
5623I1610133o361416m826698k042751m012262j430639o87070r33965k418027
$$ 91610133 85248717 80422019 78379268 74367006 72936367 72249297 71315332 68897305
5615F8897305J31996l24838n6410M25733P93199j583041n51083M51387K15097
$$ 68897305 69029301 68704463 68648053 69073786 69866985 68283944 67732861 68184248 68399345
5606F8399345J009400J61899M7398O48595L343352j168289J688956J845576J352738
$$ 68399345 69408745 69570644 69618042 70266637 73609989 72441700 74130656 75976232 77328970
5597G7328970Q363K199473k709577K391142K681563n45497q731j86681j326487
$$ 77328970 77337333 79536806 76827229 79218371 81899934 81354437 81345706 81159025 79832538
5588G9832538J569649j946928O66168j093128j457188K98325P57234k08065Q79051
$$ 79832538 81402187 79455259 80121427 79028299 77571111 77869436 78626670 78418605 79297656
5579G9297656p76996L7626K471825O96922L15734K12283N710J868064j6232L47790
$$ 79297656 78520660 78558286 81030111 81727033 82042767 82255050 82260760 84128824 84112592 84460382
5569H4460382K062160J709579m84739j036162M60070R07744R04224p73694J039474
$$ 84460382 86522542 88232121 87747382 86711220 87171290 88079034 88983258 88209564 89249038
5560H9249038r22835l44306M77073r64758l84739M99356P24331n51350j214959
$$ 89249038 88326203 87981897 88458970 87494212 87109473 87608829 88333160 87781810 86566851
5551H6566851Q24906O1606J677803J115306R83634J955350r18921K268692r57050
$$ 86566851 87391757 87453363 89131166 90246472 91230106 93185456 92266535 94535227 93578177
5542I3578177n80837l2092j177109j449240J98417n02133j660871l72795k331072
$$ 93578177 92997340 92965248 91788139 90338899 90537316 90035183 88374312 88001517 85670445
5533H5670445M85551R85274j589228J99213j268530R7266o44357n86420K761737
$$ 85670445 86155996 87141270 85552042 85751255 84482725 84579991 83935634 83349214 86110951
5524H6110951J75813K135171L194207K489435L058112M17061k69980j298103n62448
$$ 86110951 86286764 88421935 91616142 94105577 97163689 97580750 97310770 96012667 95450219
5515I5450219J369213l212968L716345j811333j257712r5314Q65759j8132k088347
$$ 95450219 96819432 93606464 97322809 95511476 94253764 94158450 95024209 95006077 92917730
5506I2917730l43545J060233m18480Q38023r44794K49340R6310p77474K101107
$$ 92917730 92574185 93634418 93215938 94053961 93109167 93358507 93454817 92677343 94778450
5497I4778450r9487m73408J125968J021168r37220P84363K360764O39835l63579
$$ 94778450 94678963 94205555 95331523 96352691 95415471 96199834 98560598 99200433 98836854
5488I8836854K741032R39910r43732J266907r03098L110145M26618K404549n17759
$$ 98836854 101577886 102517796 101574064 102840971 101937873 105048018 105474636 107879185 107361426
5479A07361426L59352P91319J8695q51808n20780K049696j892928O38820j512459
$$ 107361426 107720778 108512097 108530792 107678984 107158204 109207900 107314972 107953792 106441333
5470A06441333J456854l087323K190089j768032j74264L14284O18503k451693
$$ 106441333 107898187 104810864 107000953 105232921 105058657 105372941 105991444 103539751
5462A03539751J179060n00989O15245j077300m33478M62972n25746j515602L6374
$$ 103539751 104718811 104217822 104833067 103755767 103322289 103785261 103259515 101743913 101780287
5453A01780287L1699r6461k368168m05979j882038K426555m141124O55924P7113
$$ 101780287 101811986 101715525 99347357 98941378 97059340 99485895 95344771 96000695 96077808
5444I6077808j982926O75036J153899j228555L678168K197227o87292l691030
$$ 96077808 94094882 94769918 95923817 94695262 98373430 100570657 99883365 96192335
5436I6192335r48972n749167j691411m78651k142738k388686k01204j579411J165371
$$ 96192335 95243363 89494196 87802785 87324134 85181396 82792710 82591506 81012095 82177466
5427H2177466j201756j383561L03469j249262j054j730307J352889k804329J3880
$$ 82177466 80975710 79592149 79895618 78646356 78645302 76914995 78267884 75463555 75477435
5418G5477435l39945K61841j569263K20246J95482q58196n60053j3187j596290
$$ 75477435 75137490 75399331 73830068 74050314 74245796 73387600 72827547 72814360 71218070
5409G1218070L14834j313116o05085j109206J076503k42989P65848j304752k001371
$$ 71218070 71532904 70219788 69614703 68505497 69582000 69339011 70104859 68800107 66798736
5400F6798736k14115o89394j01314j874743L87544K156706k447196j269969M15664
$$ 66798736 66584621 65895227 65793913 63919170 64306714 66463420 64016224 62746255 63161919
5391F3161919j813213J353476K8496P0197j091483n61838p99539j075101Q76229
$$ 63161919 61348706 62702182 62730678 62800875 61709392 61147554 60348015 59272914 60149143
5382F0149143k68540J226224o01926k81505p15143J215563r29722j135235n87586
$$ 60149143 59880603 61106827 60504901 60223396 59508253 60723816 59794094 58658859 58071273
5373E8071273n60044J011104j996065J203583j121132J22165J181669k384348
$$ 58071273 57511229 58522333 56526268 57729851 56608719 56730884 57912553 55528205
5365E5528205J308582j023783j08656K265212l500921k430Q80256Q68657J123342
$$ 55528205 56836787 55813004 55704348 57969560 54468639 54466209 55346465 56215122 57338464
5356E7338464j702626J197666j483168K115362J1540J06803M04991m30311J080903
$$ 57338464 55635838 56833504 55350336 57465698 57477238 57584041 57989032 57558721 58639624
5347E8639624N54715j520472l59270m25704o06416r73287R26765p07290q85111
$$ 58639624 59194339 57673867 57314597 56888893 56282477 55309190 56235955 55528665 54643554
5338E4643554Q13539L13749j417888J480661j237265J839371k458301K984052
$$ 54643554 55457093 55770842 54352954 55833615 54596350 56435721 53977420 56961472
5330E6961472N89813o59012R19595R66109j971248R71274L34575p965j419575
$$ 56961472 57551285 56892273 57811868 58777977 56806729 57778003 58112578 58104613 56685038
5321E6685038N09782k15130j945930p9650j954419p0636j040619j252465O009
$$ 56685038 57194820 56979690 55033760 54954110 52999691 52929055 51888436 50635971 50641980
5312E0641980p43064j840706o31038L64289n97720n20491j476980J34493J134978
$$ 50641980 49898916 48058210 47427172 47791461 47193741 46673250 45196270 45330763 46465741
5303D6465741k737032O11343j349924N29298q75095j683067l56356j372291k379136
$$ 46465741 43728709 44340052 42990128 43519426 42644331 40961264 40604908 39232617 36853481
5294C6853481K531347k280985j991961j14191m01873j331475j80473p00421m6721
$$ 36853481 39384828 37103843 35111882 34997691 34595818 33264343 33083870 32383449 32336728
5285C2336728j404522K032473k280386r62800Q45759Q2588m73952k427363P67470
$$ 32336728 30932206 32964679 30684293 29721493 30567252 30649840 30175888 27748525 28515995
5276B8515995P35611k04343r33863r15466Q73474J148745k151751N33504K18815
$$ 28515995 29251606 29047263 28113400 27197934 28071408 29220153 27068402 27601906 27820721
5267B7820721j440585j57082k92639L99620J847636k451320J71630j064587J242946
$$ 27820721 26380136 26223054 25930415 26330035 28177671 25726351 25897981 24833394 26076340
5258B6076340O45236j206925J431731k106627J299451j493002J485388j506303
$$ 26076340 26721576 25514651 26946382 24839755 26139206 24646204 26131592 24625289
5250B4625289k82630J136301n83081k60070J7756P16009n00186Q21980l98657
$$ 24625289 24342659 25478960 24895879 24635809 24653565 25369574 24869388 25691368 25292711
5241B5292711j537756J235886p96653M05601K58315j338486J510286J269993j824698
$$ 25292711 23754955 24990841 24194188 24599789 24858104 23519618 25029904 26299897 24475199
5232B4475199R61919k0418n40531P26786J437327j502374J242018j077362O46365
$$ 24475199 25437118 25416700 24876169 25602955 27040282 25537908 26779926 25702564 26348929
5223B6348929j963144J692457j253038J561816j440542K32324j908953J797350
$$ 26348929 24385785 26078242 24825204 26387020 24946478 25178802 23269849 25067199
5215B5067199J31097m22496K58275j69289Q22669j82712j017349J987960O34661
$$ 25067199 25198296 24775800 25034075 24864786 25687455 25504743 24487394 26475354 27110015
5206B7110015m68483L44899l79162J730165J696854j556087N03027K57174r79666
$$ 27110015 26641532 26986431 26607269 28337434 30034288 28478201 28981228 29238402 28258736
5197B8258736J368511k97740j633665K281568l583344J131881j0546k43376l42064
$$ 28258736 29627247 29329507 27695842 29977410 26394066 27525947 27515401 27272025 26929961
5188B6929961N00437O15972o67453J98696j92848L56646N40871n69309J143824
$$ 26929961 27430398 28046370 27378917 27577613 27384765 27741411 28282282 27712973 28856797
5179B8856797L65838N03247p71167j31841J652103M15516q49695J538920j547058
$$ 28856797 29222635 29725882 28954715 28822874 30474977 30890493 30040798 31579718 30032660
5170C0032660M716002j527278P90432J003732j141115J678302k569701J46460
$$ 30032660 34748662 33221384 34011816 35015548 33874433 35552735 32983034 33129494
5162C3129494K52781j65839j577327J094011L21111M71723J370848j016323M75034
$$ 33129494 33382275 33216436 31639109 32733120 33054231 33525954 34896802 33880479 34355513
5153C4355513J485263K88146J48507J142398J74876j54408J651243L46715J612427
$$ 34355513 35840776 36128922 36277429 37419827 37594703 37440295 39091538 39438253 41050680
5144D1050680j673088K465755j209897L126238J233491O77052J212674J376074
$$ 41050680 39377592 41843347 40633450 43759688 44993179 45670231 46882905 48258979
5136D8258979q45591L395092M74497J152249j25628K318761J810885j117256r3938
$$ 48258979 47413388 50808480 51282977 52435226 52309598 54628359 56439244 55321988 55228050
5127E5228050N86638J129911R07616M87707N00018p79418K155975q62185J22861
$$ 55228050 55814688 56944599 57852215 58339922 58839940 58060522 60216497 59354312 59477173
5118E9477173R28251K082181j64136R3137K143794K036623R40111O01122J991213
$$ 59477173 60405424 62487605 62323469 62416606 64560400 66597023 67537134 68138256 70129469
5109G0129469J842241L050856J749866L214638L874558J447893L394886J065320
$$ 70129469 71971710 75022566 76772432 79987070 83861628 85309521 88704407 89769727
5101H9769727M424142L97917J712869L1700q88437R23895j25746j327473R26263
$$ 89769727 94193869 94591786 96304655 96336355 95447918 96371813 96246067 94918594 95844857
5092I5844857k280810p73996o41148j505085J238111k073218N34448p9803M72694
$$ 95844857 93564047 92790051 92148903 90643818 91881929 89808711 90343159 90263356 90736050
5083I0736050j167044J679323L233241J391908L51211M506967O47735K555358
$$ 90736050 89569006 91248329 94481570 95873478 96224689 100731656 101379391 103934749
5075A03934749K468906K702288L922763Q37532K679983J196399P22574j342542
$$ 103934749 106403655 109105943 113028706 113866238 116546221 117742620 118465194 117122652
5067A17122652J135057k221768j489123m794294j44565l878116j880834k113883
$$ 117122652 118257709 116035941 114546818 109752524 109607959 105729843 103849009 101735126
5059A01735126k451628o72366l201976k99293j096030k107872q63279p14360O35793
$$ 101735126 99283498 98611132 95409156 95109863 94013833 91905961 91042682 90328322 90964115
5050I0964115M83177K35488l26393J50110J614804M80685L465258k5758P23356
$$ 90964115 91447292 91682780 91356387 91506497 93121301 93601986 97067244 97041486 97764842
5041I7764842o29532p92192K254116k653064Q31337l473517j857022m90000l438855
$$ 97764842 97135310 96343118 98597234 95944170 96775507 93301990 91444968 90954968 87516113
5032H7516113j680014j852043j720863k034979j992825j873379j573136j637691
$$ 87516113 85836099 83984056 82263193 80228214 78235389 76362010 74788874 73151183
5024G3151183j191755k54621m67586k397215r43350O18306j505316O68249m69543
$$ 73151183 71959428 71704807 71237221 68840006 67896656 68514962 67009646 67677895 67208352
5015F7208352k490305k20617K86475R5436q34159k224827J943983l695917J171622
$$ 67208352 64718047 64497430 64783905 64879341 64045182 61820355 63764338 60068421 61240043
5006F1240043k6443j200130p11518j636024p31354p48097j250250j102130j106445
$$ 61240043 61213600 60013470 59301952 57665928 56934574 56186477 54936227 53834097 52727652
4997E2727652m15421j929075P96153l05477k109431j042793R69356j879551p73137
$$ 52727652 52312231 50383156 51179309 50873832 48764401 47721608 48690964 46811413 46038276
4988D6038276J86266p77138p04068p5833J854L79788q18188j277204M1643R8003
$$ 46038276 46224542 45447404 44743336 44667503 44669357 45049145 44230957 42953753 42995396 43093399
4978D3093399j214116J05864k274781O08899k92773M07478j406115j553602Q11498
$$ 43093399 41879283 41985147 39710366 40319265 40026492 40433970 39027855 37474253 38285751
4969C8285751m24252M86023P83435K44235j644826J11695j63765J464449L16010
$$ 38285751 37861499 38347522 39130957 39375192 37730366 37842061 37678296 39142745 39458755
4960C9458755r8619J720836l41180J621087R51131L796332O483563J3552185L0949784
$$ 39458755 39360136 41080972 40739792 42360879 43312010 47108342 53591905 67144090 98093874
4951I8093874K9410832R474629j4110766k1635431j8401739j6983037j1843766
$$ 98093874 127504706 136979335 122868569 101233138 82831399 65848362 54004596
4944E4004596o844551m969979m206204l741466k20355k285878m3856j261902K07896
$$ 54004596 47160045 42190066 37983862 34242396 34022041 31736163 31692307 30430405 30638301
4935C0638301n53580j248108M40541j148509j041547N64630o9551j49464j848884
$$ 30638301 30084721 28836613 29277154 28128645 27087098 27651728 27582177 27432713 25583829
4926B5583829l06077L13882J210278p54777J7326n0153r62770Q68913j245926
$$ 25583829 25277752 25591634 26801912 26047135 26064461 26014308 25051538 25920451 24674525
4917B4674525J244120p91552m10222O08171k6962j003598P37197N10309j122057
$$ 24674525 25918645 25127093 24716871 25325042 25298080 24294482 25031679 25541988 24419931
4908B4419931J469649k354483N86416j082071K281168j120766K287908r11304
$$ 24419931 25889580 23535097 24121513 23039442 25320610 24199844 26487752 25576448
4900B5576448Q76088m90536m42670p13361J10314p662J136060j524481J258663
$$ 25576448 26452536 25962000 25519330 24805969 24916283 24908621 26044681 24520200 25778863
4891B5778863P45702J158109k425249K096590k219804L302901r70811j355056
$$ 25778863 26524565 27682674 25257425 27354015 25134211 28437112 27466301 26111245
4883B6111245J257190K64112J269064J430796j726133O97591Q53779j00902J341202
$$ 26111245 27368435 27632547 28901611 30332407 28606274 29303865 30157644 30056742 31397944
4874C1397944j790892J640373N67501P14191j338453P87605J060519k12960M98765
$$ 31397944 29607052 31247425 31814926 32529117 31190664 31978269 33038788 32825828 33324593
4865C3324593k62086J971671k64604J690529L97267m58673R59138M35540J481666
$$ 33324593 33062507 35034178 34769574 36460103 36857370 36398697 37357835 37793375 39275041
4856C9275041R40775J154519J553853N9040J733017j117998L257288L63965K921403
$$ 39275041 40215816 41370335 42924188 42983228 44716245 43598247 46855535 47219500 50140903
4847E0140903k00323J970508Q64651p04634L470560J15435J635031K216100J242751
$$ 50140903 49940580 51911088 52775739 52071105 55541665 55657100 57292131 59508231 60750982
4838F0750982N11308K687371Q58023J609340R06856J880278J565621K306110P02425
$$ 60750982 61262290 63949661 64807684 66417024 67323880 69204158 70769779 73075889 73778314
4829G3778314K693517J839850L377797J376209L144307J853074J25166K022772
$$ 73778314 76471831 78311681 81689478 83065687 86209994 88063068 88188234 90211006
4821I0211006J660415J542927K316387L725447J602864L502797K583744L226680
$$ 90211006 91871421 93414348 95730735 99456182 101059046 104561843 107145587 110372267
4813A10372267K225786K875463L333990K907991L756719K186452M085330K747997
$$ 110372267 112598053 115473516 118807506 121715497 125472216 127658668 131743998 134491995
4805A34491995L975114K164276M006408K049984M632649K615527M661854N324179
$$ 134491995 138467109 140631385 144637793 146687777 151320426 153935953 158597807 163921986
4797A63921986L415362N851248O370701N634501O660181N358236O806617P132939
$$ 163921986 167337348 173188596 179559297 185193798 191853979 197212215 204018832 211151771
4789B11151771O060754P434979O846990N189630L733553O882216O440495K561322
$$ 211151771 217212525 224647504 231494494 236684124 240417677 247299893 253740388 256301710
4781B56301710N310122L051251N596809L742594N526931M707176K505390L844891
$$ 256301710 261611832 264663083 270259892 274002486 279529417 284236593 286741983 290586874
4773B90586874M010049M097769J841993L412200Q00361M176951J376778K734519
$$ 290586874 294596923 298694692 300536685 303948885 304749246 308926197 310302975 313037494
4765C13037494o17386L557782n17008Q79338k402662j624874l177966n488875
$$ 313037494 312420108 315977890 315460882 316340220 313937558 312312684 309134718 303645843
4757C03645843m204772l882792l680038n898461m680107m676323n256915m037891
$$ 303645843 299441071 295558279 291878241 285979780 281299673 276623350 271366435 267328544
4749B67328544n979431n581526n056245m881162p061703m495672n269207n520105
$$ 267328544 261349113 255767587 250711342 245830180 238768477 234272805 229003598 223483493
4741B23483493o339249m826805p095154l776670p852472n625860m975188l336237
$$ 223483493 217144244 212317439 205222285 201445615 193593143 187967283 182992095 179655858
4733A79655858o611475n754753o243448n169661l961577n467705m559409m623261
$$ 179655858 173044383 167289630 161046182 155876521 151914944 146447239 141887830 137264569
4725A37264569l196906o068784k768290m312137l385449m955272k001257l393229
$$ 137264569 134067663 127998879 125230589 120918452 117533003 112577731 110576474 107183245
4717A07183245l502996l133423k811417l099592k457819j923234l032886k184768
$$ 107183245 103680249 100546826 97735409 94635817 92177998 90254764 87221878 85037110
4709H5037110j833666m641260j005006l235560Q33161k988443k404271k295473
$$ 85037110 83203444 78562184 77557178 74321618 75154779 72166336 69762065 67466592
4701F7466592n88618l858277j367456k692988j102440J16304j806110p01677j871661
$$ 67466592 66877974 63019697 61652241 58959253 57856813 57973117 56167007 55465330 53593669
4692E3593669k822116p99381k263131K33122k749850k073959J044218j923918
$$ 53593669 50771553 49972172 47709041 47942163 45192313 43118354 44162572 42238654
4684D2238654j272112J07792k636573K68957j544735K02403k452384j073047J171065
$$ 42238654 40966542 41074334 38437761 38706718 37161983 37364386 34912002 33838955 35010020
4675C5010020j830590Q89912J02384k262943k39269o98136p148q4229r50863K60739
$$ 35010020 33179430 34069342 34171726 31908783 31669514 30971378 30964230 30880001 29929138 30189877
4665C0189877j860093j088860L63495r17943l29569n83889j232034Q83294q96428
$$ 30189877 28329784 27240924 27604419 26686476 26356907 25773018 24540984 25424278 24527850
4656B4527850j40596M1454j254811j787452J368380N81086k343076J290548J48306
$$ 24527850 24387254 24428708 23173897 21386445 22754825 23335911 20992835 22283383 22431689
4647B2431689j416682n95577k36550j019040P69941j114419M91771J135392l298756
$$ 22431689 21015007 20419430 20182880 19163840 19933781 18819362 19311133 20446525 17147769
4638A7147769J750735Q2415k171967J101525M36377N59340k486336J312397q4532
$$ 17147769 18898504 18980919 16808952 17910477 18346854 18906194 16419858 17732255 17647723
4629A7647723n1204j418703L10946J82325o36921K90218p62463M27126O03079
$$ 17647723 17596519 16177816 16488762 16671087 16034166 16324384 15561921 15989047 16592126
4620A6592126k145887R36290j002307J879577p08182j214781P48258K9475j697363
$$ 16592126 14446239 15382529 14380222 16259799 15551617 14336836 15085094 15114569 13417206
4611A3417206M85577P10206o47059R89862q61205k52644R14241k372774N61291
$$ 13417206 13902783 14612989 13965930 14955792 14094587 13841943 14756184 12383410 12944701
4602A2944701N95751q84284J063727j267074k23684O86587M6499k093648K903342
$$ 12944701 13540452 12656168 13719895 12452821 12229137 12915724 12962223 10868575 13771917
4593A3771917k011681J056646j40230j131615M51589N17335j213624J321312j877931
$$ 13771917 11760236 12816882 12676652 11545037 11996626 12513961 11300337 12621649 10743718
4584A0743718j93737J406672p47281m5598L06500m61899J87228k69738J97488
$$ 10743718 10549981 11956653 11209372 11163774 11470274 11008375 11195603 10925865 11123353
4575A1123353j03232l18137R79639Q17j740272Q00742K35396j688911J111429
$$ 11123353 11020121 10701984 11681623 11682440 9942168 10742910 10978306 9289395 10400824
4566A0400824J963855j150482j66290m93634r46716R6009J588748M02058j570274
$$ 10400824 12364679 11214197 11047907 10554273 9607557 9703566 11292314 11694372 10124098
4557A0124098l64041n0545O85706k03735J30921j49478O9279J74753J505309j264683
$$ 10124098 9760057 9709512 10395218 10191483 10322404 10172926 10242205 10416958 11922267 10657584
4547A0657584m99526N50763O12621j553850m1615L03970K20213P24042k577585
$$ 10657584 10158058 10708821 11321442 9767592 9725977 10029947 10250160 10974202 8396617
4538H396617J281283j05856o95992m06283J295473o74450J314166j939660m02838
$$ 8396617 9677900 9572044 8876052 8469769 9765242 9090792 10404958 8465298 8062460
4529H062460Q89541L16985J96342N8756o27569L62220m30763J139082R62234k035311
$$ 8062460 8952001 9268986 9465328 9524084 8896515 9258735 8827972 9967054 10929288 8893977
4519H893977J039344P13640j80205j354815M48517n4121k48502j653511N86472
$$ 8893977 9933321 10646961 10466756 9111941 9560458 9506337 9257835 7604324 8190796
4510H190796N66733m88590k37104J89979M50101p84472m6675p55636J806078J40445
$$ 8190796 8757529 8268939 8031835 8221814 8671915 7887443 7840768 7085132 8891210 9031655
4500I031655n99874J342605k290540J366598L46657M80064K68962j703614K063666
$$ 9031655 8431781 9774386 7483846 8850444 9197101 9677165 9946127 8242513 10306179
4491A0306179m89357j956891l5674M02114j280589J004187n53055P16901j343701
$$ 10306179 9816822 7859931 7824257 8226371 6945782 7949969 7396914 8113815 6770114
4482F770114R70360O47189j007205p17090J78196O36128r43460J319432p24348
$$ 6770114 7740474 8387663 7380458 6663368 6841564 7477692 6534232 7853664 7129316
4473G129316P58233j624379j12687Q07340j058016J406735j214675j412265J836969
$$ 7129316 7887549 6263170 6150483 6957823 5899807 7306542 6091867 4679602 6516571
4464F516571J357194n5925m16114p82855j143019J634335L07181k20932k112418
$$ 6516571 7873765 7817840 7401726 6618871 5475852 7110187 7417368 7196436 5084018
4455E084018M54866O85721N87599j386081J966949k752241J538618M79687O98642
$$ 5084018 5538884 6224605 6812204 5426123 7393072 4640831 6179449 6659136 7357778
4446G357778k266304J986899k344948P65920R66876p40422J571705j709731J910019
$$ 7357778 5091474 7078373 4733425 5499345 6466221 5725799 7297504 5587773 7497792
4437G497792o80979j981807J639530J238403J37823j549360P69630j470595K291068
$$ 7497792 6816813 4835006 6474536 7712939 7850762 6301402 7071032 5600437 7891505
4428G891505j601674O05842R91167j251768J88769m68173N13371J625456j862717
$$ 7891505 6289831 6895673 7886840 6635072 6823841 6355668 6869039 8494495 6631778
4419F631778L24297p67409K594028j481771L18974j049972o18525J275135R19544
$$ 6631778 6956075 6188666 8782694 7300923 7619897 6569925 5951400 7226535 8146079
4410H146079j128033O35456j84563N66651q13040j239594J420287J180918l69696
$$ 8146079 7018046 7653502 7468939 8035590 7222550 5982956 7403243 8584161 8214465
4401H214465l26739l56921P32368M64809M16368l2241p53987M33542K182521n85461
$$ 8214465 7887726 7530805 8263173 8727982 9144350 9112109 8358122 8791664 10974185 10388724
4391A0388724j224650R92414m11008p1728p86591M04160J043099l442385P02094
$$ 10388724 9164074 10156488 9745480 9673752 8887161 9291321 10334420 6892035 7594129
4382G594129J01398J292325l02308k99127L72592J62668P35681J557638r57256
$$ 7594129 7695527 8987852 8685544 8386417 8759009 8921677 9657358 11214996 10257740
4373A0257740M58092l2530j563052J599353k48450J81204j1342J323096m42094
$$ 10257740 10715832 10683302 9120250 10719603 10471153 10652357 10641015 11964111 11522017
4364A1522017J406677P41057O0433q39891J969934K8788L46448J779720M760365
$$ 11522017 12928694 13669751 13730184 12890293 14860227 14889015 15235463 17015183 21775548
4355B1775548O516837J0777068J122992m429189k979146p210236l426184j159433
$$ 21775548 28292385 39069453 40192445 35763256 32784110 25573874 22147690 20988257
4347B0988257k525291j621515n74307j176327J099594P25586J056508j299789
$$ 20988257 18462966 16841451 16267144 15090817 16190411 16915997 17972505 16672716
4339A6672716Q47804n96944R27808k15646J748318P48190K000937R33220J690866
$$ 16672716 17520520 16923576 17851384 17635738 19384056 20132246 22133183 23066403 24757269
4330B4757269J501718L500281P254744J2048893J9729725J1032431o016048q234347
$$ 24757269 26258987 29759268 37014012 49062905 68792630 79825061 73809013 65574666
4322F5574666p711655n960836j715650k68371M63933J708872L46707l156592l596552
$$ 65574666 57863011 51902175 50186525 49918154 50382087 52090959 52437666 49281074 45684522
4313D5684522l694102l675143n501491m362101j165957k822948r07948q20289
$$ 45684522 41990420 38315277 32813786 28451685 27285728 24462780 23554832 22734543
4305B2734543j568168j102427L35035p69387j584684L875665M186916P010184
$$ 22734543 21166375 20063948 20398983 19629596 18044912 21920577 26107493 33117677
4297C3117677O310210l141397l263566n398827o508846k238563k899291o60382
$$ 33117677 39427887 36286490 33022924 27624097 21115251 18876688 15977397 15317015
4289A5317015l132395L74001j483192l68762o79225n24950O48251j946529J383103
$$ 15317015 12184620 12558621 11075429 10706667 10027442 9502492 10150743 8204214 9587317
4280I587317K89480k069478P32501P04081k450999k78705N03301j006998J89729
$$ 9587317 9876797 7807319 8539820 9243901 6792902 6514197 7017498 6010500 6200229
4271F200229J317023r46348k88523Q10536k89911m47813J094857j24287l82656
$$ 6200229 7517252 6570904 6282381 7092917 6803006 6355193 7450050 7325763 6943107
4262F943107m15039j098912Q69622M63704o38083J3562p48489j061926J662649
$$ 6943107 6528068 5429156 6298778 6762482 6124399 6137961 5389472 4327546 5990195
4253E990195m81175j005943J821459n87164r38343L82066L25582L14009j019532
$$ 5990195 5509020 4503077 6324536 5737372 4799029 5181095 5506677 5820686 4801154
4244D801154J73292K55096K45817N93697j086054J254556j324082k118399J267382
$$ 4801154 4974446 5229542 5475359 6069056 4983002 6237558 4913476 2795077 4062459
4235D062459K1240Q06854m00801o62900P1569J491364j623025L65710Q27792l58617
$$ 4062459 4083699 4890553 4489752 3826852 3898421 5389785 3766760 4132470 4960262 4601645
4225D601645J138092j271896n34771k5315K81848J8847L55557J231638j334445
$$ 4601645 5739737 4467841 3933070 3907755 4189603 4208450 4564007 5795645 4461200
4216D461200m3578j610825O49785J516080n64977j000739J854579j370390J278996
$$ 4461200 4417622 2806797 3456582 4972662 4407685 3406946 5261525 3891135 5170131
4207E170131j717872R92710J83285P01064k876450Q21532J113971o76600q9311
$$ 5170131 3452259 4444969 4628254 5329318 2452868 3274400 4388371 3711771 3622460
4198C622460O49581o35052l73808M75612J813227j046944o79299p77523k20127
$$ 3622460 4272041 3636989 3263181 3738793 5552020 4505076 3825777 3048254 2828127
4189B828127J924526j529274k48711J571064j335260K448996j034163o30663O3765
$$ 2828127 4752653 3223379 2974668 4545732 3210472 5659468 4625305 3994642 4058407
4180D058407n46737q12691Q45085Q78372L84040m16467K84756k32389O9733r52388
$$ 4058407 3511670 2698979 3544064 4422436 4806476 4390009 4674765 4442376 4512109 3559721
4170C559721J17274L02719j299756J21370L27220K75588q85172J45118L17369
$$ 3559721 3676995 3979714 2679958 2801328 3128548 3404136 2518964 2664082 2981451
4161B981451J243670j662704J385631L91772J119351l125344Q39358o81149m10363
$$ 2981451 4225121 2562417 3948048 4339820 5459171 2333827 3173185 2492036 2081673
4152B081673J630437j743643J212972n6121l97251m91581O03810J97312r09919
$$ 2081673 3712110 1968467 3181439 3125318 2728067 2236486 2840296 3037608 2127689
4143B127689J366609P36542j110954J99497q47875M88339J145845J78812O00810
$$ 2127689 3494298 4230840 3119886 3319383 2471508 2959847 4105692 4284504 4885314
4134D885314j656666Q48735K03965j064397n40714J583489j338070q55891J119896
$$ 4885314 3228648 4077383 4281348 3216951 2676237 4259726 2921656 2065765 3185661
4125C185661o24188J97402K910P40286q10259J059118j040289J41192J886350
$$ 3185661 2561473 2758875 2761785 3502071 2691812 3750930 2710641 2851833 4738183
4116D738183j780375O87636k18629k023068J756276l30949J09110M2436o55361
$$ 4738183 2957808 3645444 3426815 1403747 3160023 2829074 2938184 2980620 2325259
4107B325259m34890K194349q66510r5050r84918J430215m02617p07870J944236
$$ 2325259 1890369 4084718 3218208 3123158 2138240 3568455 3165838 2457968 4402204
4098D402204k496785R42876o72790L26612O17679j494241j02158J570116n71872
$$ 4402204 1905419 2848295 2175505 2502117 3119796 1625555 1523397 3093513 2521641
4089B521641n30875J826913k09825j287820j117263J549040M19267j024303J359267
$$ 2521641 1990766 3817679 3607854 2320034 1202771 2751811 3171078 2146775 3506042
4080C506042j166138N80452j40030j62336L49585l30424J278734K67852Q02781
$$ 3506042 2339904 2920356 2780326 2617990 2967575 2637151 3915885 4183737 4986518
4071D986518k81797p78101j984395J742310j937351J992001M60296j323963J332746
$$ 4986518 4704721 3926620 1942225 3684535 1747184 3739185 4199481 2875518 4208264
4062D208264j584103K13057J274886j890616J392656P8090m56333j61603O92359
$$ 4208264 2624161 2837218 4112104 2221488 3614144 3692234 3235901 3074298 3766657
4053C766657k37640K068807k880081N77786j64215l80231J202912J383502j423378
$$ 3766657 3529017 5597824 2717743 3295529 3131314 2751083 3953995 5337497 3914119
4044C914119m95587J594362P18300j079830j8761J61752k59761P19345j09141
$$ 3914119 3418532 5012894 5731194 4651364 4632603 4794355 4534594 5253939 5144798
4035E144798q83763O02185j035241J325250k72442j361532Q02997p6491J350943
$$ 5144798 4261035 4863220 3827979 5153229 4880787 3519255 4322252 4245761 5596704
4026E596704n83307K973460j005124l09886N94080j072175J213812O07857k469133
$$ 5596704 5013397 7986857 6981733 6671847 7265927 6193752 7407564 8015421 5546288
4017E546288K241629k136448M08967j090633n52874M953j227374Q37565n45955
$$ 5546288 7787917 5651469 6060436 4969803 4416929 4421882 3194508 4032073 3486118
4008C486118J246077p11557P66889n27296J63151M15457j540855R32637n79700
$$ 3486118 4732195 4020638 4787527 4260231 4423382 4838839 3297984 4230621 3650921
3999C650921p51696K134224J683996j354489P87250l43714j604749p5467Q80307
$$ 3650921 2899225 5033449 6717445 5362956 6150206 5806492 4201743 4126276 5006583
3990E006583l51403K02968j223343N24403j176714p47650J436481j899316M98188
$$ 5006583 4655180 4858148 3634805 4159208 2982494 2234844 3671325 1772009 2270197
3981B270197J132827p7437j023269n48178K84999r86410J721420J124763p79990
$$ 2270197 3403024 3325587 2302318 1754140 2039139 1052729 2774149 3898912 3118922
3972C118922n22149K65943r2459l13256J29090K25850p06571J967927j624507
$$ 3118922 2596773 2862716 2770257 2457001 2586091 2811941 2105370 4073297 2448790
3963B448790o30707J037616j289770J155791l13875P36152j549982M66903R61991
$$ 2448790 1818083 2855699 1565929 2721720 2407845 3143997 1594015 2060918 3022909
3954C022909J375998k294247m96534L32128n75748J050117k61067o7248l81164
$$ 3022909 4398907 2104660 1608126 1940254 1364506 2414623 2153556 2086308 1705144
3945A705144J81329j094305P93418L83497k52553M84233j481050Q40076m7157
$$ 1705144 1886473 792168 1585586 1969083 1716530 2200763 719713 1559789 1512632
3936A512632O96057j041859O45134P07429o72894k05600P1034R70943j404090
$$ 1512632 2208689 1166830 1811964 2519393 1846499 1640899 1711933 2682876 1278786
3927A278786K26915M19449K24698l52229j156116p9114q64402J652982Q09312
$$ 1278786 1505701 1925150 2149848 1797619 641503 562389 -302013 1350969 2160281
3918B160281k75601l93569k52289q13378M35555J145609r88734N7354O17992l07169
$$ 2160281 1884680 1491111 1238822 425444 860999 2006608 1017874 1075228 1693220 1386051
3908A386051K71933p42485J961504j115921O21634j083738M31748J291167j386163
$$ 1386051 1657984 915499 2877003 1761082 2382716 1298978 1730726 3021893 1635730
3899A635730n08253J400249q34020O47705K76133j077876q04220Q11631J172351
$$ 1635730 1127477 2527726 1693706 2341411 2617544 1539668 735448 1547079 2719430
3890B719430j39371j81154k021126K613867j706979J553789j70377J92350j032809
$$ 2719430 2580059 2398905 377779 2991646 1284667 2838456 2668079 2860429 1827620
3881A827620m65690R29078j398061M25336p22894J274637J094156j636730J061636
$$ 1827620 1361930 2291008 892947 1318283 595389 1870026 2964182 1327452 2389088
3872B389088j45254j002588L23685o45903M73802J130054p5562k22008L19994
$$ 2389088 2243834 1241246 1564931 919028 1392830 2522884 2447322 2225314 2545308
3863B545308K605287k881121L81444m83012J572189k286761J335180p85721K01534
$$ 2545308 5150595 2269474 2650918 2167906 3740095 1453334 2788514 2002793 2204327
3854B204327J071609j671997o55117K375560k614266j64049K025540j812736K238510
$$ 2204327 3275936 1603939 948822 3324382 710116 546067 2571607 758871 2997381
3845B997381j345058o36900r3577R78048J271399n12361k044695J935904j270671
$$ 2997381 1652323 1015423 921846 1899894 3171293 2658932 614237 2550141 1279470
3836A279470O67266o25233N15494J148693j601313J100033M8616j829430M18241
$$ 1279470 1946736 1321503 1836997 2985690 1384377 2484410 2533026 703596 1121837
3827A121837P09087m7354n17414o31177K49800L52102J285477p60378k07128j538788
$$ 1121837 1830924 1783570 1266156 634979 884779 1236881 2522358 1761980 1554852 16064
3817A6064J806790m11629j545290J084532K16590R17531j246886J460886j299493
$$ 16064 1822854 1411225 -134065 950467 1167057 2084588 837702 2298588 999095
3808I99095Q39255Q25214k22161j158631o73847R82485k58973P1670J596989k651413
$$ 999095 1838350 2663564 2441403 1282772 608925 1591410 1332437 1404107 3001096 349683
3798C49683O94304J78541o9391q11371q37865J967739o33324j8043J968748k079847
$$ 349683 1043987 1222528 1153137 341766 -496099 1471640 838316 820273 2789021 709174
3788G09174J219741j316656j2761j06162J678915m93408j686200m4003J126737
$$ 709174 1928915 612259 599498 493336 2172251 1678843 -7357 -51360 1075377
3779A075377o92610k47959J598609q99568J489253q48871j16902J063051q57924
$$ 1075377 382767 134808 1733417 833849 2323102 1474231 1357329 2420380 1562456
3770A562456P80967K49991j299250j141455J246640J239157j019717J8378M6638
$$ 1562456 2343423 2593414 1294164 152709 1399349 2638506 1618789 1637167 1683805
3761A683805r13043J918268j398740P03060j769921L1427P24432J202920j362999
$$ 1683805 770762 2689030 1290290 1993350 223429 254856 979288 2182208 819209
3752H19209M74874R4247Q33049q88065K73328J388951j458574P00007j446138
$$ 819209 1294083 1388330 2221379 1333314 1606642 2995593 1537019 2237026 790888
3743G90888N34674N51276K17894N76292j114449J101030q07746j279627k65901
$$ 790888 1325562 1876838 2094732 2671024 1556575 2657605 1849859 570232 304331
3734C04331J449434o33468J710596j470475K5302P45155j571106M6443K346626
$$ 304331 1753765 1120297 2830893 1360418 1385720 2130875 559769 606212 2952838
3725B952838k464916O62239k80296K890610j081315l02773k7749j288009J240384
$$ 2952838 487922 1150161 869865 3760475 2679160 2376387 2348638 1060629 2301013
3716B301013j223067J34508N2285Q33784k373850P50216R96868j470179J564071
$$ 2301013 1077946 1212454 1264739 2098523 -275327 474889 1471757 1578 1565649
3707A565649m88742J56714q98229J528570l50797L02182J11267j054591K06900
$$ 1565649 1076907 1233621 335392 1863962 1513165 1815347 1926614 872023 1078923
3698A078923O77981N93057m72798n37846K90701n00575M47217J47430j80958j387098
$$ 1078923 1756904 2349961 1877163 1339317 1630018 1129443 1576660 1724090 1543132 156034
3688A56034P93020J262543j473982J367419m00423L82077o67616K475799k718660
$$ 156034 949054 2211597 737615 2105034 1704611 2086688 1419072 3894871 1176211
3679A176211K854871k801213J859976R71870q47916J801032k327849M12483o56532
$$ 1176211 4031082 1229869 3089845 4061715 3213799 5014831 2686982 3099465 2442933
3670B442933J05925k16693j288809M0104j220285R19567k70357J685197l72258
$$ 2442933 2548858 2332165 1043356 1083460 -136825 782742 512385 2197582 1825324
3661A825324l7344Q66550R19975k030789N60464m8356o62910L6994R10844o05565
$$ 1825324 1787980 2654530 3574505 1543716 2104180 2055824 1392914 1429908 2340752 1735187
3651A735187j77468p39033J16562J555751j751147R84569R10374j948510K24467
$$ 1735187 1557719 818686 935248 2490999 739852 1724421 2634795 686285 910752
3642I10752J36280J152796j087030J130210m64733l03126R60235m62885O07551
$$ 910752 1047032 2199828 1112798 2243008 1778275 1475149 2435384 1972499 2580050
3633B580050j402588L88313p90627J41424N94646O31300n59015n29146K222844
$$ 2580050 1177462 1565775 775148 916572 1511218 2142518 1583503 1054357 3277201
3624C277201j264218p85978J436886K58411K01699m66173M6458q23279O72946
$$ 3277201 2012983 1227005 2663891 2922302 3124001 2657828 2704286 1881007 2553953
3615B553953m90246n88429r87480Q83084n50487p14953K023578l273020K617136
$$ 2553953 2063707 1475278 487798 1370882 820395 105442 2129020 -1144000 1473136
3606A473136m73149O69668j126466J099100L54003j016652N69211l91302n553
$$ 1473136 999987 1669655 543189 1642289 1996292 979640 1548851 1157549 1151996
3597A151996q10207J099889O60900J98950r41418O85156r41197L16753q99408
$$ 1151996 341789 1441678 2102578 2301528 1360110 2045266 1104069 1420822 521414
3588E21414J881773l196313K521399r58576L917811l979325J53724J744188o73939
$$ 521414 2403187 -793126 1728273 769697 4687508 708183 861907 2606095 1932156
3579A932156l35346j504786K188660n36842K44392k58743M70515m2998l85648
$$ 1932156 1596810 92024 2280684 1743842 1988234 1729491 2200006 2157008 1771360
3570A771360Q44627k741530K016531r4639R17658k08103l439j148784J408997
$$ 1771360 2615987 -125543 1890988 1796349 2714007 2505904 2502465 1353681 2762678
3561B762678j027639J08075R68543N45179Q72006j005362O23501j774231L88787
$$ 2762678 1735039 1843114 2811657 3356836 4228842 3223480 3846981 2072750 2461537
3552B461537K05159k6230L48601k436522M62649J599828K268055j636856J023587
$$ 2461537 2666696 2640466 2989067 552545 1015194 2615022 4883077 3246221 4269808
3543D269808P76278L64390r63637p80863k05846k70318R29797m88819j165451
$$ 4269808 5046086 5410476 4446839 3665976 3460130 3189812 4119609 3630790 2465339
3534B465339O13376J027554Q5125K461660L931044J510218j277688r31354j722577
$$ 2465339 3078715 4106269 4191394 6653054 10584098 12094316 10816628 9885274 8162697
3525H162697k096336j664680J047973r87635k66178j458521J095424m94061Q33538
$$ 8162697 6066361 4401681 5449654 4462019 4195841 2737320 3832744 3338683 4172221
3516D172221k367790J469047O36562M60626R64606J121026K294951j635473j202452
$$ 4172221 1804431 3273478 3910040 4370666 5335272 6456298 8751249 7115776 5913324
3507E913324r50685J420216l327775p5543J63526l71698j69901j000527J165384
$$ 5913324 4962639 6382855 3055080 2979537 3143063 2771365 2601464 1600937 2766321
3498B766321l76518J82819q8075J044087k042107J744165o7719P992j280591L60736
$$ 2766321 2389803 2572622 2484547 3528634 1486527 3230692 3162973 3170965 1890374 2251110
3488B251110j581519J276778j684594K983626l39682j974371M96587J042401p41837
$$ 2251110 669591 1946369 261775 3245401 2905719 931348 1427935 2470336 1728499
3479A728499J381637k48959J379132p23166r31687L7759K00366q78589J019032
$$ 1728499 3110136 2861177 4240309 3517143 2585456 2623215 2823581 1944992 2964024
3470B964024o44416N24586K45751J109818j038707k63648j45130m09400N91740
$$ 2964024 2319608 2844194 3089945 4199763 3161056 2897408 2752278 2342878 2934618
3461B934618j507039K048422j396782J602868J047083k486369R26527J129492
$$ 2934618 1427579 3476001 2079219 3682087 4729170 2242801 3169328 4298820
3453D298820J109324P69332J349509m46715j000119O50202j076672k29415J256654
$$ 4298820 5408144 6177476 7526985 7080270 6080151 6730353 5653681 5424266 6680920
3444F680920j320415J054641k388499J602886p0753P39303J7556K63986P05687
$$ 6680920 5360505 6415146 4026647 5629533 5558780 6298083 6315639 6579625 7285312
3435G285312P02539j201027J498989M77115J756064J858245L703215O220987J2135306
$$ 7285312 7987851 6786824 8285813 8762928 10518992 12377237 16080452 22301439 34436745
3426C4436745J1888711j386496o552879p603269r140002l392526n312964k491540
$$ 34436745 46325456 44938960 38386081 30782812 21642810 18250284 12937320 10445780
3418A0445780l911160J881304k146915l96557N65317q01516j19996j50823j038757
$$ 10445780 6534620 8415924 6269009 5872452 6437769 5636253 5516257 5365434 4326677
3409D326677R84135j331594O04856J79126l91889l56423R09590M05037o62370
$$ 4326677 5310812 3979218 4584074 4763200 4371311 4014888 4924478 5329515 4667145
3400D667145P03324m32582k45338L79887L3917k038808J388986l85081k87358
$$ 4667145 5370469 4937887 4692549 5072436 5106353 3067545 4456531 4071450 3784092
3391C784092P47486j71653R16567N70051j220190p74469J854602P42523j00008
$$ 3784092 4531578 4359925 5276492 5846543 4626353 3851884 5706486 6449009 6349001
3382F349001q34229K19316j20031L07340J313289R36265j834642p40929P71337
$$ 6349001 5514772 5734088 5614057 5921397 7234686 8170951 6336309 5595380 6366717
3373F366717J343575k244722j42815J116987q2701j364591R05255r42385J711757
$$ 6366717 7710292 5465570 5322755 6439742 6357041 4992450 5897705 4955320 6667077
3364F667077O46415q3634L47898J1274q74158N50860j306592J447251l80140K396017
$$ 6667077 7313492 7229858 7577756 7589030 6714872 7265732 5959140 7406391 7026251 9422268
3354I422268j043101L36883J033321n75084n84750J318271m20209J868198K240785
$$ 9422268 8379167 8716050 9749371 9174287 8589537 9907808 9487599 11355797 13596582
3345A3596582j2019K287343P82105J173592K221758K256122N488675M910306J016544
$$ 13596582 13584563 15871906 16654011 17827603 20049361 22305483 27794158 32704464 33721008
3336C3721008O66124Q55405K179313K733652K288261O851060J1038586J2614759
$$ 33721008 34387132 35242537 37421850 40155502 42443763 49294823 60333409 72948168
$$ [...]
##END NTUPLES=NMR SPECTRUM
##END=
