##TITLE=abcd
##JCAMPDX= 6.0         $$ Bruker NMR JCAMP-DX V2.0
##DATA TYPE= NMR SPECTRUM
##DATA CLASS= NTUPLES
##ORIGIN= UXNMR, Bruker Analytische Messtechnik GmbH
##OWNER= root
$$ XWIN-NMR		Version 3.5
$$ Fri Mar  6 17:36:35 2026 Russian Standard Time (UT+4h)  servis@DPX200
##.OBSERVE FREQUENCY= 200.131235884673
##.OBSERVE NUCLEUS= ^1H
##.ACQUISITION MODE= SIMULTANEOUS
##.ACQUISITION SCHEME= undefined
##.AVERAGES= 32
##.DIGITISER RES= 18
##SPECTROMETER/DATA SYSTEM= spect
##.PULSE SEQUENCE= zg
##.SOLVENT NAME= CDCl3
##.SHIFT REFERENCE= (INTERNAL, CDCl3, 0, 16.4885)
##AUDIT TRAIL= $$ (NUMBER, WHEN, WHO, WHERE, WHAT)
$$ ##TITLE= Audit trail, XWIN-NMR		Version 3.5
$$ ##JCAMPDX= 5.01
$$ ##ORIGIN= Bruker BioSpin GmbH
$$ ##OWNER= servis
$$ F:\spectra/data/av/nmr/H1/1/pdata/1/auditp.txt
$$ ##AUDIT TRAIL=  $$ (NUMBER, WHEN, WHO, WHERE, WHAT)
(   1,<2026-03-06 17:35:43.42 +0400>,<servis>,<DPX200>,
      <created by zg, POWCHK disabled, PULCHK disabled
       configuration hash MD5:
       00 E9 B6 7A A2 85 ED C7 34 08 36 98 17 FE 4E 26
       data hash MD5: 32K
       CD AB 0C C3 D4 B0 8C FD A0 00 06 10 42 78 85 D1>)
(   2,<2026-03-06 17:36:16.95 +0400>,<servis>,<DPX200>,
      <Start of raw data processing
       efp BC_mod = 2 LB = 0.05 FT_mod = 6 PKNL = 1 PHC0 = -254.5951 PHC1 = -0.898437 SI = 16K 
       data hash MD5: 16K
       D1 26 8E 30 A2 82 96 93 E2 64 8D 71 CC 6D C8 75>)
$$ ##END=
$$ 
$$ hash MD5
$$ 36 37 E1 32 44 54 F8 33 85 9F A3 D2 5D 53 C0 21
##$RELAX= 
##$RELAX= 
##$RELAX= 
##$RELAX= 
##$RELAX= 
##$RELAX= 
##$RELAX= 
##$RELAX= 
$$ Bruker specific parameters
$$ --------------------------
##$DU= <F:\spectra>
##$EXPNO= 1
##$NAME= <H1>
##$PROCNO= 1
##$TYPE= <nmr>
##$USER= <av>
##$AMP= (0..31)
100 100 100 100 100 100 100 100 100 100 100 100 100 100 100 100 100 100 
100 100 100 100 100 100 100 100 100 100 100 100 100 100 
##$AQSEQ= 0
##$AQ_mod= 1
##$AUNM= <au_zg>
##$AUTOPOS= <>
##$BF1= 200.13
##$BF2= 200.13
##$BF3= 200.13
##$BF4= 200.13
##$BF5= 500.13
##$BF6= 500.13
##$BF7= 500.13
##$BF8= 500.13
##$BYTORDA= 1
##$CFDGTYP= 0
##$CFRGTYP= 5
##$CHEMSTR= <none>
##$CNST= (0..31)
1 1 145 1 1 1 1 1 1 1 1 1 1 1 1 1 1 1 1 1 1 1 1 1 1 1 1 1 1 1 1 1 
##$CPDPRG= <>
##$CPDPRG1= <>
##$CPDPRG2= <>
##$CPDPRG3= <>
##$CPDPRG4= <mlev>
##$CPDPRG5= <mlev>
##$CPDPRG6= <mlev>
##$CPDPRG7= <mlev>
##$CPDPRG8= <mlev>
##$CPDPRGB= <>
##$CPDPRGT= <>
##$D= (0..31)
0 2 0 0 0 0 0 0 0 0.06 0 0 0 0 0 0 0.0002 0 0 0 0 0 0 0 0 0 0 0 0 0 0 
0 
##$DATE= 1772804143
##$DBL= (0..7)
120 120 120 120 120 120 120 120 
##$DBP= (0..7)
150 150 150 150 150 150 150 150 
##$DBP07= 0
##$DBPNAM0= <>
##$DBPNAM1= <>
##$DBPNAM2= <>
##$DBPNAM3= <>
##$DBPNAM4= <>
##$DBPNAM5= <>
##$DBPNAM6= <>
##$DBPNAM7= <>
##$DBPOAL= (0..7)
0.5 0.5 0.5 0.5 0.5 0.5 0.5 0.5 
##$DBPOFFS= (0..7)
0 0 0 0 0 0 0 0 
##$DE= 6
##$DECBNUC= <off>
##$DECIM= 32
##$DECNUC= <off>
##$DECSTAT= 4
##$DIGMOD= 1
##$DIGTYP= 9
##$DL= (0..7)
0 120 120 120 120 120 120 120 
##$DP= (0..7)
150 150 150 150 150 150 150 150 
##$DP07= 0
$$ [...]
##$SUBNAM4= <"">
##$SUBNAM5= <"">
##$SUBNAM6= <"">
##$SUBNAM7= <"">
##$SUBNAM8= <"">
##$SUBNAM9= <"">
##$SW= 20.6817932712277
##$SWIBOX= (0..15)
0 0 3 0 0 0 0 0 0 0 0 0 0 0 0 0 
##$SW_h= 4139.07284768212
##$TD= 32768
##$TD0= 1
##$TE= 0
##$TE2= 300
##$TE3= 300
##$TEG= 300
##$TL= (0..7)
0 120 120 120 120 120 120 120 
##$TP= (0..7)
150 150 150 150 150 150 150 150 
##$TP07= 0
##$TPNAME0= <>
##$TPNAME1= <>
##$TPNAME2= <>
##$TPNAME3= <>
##$TPNAME4= <>
##$TPNAME5= <>
##$TPNAME6= <>
##$TPNAME7= <>
##$TPOAL= (0..7)
0.5 0.5 0.5 0.5 0.5 0.5 0.5 0.5 
##$TPOFFS= (0..7)
0 0 0 0 0 0 0 0 
##$TUNHIN= 0
##$TUNHOUT= 0
##$TUNXOUT= 0
##$USERA1= <user>
##$USERA2= <user>
##$USERA3= <user>
##$USERA4= <user>
##$USERA5= <user>
##$V9= 5
##$VALIST= <valist>
##$VCLIST= <CCCCCCCCCCCCCCC>
##$VD= 0
##$VDLIST= <DDDDDDDDDDDDDDD>
##$VPLIST= <PPPPPPPPPPPPPPP>
##$VTLIST= <TTTTTTTTTTTTTTT>
##$WBST= 1024
##$WBSW= 30
##$XGAIN= (0..3)
0 0 0 0 
##$XL= 0
##$YL= 0
##$YMAX_a= 984047
##$YMIN_a= -867085
##$ZGOPTNS= <>
##$ZL1= 120
##$ZL2= 120
##$ZL3= 120
##$ZL4= 120
##$ABSF1= 0
##$ABSF2= 0
##$ABSG= 0
##$ABSL= 0
##$ALPHA= 0
##$AQORDER= 0
##$ASSFAC= 0
##$ASSFACI= 0
##$ASSFACX= 0
##$ASSWID= 0
##$AUNMP= <proc_1d>
##$AZFE= 0.1
##$AZFW= 0.1
##$BCFW= 0
##$BC_mod= 2
##$BYTORDP= 0
##$COROFFS= 0
##$CY= 18.4799938201904
##$DATMOD= 1
##$DC= 0
##$DFILT= <>
##$DTYPP= 0
##$F1P= 9.9274215381318
##$F2P= -0.165520771350173
##$FCOR= 1
##$FTSIZE= 16384
##$FT_mod= 6
##$GAMMA= 0
##$GB= 0
##$INTBC= 1
##$INTSCL= 4.127829e-11
##$ISEN= 128
##$LB= 0.05
##$LEV0= 0
##$LPBIN= 0
##$MAXI= 10000
##$MC2= 0
##$MEAN= 0
##$ME_mod= 0
##$MI= 50
##$NCOEF= 0
##$NC_proc= -5
##$NLEV= 6
##$NOISF1= 3.799351
##$NOISF2= 2.8
##$NSP= 0
##$NTH_PI= 0
##$NZP= 0
##$OFFSET= 16.48848
##$PC= 4
##$PHC0= -254.5951
##$PHC1= -0.898437
##$PH_mod= 1
##$PKNL= yes
##$PPARMOD= 0
##$PSCAL= 4
##$PSIGN= 0
##$REVERSE= no
##$SF= 200.130005582386
##$SI= 16384
##$SIGF1= 3
##$SIGF2= 2
##$SINO= 400
##$SIOLD= 16384
##$SREGLST= <1H.CDCl3>
##$SSB= 0
##$STSI= 16384
##$STSR= 0
##$SW_p= 4139.07284768211
##$SYMM= 0
##$S_DEV= 0
##$TDeff= 32768
##$TDoff= 0
##$TI= <>
##$TILT= no
##$TM1= 0
##$TM2= 0
##$TOPLEV= 0
##$USERP1= <user>
##$USERP2= <user>
##$USERP3= <user>
##$USERP4= <user>
##$USERP5= <user>
##$WDW= 1
##$XDIM= 16384
##$YMAX_p= 391411242
##$YMIN_p= -710357
$$ End of Bruker specific parameters
$$ ---------------------------------
##NTUPLES= NMR SPECTRUM
##VAR_NAME=  FREQUENCY,     SPECTRUM/REAL,   SPECTRUM/IMAG
##SYMBOL=    X,             R,               I
##VAR_TYPE=  INDEPENDENT,   DEPENDENT,       DEPENDENT
##VAR_FORM=  AFFN,          ASDF,            ASDF
##VAR_DIM=   16384,         16384,           16384
##UNITS=     HZ,            ARBITRARY UNITS, ARBITRARY UNITS
##FACTOR=    0.252644378177508, 1,           1
##FIRST=     3299.83951724647, 0,            0
##LAST=      -839.233330435636, 0,           0
##MIN=       -839.233330435636, -710357,     0
##MAX=       3299.83951724647, 391411242,    0
$$ Real data points
##PAGE= N=1
##DATA TABLE= (X++(R..R)), XYDATA
$$ [...]
$$ plain form
7636 -554168 -476892 -463821 -399551 -466600 -416443 -436254 -416450 -545290 -506658 -335590 -443953
7625 -443953 -407088 -500157 -410722 -472983 -472672 -424706 -505454 -310191 -442278 -535773 -399740
7614 -399740 -437011 -439973 -547176 -544664 -399096 -498345 -398608 -440284 -485729 -556929 -502978 -454587
7602 -454587 -590585 -547327 -459338 -447469 -417688 -417325 -441074 -432415 -416001 -486155 -496587 -452890
7590 -452890 -496255 -469588 -463135 -443327 -466842 -524612 -490245 -421962 -515813 -459729 -462611 -463154
7578 -463154 -397819 -530892 -475999 -506213 -396330 -405489 -355238 -425664 -446478 -449945 -338594
7567 -338594 -353189 -428551 -418740 -389732 -405131 -396698 -478113 -500305 -479097 -460886 -412380 -452847
7555 -452847 -448779 -379497 -326824 -404934 -454452 -400341 -383108 -417485 -476447 -278773 -404086
$$ packed form
7636e54168P7276J3071O4270o7049N0157j9811J9804j28840L8632J71068j08363
7625d43953L6865r3069Q9435o2261L11M7966q0748J95263j32087r3495J36033
7614c99740l7271k962j07203K512J45568r9249R9737m1676m5445p1200N3951M8391
7602d54587j35998M3258Q7989J1869K9781L63k3749Q659J6414p0154j0432M3697
7590d52890m3365K6667O453J9808k3515n7770L4367O8283r3851N6084k882n43
7578d63154O5335j33073N4893l0214J09883r159N0251p0426k0814l467J11351
7567c38594j4595p5362R811K9008j5399Q433q1415k2192K1208J8211M8506m0467
7555d52847M068O9282N2673p8110m9518N4111J7233l4377n8962J97674j25313
$$ plain form
7544 -404086 -501288 -461376 -420296 -431146 -378026 -394440 -438584 -459751 -309560 -478843 -347334
7533 -347334 -399034 -312310 -427201 -386180 -330758 -416475 -380358 -367163 -440565 -515554 -376833
7522 -376833 -437067 -375496 -475798 -373167 -305476 -488887 -464941 -433671 -304935 -404850 -416664
7511 -416664 -375293 -346175 -389910 -437651 -419596 -391892 -349636 -393194 -401363 -415740 -380610 -296951
7499 -296951 -395831 -418822 -356729 -309670 -372767 -389710 -487835 -460503 -477151 -391477 -508676
7488 -508676 -469460 -376977 -379559 -414537 -384919 -389878 -481874 -351131 -425894 -425878 -398370 -398214 -362375
7475 -362375 -393598 -368573 -447879 -475590 -421980 -329938 -467278 -413535 -462070 -386311 -353775
7464 -353775 -459423 -454255 -384849 -449036 -387838 -375947 -514903 -399470 -344590 -424690 -391430
$$ packed form
7544d04086r7202L9912M1080j0850N3120j6414m4144k1167J50191j69283J31509
7533c47334n1700Q6724j14891M1021N5422q5717L6117J3195p3402p4989J38721
7522c76833o0234O1571j00302J02631O7691j83411K3946L1270J28736r9915j1814
7511d16664M1371K9118m3735m7741J8055K7704M2256m3558q169j4377L5130Q3659
7499b96951r8880k2991O2093M7059o3097j6943r8125K7332j6648Q5674j17199
7488e08676L9216R2483k582l4978K9618m959r1996J30743p4763J6K7508J56L5839
7475c62375l1223K5025p9306k7711N3610R2042j37340N3743m8535P5759L2536
7464c53775j05648N168O9406o4187O1198J1891j38956J15433N4880q0100L3260
$$ plain form
7453 -391430 -478728 -419917 -459760 -447430 -464911 -329612 -333631 -458580 -419618 -460426 -426569
7442 -426569 -466384 -496708 -506501 -400230 -424696 -498235 -437503 -383437 -459431 -421673 -483005 -452456
7430 -452456 -481189 -362838 -491398 -475828 -414514 -400821 -467070 -367975 -498442 -445016 -442390
7419 -442390 -417808 -329272 -421327 -430548 -398639 -458006 -384342 -473766 -375088 -391562 -421100 -518784
7407 -518784 -464316 -448500 -505882 -457753 -424929 -494397 -398111 -460812 -468074 -484271 -529497 -529297
7395 -529297 -438681 -517794 -534707 -479611 -394350 -488500 -431044 -364087 -485137 -459571 -361838
7384 -361838 -467763 -477935 -478273 -450209 -373624 -489026 -536574 -392350 -410878 -470145 -478053 -524075
7372 -524075 -460507 -348713 -345809 -415118 -406338 -486474 -395723 -431139 -447253 -543441 -438660 -474414
$$ packed form
7453c91430q7298N8811l9843J2330j7481J35299m019j24949L8962m0808L3857
7442d26569l9815l0324r793J06271k4466p3539O0732N4066p5994L7758o1332L0549
7430d52456k8733J18351j28560J5570O1314J3693o6249R9095j30467N3426K626
7419d42390K4582Q8536r2055r221L1909n9367P3664q9424R8678j6474k9538r7684
7407e18784N4468J5816n7382M8129L2824o9468R6286o2701p262j6197m5226K00
7395e29297R0616p9113j6913N5096Q5261r4150N7456O6957j21050K5566R7733
7384c61838j05925j0172l38K8064P6585j15402m7548J44224j8528n9267p908m6022
7372e24075O3568J11794K904o9309Q780q0136R0751l5416j6114r6188J04781l5754
$$ plain form
7360 -474414 -483763 -406014 -334996 -373901 -494441 -476335 -402306 -346467 -463050 -352107 -378543
7349 -378543 -491281 -481635 -387224 -370001 -470459 -459154 -416820 -379704 -533949 -494420 -433182
7338 -433182 -466220 -505441 -394082 -397167 -392441 -462873 -429156 -500191 -325353 -470253 -398376
7327 -398376 -344632 -373824 -498530 -359059 -361530 -369374 -494889 -424565 -596091 -612401 -502391
7316 -502391 -407085 -460122 -500560 -463018 -527935 -466789 -498841 -456730 -490621 -473949 -413675 -542433
7304 -542433 -499848 -475760 -505150 -403408 -433078 -464970 -504512 -540808 -537326 -471460 -404281 -531078
7292 -531078 -483077 -545192 -465033 -381483 -407024 -445145 -385730 -446169 -471804 -433023 -450338 -421823
7280 -421823 -384163 -517964 -525081 -549168 -510266 -471680 -437709 -416212 -390164 -478293 -470255 -484699
$$ packed form
7360d74414r349P7749P1018l8905j20540J8106P4029N5839j16583J10943k6436
7349c78543j12738R646R4411J7223j00458J1305M2334L7116j54245L9529O1238
7338d33182l3038l9221J11359l085M726p0432L3717p1035J74838j44900P1877
7327c98376N3744k9192j24706J39471k471p844j25515P0324j71526j6310J10010
7316e02391R5306n3037m0438L7542o4917O1146l2052M2111l3891J6672O0274j28758
7304e42433M2585K4088k9390J01742k9670l1892l9542l6296L482O5866O7179j26797
7292e31078M8001o2115Q0159Q3550k5541l8121N9415o0439k5635L8781j7315K8515
7280d21823L7660j33801p117k4087L8902L8586L3971K1497K6048q8129Q038j4444
$$ plain form
7268 -484699 -521221 -519603 -387469 -405885 -377249 -455106 -514108 -433422 -405672 -409112 -420797 -329831
7256 -329831 -386562 -462210 -447999 -455912 -444183 -485832 -372848 -477007 -355286 -341851 -438495
7245 -438495 -358013 -313156 -358772 -328856 -370719 -361947 -398175 -486602 -501275 -439860 -426281 -381315
7233 -381315 -373229 -423915 -437199 -305818 -301380 -392562 -450260 -429747 -534964 -466778 -389754 -415679
7221 -415679 -402455 -468426 -422068 -431328 -393993 -376534 -320536 -387636 -420419 -451207 -370533 -331818
7209 -331818 -430270 -381572 -432552 -379384 -428383 -394840 -381603 -514792 -424388 -397572 -406818 -377263
7197 -377263 -453411 -336923 -375517 -427984 -390620 -400449 -455928 -334762 -405146 -392793 -432756
7186 -432756 -424904 -366274 -437757 -446395 -376568 -458433 -450120 -440837 -444678 -461874 -452029 -449013 -480024
$$ packed form
7268d84699l6522J618J32134j8416K8636p7857n9002Q0686K7750l440j1685R0966
7256c29831n6731p5648J4211p913J1729m1649J12984j04159J21721J3435r6644
7245d38495Q0482M4857m5616K9916m1863Q772l6228q8427j4673O1415J3579M4966
7233c81315Q086n0686j3284J31381M438r1182n7698K0513j05217O8186P7024k5925
7221d15679J3224o5971M6358r260L7335J7459N5998o7100l2783l0788Q0674L8715
7209c31818r8452M8698n0980N3168m8999L3543J3237j33189R0404K6816r246K9555
7197c77263p6148J16488l8594n2467L7364r829n5479J21166p0384J2353l9963
7186d32756P852N8630p1483q638O9827q1865Q313R283l841j7196R845L016l1011
$$ plain form
7173 -480024 -396729 -491495 -398634 -373447 -359865 -421271 -298112 -348254 -368318 -405312 -355881
7162 -355881 -379102 -443452 -292573 -452312 -372179 -425125 -472684 -348111 -396802 -476910 -317401
7151 -317401 -335297 -349275 -425933 -538986 -355149 -413474 -431955 -374026 -396322 -458514 -336983
7140 -336983 -439852 -401697 -388609 -460061 -362845 -367765 -412150 -485644 -460487 -442128 -448202 -447868
7128 -447868 -459622 -364703 -475782 -477289 -466489 -509648 -442057 -472106 -369814 -369926 -453062 -518152
7116 -518152 -415552 -433902 -425180 -523010 -443112 -434192 -472180 -416232 -448956 -333659 -382907 -490438
7104 -490438 -435544 -446762 -422815 -404270 -495175 -358801 -412108 -418467 -412700 -415539 -512297 -387242
7092 -387242 -398817 -423365 -444168 -353575 -408839 -401663 -484806 -355881 -407485 -483491 -427900 -371730
$$ packed form
7173d80024Q3295r4766R2861K5187J3582o1406J23159n0142k0064l6994M9431
7162c55881k3221o4350J50879j59739Q0133n2946m7559J24573m8691q0108J59509
7151c17401j7896j3978p6658j13053J83837n8325j8481N7929k2296o2192J21531
7140c36983j02869L8155J3088p1452R7216m920m4385p3494K5157J8359o074L34
7128d47868j1754R4919j11079j507J0800m3159O7591l0049J02292j12q3136o5090
7116e18152J02600j8350Q722r7830P9898Q920l7988N5948l2724J15297m9248j07531
7104d90438N4894j1218K3947J8545r0905J36374n3307o359N767k839r6758J25055
7092c87242j1575k4548k0803R0593n5264P176q3143J28925n1604p6006N5591N6170
$$ plain form
7080 -371730 -375958 -442833 -358531 -380825 -434839 -450875 -402558 -375485 -346047 -381319 -405142 -360877
7068 -360877 -355315 -481222 -354316 -432047 -435647 -387212 -319110 -425173 -365453 -466680 -450359
7057 -450359 -527060 -377424 -380262 -434151 -401488 -430855 -471263 -404984 -397772 -445811 -403119 -442184
7045 -442184 -378170 -446401 -346438 -390927 -402276 -333323 -321337 -351837 -463468 -395997 -443408
7034 -443408 -376458 -368048 -489515 -392212 -424226 -391494 -497079 -417753 -372804 -387578 -423917
7023 -423917 -361318 -381174 -307770 -381509 -350119 -384906 -353895 -308515 -439171 -448671 -376546 -364588
7011 -364588 -314667 -423171 -347741 -442470 -352040 -461482 -421822 -469449 -416432 -430462 -424246
7000 -424246 -318180 -388992 -341405 -415403 -445259 -293282 -321609 -417034 -406001 -369255 -447439
$$ packed form
7080c71730m228o6875Q4302k2294n4014j6036M8317K7073K9438l5272k3823M4265
7068c60877N562j25907J26906p7731l600M8435O8102j06063N9720j01227J6321
7057d50359p6701J49636k838n3889L2663k9367m0408O6279P212m8039M2692l9065
7045d42184O4014o8231R9963m4489j1349O8953J1986l0500j11631O7471m7411
7034d43408O6950Q410j21467R7303l2014L2732j05585P9326M4949j4774l6339
7023d23917O2599j9856P3404p3739L1390l4787L1011M5380j30656r500P2125J1958
7011c64588M9921j08504P5430r4729R0430j09442L9660m7627N3017j4030O216
7000d24246J06066p0812M7587p3998k9856J51977k8327r5425J1033L6746p8184
$$ plain form
6989 -447439 -300446 -424330 -381614 -358493 -404404 -396033 -380839 -388875 -453650 -414812 -340971 -376376
6977 -376376 -304817 -342589 -357881 -328294 -379664 -300499 -506522 -403685 -460421 -296214 -341768
6966 -341768 -316301 -377709 -425391 -348170 -312194 -376899 -420855 -325375 -391692 -384628 -266187 -333146
6954 -333146 -414712 -368367 -287731 -340428 -270569 -316190 -355592 -283506 -416314 -419127 -428752 -386511
6942 -386511 -416405 -344015 -261191 -379375 -385923 -374251 -309023 -405860 -406177 -306873 -403346 -426613
6930 -426613 -366837 -426966 -401807 -424530 -407067 -347475 -322848 -422294 -435802 -312396 -406092
6919 -406092 -357103 -343427 -306150 -391454 -329440 -362087 -498163 -360588 -408477 -379103 -365150
6908 -365150 -383796 -402362 -367914 -323447 -361564 -374282 -368204 -214997 -421498 -374185 -350470
$$ packed form
6989d47439J46993j23884M2716K3121m5911Q371J5194q036o4775L8838P3841l5405
6977c76376P1559l7772j5292K9587n1370P9165k06023J02837n6736J64207m5554
6966c41768K5467o1408m7682P7221L5976o4705m3956R5480o6317P064J18441o6959
6954c33146q1566M6345Q0636n2697O9859m5621l9402P2086j32808k813r625M2241
6942c86511k9894P2390Q2824j18184o548J1672O5228r6837l17R9304r6473k3267
6930d26613N9776o0129K5159k2723J7463N9592K4627r9446j3508J23406r3696
6919d06092M8989J3676L7277q5304O2014l2647j36076J37575m7889K9374J3953
6908c65150j8646j8566L4448M4467l8117j2718O078J53207k06501M7313K3715
$$ plain form
6897 -350470 -385018 -375920 -412727 -449962 -276840 -411598 -299218 -400816 -333184 -424325 -335111
6886 -335111 -296792 -399777 -336215 -341687 -388413 -409036 -461763 -346021 -337903 -395049 -277707
6875 -277707 -372280 -334805 -351390 -337279 -329545 -289337 -362948 -456725 -430388 -439976 -391775 -325198
6863 -325198 -466672 -446365 -324557 -332701 -383342 -356653 -412666 -343927 -371035 -320692 -401487
6852 -401487 -443949 -464037 -385061 -344529 -395396 -330037 -467462 -349613 -326645 -276441 -340857
6841 -340857 -302881 -312922 -391260 -279017 -394256 -314406 -302151 -272308 -387493 -293498 -297997
6830 -297997 -257001 -392532 -292349 -336232 -259608 -287949 -372492 -309600 -371053 -337859 -281768
6819 -281768 -322711 -285608 -325971 -375468 -238144 -326484 -319151 -338414 -305932 -321431 -281734 -192908
$$ packed form
6897c50470l4548R098l6807l7235J73122j34758J12380j01598O7632r1141Q9214
6886c35111L8319j02985O3562n472m6726k0623n2727J15742Q118n7146J17342
6875b77707r4573L7475j6585J4111P734M0208p3611r3777K6337r588M8201O6577
6863c25198j41474K0307J21808q144n0641K6689n6013O8739k7108N0343q0795
6852d01487m2462k0088P8976M0532n0867O5359j37425J17849K2968N0204o4416
6841c40857L7976j0041p8338J12243j15239P9850J2255K9843j15185R3995m499
6830b97997M0996j35531J00183m3883P6624k8341q4543O2892o1453L3194N6091
6819b81768m0943L7103m0363m9497J37324q8340P333j9263L2482j5499L9697Q8826
$$ plain form
6807 -192908 -251322 -118616 -304306 -154610 -236383 -123167 -148483 -262101 -270109 -327292 -269323
6796 -269323 -269969 -264537 -217348 -228307 -172803 -131429 -192634 -178047 -205577 -173500 -160443 -152860
6784 -152860 -229317 -220725 -266362 -311274 -263081 -285217 -221861 -194958 -256942 -262436 -121848 -220190
6772 -220190 -237322 -225851 -242759 -177766 -178655 -202098 -234495 -205127 -184461 -219271 -160051 -154258
6760 -154258 -185317 -225514 -175644 -224993 -81900 -166541 -149481 -156143 -212455 -214854 -101629 -148879
6748 -148879 -173498 -188082 -139047 -137556 -108830 -124686 -122744 -141944 -22743 -40237 73822 109674
6736 109674 11428 -79654 19493 59218 -9905 -9598 -65316 -108675 -74703 -130492 -43474 -123786
6724 -123786 -80796 -160043 -72187 -33645 -13607 -84464 -15591 -76038 -11257 26978 1307 -22907
$$ packed form
6807a92908n8414J32706j85690J49696q1773J13216k5316j13618q008n7183N7969
6796b69323o46N432M7189j0959N5504M1374o1205J4587k7530L2077J3057P583
6784a52860p6457Q592m5637m4912M8193k2136O3356K6903o1984n494J40588r8342
6772b20190j7132J1471j6908O4993q89k3443l2397K9368K0666l4810N9220N793
6760a54258l1059m0197M9870m9349J43093q4641J7060o662n6312k399J13225m7250
6748a48879k4619j4584M9035J491K8726j5856J942j9200J19201j7494J14059L5852
6736A09674r8246r1082R9147L9725o9123L07n5718m3359L3972n5789Q7018q0312
6724a23786M2990p9247Q7856L8542K0038p0857O8873o0447O4781L8235k5671k4214
$$ plain form
6712 -22907 196032 340938 423932 588623 595833 536048 449404 447534 248151 376234 154053
6701 154053 -12493 60898 26703 -39027 -1187 9945 -49192 14884 -9678 -2655 -48534 787
6689 787 53107 59151 107447 86929 217290 185669 325120 582091 778459 827020 907253 793338
6677 793338 717900 539762 393993 172420 165188 78008 93328 -106750 11275 -93381 -35120
6666 -35120 -194949 -45403 -152018 -82570 7810 -76387 41982 6643 -23190 38047 113837
6655 113837 131978 292403 400267 518888 567362 480309 491541 315445 224731 115542 124791
6644 124791 -5918 2295 36124 -90386 -59315 -285656 -140059 -203886 -88699 -186066 -171928
6633 -171928 -185028 -171298 -217947 -153266 -203352 21702 54951 116789 190440 98366 9279
$$ packed form
6712b2907K18939J44906Q2994J64691P210n9785q6644j870j99383J28083k22181
6701A54053j66546P3391l4195o5730L7840J1132n9137O4076k4562P023m5879M9321
6689G87N2320O044M8296k0518J30361l1621J39451K56971J96368M8561Q0233j13915
6677G93338p5438j78138j45769k21573p232q7180J5320k00078J18025j04656N8261
6666c5120j59829J49546j06615O9448R0380q4197J18369l5339k9833O1237P5790
6655A13837J8141J60425J07864J18621M8474q7053J1232j76096r0714j09189R249
6644A24791j30709Q213L3829j26510L1071k26341J45597o3827J15187r7367J4138
6633a71928j3100J3730m6649O4681n0086K25054L3249O1838P3651r2074q9087
$$ plain form
6622 9279 30890 -41209 -99088 -135124 -150508 -115609 -97117 -214655 -155398 -185673 -122206 -184692
6610 -184692 -129294 -216030 -162748 -180328 -238818 -217716 -113859 -31345 -23436 -2922 87975 225520
6598 225520 135037 39692 -18465 -75998 -153996 -171376 -194318 -160413 -110254 -134171 -248289
6587 -248289 -162765 -283453 -195937 -276973 -299770 -141193 -196611 -199427 -167531 -181755 -113447
6576 -113447 -18244 164751 342993 441453 291825 257120 69825 -19524 44087 -58248 -141243
6565 -141243 -202248 -248088 -262144 -239303 -285225 -261137 -322850 -241980 -314095 -240975 -258400 -300558
6553 -300558 -239058 -285716 -186835 -142110 -143176 16273 104059 225792 303385 286623 195868
6542 195868 -1665 -123502 -115592 -220361 -259949 -295810 -261504 -329120 -413957 -360486 -384438
$$ packed form
6622I279K1611p2099n7879l6036j5384L4899J8492j17538N9257l0275O3467o2486
6610a84692N5398q6736N3282j7580n8490K1102J03857Q2514P909K0514R0897J37545
6598B25520r0483r5345n8157n7533p7998j7380k2942L3905N0159k3917j14118
6587b48289Q5524j20688Q7516q1036k2797J58577n5418k816L1896j4224O8308
6576a13447R5203J82995J78242R8460j49628l4705j87295q9349O3611j02335q2995
6565a41243o1005m5840j4056K2841m5922K4088o1713Q0870p2115P3120j7425m2158
6553c00558O1500m6658R8881M4725j066J59449Q7786J21733P7593j6762r0755
6542A95868j97533j21837P910j04769l9588l5861L4306o7616q4837N3471k3952
$$ plain form
6531 -384438 -410294 -331954 -367868 -354127 -211488 -355028 -335982 -283005 -207849 -315282 -334083
6520 -334083 -261665 -323801 -231432 -193731 -198225 -252543 -338989 -288311 -392665 -420441 -327340 -315726
6508 -315726 -318194 -348097 -387954 -349223 -369444 -397270 -394920 -316006 -386402 -372966 -312856 -365285
6496 -365285 -297726 -598562 -373216 -359175 -368296 -400618 -388918 -381123 -421399 -402933 -371113 -375810
6484 -375810 -466842 -447228 -410452 -276500 -415325 -452604 -367577 -375720 -455956 -331834 -421946
6473 -421946 -433871 -455202 -436135 -428775 -425322 -432099 -399483 -488181 -529240 -449440 -457859 -451594 -308049
6460 -308049 -404659 -411705 -331728 -431751 -334657 -340837 -410265 -414678 -384346 -394966 -423104 -460790
6448 -460790 -458443 -425984 -397118 -468735 -392118 -432560 -359165 -387752 -496786 -386596 -456150
$$ packed form
6531c84438k5856P8340l5914J3741J42639j43540J9046N2977P5156j07433j8801
6520c34083P2418o2136R2369L7701m494n4318q6446N0678j04354k7776R3101J1614
6508c15726k468k9903l9857L8731k0221k7826K350P8914p0396J3436O0110n2429
6496c65285O7559l00836K25346J4041r121l2322J1700P795m0276J8466L1820m697
6484c75810r1032J9614L6776J33952j38825l7279Q5027q143q0236J24122r0112
6473d21946j1925k1331J9067P360L453o777L2616q8698m1059P9800q419O265J43545
6460c08049r6610p046P9977j00023R7094o180o9428m413L0332j0620k8138l7686
6448d60790K347L2459K8866p1617P6617m0442P3395k8587j09034J10190o9554
$$ plain form
6437 -456150 -447352 -350503 -461154 -448114 -423729 -398360 -411843 -415412 -357611 -359823 -493470 -386524
6425 -386524 -388788 -395815 -362442 -389852 -336958 -435571 -395911 -437168 -415172 -406844 -319657 -399982
6413 -399982 -335510 -261739 -356622 -359584 -292926 -389500 -360192 -407197 -407990 -376757 -295637 -338465
6401 -338465 -378696 -458138 -399376 -385572 -277988 -287304 -298441 -257858 -292962 -173233 -150371
6390 -150371 -174342 -217142 -388760 -267877 -353828 -343689 -314040 -297686 -355119 -327842 -330548
6379 -330548 -349800 -329251 -392577 -370501 -404586 -388918 -412629 -454227 -344738 -359579 -483401
6368 -483401 -308805 -324987 -420571 -329300 -318236 -379866 -385161 -285482 -349374 -397667 -438952 -329084
6356 -329084 -316154 -400737 -384607 -413493 -410367 -365246 -444779 -405334 -417053 -332662 -372178 -405617
$$ packed form
6437d56150Q798R6849j10651J3040K4385K5369j3483l569N7801k212j33647J06946
6425c86524k264p027L3373k7410N2894r8613L9660m1257K1996Q328Q7187q0325
6413c99982O4472P3771r4883k962O6658r6574K9308m7005p93L1233Q1120m2828
6401c38465m0231p9442N8762J3804J07584r316j1137M0583l5104J19729K2862
6390a50371k3971m2800j71618J20883q5951J0139K9649J6354n7433K7277k706
6379c30548j9252K0549o3326K2076l4085J5668k3711m1598J09489j4841j23822
6368d83401J74596j6182r5584R1271J1064o1630n295R9679o3892m8293m1285J09868
6356c29084J2930q4583J6130k8886L126M5121p9533L9445j1719Q4391l9516l3439
$$ plain form
6344 -405617 -327519 -427109 -394044 -364690 -401509 -356720 -439799 -398088 -456226 -398727 -392425 -393541
6332 -393541 -417139 -391068 -445468 -451203 -395657 -288613 -373506 -427168 -378251 -418317 -415408 -353715
6320 -353715 -414109 -401141 -297934 -417448 -315105 -299209 -374008 -322743 -351877 -384236 -307287
6309 -307287 -364177 -322694 -294896 -333206 -249070 -372863 -311523 -337092 -439181 -349527 -389057
6298 -389057 -403123 -372711 -456254 -414676 -320418 -434670 -383304 -414697 -308723 -384635 -287082
6287 -287082 -415051 -351195 -356232 -366004 -350012 -363634 -292452 -426966 -251970 -399795 -388928
6276 -388928 -343689 -280867 -276466 -412416 -378925 -407484 -385118 -370238 -463019 -211696 -416982
6265 -416982 -305277 -274813 -315168 -323900 -393729 -386120 -336997 -218838 -341182 -351220 -331423
$$ packed form
6344d05617P8098r9590L3065K9354l6819M4789q3079M1711n8138N7499O302j116
6332c93541k3598K6071n4400n735N5546J07044q4893n3662M8917m0066K909O1693
6320c53715o0394J2968J03207j19514J02343J5896p4799N1265k9134l2359P6949
6309c07287n6890M1483K7798l8310Q4136j23793O1340k5569j02089Q9654l9530
6298c89057j4066L0412q3543M1578R4258j14252N1366l1393J05974p5912R7553
6287b87082j27969O3856n037r772J5992j3622P1182j34514J74996j47825J0867
6276c88928M5239O2822M401j35950L3491k8559K2366J4880r2781K51323k05286
6265d16982J11705L0464m0355q732o9829P609M9123J18159j22344j0038J9797
$$ plain form
6254 -331423 -259739 -269815 -344263 -367117 -312296 -306060 -266361 -337871 -252134 -270205 -334428 -390760
6242 -390760 -354300 -253916 -226676 -243933 -295329 -265078 -286584 -340814 -329797 -173155 -333305
6231 -333305 -284387 -229539 -231004 -261418 -246356 -338293 -368711 -391790 -295951 -293293 -291593 -338678
6219 -338678 -294670 -334328 -231911 -201550 -239216 -311543 -311729 -220817 -240552 -198164 -281229 -205397
6207 -205397 -237238 -320185 -294136 -262757 -265290 -243039 -219149 -201062 -159442 -203885 -168902 -161288
6195 -161288 -238430 -157818 -180240 -188733 -118319 -156604 -143817 -67522 -139970 -212908 -136657 -144960
6183 -144960 -133284 -206784 -133463 -159663 -196918 -225484 -159924 -174918 -168895 -124679 -219789 -169230
6171 -169230 -107451 -198576 -128313 -96288 -261804 -134456 -116822 -114552 -153836 -215518 -80628
$$ packed form
6254c31423P1684j0076p4448k2854N4821O236L9699p1510Q5737j8071o4223n6332
6242c90760L6460J00384K7240j7257n1396L0251k1506n4230J1017J56642j60150
6231c33305M8918N4848j465l0414J5062r1937l0418k3079R5839K658J700m7085
6219c38678M4008l9658J02417L0361l7666p2327j86R0912j9735M2388q3065P5832
6207b05397l1841q2947K6049L1379k533K2251K3890J8087M1620m4443L4983P614
6195a61288p7142Q0612k2422q493P0414l8285J2787P6295p2448p2938P6251q303
6183a44960J1676p3500P3321k6200l7255k8566O5560j4994O023M4216r5110N0559
6171a69230O1779r1125P0263L2025j65516J27348J7634K270l9284o1682J34890
$$ plain form
6160 -80628 -147222 -197487 -126995 -87876 -173389 -170799 -210729 -155578 -167591 -161759 -106239 -216966
6148 -216966 -166016 -135751 -224176 -150391 -193050 -129808 -164144 -74653 -96954 -89718 -91184 -116654
6136 -116654 -119104 -177805 7630 -69509 -21069 -185809 -201339 -117793 -58507 -143765 -69081
6125 -69081 -164489 -139781 -128707 -151939 -71593 -95327 -74091 -56388 -66483 -139196 -187682 -140052
6113 -140052 -110337 17237 -168143 -119398 -54923 -44441 -65637 -71209 -149522 -38247 -25388
6102 -25388 -83173 39953 -64685 -4205 -94233 -74249 -158333 -49372 -8642 -50855 -105071
6091 -105071 -50083 44817 34668 53888 13801 -7949 -34901 75316 70014 59589 79674 -7547
6079 -7547 90134 23550 65086 40085 15951 76373 36058 136816 115062 80577 61323 107542
$$ packed form
6160h0628o6594n0265P0492L9119q5513K590l9930N5151j2013N832N5520j10727
6148b16966N0950L0265q8425P3785m2659O3242l4336Q9491k2301P236j466k5470
6136a16654k450n8701J85435p7139M8440j64740j5530Q3546N9286q5258P4684
6125f9081r5408K4708J1074k3232Q0346k3734K1236J7703j0095p2713m8486M7630
6113a40052K9715J27574j85380M8745O4475J0482k1196n572p8313J11275J2859
6102b5388n7785J23126j04638O0480r0028J9984q4084J08961M0730m2213n4216
6091a05071N4988R4900j0149J9220m0087k1750k6952J10217n302j0425K0085q7221
6079g547R7681o6584M1536k5001k4134O0422m0315J00758k1754l4485j9254M6219
$$ plain form
6067 107542 175017 12624 163246 221596 282387 297033 374566 454652 422092 474801 539255
6056 539255 645354 695396 733608 869275 870001 821559 757756 906042 823826 770517 747610
6045 747610 664857 663861 684334 603595 615751 671067 640066 705684 726985 707924 732782 777866
6033 777866 821087 877692 935007 1069778 1144961 1132852 1366070 1372870 1552792 1756244 1822094
6022 1822094 1845387 1844782 1920894 1876243 1772921 1703672 1598874 1437996 1429552 1363104 1151929
6011 1151929 1194303 1162302 1214967 1125853 1106815 1121202 1179782 1275713 1200286 1270324 1405267
6000 1405267 1425630 1464800 1590783 1591512 1689665 1778714 1912971 1877956 1957048 1983639 1947298
5989 1947298 1820444 1908955 1814147 1747049 1685904 1644968 1659976 1601720 1649611 1628176 1591941
$$ packed form
6067A07542O7475j62393J50622N8350O0791J4646P7533Q0086l2560N2709O4454
6056E39255J06099N0042L8212J35667P26m8442o3803J48286q2216n3309k2907
6045G47610q2753r96K0473q0739J2156N5316l1001O5618K1301j9061K4858M5084
6033G77866M3221N6605N7315J34771P5183j2109K33218O800J79922K03452O5850
6022A822094K3293o05P6112m4651j03322o9249j04798j60878q444o6448k11175
6011A151929M2374l2001N2665q9114j9038J4387N8580R5931p5427P0038J34943
6000A405267K0363L9170J25983P29R8153Q9049J34257l5015P9092K6591l6341
5989A947298j26854Q8511r4808o7098o1145m0936J5008n8256M7891k1435l6235
$$ plain form
5978 1591941 1669243 1747927 1688630 1825966 1875018 1946217 1939814 1994955 1874063 1997845 1928320
5967 1928320 1877426 1814682 1847031 1786245 1745888 1663319 1758932 1736925 1708554 1757019 1770996
5956 1770996 1803142 1860948 1935086 1953797 2039650 2066121 2237468 2309660 2483385 2521982 2723991
5945 2723991 2928089 2861889 2973839 3094218 3060412 3052110 2990338 2894835 2898087 2822406 2746283
5934 2746283 2721301 2649169 2744304 2751264 2817490 2737492 2873395 3006829 3062180 3224329 3345739
5923 3345739 3393974 3521883 3691756 3838784 3967431 4100149 4214231 4381141 4451249 4538629
5913 4538629 4501800 4464462 4461223 4455732 4395385 4360830 4335457 4362561 4153589 4342496 4261078
5902 4261078 4328730 4265679 4346806 4385356 4429882 4556191 4602070 4708208 4796339 4975350 5131873
$$ packed form
5978A591941P7302P8684n9297J37336M9052P1199o403N5141j20892J23782o9525
5967A928320n0894o2744L2349o0786m0357q2569R5613k2007k8371M8465J3977
5956A770996L2146N7806P4138J8711Q5853K6471J71347P2192J73725L8597K02009
5945B723991K04098o6200J11950J20379l3806q302o1772r5503L252p5681p6123
5934B746283k4982p2132R5135O960O6226p9998J35903J33434N5351J62149J21410
5923C345739M8235J27909J69873J47028J28647J32718J14082J66910P0108Q7380
5913D538629l6829l7338l239n491o0347l4555k5373K7104k08972J88907q1418
5902D261078O7652o3051Q1127L8550M4526J26309M5879J06138Q8131J79011J56523
$$ plain form
5891 5131873 5128879 5219903 5342881 5338396 5316426 5355057 5315437 5180934 5275977 5067842 5140311
5880 5140311 5092802 5089284 5052282 5153013 5071242 5186932 5080422 5157142 5225884 5322749 5357595
5869 5357595 5343120 5382273 5499681 5502623 5637834 5753372 5808337 5931335 6011491 6104505 6172851
5858 6172851 6176116 6357571 6335261 6413294 6490974 6427835 6584453 6707722 6703431 6750289 6841316
5847 6841316 7052609 7003807 7255626 7225847 7344622 7462091 7609145 7749652 7853502 8103638
5837 8103638 8209643 8436878 8513065 8724162 8983204 9160980 9342158 9505906 9733683 9941968
5827 9941968 10155691 10349342 10652315 10915290 11224386 11610705 11898601 12319625 12711650 13038569
5817 13038569 13473525 14014068 14440356 15095949 15823004 16658958 17451685 18326126 19374322
$$ packed form
5891E131873k994R1024J22978m485k1970L8631l9620j34503R5043k08135P2469
5880E140311m7509l518l7002J00731q1771J15690j06510P6720O8742R6865L4846
5869E357595j4475L9153J17408K942J35211J15538N4965J22998Q0156R3014O8346
5858F172851L265J81455k2310P8033P7680o3139J56618J23269m291M6858R1027
5847F841316K11293m8802K51819k9779J18775J17469J47054J40507J03850K50136
5837H103638J06005K27235P6187K11097K59042J77776J81178J63748K27777K08285
5827I941968K13723J93651L02973K62975L09096L86319K87896M21024L92025L26919
5817A3038569M34956N40543M26288O55593P27055Q35954P92727Q74441J048196
$$ plain form
5808 19374322 20527289 21870657 23377665 25133436 27303576 29904322 33228069 37643883
5800 37643883 43362061 50639683 59444172 69535126 80229134 91262902 101985813 111333587
5792 111333587 118173162 121341097 120841059 117095827 110857051 102966584 94136405 85077798
5784 85077798 76583499 69462740 63520814 59181814 56220064 54456128 53535576 53562421 54362560
5775 54362560 55757921 58024009 61278068 66007050 72968956 82546007 94978142 110283070
5767 110283070 127974130 148035862 169615814 190638032 209206996 223545117 232347502
5760 232347502 234641358 229984671 219459429 204021533 185582794 165528526 145657835
5753 145657835 126913668 110527192 96661389 85758634 77419748 71517142 67606485
$$ packed form
5808A9374322J152967J343368J507008J755771K170140K600746L323747M415814
5800C7643883N718178P277622Q804489J0090954J0694008J1033768J0722911R347774
5792A11333587O839575L167935n00038l745232o238776p890467q830179r058607
5784H5077798q494299p120759n941926m339000k961750j763936r20552K6845Q00139
5775E4362560J395361K266088L254059M728982O961906R577051J2432135J5304928
5767A10283070J7691060K0061732K1579952K1022218J8568964J4338121Q802385
5760B32347502K293856m656687j0525242j5437896j8438739k0054268j9870691
5753A45657835j8744167j6386476j3865803j0902755q338886n902606l910657
$$ plain form
5746 67606485 65092387 63910799 63848982 64610193 66169059 68634499 72183356 77190006 84068075
5737 84068075 92929319 103408671 114828852 126859656 138998664 150305720 158946273
5730 158946273 163112551 162598750 158123300 150697092 141418723 131359608 121191296 112654048
5722 112654048 106451502 103425541 103361864 106021484 110988821 117723333 125600362 133541315
5714 133541315 140640074 145317670 147187289 146039529 142469227 136836591 129334849 120763018
5706 120763018 111893327 103661266 96595625 91211354 87522478 85272665 84510251 85001493
5698 85001493 86287846 88910688 92679014 97987276 105235914 114494993 125940704 140005649
5690 140005649 156699600 176621619 199341421 224589937 250608646 275650702 296839813
$$ packed form
5746F7606485k514098j181588o1817P61211J558866K465440L548857N006650O878069
5737H4068075Q861244J0479352J1420181J2030804J2139008J1307056Q640553
5730A58946273M166278n13801m475450p426208r278369j0059115j0168312q537248
5722A12654048o202546l025961o3677K659620M967337O734512P877029P940953
5714A33541315P098759M677596J869619j147760l570302n632636p501742q571831
5706A20763018q869691q232061p065641n384271l688876k249813p62414M91242
5698H5001493J286353K622842L768326N308262P248638R259079J1445711J4064945
5690A40005649J6693951J9922019K2719802K5248516K6018709K5042056K1189111
$$ plain form
5683 296839813 312601633 321360955 322770143 316975751 304864459 287598569 267784367
5676 267784367 247529669 229068968 213390187 201030685 191928449 186096205 183546762
5669 183546762 183578956 185971336 190277306 196097449 203231082 211603828 220991618 231406292
5661 231406292 243478380 257494219 273109263 289537298 305163805 317638464 324775666
5654 324775666 325229248 318563418 305365484 287181391 266090921 243954063 222087047
5647 222087047 201733967 183778425 168403207 155943580 146008228 138257256 132371951
5640 132371951 127843635 124521680 121970573 119823007 117526564 115182868 112626034 109609854
5632 109609854 106020941 101551846 96653796 91164050 85476388 79750187 73969549 68546221
$$ packed form
5683B96839813J5761820Q759322J409188n794392j2111292j7265890j9814202
5676B67784367k0254698j8460701j5678781j2359502r102236n832244k549443
5669A83546762L2194K392380M305970N820143P133633Q372746R387790J0414674
5661B31406292J2072088J4015839J5615044J6428035J5626507J2474659P137202
5654C24775666M53582o665830j3197934j8184093k1090470k2136858k1867016
5647B22087047k0353080j7955542j5375218j2459627r935352p750972n885305
5640A32371951m528316l321955k551107k147566k296443k343696k556834l016180
5632A09609854l588913m469095m898050n489746n687662n726201n780638n423328
$$ plain form
5624 68546221 63299688 58630890 54452084 50748446 47528767 44629803 42106200 39918324
5616 39918324 37947926 36072953 34386656 32783600 31544568 30371920 29270615 28192638
5608 28192638 27179276 26379511 25657514 25013326 24465027 23981722 23324203 22866678 22347442
5599 22347442 21806097 21318884 20863372 20578714 20063645 19603776 19212922 18822580 18389763
5590 18389763 17862215 17509474 17239128 16858865 16469427 16266005 15911830 15664501 15477659
5581 15477659 15378426 14958011 14676496 14450071 14449019 14246592 14123453 13880398 13873581 13727072
5571 13727072 13705276 13630112 13491837 13446063 13271239 13213607 13132277 13075470 12962221 13035625 12988944
5560 12988944 12899080 13004464 12982295 12925207 13007950 13104110 13010053 13170360 13182659 13174793 13254912
$$ packed form
5624F8546221n246533m668798m178806l703638l219679k898964k523603k187876
5616C9918324j970398j874973j686297j603056j239032j172648j101305j077977
5608B8192638j013362p99765p21997o44188n48299m83305o57519m57525n19236
5599B2347442n41345m87213m55512k84658n15069m59869l90854l90342m32817
5590A8389763n27548l52741k70346l80263l89438k03422l54175k47329j86842
5581A5477659r9233m20415k81515k26425j052k02427j23139k43055o817j46509
5571A3727072k1796p5164j38275m5774j74824n7632q1330n6807j13249P3404m6681
5560A2988944q9864J05384k2169n7088Q2743R6160r4057J60307J2299p866Q0119
$$ plain form
5549 13254912 13311100 13345792 13456901 13731384 13770449 13938855 14288337 14389006 14628777 14897742
5539 14897742 15132932 15447843 15680114 16012871 16376886 16696929 17172684 17592582 18101075
5530 18101075 18796569 19349279 19928480 20662412 21486659 22371714 23303612 24423295 25562360
5521 25562360 26918655 28356211 29935570 31823183 33882725 36385251 39168855 42540147
5513 42540147 46402674 50733614 55492367 60362323 65655581 70595976 75377704 79870910
5505 79870910 83553502 86477016 88887329 90758346 92198452 93540321 94536300 95752109
5497 95752109 97189942 98970703 100983956 103474903 106574363 110138588 114250074 119232774
5489 119232774 124907508 131005655 137949625 145544040 153433842 161293648 168503159 175019610
$$ packed form
5549A3254912N6188L4692J11109K74483L9065J68406L49482J00669K39771K68965
5539A4897742K35190L14911K32271L32757L64015L20043M75755M19898N08493
5530A8101075O95494N52710N79201P33932Q24247Q85055R31898J119683J139065
5521B5562360J356295J437556J579359J887613K059542K502526K783604L371292
5513D2540147L862527M330940M758753M869956N293258M940395M781728M493206
5505G9870910L682592K923514K410313J871017J440106J341869R95979J215809
5497I5752109J437833J780761K013253K490947L099460L564225M111486M982700
5489A19232774N674734O098147O943970P594415P889802P859806P209511O516451
$$ plain form
5481 175019610 180410847 183988836 185264995 184461345 181776991 177497155 171920466 165543264
5473 165543264 158767826 151922678 145787795 140335562 135688034 131872705 128655221 126110553
5465 126110553 123992970 122125417 120175568 118229072 116021472 113500115 110487220 106931144
5457 106931144 102800680 98131978 93334426 88272445 83007998 77520991 72068112 66686761
5449 66686761 61611988 56728224 52130577 47914550 44289520 40811035 37831396 35324659
5441 35324659 33141164 31109791 29601518 28319027 26970646 25770518 24753662 23786140
5433 23786140 22927806 22080867 21373330 20655888 19991868 19255853 18606249 18173960 17533825
5424 17533825 17060311 16668599 16257478 15769868 15285987 14893328 14364783 13909524 13666307
$$ packed form
5481A75019610N391237L577989J276159q03650k684354m279836n576689o377202
5473A65543264o775438o845148o134883n452233m647528l815329l217484k544668
5465A26110553k117583j867553j949849j946496k207600k521357l012895l556076
5457A06931144m130464m668702m797552n061981n264447n487007n452879n381351
5449F6686761n074773m883764m597647m216027l625030l478485k979639k506737
5441C5324659k183495k031373j508273j282491j348381j200128j016856r67522
5433B3786140q58334q46939p07537p17442o64020p36015o49604m32289o40135
5424A7533825m73514l91712m11121m87610m83881l92659n28545m55259k43217
$$ plain form
5415 13666307 13213325 12933954 12623035 12644708 12653201 12275261 11847042 11235921 10679917 10161356
5405 10161356 9915976 9758577 9226184 9075585 8833629 8605734 8400642 8134548 7993440
5396 7993440 7795553 7629962 7506486 7338271 7157383 7170945 6982033 6780762 6612695 6406619
5386 6406619 6289951 6109877 5927760 5848170 5671040 5502883 5434789 5231819 5202009 5112945
5376 5112945 4896982 4781045 4707486 4662104 4528661 4502403 4433990 4274144 4093210 4000270
5366 4000270 3857877 3807741 3816822 3656170 3625471 3549932 3555684 3560816 3491302 3484235 3376368 3289778
5354 3289778 3327190 3304393 3274116 3263435 3237031 3167820 3124042 3138122 3114128 3066811 3052812
5343 3052812 3046840 2961250 2926319 2898970 2801545 2779429 2672828 2532143 2561840 2587858 2534863
$$ packed form
5415A3666307m52982k79371l10919K1673Q493l77940m28219o11121n56004n18561
5405A0161356k45380j57399n32393j50599k41956k27895k05092k66094j41108
5396G993440j97887j65591j23476j68215j80888J3562j88912k01271j68067k06076
5386F406619j16668j80074j82117p9590j77130j68157o8094k02970k9810q9064
5376E112945k15963j15937p3559m5382j33443k6258o8413j59846j80934r2940
5366D000270j42393n0136R081j60652l0699p5539N752N132o9514p067j07867q6590
5354C289778L7412k2797l0277j0681k6404o9211m3778J4080k3994m7317j3999
5343C052812n972q5590l4931k7349r7425k2116j06601j40685K9697K6018n2995
$$ plain form
5332 2534863 2539686 2485300 2540500 2382816 2347932 2515426 2491545 2423313 2463026 2498493 2541527
5321 2541527 2491011 2670727 2578283 2638465 2711186 2777866 2719349 2650139 2702508 2534652 2424347
5310 2424347 2312344 2291451 2154516 2120455 2166270 2164002 2093954 2060626 2173767 2076840 2102082
5299 2102082 2084876 2120013 2033241 2164563 2180245 2257509 2336360 2381171 2367613 2560236 2573499
5288 2573499 2642724 2762085 2762246 2794886 2733877 2701285 2605620 2403115 2456451 2424748 2416508 2374209
5276 2374209 2296864 2351453 2353881 2417140 2434876 2341857 2422435 2397494 2416367 2440429 2449283 2414292
5264 2414292 2488076 2673074 2664371 2721257 2943322 2992310 3136213 3158141 3142643 3195326 3167137
5253 3167137 3187451 3151101 3216921 3149728 2876682 2955089 3039183 2951382 2910313 2899816 2870893
$$ packed form
5332B534863M823n4386N5200j57684l4884J67494k3881o8232L9713L5467M3034
5321B541527n0516J79716r2444O0182P2721O6680n8517o9210N2369j67856j10305
5310B424347j12003k0893j36935l4061M5815k268p0048l3328J13141r6927K5242
5299B102082j7206L5137q6772J31322J5682P7264P8851M4811j3558J92623J3263
5288B573499O9225J19361J61L2640o1009l2592r5665k02505N3336l1703q240m2299
5276B374209p7345N4589K428O3259J7736r3019Q0578k4941J8873K4062Q854l4991
5264B414292P3784J84998q703N6886K22065M8988J43903K1928j5498N2683k8189
5253C167137K0314l6350O5820o7193k73046P8407Q4094q7801m1069j0497k8923
$$ plain form
5242 2870893 2885657 2609973 2813743 2831243 2876759 2823728 2828997 2866507 2917223 3048314 2989396
5231 2989396 3096480 3080763 3122697 3262649 3200832 3208472 3165224 3140428 3079056 3183358 3009426
5220 3009426 2897234 2863180 2888802 2777518 2857405 2755074 2701473 2612882 2693102 2598740 2656043
5209 2656043 2489391 2474626 2613861 2468435 2480107 2619108 2646592 2603924 2564797 2450837
5199 2450837 2454289 2458254 2397176 2432646 2415468 2439759 2346123 2334706 2310447 2457493 2319490
5188 2319490 2399421 2354987 2363545 2362957 2337066 2455473 2392979 2525850 2479293 2582106 2565469
5177 2565469 2576898 2608550 2741270 2806637 2824491 2831227 2719163 2818372 2836476 2806028 2859682
5166 2859682 2829303 2882125 2887035 2947598 2974158 2936800 3040618 3013991 3129920 3024633 3077381
$$ packed form
5242B870893J4764k75684K03770J7500M5516n3031N269L7510N0716J31091n8918
5231B989396J07084j5717M1934J39952o1817P640m3248k4796o1372J04302j73932
5220C009426j12192l4054K5622j11284P9887j02331n3601q8591Q0220r4362N7303
5209B656043j66652j4765J39235j45426J1672J39001K7484m2668l9127j13960
5199B450837L452L965o1078L5470j7178K4291r3636j1417k4259J47046j38003
5188B319490P9931m4434Q558n88k5891J18407o2494J32871m6557J02813j6637
5177B565469J1429L1652J32720O5367J7854O736j12064R9209J8104l0448N3654
5166B859682l0379N2822M910O0563K6560l7358J03818k6627J15929j05287N2748
$$ plain form
5155 3077381 3120299 3231544 3213382 3255033 3363588 3418468 3515784 3559909 3705462 3747975 3768600
5144 3768600 3824290 3966842 3847524 4098376 3969212 3981964 4110463 4235043 4317504 4307757
5134 4307757 4387371 4545981 4604134 4614894 4651617 4780976 4820242 4942796 4974409 5105356 5126353
5123 5126353 5280379 5347089 5573045 5751127 5752686 5965475 6071105 6275968 6449146 6646703
5113 6646703 6838830 6921976 7273694 7372387 7691397 7944917 8310075 8652378 8992010 9373538
5103 9373538 9834458 10268444 10835135 11477279 12189626 13046233 14089971 15401868 17015507
5094 17015507 19035656 21584034 24834165 29164217 34250819 39938571 45562597 49666333
5086 49666333 50807165 48855580 44975719 40232280 36064917 32756117 30498529 29134071
$$ packed form
5155C077381M2918J11245j8162M1651J08555N4880R7316M4125J45553M2513K0625
5144C768600N5690J42552j19318K50852j29164J2752J28499J24580Q2461r747
5134D307757P9614J58610N8153J0760L6723J29359L9266J22554L1613J30947K0997
5123E126353J54026O6710K25956J78082J559K12789J05630K04863J73178J97557
5113F646703J92127Q3146L51718R8693L19010K53520L65158L42303L39632L81528
5103I373538M60920M33986N66691O42144P12347Q56607J043738J311897J613639
5094A7015507K020149K548378L250131M330052N086602N687752N624026M103736
5086D9666333J140832j951585l879861m743439m167363l308800k257588j364458
$$ plain form
5078 29134071 28535150 28723867 28765404 28795135 28675921 28588484 28910372 29621546 30767866 32396110
5068 32396110 34636426 37459521 41246080 46623781 54359979 64785788 77215077 89527122
5060 89527122 101034738 113217362 126932472 139993083 146901526 143940307 132760524
5053 132760524 116812331 100829424 87485574 77364645 70344912 65257812 61114060
5046 61114060 57661928 54823620 52692732 51457409 51043106 51187815 52004627 53289247 55219357
5037 55219357 58090943 62436018 69541486 80367770 93140430 105778359 120134435 136978015
5029 136978015 155771408 173765738 187459661 192661289 186793163 171049064 150615330
5022 150615330 128983027 109750443 94337178 82395685 73197466 65998406 60758628
$$ packed form
5078B9134071n98921J88717M1537K9731j19214q7437L21888P11174J146320J628244
5068C2396110K240316K823095L786559N377701P736198J0425809J2429289J2312045
5060H9527122J1507616J2182624J3715110J3060611O908443k961219j1179783
5053A32760524j5948193j5982907j3343850j0120929p019733n087100m143752
5046F1114060l452132k838308k130888j235323m14303J44709Q16812J284620J930110
5037E5219357K871586M345075P105468J0826284J2772660J2637929J4356076J6843580
5029A36978015J8793393J7994330J3693923N201628n868126j5744099k0433734
5022A50615330k1632303j9232584j5413265j1941493r198219p199060n239778
$$ plain form
5015 60758628 56821652 53901735 51743729 50422677 50281285 50386679 50623620 50882225 51297847
5006 51297847 52123676 53827314 56603664 61469902 69207396 81237824 96601719 112225131
4998 112225131 124882492 131039465 129166409 120133302 106858495 92278623 78683196
4991 78683196 67065414 57766114 50263937 44297843 39571241 36024209 33523655 31663518
4983 31663518 30379803 29473752 28624610 27792710 26832977 25866678 25061793 24621688 24363023
4974 24363023 24565435 25163515 26510686 28904179 32174591 35630768 38274234 39511769
4966 39511769 38787064 36370872 33169194 29627492 26094220 23142335 20648329 18491698
4958 18491698 16811406 15260707 14162786 13168158 12341550 11639733 11173682 10703433 10393061
$$ packed form
5015F0758628l936976k919917k158006j321052j41392J05394K36941K58605M15622
5006E1297847Q25829J703638K776350M866238P737494J2030428J5363895J5623412
4998A12225131J2657361O156973j873056r033107j3274807j4579872j3595427
4991G8683196j1617782r299300p502177n966094m726602l547032k500554j860137
4983C1663518j283715r06051q49142q31900r59733r66299q04885m40105k58665
4974B4363023K02412N98080J347171K393493L270412L456177K643466J237535
4966C9511769p24705k416192l201678l541702l533272k951885k494006k156631
4958A8491698j680292j550699j097921r94628q26608p01817m66051m70249l10372
$$ plain form
4949 10393061 10111031 9759521 9428340 9213637 9076522 8807083 8690465 8486719 8292886
4940 8292886 8186621 8017866 8007217 7946387 7914825 8099957 8359122 8427313 8280738 8109491
4930 8109491 7736364 7531294 7416041 7262449 7200916 7110564 7131683 7107671 7605723 8347006
4920 8347006 9111714 9147401 8915706 8243557 7669152 7229699 6900169 6711793 6596886 6546539
4910 6546539 6405269 6446585 6440372 6396090 6297597 6350200 6291651 6128788 6218988 6237101 6226175
4899 6226175 6265225 6200734 6348157 6312459 6424965 6412471 6449637 6544255 6544597 6591580 6526437
4888 6526437 6660397 6669863 6707035 6820152 6742990 6831572 6778021 6826508 6922971 6993585 7007019
4877 7007019 7123080 7179300 7266941 7259522 7431374 7480269 7483230 7587361 7637272 7821257 7904607
$$ packed form
4949A0393061k82030l51510l31181k14703j37115k69439j16618k03746j93833
4940H292886j06265j68755j0649o0830l1562J85132K59165O8191j46575j71247
4930H109491l73127k05070j15253j53592o1533r0352K1119k4012M98052P41283
4920H347006P64708L5687k31695o72149n74405m39453l29530j88376j14907n0347
4910F546539j41270M1316o213m4282r8493N2603n8549j62863R0200J8113j0926
4899F226175L9050o4491J47423l5698J12506j2494L7166R4618L42M6983o5143
4888F526437J33960R466L7172J13117p7162Q8582n3551M8487R6463P0614J3434
4877G007019J16061N6220Q7641p419J71852M8895K961J04131M9911J83985Q3350
$$ plain form
4866 7904607 7941205 8154505 8180502 8389577 8404780 8499978 8634567 8817045 8955770 9050420
4856 9050420 9191891 9310633 9481042 9647114 9741225 9960494 10089912 10296713 10505781 10770657
4846 10770657 10941847 11156478 11423323 11658229 11961689 12218500 12652605 12971859 13347039
4837 13347039 13771759 14120938 14576296 15209871 15664833 16229612 17002564 17705884 18755650
4828 18755650 19708799 20780028 21659707 22660191 23396263 24131410 25092451 26127642 27459839
4819 27459839 29408691 31478588 33319269 34763384 35669091 36354345 36851936 37823457 39185118
4810 39185118 40881352 42619453 44044406 45173627 45851517 46474245 47274704 48191906 49593329
4801 49593329 51400555 53479620 55816143 58825224 62463938 67189117 72805207 79398163
$$ packed form
4866G904607L6598K13300K5997K09075J5203R5198J34589J82478J38725R4650
4856I050420J41471J18742J70409J66072R4111K19269J29418K06801K09068K64876
4846A0770657J71190K14631K66845K34906L03460K56811M34105L19254L75180
4837A3347039M24720L49179M55358O33575M54962N64779P72952P03320J049766
4828A8755650R53149J071229Q79679J000484P36072P35147R61041J035191J332197
4819B7459839J948852K069897J840681J444115R05707O85254M97591R71521J361661
4810C9185118J696234J738101J424953J129221O77890O22728Q00459R17202J401423
4801D9593329J807226K079065K336523L009081L638714M725179N616090O592956
$$ plain form
4793 79398163 86494312 94522257 103178271 112913766 123719337 135186091 146429414 156480903
4785 156480903 164238165 169451399 172343099 173806255 175085000 177760271 182696634 190756802
4777 190756802 203858973 224175859 249930141 272682436 283697553 282773504 274085912
4770 274085912 263730992 257083501 255261662 258648061 267357957 282037106 303345176 329822251
4762 329822251 356681128 379098036 391411242 390081839 376822154 355817384 331610577
4755 331610577 308151760 287590609 271077955 258818214 252130069 253003022 261721013 272062632
4747 272062632 274778320 266928316 250771841 231146631 212946014 198259675 186392197
4740 186392197 176960223 169730017 165144074 163116655 162536741 161415045 157696669 150744953
$$ packed form
4793G9398163P096149Q027945Q656014R735495J0805571J1466754J1243323J0051489
4785A56480903P757262N213234K891700J463156J278745K675271M936363Q060168
4777A90756802J3102171K0316886K5754282K2752295J1015117r24049q687592
4770B74085912j0354920o647491j821839L386399Q709896J4679149K1308070K6477075
4762C29822251K6858877K2416908J2313206j329403j3259685k1004770k4206807
4755C31610577k3458817k0561151j6512654j2259741o688145Q72953Q717991J0341619
4747B72062632K715688p850004j6156475j9625210j8200617j4686339j1867478
4740A86392197r431974p230206m585943k027419n79914j121696l718376o951716
$$ plain form
4732 150744953 141168337 130555556 120028856 110151416 100896150 92184843 84185355 76621563
4724 76621563 69954107 64475175 59884114 56154908 53121140 50467774 48378271 46768042
4716 46768042 45584021 44947742 44786683 44655974 44260840 43512404 42108558 40421112 38799514
4707 38799514 37553067 36705788 36078187 35346980 33896308 32179740 29947471 27923288 26368363
4698 26368363 25070929 24123878 23405165 22747036 22218574 21634924 20796556 19812120 18798047
4689 18798047 17748139 16957191 16096708 15443110 14860625 14240535 13660000 13148073 12777459
4680 12777459 12348996 11929874 11583801 11129781 10847219 10559070 10253698 9896361 9634058
4671 9634058 9425985 9162569 9041496 8754796 8574343 8391380 8207746 7956759 7777323 7615396
$$ packed form
4732A50744953r576616j0612781j0526700r877440r255266q711307p999488p563792
4724G6621563o667456n478932m591061l729206l033768k653366k089503j610229
4716D6768042j184021o36279j61059j30709l95134p48436j403846j687446j621598
4707C8799514j246447q47279o27601p31207j450672j716568k232269k024183j554925
4698B6368363j297434r47051p18713o58129n28462n83650q38368r84436j014073
4689A8798047j049908p90948q60483o53598n82485o20090n80535n11927l70614
4680A2777459m28463m19122l46073m54020k82562k88149l05372l57337k62303
4671I634058k08073k63416j21073k86700j80453j82963j83634k50987j79436j61927
$$ plain form
4661 7615396 7386109 7226509 7126150 6943525 6785262 6692259 6540216 6360239 6261389 6150276
4651 6150276 6004489 5858486 5855653 5566441 5407586 5374093 5279091 5263731 5122319 4945612
4641 4945612 5017567 4840724 4790417 4621847 4635286 4497770 4406885 4401096 4368931 4105897 4042168
4630 4042168 4035808 3991830 3807557 3771909 3762322 3615082 3601128 3568477 3526668 3326988 3396881
4619 3396881 3310667 3179794 3174951 3045393 3056154 3036758 3033858 2991655 2955911 2851850 2788107
4608 2788107 2830535 2685323 2623066 2667817 2607031 2448107 2543754 2461340 2478422 2467493 2312863
4597 2312863 2360728 2287692 2249019 2157967 2220379 2193870 2084304 2028368 2100292 2071288 1977950
4586 1977950 2014685 1903709 1788122 1831063 1791132 1832796 1753108 1789536 1693519 1686151 1647853
$$ packed form
4661G615396k29287j59600j00359j82625j58263r3003j52043j79977r8850j11113
4651F150276j45787j46003k833k89212j58855l3493r5002j5360j41412j76707
4641D945612P1955j76843n0307j68570J3439j37516r0885n789l2165k63034o3729
4630D042168o360m3978j84273l5648r587j47240j3954l2651m1809j99680O9893
4619C396881q6214j30873m843j29558J0761j9396k900m2203l5744j04061o3743
4608B788107M2428j45212o2257M4751o0786j58924R5647q2414J7082j0929j54630
4597B312863M7865p3036l8673r1052O2412k6509j09566n5936P1924k9004r3338
4586A977950L6735j10976j15587M2941l9931M1664p9688L6428r6017p368l8298
$$ plain form
4575 1647853 1720160 1681152 1690644 1636890 1603135 1633870 1497069 1519754 1481232 1501315 1569225
4564 1569225 1545116 1459029 1545934 1593410 1488402 1680382 1596105 1537784 1537213 1480293 1544347
4553 1544347 1525951 1436061 1436556 1407845 1472095 1481383 1517354 1515644 1590791 1447453 1646637 1638579
4541 1638579 1469947 1542011 1651704 1581314 1717543 1749003 1755750 1789834 1833111 1773429 1748299
4530 1748299 1776735 1672181 1718951 1663109 1645297 1634093 1678802 1602567 1731696 1711700 1741272
4519 1741272 1919382 2042399 2021541 2016777 2044439 2004058 2013643 1942537 1953514 1861019 1905180
4508 1905180 1832997 1883830 1927202 1761254 1777291 1710525 1679755 1723522 1697276 1698421 1674446
4497 1674446 1619561 1605780 1716588 1675967 1604982 1727961 1715251 1753590 1704749 1652095 1743369
$$ packed form
4575A647853P2307l9008R492n3754l3755L0735j36801K2685l8522K0083O7910
4564A569225k4109q6087Q6905M7476j05008J91980q4277n8321n71n6920O4054
4553A544347j8396q9890M95k8711O4250R288L5971j710P5147j43338J99184q058
4541A638579j68632P2064J09693p0390J36229L1460O747L4084M3277n9682k5130
4530A748299K8436j04554M6770n5842j7812j1204M4709p6235J29129j9996K9572
4519A741272J78110J23017k0858m764K7662m0381R585p1106J0977r2495M4161
4508A905180p2183N0833M3372j65948J6037o6766l0770M3767k6246J145k3975
4497A674446n4885j3781J10808m0621p0985J22979j2710L8339m8841n2654R1274
$$ plain form
4486 1743369 1629793 1561612 1593174 1506845 1336097 1382232 1255750 1204805 1192257 1083780 1109533
4475 1109533 1199893 1180621 1212608 1326636 1328445 1214738 1165781 1143969 1140580 950030 1122430
4464 1122430 977766 930680 914193 935784 874296 875467 914827 786444 790186 798538 755323 698795
4452 698795 736472 619754 659119 662233 735426 665622 735625 790381 753008 660869 657646 670492
4440 670492 686024 582919 567503 595167 555079 578323 542842 652848 659967 598608 607845 661130
4428 661130 708346 694187 776139 643004 577715 571774 651020 657474 640721 629108 672099 670391
4416 670391 682552 697900 637110 756649 628654 709766 626875 679209 666210 751617 808162
4405 808162 696935 705328 757974 692218 772268 728687 826846 831821 807204 868558 841266 796879
$$ packed form
4486A743369j13576o8181L1562q6329j70748M6135j26482n0945j2548j08477K5753
4475A109533R0360j9272L1987J14028J809j13707m8957k1812l389j90550J72400
4464A122430j44664m7086j6487K1591o1488J171L9360j28383L742Q352m3215n6528
4452F98795L7677j16718L9365L114P3193o9804P0003N4756l7373r2139l223J2846
4440F70492J5532j03105j5416K7664m0088K3244l5481J10006P119o1359R237N3285
4428F61130M7216j4159Q1952j33135o5289n941P9246O454j6753j1613M2991j708
4416F70391J2161J5348o0790J19539j27995Q1112q2891N2334j2999Q5407N6545
4405H08162j11227Q393N2646o5756Q0050m3581R8159M975k4617O1354k7292m4387
$$ plain form
4393 796879 891228 961031 980683 941343 982268 1083615 1169218 1219110 1217317 1199381 1182216 1128761
4381 1128761 1188767 1155079 1176629 1250934 1276965 1307140 1414271 1595390 1706323 1730258 1575344
4370 1575344 1501600 1407144 1340747 1403060 1533897 1698734 1757691 1888506 1800496 1663789 1733546
4359 1733546 1980652 1932941 1979339 1811944 1717179 1678226 1608710 1555941 1517391 1581111 1689300
4348 1689300 2027632 2309670 2630239 2796483 2640437 2441436 2318278 2138686 1990012 1928456
4338 1928456 2144259 2343551 2727452 2626053 2657066 2402292 2273272 2246022 2234934 2249061
4328 2249061 2197216 2254899 2223077 2515431 2637509 2584396 2541947 2338486 2392672 2361199 2395115
4317 2395115 2519652 2612989 2373869 2272125 2216365 2225623 2207229 2374822 2473570 2560518 2703008
$$ packed form
4393G96879R4349O9803J9652l9340M0925J01347Q5603M9892j793j7936j7165n3455
4381A128761O0006l3688K1550P4305K6031L0175J07131J81119J10933K3935j54914
4370A575344p3744r4456o6397O2313J30837J64837N8957J30815q8010j36707O9757
4359A733546K47106m7711M6398j67395r4765l8953o9516n2769l8550O3720J08189
4348A689300L38332K82038L20569J66244j56046j99001j23158j79592j48674o1556
4338A928456K15803J99292L83901j01399L1013k54774j29020k7250j1088J4127
4328B249061n1845N7683l1822K92354J22078n3113m2449k03461N4186l1473L3916
4317B395115J24537R3337k39120j01744n5760R258j8394J67593R8748Q6948J42490
$$ plain form
4306 2703008 2871385 2722968 2642521 2639150 2637616 2782986 2977630 3186144 3428691 3854727
4296 3854727 4548165 4747382 4750510 4785230 4656420 4729079 5071867 5439794 6001500 6462812
4286 6462812 6852514 6849476 6698316 6068820 5576765 4977307 4432512 3825823 3411993 3040592
4276 3040592 2710448 2570554 2284967 2235757 2127983 1987177 1967318 2070867 2268005 2283601
4266 2283601 2144589 1974161 1727327 1666937 1522102 1421654 1300318 1104327 1169682 1144049
4256 1144049 1097432 1054544 980719 1106544 990186 888994 871797 821424 776604 816638 829641
4245 829641 754061 736434 657122 726163 732872 668589 605081 614442 617800 674273 640657 686226
4233 686226 648918 625466 542120 538071 468751 588098 546424 537569 468312 458235 451181 480692
$$ packed form
4306B703008J68377j48417q0447l371j534J45370J94644K08514K42547M26036
4296C854727O93438J99217L128L4720j28810P2659L42788L67927N61706M61312
4286F462812L89702l038j51160o29496m92055n99458n44795o06689m13830l71401
4276C040592l30144j39894k85587m9210j07774j40806j9859J03549J97138J5596
4266B283601j39012j70428k46834o0390j44835j00448j21336j95991O5355k5633
4256A144049m6617m2888p3825J25825j16358j01192j7197n0373m4820M0034J3003
4245H29641p5580j7627p9312O9041O709o4283o3508R361L358N6473l3616M5569
4233F86226l7308k3452q3346m049o9320J19347m1674q855o9257j0077p054K9511
$$ plain form
4221 480692 469661 390554 300612 368896 355878 344891 299360 332312 325190 365875 287933 344006
4209 344006 403098 372990 305179 263219 282618 315340 295560 360712 268067 346627 257814 284865
4197 284865 182842 302588 343858 323254 180039 238426 167811 187121 237173 221327 216360
4186 216360 175843 225157 216500 176900 261307 247680 132576 184448 182377 218237 122810 182277
4174 182277 207931 218195 206712 83305 192469 150962 123117 134438 169997 122076 140257
4163 140257 161793 116971 156786 72521 162823 167536 190429 132960 129578 49336 184136 136673
4151 136673 60676 76848 -3368 49605 124788 110349 96212 -2892 70385 212155 163018
4140 163018 116567 48741 124944 231710 125271 103035 35830 47048 -15849 66983 26787
$$ packed form
4221D80692j1031p9107q9942O8284j3018j0987m5531L2952p122M0685p7942N6073
4209C44006N9092l0108o7811m1960J9399L2722j9780O5152r2645P8560q8813K7051
4197B84865j02023J19746M1270k0604j43215N8387p0615J9310N0052j5846m967
4186B16360m0517M9314q657l9600Q4407j3627j15104N1872k071L5860r5427N9467
4174A82277K5654J0264j1483j23407J09164m1507k7845J1321L5559m7921J8181
4163A40257K1536m4822L9815q4265R0302M713K2893n7469l382q0242J34800m7463
4151A36673p5997J6172q0216N2973P5183j4439j4137r9104P3277J41770m9137
4140A63018m6451o7826P6203J06766j06439k2236o7205J1218o2897Q2832m0196
$$ plain form
4129 26787 98133 23498 183909 110509 11222 29483 126375 108983 107481 92105 73210 68352
4117 68352 118550 151109 35485 18111 2978 15632 104179 111847 61065 -6977 -11286 18356
4105 18356 46931 -2922 3504 -2976 -62864 131366 106808 20482 69282 4667 39484 20878
4093 20878 85847 -26012 19640 33097 110230 12571 132008 27876 113336 33899 123179
4082 123179 135833 199782 124355 98933 102421 73932 123166 52932 171422 160024 56816
4071 56816 156544 136273 124006 99426 118658 79684 162071 101073 63430 71213 30873 42607
4059 42607 96467 80188 162734 118699 114040 136310 145923 139522 278451 302338 190176 347500
4047 347500 388536 270051 331696 231936 272392 304796 276436 236609 281865 296139 275021
$$ packed form
4129B6787P1346p4635J60411p3400r9287J8261R6892j7392j502j5376j8895m858
4117F8352N0198L2559j15624j7374j5133J2654Q8547P668n0782o8042m309K9642
4105A8356K8575m9853O426o480n9888J94230k4558q6326M8800o4615L4817j8606
4093B0878O4969j11859M5652J3457P7133r7659J19437j04132Q5460p9437Q9280
4082A23179J2654O3949p5427k5422L488k8489M9234p0234J18490j1398j03208
4071E6816R9728k0271j2267k4580J9232l8974Q2387o0998l7643P783m0340J1734
4059D2607N3860j6279Q2546m4035m659K2270R613o401J38929K3887j12162J57324
4047C47500M1036j18485O1645r9760M0456L2404k8360l9827M5256J4274k1118
$$ plain form
4036 275021 211941 251472 176406 258757 215310 242408 245451 168026 199411 195680 247735 314552
4024 314552 271130 238115 257332 195299 383922 355674 480098 463598 402017 435165 447220
4013 447220 505093 495848 501174 426650 446686 454423 494319 407582 355057 501095 530537 473989
4001 473989 461605 605894 447286 471907 545222 535382 527852 645974 680091 715116 885591
3990 885591 999927 923096 865466 897080 795411 773897 665898 550161 505736 412820 539799
3979 539799 440713 402166 444722 375028 371791 517479 442479 477704 499258 546959 630107 547171
3967 547171 709451 722657 718579 690972 652236 621871 567739 539308 540641 465874 412296 269943
3955 269943 316304 373167 347467 274115 330793 203169 299462 238919 307817 240497 252368
$$ packed form
4036B75021o3080L9531p5066Q2351m3447K7098L043p7425L1385l731N2055O6817
4024C14552m3422l3015J9217o2033J88623k8248J24424j6500o1581L3148J2055
4013D47220N7873r245N326p4524K0036P737L9896q6737n2525J46038K9442n6548
4001D73989j2384J44289j58608K4621P3315r840p530J18122L4117L5025J70475
3990H85591J14336p6831n7630L1614j01669k1514j07999j15737m4425r2916J26979
3979E39799r9086l8547M2556o9694l237J45688p5000L5225K1554M7701Q3148q2936
3967E47171J62280J3206m078k7607l8736l0365n4132k8431J333p4767n3578j42353
3955B69943M6361N6863k5700p3352N6678j27624R6293o0543O8898o7320J1871
$$ plain form
3944 252368 188123 207941 227613 209950 180525 155699 171169 121532 35681 156024 -8234
3933 -8234 114588 -794 38572 40268 18223 63663 80297 -43426 -26002 -1426 47500 36382
3921 36382 20442 -9156 -57182 -47529 -35952 -62248 -30550 -19562 18392 -30786 -122941 -92132
3909 -92132 -109412 -79748 -108281 -142407 -179293 -69860 -137498 -66946 -147406 -221470 -156985 -119698
3897 -119698 -23891 -60841 -106666 -170925 -92821 -180998 -173521 -147938 -221236 -201321 -116452 -57510
3885 -57510 -73074 -148430 -40980 -125355 -87948 -147294 -144816 -125748 -150868 -156133 -114909 -80408
3873 -80408 -171388 -174890 -21374 -126818 -83857 -133018 -184660 -153644 -208662 -146952 -106568 -157430
3861 -157430 -126462 -93704 -48864 -52902 -82050 -87659 -133813 -151596 -66953 -185360 -232288 -227898
$$ packed form
3944B52368o4245J9818J9672j7663k9425k4826J5470m9637q5851J20343j64258
3933h234J22822j15382L9366J696k2045M5440J6634j23723J7424K4576M8926j1118
3921C6382j5940k9598m8026R653J1577k6296L1698J0988L7954m9178r2155L0809
3909i2132j7280K9664k8533l4126l6886J09433o7638P0552q0460p4064O4485L7287
3897a19698R5807l6950m5825o4259P8104q8177P477K5583p3298J9915Q4869N8942
3885e7510j5564p5356J07450q4375L7407n9346K478J9068k5120n265M1224L4501
3873h0408r0980l502J53516j05444M2961m9161n1642L1016n5018O1710M0384n0862
3861a57430L0968L2758M4840m038k9148n609m6154j7783Q4643j18407m6928M390
$$ plain form
3849 -227898 -187750 -137702 -82007 -102733 -158867 -114370 -117168 -166842 -205506 -193219 -197259 -258013
3837 -258013 -217161 -89925 -65397 -135953 -139168 -149992 -140115 -75759 -164728 -201811 -167950 -178473
3825 -178473 -151433 -225487 -79633 -226890 -116735 -131613 -75590 -137634 -160868 -164539 -263264
3814 -263264 -201488 -212055 -335483 -229637 -187712 -105645 -158929 -257398 -168808 -196745 -207009
3803 -207009 -274587 -209685 -242266 -183348 -234091 -76821 -152778 -253379 -229205 -229480 -234268 -187688
3791 -187688 -253954 -128059 -168272 -120642 -230152 -240801 -191959 -158019 -172159 -128065 -135128
3780 -135128 -152627 -218178 -204812 -87342 -165817 -178947 -163051 -233569 -231301 -245173 -236755 -226368
3768 -226368 -199521 -176283 -257352 -210579 -125304 -218225 -119617 -227576 -192605 -242243 -145400
$$ packed form
3849b27898M0148N0048N5695k0726n6134M4497k798m9674l8664J2287m040o0754
3837b58013M0852J27236K4528p0556l215j0824R877O4356q8969l7083L3861j0523
3825a78473K7040p4054J45854j47257J10155j4878N6023o2044k3234l671r8725
3814b63264O1776j0567j23428J05846M1925Q2067n3284r8469Q8590k7937j0264
3803b07009o7578O4902l2581N8918n0743J57270p5957j00601K4174k75m788M6580
3791a87688o6266J25895m0213M7630j09510j0649M8842L3940j4140M4094p063
3780a35128j7499o5551J3366J17470p8475j3130J5896p0518K268j3872Q418J0387
3768b26368K6847K3238q1069M6773Q5275r2921R8608j07959L4971m9638R6843
$$ plain form
3757 -145400 -362293 -229310 -206097 -206440 -127932 -211453 -111966 -134645 -161756 -137076 -120454 -265628
3745 -265628 -182438 -171761 -275068 -194746 -89119 -207235 -73052 -143972 -132888 -169933 -170040
3734 -170040 -126446 -135101 -176504 -55228 -145819 -126807 -17300 -110936 -159090 -83893 -151501
3723 -151501 -178920 -200398 -220480 -182961 -117996 -159741 -164474 -47347 -168740 -154605 -150600 -109897
3711 -109897 -205955 -67893 -209389 -213493 -161187 -243099 -193709 -53919 -144250 -172506 -176528
3700 -176528 -108732 -235624 -184011 -168098 -183330 -169690 -119633 -240016 -152094 -123211 -223353
3689 -223353 -241686 -227887 -137638 -92366 -131364 -158066 -106830 -182972 -144386 -174042 -243264 -282475
3677 -282475 -246420 -272375 -275821 -257296 -206684 -181032 -274588 -231520 -200718 -171573 -151171 -275383
$$ packed form
3757a45400k16893J32983K3213l43P8508q3521R9487k2679k7111K4680J6622j45174
3745b65628Q3190J0677j03307Q0322J05627j18116J34183p0920J1084l7045j07
3734a70040M3594q655m1403J21276r0591J9012J09507r3636m8154P5197o7608
3723a51501k7419k1478k0082L7519O4965m1745m733J17127j21393J4135M005M0703
3711a09897r6058J38062j41496m104N2306q1912M9390J39790r0331k8256m022
3700a76528O7796j26892N1613J5913j5232J3640N0057j20383Q7922K8883j00142
3689b23353j8333J3799R0249M5272l8998k6702N1236p6142L8586k9656o9222l9211
3677b82475L6055k5955l446J8525N0612K5652r3556M3068L0802K9145K0402j24212
$$ plain form
3665 -275383 -240585 -234234 -307590 -282898 -209585 -318093 -179000 -248249 -263453 -220804 -268584
3654 -268584 -160163 -201491 -210017 -289995 -355580 -153402 -291600 -396850 -216687 -145727 -224493
3643 -224493 -223728 -175121 -205869 -228223 -208117 -163162 -263871 -186023 -251025 -230928 -177920 -250776
3631 -250776 -263572 -179207 -203505 -193515 -209117 -147060 -222621 -180907 -184116 -280169 -162450 -294922
3619 -294922 -297386 -262548 -293035 -196227 -234944 -147951 -227733 -178660 -267005 -218005 -236001 -275069
3607 -275069 -238296 -294810 -197640 -243799 -258405 -204652 -246284 -156796 -230438 -86749 -264649
3596 -264649 -208310 -349717 -213989 -152245 -256461 -222674 -99900 -68151 -121991 -171517 -156194
3585 -156194 -78984 -145737 -268644 -268359 -202725 -308286 -270417 -234554 -309265 -302612 -179153 -259036
$$ packed form
3665b75383L4798O351p3356K4692P3313j08508J39093o9249j5204M2649m7780
3654b68584J08421m1328q526p9978o5585K02178j38198j05250J80163P0960p8766
3643b24493P65M8607l0748k2354K0106M4955j00709P7848o5002K0097N3008p2856
3631b50776j2796Q4365k4298R990j5602O2057p5561M1714l209r6053J17719j32472
3619b94922k464L4838l0487R6808l8717Q6993p9782M9073q8345M9000j7996l9068
3607b75069L6773n6514R7170m6159j4606N3753m1632Q9488p3642J43689j77900
3596b64649N6339j41407J35728O1744j04216L3787J22774L1749n3840m9526J5323
3585a56194P7210o6753j22907K85O5634j05561L7869L5863p4711O653J23459p9883
$$ plain form
3573 -259036 -186598 -230808 -191214 -120163 -208757 -234933 -200913 -206106 -253879 -267687 -190698 -214548
3561 -214548 -294147 -284050 -259685 -281027 -185115 -259627 -286915 -222775 -210313 -275366 -211471 -205749
3549 -205749 -261961 -215938 -196878 -231259 -219135 -203315 -328313 -267541 -213037 -250932 -102915
3538 -102915 -223377 -216442 -258112 -277472 -236217 -266964 -227464 -267597 -231285 -135118 -47119 -145922
3526 -145922 -115243 -127093 -100866 -144550 -182562 -234105 -208892 -141631 -142531 -155756 -258232 -193898
3514 -193898 -176531 -119860 -161394 -179115 -185608 -63452 -94771 -234456 -156971 -50685 -58292
3503 -58292 -54913 39919 -33605 244518 342273 331477 187152 81101 -6138 -81 -38087 -112116
3491 -112116 -106366 -132361 -169082 -216519 -251745 -123829 -94387 -77348 -204041 -114432 -65474
$$ packed form
3573b59036P2438m4210L9594P1051q8594k6176L4020n193m7773j3808P6989k3850
3561b14548p9599J0097K4365k1342R5912p4512k7288O4140J2462o5053O3895N722
3549b05749n6212M6023J9060l4381J2124J5820j24998O0772N4504l7895J48017
3538a02915j20462O935m1670j9360M1255l0747L9500m0133L6312R6167Q7999r8803
3526a45922L0679j1850K6227m3684l8012n1543K5213O7261r00j3225j02476O4334
3514a93898J7367N6671m1534j7721o493J22156l1319j39685P7485J06286p607
3503e8292L379R4832p3524K78123R7755j0796j44325j06051q7239O057l8006p4029
3491a12116N750k5995l6721m7437l5226J27916K9442J7039j26693Q9609M8958
$$ plain form
3480 -65474 -16830 62243 122303 12801 -17036 -121371 -181624 -120964 -192166 -40510 -189929
3469 -189929 -202699 -140506 -214751 -237862 -149789 -103973 -156917 -255709 -184007 -245066 -235845 -299548
3457 -299548 -219058 -123559 -210862 -357136 -246370 -129533 -234636 -133666 -163640 -181211 -225967
3446 -225967 -140241 -189467 -122630 -196973 -218238 -182358 -111374 -151482 -154787 -208334 -202131 -187139
3434 -187139 -116826 -179762 -140536 -165619 -121259 -174666 -234216 -96801 -101032 -62961 -110891 -143456
3422 -143456 -106692 -81888 -164978 -61530 -158865 -6018 -31508 -98339 92555 171447 407077
3411 407077 413376 362704 201066 169876 201817 47221 16730 79996 38193 83512 106433
3400 106433 202025 209470 472178 1076051 1805381 1871727 1742008 1386721 845147 587333
$$ packed form
3480f5474M8644P9073O0060j09502k9837j04335o0253O0660p1202J51656j49419
3469a89929j2770O2193p4245k3111Q8073M5816n2944r8792P1702o1059R221o3703
3457b99548Q0490R5499q7303j46274J10766J16837j05103J00970k9974j7571m4756
3446b25967Q5726m9226O6837p4343k1265L5880P0984m0108l305n3547O203J4992
3434a87139P0313o2936L9226k5083M4360n3407n9550J37415m231L8071m7930l2565
3422a43456L6764K4804q3090J03448r7335J52847k5490o6831J90894P8892K35630
3411D07077O299n0672j61638l1190L1941j54596l0491O3266m1803M5319K2921
3400A06433R5592P445K62708O03873P29330O6346j29719l55287n41574k57814
$$ plain form
3390 587333 434016 232818 85257 80089 54671 37079 -46116 25714 36104 -64688 23144
3379 23144 -96298 -128808 -49348 -70968 2563 -73522 10713 8092 51066 75973 -60284 27172
3367 27172 45108 9021 54991 -37034 25729 17733 51808 -4271 71327 111615 377657 371936
3355 371936 444324 540527 434224 315264 245939 221247 185425 102550 74437 87867 80459
3344 80459 24586 50738 -79255 -45128 1207 51885 33225 -22669 113712 -4562 31991
3333 31991 -15851 120315 -95276 37848 29959 60617 96990 143191 175617 69896 174765
3322 174765 107762 152948 162915 259516 228842 112553 355825 301409 324701 372314 459881
3311 459881 516858 709079 881847 1129439 1193128 1294807 1223949 1243058 1338335 1546991 1641616
$$ packed form
3390E87333j53317k01198j47561n168k5418j7592q3195P1830J0390j00792Q7832
3379B3144j19442l2510P9460k1620P3531p6085Q4235k621M2974K4907j36257Q7456
3367B7172J7936l6087M5970r2025O2763p996L4075n6079P5598M0288K66042n721
3355C71936P2388R6203j06303j18960o9325k4692l5822q2875k8113J3430p408
3344H0459n5873K6152j29993L4127M6335N0678j8660n5894J36381j18274L6553
3333C1991m7842J36166k15591J33124p889L0658L6373M6201L2426j05721J04869
3322A74765o7003M5186R967R6601l0674j16289K43272n4416K3292M7613Q7567
3311D59881N6977J92221J72768K47592O3689J01679p0858J9109R5277K08656R4625
$$ plain form
3300 1641616 1977751 2499571 3174303 5008732 10706803 17665155 18302925 17544136 13409146
3291 13409146 9330254 6621777 4796016 3488701 2558298 1901420 1461843 1166930 1102076
3282 1102076 1218194 1107606 1041736 747934 676177 700835 523521 442163 441905 330715 270512
3271 270512 251292 212335 280874 193264 208831 173835 171502 105234 127681 79825 75043 112351
3259 112351 -46817 18345 -60514 22977 40247 -18007 -31360 75935 44481 -87364 -27696
3248 -27696 54286 24400 14434 -23555 75152 31575 55919 -95043 -141470 -75551 51605 -139988
3236 -139988 -171396 -76274 -137209 -126227 -151034 -87473 -98953 -136198 -51150 -61801 -141427 -176716
3224 -176716 -135472 -76643 -200761 -161696 -78689 -148313 -148369 -223781 -188978 -162814 -183975 -101252
$$ packed form
3300A641616L36135N21820O74732J834429N698071O958352O37770p58789m134990
3291A3409146m078892k708477j825761j307315r30403o56878m39577k94913o4854
3282A102076J16118j10588o5870k93802p1757K4658j77314q1358k58j11190o0203
3271B70512j9220l8957O8539q7610J5567l4996k333o6268K2447m7856m782L7308
3259A12351j59168O5162p8859Q3491J7270n8254j3353J07295l1454j31845N9668
3248b7696Q1982k9886r966l7989R8707m3577K4344j50962m6427O5919J27156j91593
3236a39988l1408R5122o0935J0982k4807O3561j1480l7245Q5048j0651p9626l5289
3224a76716M1244N8829j24118L9065Q3007o9624n6p5412L4803K6164k1161Q2723
$$ plain form
3212 -101252 -214443 -234679 -234152 -274868 -166294 -210498 -161570 -196267 -245000 -175463 -262516 -236484
3200 -236484 -214883 -273081 -204654 -227023 -270690 -236495 -286920 -259481 -165263 -127583 -147774 -195105
3188 -195105 -275374 -150550 -138065 -231813 -216356 -207905 -246980 -288850 -237000 -204132 -156276 -181556
3176 -181556 -151938 -310941 -208181 -204817 -211130 -177001 -265162 -121211 -196787 -228236 -234197 -261053
3164 -261053 -211523 -224477 -202758 -324326 -298522 -241050 -243925 -284805 -197857 -306397 -209172
3153 -209172 -184909 -264007 -349070 -318927 -247853 -155806 -234753 -292263 -218383 -236199 -298023 -322895
3141 -322895 -360890 -362667 -230385 -260565 -278211 -247416 -326016 -199060 -344937 -292834 -356969
3130 -356969 -286507 -251617 -335843 -270975 -265310 -260668 -283230 -309565 -306888 -200741 -220782 -303533
$$ packed form
3212a01252j13191k0236N27m0716J08574m4204M8928l4697m8733O9537q7053K6032
3200b36484K1601n8198O8427k2369m3667L4195n0425K7439R4218L7680k0191m7331
3188a95105q0269J24824J2485r3748J5457Q451l9075m1870N1850L2868M7856k5280
3176a81556K9618j59003J02760L364o313L4129q8161J43951p5576l1449n961k6856
3164b61053M9530j2954K1719j21568K5804N7472k875m0880Q6948j08540R7225
3153b09172K4263p9098q5063L0143P1074R2047p8947n7510P3880j7816o1824k4872
3141c22895l7995j777J32282l0180j7646L0795p8600J26956j45877N2103o4135
3130c56969P0462L4890q4226O4868N665M642k2562k6335K677J06147k0041q2751
$$ plain form
3118 -303533 -270535 -403300 -189965 -156788 -258389 -276524 -233292 -259259 -336019 -239070 -395131
3107 -395131 -297018 -337845 -263511 -289911 -333440 -231424 -329775 -326959 -291364 -310509 -351806 -336261
3095 -336261 -290524 -333649 -205164 -290802 -223670 -311821 -302803 -220726 -192044 -188796 -293017 -303358
3083 -303358 -316311 -204490 -243450 -270307 -288277 -288970 -292387 -312623 -300550 -330112 -310556 -376219
3071 -376219 -291460 -157960 -257599 -304167 -277040 -267704 -146050 -240274 -423185 -232353 -225974
3060 -225974 -180346 -116083 -188548 -272638 -226611 -291134 -244030 -272816 -194827 -279448 -301887 -279676
3048 -279676 -294276 -267409 -189214 -266999 -318371 -241470 -270195 -269532 -215105 -226442 -230773 -300648
3036 -300648 -307181 -211887 -294923 -341453 -302161 -331774 -304003 -218572 -209561 -242500 -246145 -339728
$$ packed form
3118c03533L2998j32765K13335L3177j01601j8135M3232k5967p6760R6949j56061
3107c95131R8113m0827P4334k6400m3529J02016r8351K816L5595j9145m1297J5545
3095c36261M5737m3125J28485q5638O7132q8151R018Q2077K8682L248j04221j0341
3083c03358j2953J11821l8960k6857j7970o93l417k0236J2073k9562J9556o5663
3071c76219Q4759J33500r9639m6568K7127R336J21654r4224j82911J90832O379
3060b25974M5628O4263p2465q4090M6027o4523M7104k8786P7989q4621k2439K2211
3048b79676j4600K6867P8195p7785n1372P6901k8725O63N4427j1337m331o9875
3036c00648o533R5294q3036m6530L9292k9613K7771Q5431R011l2939l645r3583
$$ plain form
3024 -339728 -335444 -317460 -374855 -394963 -355468 -360491 -257542 -237705 -317781 -272407 -280572 -356708
3012 -356708 -366936 -264378 -274106 -275816 -308399 -339792 -272635 -307192 -181351 -273973 -316022 -258122
3000 -258122 -225406 -360358 -260564 -220697 -232092 -251110 -338730 -227242 -322219 -311411 -256336
2989 -256336 -276705 -300952 -338060 -253768 -342725 -304904 -363387 -213798 -305042 -291708 -269520
2978 -269520 -353306 -240008 -275001 -302269 -245759 -329946 -276380 -285839 -279071 -327673 -403663 -281690
2966 -281690 -290812 -334714 -394770 -264124 -272665 -290625 -321492 -275128 -318842 -331399 -253767 -256396
2954 -256396 -327314 -233202 -365691 -358420 -371161 -287220 -251528 -229942 -205837 -227978 -352172
2943 -352172 -357064 -377382 -308555 -319011 -400512 -236701 -283226 -368821 -262423 -342559 -263906
$$ packed form
3024c39728M284J7984n7395k0108L9495n023J02949J9837q0076M5374q165p6136
3012c56708j0228J02558r728j710l2583l1393O7157l4557J25841r2622m2049N7900
3000b58122L2716j34952R9794L9867j1395j9018q7620J11488r4977J0808N5075
2989b56336k0369k4247l7108Q4292q8957L7821n8483J49589r1244J3334K2188
2978b69520q3786J13298l4993k7268N6510q4187N3566r459O768m8602p5990J21973
2966b81690r122m3902o0056J30646q541j7960l0867M6364m3714j2557P7632k629
2954b56396p0918R4112j32489P271j2741Q3941L5692K1586K4105k2141j24194
2943c52172m892k0318O8827j0456q1501J63811m6525q5595J06398q0136P8653
$$ plain form
2932 -263906 -301252 -322953 -322519 -301467 -270950 -255926 -303561 -327593 -292011 -206775 -261853 -206185
2920 -206185 -241040 -306962 -402991 -231567 -256939 -281211 -383870 -266953 -378090 -352816 -183982
2909 -183982 -300162 -241577 -273142 -239179 -369369 -324433 -263648 -391036 -319924 -257251 -313378
2898 -313378 -275796 -401912 -312705 -299647 -307076 -325225 -364899 -298833 -319338 -316632 -273296 -315467
2886 -315467 -293316 -285636 -274425 -334831 -270194 -360574 -268637 -287871 -217736 -255193 -185452 -272384
2874 -272384 -247326 -295879 -306419 -253023 -355233 -334314 -281194 -314928 -362767 -295046 -338401
2863 -338401 -227009 -301946 -305293 -261942 -360722 -332126 -302387 -234069 -302306 -320653 -289054 -272054
2851 -272054 -272714 -262570 -222056 -299272 -200216 -334356 -213183 -344117 -312357 -215345 -251254
$$ packed form
2932b63906l7346k1701M34K1052L0517J5024m7635k4032L5582Q5236n5078N5668
2920b06185l4855o5922r6029J71424k5372k4272j02659J16917j11137K5274J68834
2909a83982j16180N8585l1565L3963j30190M4936O0785j27388P1112O2673n6127
2898c13378L7582j26116Q9207J3058p429j8149l9674O6066k0505K706M3336m2171
2886c15467K2151P680J1211o0406O4637r0380R1937j9234P0135l7457O9741q6932
2874b72384K5058m8553j0540N3396j02210K0919N3120l3734m7839O7721m3355
2863c38401J11392p4937l347M3351r8780K8596K9739O8318o8237j8347L1599J7000
2851b72054o60J0144M0514p7216R9056j34140J21173j30934L1760R7012l5909
$$ plain form
2840 -251254 -309356 -319275 -175949 -226612 -336598 -445030 -354047 -294334 -284536 -363397 -316804
2829 -316804 -277115 -326151 -291273 -303415 -310534 -348457 -339971 -389746 -411115 -408081 -237478 -367262
2817 -367262 -302469 -283297 -313613 -247502 -311107 -299366 -349781 -295153 -312444 -309359 -339429 -264714
2805 -264714 -344763 -313043 -328002 -337947 -284813 -278276 -277876 -269224 -235977 -276775 -348738 -300698 -266564
2792 -266564 -287797 -342319 -331299 -338804 -215487 -326249 -290297 -307884 -315604 -308151 -355429 -274264
2780 -274264 -270666 -252412 -289874 -329459 -297807 -213976 -315755 -345225 -300133 -262132 -270457 -342434
2768 -342434 -274445 -273260 -304161 -261116 -304036 -336561 -242571 -291920 -252807 -282312 -355984 -308260
2756 -308260 -208022 -278291 -305463 -340893 -338754 -302198 -298138 -391358 -287232 -312784 -275467 -408248
$$ packed form
2840b51254n8102r919J43326n0663j09986j08432R0983N9713R798p8861M6593
2829c16804L9689m9036L4878j2142p119l7923Q486m9775k1369L034J70603j29784
2817c67262O4793J9172l0316O6111o3605J1741n0415N4628j7291L085l0070P4715
2805b64714q0049L1720j4959r945N3134O537M00Q652L3247m0798p1963M8040L4134
2792b66564k1233n4522J1020p505J23317j10762L5952j7587p720P453m7278Q1165
2780b74264L598J8254l7462l9585L1652Q3831j01779k9470M5092L8001q325p1977
2768c42434O7989J185l0901M3045m2920l2525R3990m9349L9113k9505p3672M7724
2756c08260J00238p0269k7172l5430K139L6556M060r3220J04126k5552L7317j32781
$$ plain form
2744 -408248 -303845 -338386 -286867 -347566 -273845 -338970 -299927 -349204 -343483 -315608 -327612 -301993
2732 -301993 -288506 -276906 -300473 -283542 -296546 -325165 -269216 -374609 -264230 -271867 -292199
2721 -292199 -217041 -338839 -299397 -380196 -284871 -321188 -344589 -407557 -326606 -373916 -369273 -351935
2709 -351935 -425411 -238229 -354164 -313342 -297317 -267971 -289777 -218609 -255424 -356904 -295132
2698 -295132 -258987 -325769 -293491 -304055 -307274 -218418 -292752 -282084 -297083 -221741 -276280 -317857
2686 -317857 -334558 -254611 -320658 -317152 -266454 -253959 -244425 -292147 -310341 -300904 -312244 -284806
2674 -284806 -278727 -333335 -338794 -317735 -357640 -318986 -349183 -211785 -298128 -331140 -279353 -230862
2662 -230862 -335605 -337147 -331451 -333869 -274934 -249942 -287659 -266786 -268385 -366663 -276661 -234938
$$ packed form
2744d08248J04403l4541N1519o0699P3721o5125L9043m9277N721K7875j2004K5619
2732c01993J3487J1600k3567J6931j3004k8619N5949j05393J10379p637k0332
2721b92199P5158j21798L9442q0799R5325l6317k3401o2968Q0951m7310M643J7338
2709c51935p3476J87182j15935M0822J6025K9346k1806P1168l6815j01480O1772
2698b95132L6145o6782L2278j0564l219Q8856p4334J0668j4999P5342n4539m1577
2686c17857j6701P9947o6047L506N0698J2495R534m7722j8194R437j1340K7438
2674b84806O079n4608n459K1059l9905L8654l0197J37398q6343l3012N1787M8491
2662b30862j04743j542N696k418N8935K4992l7717K0873j599r8278R0002M1723
$$ plain form
2650 -234938 -227448 -214670 -325424 -300835 -349489 -399552 -356520 -238134 -305449 -364648 -343066
2639 -343066 -355963 -346973 -262016 -360947 -278592 -293918 -425651 -281477 -355833 -279781 -326235
2628 -326235 -304577 -331682 -353877 -217863 -248463 -276178 -362053 -316322 -415040 -223205 -323172
2617 -323172 -376696 -351701 -332878 -332335 -361126 -311016 -365363 -310131 -360280 -324678 -263158 -322478
2605 -322478 -364947 -330387 -323804 -382804 -323168 -358241 -355175 -308360 -338970 -288957 -257932 -325721
2593 -325721 -325569 -285361 -349179 -354689 -274726 -269932 -367568 -258416 -326750 -329311 -294621 -297898 -360298
2580 -360298 -257730 -221035 -309924 -293281 -373860 -307792 -335701 -322365 -284203 -410697 -267337
2569 -267337 -327980 -313074 -258120 -231554 -274483 -246387 -323157 -268510 -354213 -291142 -334334 -299750
$$ packed form
2650b34938P490J2778j10754K4589m8654n0063M3032J18386o7315n9199K1582
2639c43066j2897Q990Q4957r8931Q2355j5326j31733J44174p4356P6052m6454
2628c26235K1658k7105k2195J36014l0600k7715q5875M5731r8718J91835r9967
2617c23172n3524K4995J8823N43k8791N0110n4347N5232n0149L5602O1520n9320
2605c22478m2469L4560O583n9000N9636l5073L066M6815l0610N0013L1025o7789
2593c25721J52M0208o3818n510P9963M794r7636J09152o8334k561L4690l277o2400
2580c60298J02568L6695q8889J6643q0579O6068k7909J3336L8162j26494J43360
2569b67337o0643J4906N4954K6566m2929K8096p6770N4647q5703O3071m3192L4584
$$ plain form
2557 -299750 -352595 -331810 -326344 -307010 -271382 -277371 -315893 -284512 -341389 -290413 -327969 -315381
2545 -315381 -270777 -349887 -238212 -329263 -314315 -341483 -254149 -330636 -349161 -302184 -220103
2534 -220103 -251417 -263791 -248714 -370750 -231988 -224646 -169816 -326946 -350387 -355816 -347574 -276468
2522 -276468 -362073 -295801 -364805 -288972 -177315 -273825 -213969 -378833 -424667 -340646 -298597
2511 -298597 -308204 -272564 -261233 -371451 -283343 -275110 -221339 -359210 -324260 -307367 -262194 -265655
2499 -265655 -277984 -361796 -323474 -252749 -265884 -311885 -391920 -276988 -272543 -333301 -248376 -308332
2487 -308332 -278618 -255204 -305310 -225121 -298146 -352639 -277825 -337051 -317642 -354637 -348912 -205881
2475 -205881 -333460 -317965 -280503 -324053 -304559 -321162 -285060 -322623 -313672 -313092 -323714 -375804
$$ packed form
2557b99750n2845K0785N466J9334L5628n989l8522L1381n6877N0976l7556J2588
2545c15381M4604p9110J11675r1051J4948k7168Q7334p6487j8525M6977Q2081
2534b20103l1314j2374J5077j22036J38762P342N4830j57130k3441n429Q242P1106
2522b76468q5605O6272o9004P5833J11657r6510N9856j64864m5834Q4021M2049
2511b98597r607L5640J1331j10218Q8108Q233N3771j37871L4950J6893M5173l461
2499b65655j2329q3812L8322P0725j3135m6001q0035J14932M445o0758Q4925n9956
2487c08332K9714K3414n0106Q0189p3025n4493P4814n9226J9409l6995N725J43031
2475b05881j27579J5495L7462m3550J9494j6603L6102l7563Q951N80j0622n2090
$$ plain form
2463 -375804 -274918 -249051 -228202 -320103 -290459 -343364 -301590 -366062 -346747 -268042 -331882
2452 -331882 -331728 -289384 -343204 -337986 -278210 -249077 -318244 -209995 -297367 -321376 -284565 -254096
2440 -254096 -330478 -289191 -295191 -336910 -317478 -289310 -290240 -363017 -362488 -272987 -352391 -387145 -343824
2427 -343824 -287714 -308621 -319218 -270039 -375278 -252621 -261160 -283397 -341210 -307442 -308782 -345784
2415 -345784 -318866 -277879 -351023 -280825 -375549 -337968 -346236 -212579 -161633 -302813 -306756 -277749
2403 -277749 -378880 -300689 -287650 -312229 -352094 -417117 -360922 -279005 -299230 -336919 -401282
2392 -401282 -301783 -262060 -281728 -284132 -367269 -322492 -326196 -379361 -250384 -389613 -289499
2381 -289499 -319253 -253406 -328782 -291522 -269023 -322736 -318319 -304129 -216411 -418108 -321932 -338030
$$ packed form
2463c75804J00886K5867K0849r1901K9644n2905M1774o4472J9315P8705o3840
2452c31882J54M2344n3820N218N9776K9133o9167J08249q7372k4009L6811L0469
2440b54096p6382M1287o000m1719J9432K8168r30p2777N29Q9501p9404l4754M3321
2427c43824N6110k0907j0597M9179j05239J22657q539k2237n7813L3768j340l7002
2415c45784K6918M0987p3144P0198r4724L7581q268J33657N0946j41180l943K9007
2403b77749j01131P8191J3039k4579l9865o5023N6195Q1917k0225l7689o4363
2392d01282R9499L9723j9668k404q3137M4777l704n3165J28977j39229J00114
2381b89499k9754O5847p5376L7260K2499n3713M417J4190Q7718k01697R6176j6098
$$ plain form
2369 -338030 -285646 -341837 -232547 -287714 -293355 -322407 -266200 -367621 -269641 -335806 -288117
2358 -288117 -442146 -334809 -427615 -357272 -377342 -255214 -395244 -290547 -276614 -334398 -361576
2347 -361576 -352068 -368912 -274768 -246017 -369657 -235600 -372410 -375393 -305742 -239875 -379612
2336 -379612 -311193 -313748 -441959 -261982 -396058 -250227 -287913 -361537 -350282 -282269 -274414
2325 -274414 -326250 -437290 -323792 -308698 -344753 -339034 -318214 -269740 -315158 -300928 -272436
2314 -272436 -310381 -233485 -379079 -267894 -336925 -320631 -368125 -432986 -396594 -268576 -398380
2303 -398380 -324715 -333470 -277309 -349756 -331062 -295382 -349217 -325534 -382979 -321168 -369552 -318018
2291 -318018 -382631 -405400 -274542 -358156 -279313 -333028 -328196 -307298 -301222 -293567 -314079 -328987
$$ packed form
2369c38030N2384n6191J09290n5167n641k9052N6207j01421R7980o6165M7689
2358b88117j54029J07337r2806P0343k0070J22128j40030J04697J3933n7784k7178
2347c61576R508j6844R4144K8751j23640J34057j36810k983O9651O5867j39737
2336c79612O8419k555j28211J79977j34076J45831l7686p3624J1255O8013P855
2325b74414n1836j11040J13498J5094l6055N719K0820M8474m5418J4230K8492
2314b72436l7945P6896j45594J11185o9031J6294m7494o4861L6392J28018j29804
2303c98380P3665q755N6161p2447J8694L5680n3835K3683n7445O1811m8384N1534
2291c18018o4613k2769J30858q3614P8843n3715M832K0898O076P655k0512j4908
$$ plain form
2279 -328987 -347966 -296621 -334096 -356248 -317150 -261779 -285693 -358125 -269149 -359487 -292485 -329032
2267 -329032 -212775 -351281 -336297 -389784 -307530 -308897 -240508 -311802 -277636 -319775 -382417
2256 -382417 -300138 -276898 -279424 -327381 -356214 -295534 -265107 -332023 -308598 -233158 -323173 -355431
2244 -355431 -414116 -342497 -370664 -312615 -381219 -325708 -228626 -316822 -218306 -314594 -338316 -324122
2232 -324122 -294027 -324334 -337765 -300669 -290798 -295461 -302946 -287026 -286457 -289525 -313755 -319037 -297018
2219 -297018 -300670 -333964 -269269 -347915 -306370 -268776 -385380 -338349 -415297 -295421 -349218
2208 -349218 -313290 -233061 -300899 -253043 -353250 -327749 -300818 -344131 -270793 -359637 -201911
2197 -201911 -350828 -256721 -404886 -325227 -251010 -285958 -299587 -318179 -317890 -236969 -318123 -269429
$$ packed form
2279c28987j8979N1345l7475k2152L9098N5371k3914p2432Q8976r0338O7002l6547
2267c29032J16257j38506J4984n3487Q2254j367O8389p1294L4166m2139o2642
2256c82417Q2279K3240k526m7957k8833O0680L0427o6916K3425P5440r0015l2258
2244c55431n8685P1619k8167N8049o8604N5511R7082q8196R8516r6288k3722J4194
2232c24122L0095l0307j3431L7096R871m663p485J5920N69l068k4230n282K2019
2219b97018l652l3294O4695p8646M1545L7594j16604M7031p6948J19876n3797
2208c49218L5928Q0229o7838M7856j00207K5501K6931m3313P3338q8844J57726
2197b01911j48917R4107j48165P9659P4217l4948j3629j8592K89Q0921q1154M8694
$$ plain form
2185 -269429 -369765 -260138 -360425 -284644 -274843 -241523 -375763 -366380 -343327 -331214 -252700
2174 -252700 -306762 -302980 -385847 -337622 -343494 -352156 -201835 -266815 -267212 -353538 -362473 -313567 -332713
2161 -332713 -295382 -346650 -322499 -314001 -365829 -305535 -230636 -301174 -184120 -339436 -351245
2150 -351245 -307283 -328363 -418884 -325126 -343699 -295284 -311245 -321639 -310736 -240880 -369580
2139 -369580 -284442 -273489 -337685 -296332 -248158 -362254 -341423 -337263 -352282 -380134 -354473 -335854
2127 -335854 -228178 -342185 -305942 -261193 -413563 -312910 -243694 -375881 -426516 -346604 -348475
2116 -348475 -308426 -339520 -336603 -322815 -193199 -421056 -325580 -340994 -236394 -297812 -284832
2105 -284832 -302669 -285114 -302438 -334184 -356777 -298483 -316322 -287230 -345246 -301556 -274241 -368580
$$ packed form
2185b69429j00336J09627j00287P5781R801L3320j34240R383K3053J2113P8514
2174b52700n4062L782q2867M8225n872q662J50321o4980l97q6326q935M8906j9146
2161c32713L7331n1268K4151Q498n1828O0294P4899p0538J17054j55316j1809
2150c51245M3962k1080r0521R3758j8573M8415j5961j0394J0903O9856j28700
2139c69580Q5138J0953o4196M1353M8174j14096K0831M160j5019k7852K5661J8619
2127c35854J07676j14007L6243M4749j52370J00653O9216j32187n0635P9912j871
2116c48475M0049l1094K917J3788J29616k27857R5476j5414J04600o1418J2980
2105b84832j7837J7555j7324l1746k2593N8294j7839K9092n8016M3690K7315r4339
$$ plain form
2093 -368580 -348649 -401098 -351055 -389509 -324006 -357393 -260259 -342048 -380291 -316725 -274111 -326587
2081 -326587 -331239 -271775 -303321 -354033 -333253 -276204 -280418 -356093 -430271 -347055 -336867 -328870
2069 -328870 -368191 -323501 -285477 -321234 -309652 -300306 -355721 -366799 -366869 -398152 -306667 -377443
2057 -377443 -280752 -305787 -338658 -378670 -322208 -338296 -357974 -363128 -328534 -215078 -276822 -285404
2045 -285404 -179972 -279875 -342943 -320108 -276910 -241804 -286804 -333024 -296633 -283518 -297024
2034 -297024 -351831 -448251 -290252 -393125 -341356 -337601 -343923 -295561 -340139 -276620 -253090 -307490
2022 -307490 -323759 -296389 -360008 -333678 -302574 -328097 -338834 -275921 -359595 -309123 -380968 -304393
2010 -304393 -358528 -264520 -373340 -360099 -326342 -402794 -243689 -297539 -298567 -274817 -301702
$$ packed form
2093c68580J9931n2449N0043l8454O5503l3387R7134q1789l8243O3566M2614n2476
2081c26587m652N9464l1546n0712K0780N7049m214p5675p4178Q3216J0188P997
2069c28870l9321M4690L8024l5757J1582R346n5415j1078p0l1283R1485p0776
2057c77443R6691k5035l2871m0012N6462j6088j9678n154L4594J13456o1744q582
2045b85404J05432r9903o3068K2835M3198L5106m5000m6220L6391J3115j3506
2034b97024n4807r6420J57999j02873N1769L755o322M8362m4578O3519K3530n4400
2022c07490j6269K7370o3619K6330L1104k5523j0737O2913q3674N0472p1845P6575
2010c04393n4135R4008j08820J3241L3757p6452J59105n3850j028K3750k6885
$$ plain form
1999 -301702 -350547 -328528 -272989 -407144 -319910 -347910 -377078 -343236 -388317 -353980 -337388
1988 -337388 -375626 -316027 -382703 -377561 -329444 -374917 -298257 -305207 -271099 -318322 -397972 -325214
1976 -325214 -294223 -301545 -373716 -344660 -325694 -348552 -345291 -350440 -220798 -333928 -342133 -292208
1964 -292208 -364790 -362691 -372649 -310330 -352177 -366632 -258965 -330528 -321864 -344707 -265444 -305647
1952 -305647 -295511 -354440 -312273 -280349 -301499 -312910 -360122 -245349 -324680 -270625 -350279
1941 -350279 -364374 -347130 -387482 -301144 -319785 -308447 -226329 -347607 -398416 -305085 -418716
1930 -418716 -347781 -336401 -418178 -302937 -315609 -382847 -347250 -371907 -327319 -313163 -352599
1919 -352599 -388325 -253776 -276121 -270945 -341276 -362501 -342555 -302914 -409405 -291626 -424553
$$ packed form
1999c01702m8845K2019N5539j34155Q7234k8000k9168L3842m5081L4337J6592
1988c37388l8238N9599o6676N142M8117m5473P6660o950L4108m7223p9650P2758
1976c25214L0991p322p2171K9056J8966k2858L261n149J29642j13130q205M9925
1964b92208p2582K099r958O2319m1847j4455J07667p1563Q664k2843P9263m0203
1952c05647J0136n8929M2167L1924k1150j1411m7212J14773p9331N4055p9654
1941c50279j4095J7244m0352Q6338j8641J1338Q2118j21278n0809R3331j13631
1930d18716P0935J1380q1777J15241j2672o7238L5597k4657M4588J4156l9436
1919c52599l5726J34549k2345N176p0331k1225J9946L9641j06491J17779j32927
$$ plain form
1908 -424553 -291944 -371546 -392868 -347746 -391876 -324902 -393474 -409212 -273406 -408346 -321635
1897 -321635 -321320 -322540 -286276 -292932 -226697 -299633 -251226 -299591 -280209 -314435 -325841 -260567
1885 -260567 -355349 -256222 -309946 -312194 -318086 -345797 -395579 -351805 -365720 -293499 -230251 -273801
1873 -273801 -380422 -397040 -369002 -314285 -226346 -399405 -341717 -339370 -229233 -343804 -357523
1862 -357523 -327427 -347732 -359630 -328569 -323480 -343030 -326830 -303762 -329707 -266453 -289392 -262037
1850 -262037 -331226 -323541 -290559 -278391 -369176 -372278 -357913 -362231 -385960 -381752 -255981 -332262
1838 -332262 -345107 -307226 -381176 -356009 -412393 -325935 -308272 -380100 -334785 -213812 -384335
1827 -384335 -342273 -310308 -424017 -250523 -366560 -349154 -348347 -306922 -258185 -365166 -266625
$$ packed form
1908d24553J32609p9602k1322M5122m4130O6974o8572j5738J35806j34940Q6711
1897c21635L15j220L6264o656O6235p2936M8407m8365J9382l4226j1406O5274
1885b60567r4782R9127n3724k248n892k7711m9782M3774j3915P2221O3248m3550
1873b73801j06621j6618K8038N4717Q7939j73059N7688K347J10137j14571j3719
1862c57523L0096k0305j1898L1061N089j9550J6200K3068k5945O3254k2939K7355
1850b62037o9189P685L2982J2168r0785l102J4365m318k3729M208J25771p6281
1838c32262j2845L7881p3950K5167n6384Q6458J7663p1828M5315J20973j70523
1827c84335M2062L1965j13709J73494j16037J7406Q07M1425M8737j06981R8541
$$ plain form
1816 -266625 -274919 -334922 -400419 -291784 -355238 -348565 -363739 -349127 -265575 -345717 -335617 -366690
1804 -366690 -297045 -326826 -330474 -334266 -281129 -285843 -289555 -372511 -348630 -352981 -356889 -239466 -268198
1791 -268198 -338807 -314735 -376170 -306771 -312017 -340464 -272063 -391538 -368251 -347077 -240234
1780 -240234 -366416 -350305 -396766 -385713 -385332 -442475 -279969 -263207 -276428 -318334 -373045 -335842
1768 -335842 -426618 -354211 -250608 -371821 -374689 -332975 -357715 -350249 -288311 -356661 -311603 -250423
1756 -250423 -404713 -347208 -262743 -315408 -286356 -278663 -401350 -334005 -383568 -322177 -312831 -267261
1744 -267261 -303933 -399094 -241443 -254999 -352927 -333064 -408234 -367268 -278576 -267856 -300920
1733 -300920 -311459 -325382 -291777 -256079 -351625 -304385 -406635 -366841 -280144 -312585 -388611
$$ packed form
1816b66625q294o0003o5497J08635o3454O673j5174J4612Q3552q0142J0100l1073
1804c66690O9645k9781l648l792N3137m714l712q2956K3881m351l908J17423k8732
1791b68198p0609K4072o1435O9399n246k8447O8401j19475K3287K1174J06843
1780b40234j26182J6111m6461J1053L81n7143J62506J6762j3221m1906n4711L7203
1768c35842r0776P2407J03603j21213k868M1714k4740P466O1938o8350M5058O1180
1756b50423j54290N7505Q4465n2665K9052P693j22687O7345m9563O1391R346M5570
1744b67261l6672r5161J57651j3556r7928J9863p5170M0966Q8692J0720l3064
1733c00920j0539j3923L3605L5698r5546M7240j02250L9794Q6697l2441p6026
$$ plain form
1722 -388611 -288442 -347088 -353941 -419981 -391038 -389888 -388681 -369719 -187738 -263334 -356032 -391821
1710 -391821 -407547 -291054 -336887 -316320 -365525 -359452 -345592 -289375 -409279 -264739 -428644
1699 -428644 -330765 -345670 -425511 -214782 -359242 -273430 -326217 -332167 -337710 -321070 -369401 -317183
1687 -317183 -408504 -360047 -304837 -308030 -342712 -256219 -349068 -347832 -301631 -328120 -263404 -285931
1675 -285931 -281532 -329366 -377337 -430294 -376713 -326857 -356241 -388578 -320830 -342354 -308907 -416546
1663 -416546 -324891 -408092 -418540 -342439 -307497 -317931 -287992 -278572 -250181 -315598 -284330 -297071
1651 -297071 -295389 -352104 -365377 -331054 -310927 -368012 -351696 -331064 -339219 -340076 -384823 -317266
1639 -317266 -367883 -267032 -318853 -457310 -340005 -267882 -363085 -372509 -335484 -275597 -345725
$$ packed form
1722c88611J00169n8646o853o6040K8943J150J207J8962J81981p5596r2698l5789
1710c91821j5726J16493m5833K0567m9205O073J3860N6217j19904J44540j63905
1699d28644R7879j4905p9841K10729j44460Q5812n2787n950n543J6640m8331N2218
1687c17183r1321M8457N5210l193l4682Q6493r2849J236M6201k6489O4716k2527
1675b85931M399m7834m7971n2957N3581M9856k9384l2337O7748k1524L3447j07639
1663d16546R1655q3201j0448P6101L4942j0434K9939R420K8391o5417L1268j2741
1651b97071J682n6715j3273L4323K0127n7085J6316K0632q155q57m4747O7557
1639c17266n0617J00851n1821j38457J17305P2123r5203r424L7025N9887p0128
$$ plain form
1628 -345725 -199659 -266121 -333410 -366762 -400157 -319230 -353306 -338928 -344474 -302431 -327078 -285428
1616 -285428 -320168 -360570 -338908 -424676 -377818 -273064 -300934 -381447 -270541 -364207 -444008
1605 -444008 -349132 -328921 -354710 -343431 -336770 -308908 -351268 -291586 -279323 -370967 -302029 -335709
1593 -335709 -371334 -311319 -346331 -290606 -309098 -356867 -306765 -324716 -328438 -280523 -334737 -246056
$$ packed form
1628c45725J46066o6462o7289l3352l3395Q0927l4076J4378n546M2043k4647M1650
1616b85428l4740m0402K1662q5768M6858J04754k7870q0513J10906r3666p9801
1605d44008R4876K0211k5789J1279O661K7862m2360N9682J2263r1644O8938l3680
1593c35709l5625O0015l5012N5725j8492m7769N0102j7951l722M7915n4214Q8681
$$ [...]
##END NTUPLES=NMR SPECTRUM
##END=
