##TITLE=abcd
##JCAMPDX= 6.0         $$ Bruker NMR JCAMP-DX V2.0
##DATA TYPE= NMR SPECTRUM
##DATA CLASS= NTUPLES
##ORIGIN= UXNMR, Bruker Analytische Messtechnik GmbH
##OWNER= root
$$ XWIN-NMR		Version 3.5
$$ Wed Mar  4 17:32:13 2026 Russian Standard Time (UT+4h)  servis@DPX200
##.OBSERVE FREQUENCY= 200.131235884673
##.OBSERVE NUCLEUS= ^1H
##.ACQUISITION MODE= SIMULTANEOUS
##.ACQUISITION SCHEME= undefined
##.AVERAGES= 32
##.DIGITISER RES= 18
##SPECTROMETER/DATA SYSTEM= spect
##.PULSE SEQUENCE= zg
##.SOLVENT NAME= CDCl3
##.SHIFT REFERENCE= (INTERNAL, CDCl3, 0, 16.4885)
##AUDIT TRAIL= $$ (NUMBER, WHEN, WHO, WHERE, WHAT)
$$ ##TITLE= Audit trail, XWIN-NMR		Version 3.5
$$ ##JCAMPDX= 5.01
$$ ##ORIGIN= Bruker BioSpin GmbH
$$ ##OWNER= servis
$$ F:\spectra/data/av/nmr/H1/1/pdata/1/auditp.txt
$$ ##AUDIT TRAIL=  $$ (NUMBER, WHEN, WHO, WHERE, WHAT)
(   1,<2026-03-04 17:31:12.54 +0400>,<servis>,<DPX200>,
      <created by zg, POWCHK disabled, PULCHK disabled
       configuration hash MD5:
       00 E9 B6 7A A2 85 ED C7 34 08 36 98 17 FE 4E 26
       data hash MD5: 32K
       F5 A4 7D EF 04 03 3D 11 F0 CB AA 40 C7 AA A9 92>)
(   2,<2026-03-04 17:31:43.73 +0400>,<servis>,<DPX200>,
      <Start of raw data processing
       efp BC_mod = 2 LB = 0.05 FT_mod = 6 PKNL = 1 PHC0 = -254.5951 PHC1 = -0.898437 SI = 16K 
       data hash MD5: 16K
       EE 3F 52 AC 1E 0A 90 C6 1E 36 F4 A5 59 2C 8F 72>)
$$ ##END=
$$ 
$$ hash MD5
$$ E7 E8 51 E2 E1 0C 71 F5 DA CC BE 33 4F 0A 65 A0
##$RELAX= 
##$RELAX= 
##$RELAX= 
##$RELAX= 
##$RELAX= 
##$RELAX= 
##$RELAX= 
##$RELAX= 
$$ Bruker specific parameters
$$ --------------------------
##$DU= <F:\spectra>
##$EXPNO= 1
##$NAME= <H1>
##$PROCNO= 1
##$TYPE= <nmr>
##$USER= <av>
##$AMP= (0..31)
100 100 100 100 100 100 100 100 100 100 100 100 100 100 100 100 100 100 
100 100 100 100 100 100 100 100 100 100 100 100 100 100 
##$AQSEQ= 0
##$AQ_mod= 1
##$AUNM= <au_zg>
##$AUTOPOS= <>
##$BF1= 200.13
##$BF2= 200.13
##$BF3= 200.13
##$BF4= 200.13
##$BF5= 500.13
##$BF6= 500.13
##$BF7= 500.13
##$BF8= 500.13
##$BYTORDA= 1
##$CFDGTYP= 0
##$CFRGTYP= 5
##$CHEMSTR= <none>
##$CNST= (0..31)
1 1 145 1 1 1 1 1 1 1 1 1 1 1 1 1 1 1 1 1 1 1 1 1 1 1 1 1 1 1 1 1 
##$CPDPRG= <>
##$CPDPRG1= <>
##$CPDPRG2= <>
##$CPDPRG3= <>
##$CPDPRG4= <mlev>
##$CPDPRG5= <mlev>
##$CPDPRG6= <mlev>
##$CPDPRG7= <mlev>
##$CPDPRG8= <mlev>
##$CPDPRGB= <>
##$CPDPRGT= <>
##$D= (0..31)
0 2 0 0 0 0 0 0 0 0.06 0 0 0 0 0 0 0.0002 0 0 0 0 0 0 0 0 0 0 0 0 0 0 
0 
##$DATE= 1772631072
##$DBL= (0..7)
120 120 120 120 120 120 120 120 
##$DBP= (0..7)
150 150 150 150 150 150 150 150 
##$DBP07= 0
##$DBPNAM0= <>
##$DBPNAM1= <>
##$DBPNAM2= <>
##$DBPNAM3= <>
##$DBPNAM4= <>
##$DBPNAM5= <>
##$DBPNAM6= <>
##$DBPNAM7= <>
##$DBPOAL= (0..7)
0.5 0.5 0.5 0.5 0.5 0.5 0.5 0.5 
##$DBPOFFS= (0..7)
0 0 0 0 0 0 0 0 
##$DE= 6
##$DECBNUC= <off>
##$DECIM= 32
##$DECNUC= <off>
##$DECSTAT= 4
##$DIGMOD= 1
##$DIGTYP= 9
##$DL= (0..7)
0 120 120 120 120 120 120 120 
##$DP= (0..7)
150 150 150 150 150 150 150 150 
##$DP07= 0
$$ [...]
##$SUBNAM4= <"">
##$SUBNAM5= <"">
##$SUBNAM6= <"">
##$SUBNAM7= <"">
##$SUBNAM8= <"">
##$SUBNAM9= <"">
##$SW= 20.6817932712277
##$SWIBOX= (0..15)
0 0 3 0 0 0 0 0 0 0 0 0 0 0 0 0 
##$SW_h= 4139.07284768212
##$TD= 32768
##$TD0= 1
##$TE= 0
##$TE2= 300
##$TE3= 300
##$TEG= 300
##$TL= (0..7)
0 120 120 120 120 120 120 120 
##$TP= (0..7)
150 150 150 150 150 150 150 150 
##$TP07= 0
##$TPNAME0= <>
##$TPNAME1= <>
##$TPNAME2= <>
##$TPNAME3= <>
##$TPNAME4= <>
##$TPNAME5= <>
##$TPNAME6= <>
##$TPNAME7= <>
##$TPOAL= (0..7)
0.5 0.5 0.5 0.5 0.5 0.5 0.5 0.5 
##$TPOFFS= (0..7)
0 0 0 0 0 0 0 0 
##$TUNHIN= 0
##$TUNHOUT= 0
##$TUNXOUT= 0
##$USERA1= <user>
##$USERA2= <user>
##$USERA3= <user>
##$USERA4= <user>
##$USERA5= <user>
##$V9= 5
##$VALIST= <valist>
##$VCLIST= <CCCCCCCCCCCCCCC>
##$VD= 0
##$VDLIST= <DDDDDDDDDDDDDDD>
##$VPLIST= <PPPPPPPPPPPPPPP>
##$VTLIST= <TTTTTTTTTTTTTTT>
##$WBST= 1024
##$WBSW= 30
##$XGAIN= (0..3)
0 0 0 0 
##$XL= 0
##$YL= 0
##$YMAX_a= 332774
##$YMIN_a= -299919
##$ZGOPTNS= <>
##$ZL1= 120
##$ZL2= 120
##$ZL3= 120
##$ZL4= 120
##$ABSF1= 0
##$ABSF2= 0
##$ABSG= 0
##$ABSL= 0
##$ALPHA= 0
##$AQORDER= 0
##$ASSFAC= 0
##$ASSFACI= 0
##$ASSFACX= 0
##$ASSWID= 0
##$AUNMP= <proc_1d>
##$AZFE= 0.1
##$AZFW= 0.1
##$BCFW= 0
##$BC_mod= 2
##$BYTORDP= 0
##$COROFFS= 0
##$CY= 18.4799938201904
##$DATMOD= 1
##$DC= 0
##$DFILT= <>
##$DTYPP= 0
##$F1P= 9.9274215381318
##$F2P= -0.165520771350173
##$FCOR= 1
##$FTSIZE= 16384
##$FT_mod= 6
##$GAMMA= 0
##$GB= 0
##$INTBC= 1
##$INTSCL= 4.127829e-11
##$ISEN= 128
##$LB= 0.05
##$LEV0= 0
##$LPBIN= 0
##$MAXI= 10000
##$MC2= 0
##$MEAN= 0
##$ME_mod= 0
##$MI= 50
##$NCOEF= 0
##$NC_proc= -7
##$NLEV= 6
##$NOISF1= 3.799351
##$NOISF2= 2.8
##$NSP= 0
##$NTH_PI= 0
##$NZP= 0
##$OFFSET= 16.48848
##$PC= 4
##$PHC0= -254.5951
##$PHC1= -0.898437
##$PH_mod= 1
##$PKNL= yes
##$PPARMOD= 0
##$PSCAL= 4
##$PSIGN= 0
##$REVERSE= no
##$SF= 200.130005582386
##$SI= 16384
##$SIGF1= 3
##$SIGF2= 2
##$SINO= 400
##$SIOLD= 16384
##$SREGLST= <1H.CDCl3>
##$SSB= 0
##$STSI= 16384
##$STSR= 0
##$SW_p= 4139.07284768211
##$SYMM= 0
##$S_DEV= 0
##$TDeff= 32768
##$TDoff= 0
##$TI= <>
##$TILT= no
##$TM1= 0
##$TM2= 0
##$TOPLEV= 0
##$USERP1= <user>
##$USERP2= <user>
##$USERP3= <user>
##$USERP4= <user>
##$USERP5= <user>
##$WDW= 1
##$XDIM= 16384
##$YMAX_p= 506822989
##$YMIN_p= -1777366
$$ End of Bruker specific parameters
$$ ---------------------------------
##NTUPLES= NMR SPECTRUM
##VAR_NAME=  FREQUENCY,     SPECTRUM/REAL,   SPECTRUM/IMAG
##SYMBOL=    X,             R,               I
##VAR_TYPE=  INDEPENDENT,   DEPENDENT,       DEPENDENT
##VAR_FORM=  AFFN,          ASDF,            ASDF
##VAR_DIM=   16384,         16384,           16384
##UNITS=     HZ,            ARBITRARY UNITS, ARBITRARY UNITS
##FACTOR=    0.252644378177508, 1,           1
##FIRST=     3299.83951724647, 0,            0
##LAST=      -839.233330435636, 0,           0
##MIN=       -839.233330435636, -1777366,    0
##MAX=       3299.83951724647, 506822989,    0
$$ Real data points
##PAGE= N=1
##DATA TABLE= (X++(R..R)), XYDATA
$$ [...]
7571g05361L95082P0627j5908p11132L65167J18533l11970q5819J35485K49862
$$ -705361 -310279 -239652 -255560 -966692 -601525 -482992 -794962 -880781 -745296 -495434
7561d95434k7311m7744L2894j85312L300j41092J67804L02678k68227K20084o3655
$$ -495434 -522745 -570489 -537595 -722907 -719607 -860699 -692895 -390217 -658444 -438360 -502015
7550e02015L88307j54367l07943q6318J79665O0370n33778J9590N34154k42901
$$ -502015 -113708 -268075 -576018 -662336 -482671 -422301 -956079 -936489 -402335 -645236
7540f45236Q6555K64702J55359n10659J30663j53100L8999n521J47621M6406j10141
$$ -645236 -558681 -293979 -138620 -649279 -518616 -671716 -632717 -638238 -490617 -444211 -554352
7529e54352K01183l26133r1976K17970M46653l10247J93373m81122j09142N59457
$$ -554352 -353169 -679302 -771278 -553308 -106655 -416902 -223529 -704651 -813793 -254336
7519b54336l75669J09535J21926m0090l66450K83864l38362L93783k32220k21911
$$ -254336 -630005 -520470 -398544 -438634 -805084 -521220 -859582 -465799 -698019 -919930
7509i19930M02720J6354J21119r0297j40832p5254L47838n32132O27754o16711
$$ -919930 -517210 -500856 -379737 -470034 -610866 -686120 -338282 -870414 -242660 -859371
7499h59371k53302M51677k21171K20552k03981M0465J97685p4066J76661j30099
$$ -859371 -1112673 -660996 -882167 -661615 -865596 -825131 -627446 -701512 -524851 -654950
7489f54950j79869K73574J85724l96846N71464m84309K43087J0801m31742M52767
$$ -654950 -834819 -561245 -375521 -772367 -200903 -685212 -442125 -431324 -863066 -410299
7479d10299Q5356l45189n5983J26948K43209n6191m41843O48406n58016J45712
$$ -410299 -324943 -670132 -726115 -599167 -355958 -412149 -853992 -205586 -763602 -617890
7469f17890l7801Q2665r7762K8821M58059j18137m86522N7237K79693J42260m5238
$$ -617890 -655691 -573026 -670788 -641967 -183908 -302045 -788567 -731330 -451637 -309377 -354615
7458c54615m74569L56855J60841L0374n68067M87869j70148J61473l02258k4163
$$ -354615 -829184 -472329 -311488 -281114 -849181 -361312 -531460 -369987 -672245 -696408
7448f96408j61057L65828k03168L67447o2283j91858K28185j09465p2050N1094
$$ -696408 -857465 -491637 -694805 -327358 -389641 -581499 -353314 -462779 -534829 -483735
7438d83735o3k42706K03880l88917M55352j44451O776M63826l38945l6061r7199
$$ -483735 -483798 -726504 -522624 -911541 -456189 -600640 -593864 -130038 -468983 -505044 -602243
7427f02243q4313M73280m40455O2166J36404O694n8504M6183j42389K61118k07596
$$ -602243 -686556 -213276 -653731 -591565 -455161 -448467 -506971 -460788 -603177 -342059 -549655
7416e49655j31212N01632l96342l2912k01248L81006j83515K59996j82588P8725
$$ -549655 -680867 -179235 -575577 -608489 -809737 -428731 -612246 -352250 -534838 -456113
7406d56113k80019J92042L12938j74035K18009j70672k58696l17588J44587K59263
$$ -456113 -736132 -544090 -231152 -405187 -187178 -357850 -616546 -934134 -789547 -530284
7396e30284j45301K4571m58198K92907l21024L16973K51068O8405m57537M31584
$$ -530284 -675585 -651014 -1109212 -816305 -1137329 -820356 -569288 -500883 -958420 -526836
7386e26836j4665L395k20958J85628Q4363k6965j34028P9302j40999J23155l8031
$$ -526836 -541501 -538106 -759064 -573436 -489073 -516038 -650066 -570764 -711763 -588608 -626639
7375f26639m0464j00568K45090r5882o7045K74127m18031L61338p5435O221K13386
$$ -626639 -667103 -767671 -522581 -618463 -685508 -411381 -829412 -468074 -543509 -537288 -323902
7364c23902l52288K10508m6410l27626K87260j58954j49574L08274J67366j61856
$$ -323902 -676190 -465682 -512092 -839718 -552458 -711412 -860986 -552712 -385346 -547202
7354e47202q6117J12406m35400L08207L27011J3630j14949m5778O5276j64744
$$ -547202 -633319 -520913 -956313 -648106 -321095 -307465 -422414 -468192 -402916 -567660
7344e67660K8333Q0974l18703J38289K04002n7121l2361p072k15519l7942M23679
$$ -567660 -539327 -458353 -777056 -638767 -434765 -491886 -524247 -531319 -746838 -784780 -361101
7333c61101M9926K1237k42817L15670l28228M444k64098K55737k13862M17246
$$ -361101 -311175 -289938 -532755 -217085 -545313 -540869 -804967 -549230 -763092 -345846
7323c45846P926J79289l10199j31218k80784L55374r8470j49826L33654k19705
$$ -345846 -337920 -158631 -468830 -600048 -880832 -525458 -623928 -773754 -440100 -659805
7313f59805K35442n16956L79819n1474K90847m2779k58321k05033K39018M19447
$$ -659805 -424363 -941319 -561500 -612974 -322127 -364906 -623227 -828260 -589242 -169795
7303a69795o30233J74829n3750K30588j46155L3820j07344M0311L99979o20622
$$ -169795 -800028 -625199 -678949 -448361 -594516 -560696 -668040 -627729 -227750 -848372
7293h48372K15218L2737K62092k58268j57728J67737m9437J01253J29282k24419
$$ -848372 -633154 -600417 -338325 -596593 -754321 -586584 -636021 -534768 -405486 -629905
7283f29905r6321Q9308R8874L449n9971Q5372R2909n5549m35016K35455Q699p8940
$$ -629905 -726226 -636918 -538044 -534595 -594566 -509194 -416285 -471834 -906850 -671395 -662696 -741636
7271g41636N39183o73252j52209L70948J81680j04051k10657N20477m97780K23912
$$ -741636 -202453 -875705 -1027914 -656966 -475286 -579337 -789994 -269517 -767297 -543385
7261e43385K34607k56444P9929j16930M70991k03728k88361K63010j53313K91502
$$ -543385 -308778 -565222 -485293 -602223 -131232 -334960 -623321 -360311 -513624 -222122
7251b22122l49333K88151l42264K82623j13860j99780L40556n62773K30961Q866
$$ -222122 -571455 -283304 -625568 -342945 -456805 -656585 -316029 -878802 -647841 -638975
7241f38975k12176L44649k01410P8326K97800j29704k35363K1919l1568K28518
$$ -638975 -851151 -506502 -707912 -629586 -331786 -461490 -696853 -674934 -706502 -477984
7231d77984m81513J16300L58785k41923N48067j11976k55444J470q5660K796o0895
$$ -477984 -959497 -843197 -484412 -726335 -178268 -290244 -545688 -544218 -629878 -627082 -687977
7220f87977o6678L19407m54488L96346n05896P22982j95613r4702j61054K72781
$$ -687977 -754655 -435248 -889736 -493390 -999286 -276304 -471917 -566619 -727673 -454892
7210d54892l47829k44564L90286J9679j48201L66480j54683r8479j18907L09460
$$ -454892 -802721 -1047285 -656999 -637320 -785521 -419041 -573724 -672203 -791110 -481650
7200d81650j76898k11359l7422M03214r8475j24938l3825L8419J47512N0145P6828
$$ -481650 -658548 -869907 -907329 -504115 -602590 -727528 -761353 -722934 -575422 -525277 -448449
7189d48449m80357L94785O2673k55314J8212l1941p9629K74512k45082j27922
$$ -448449 -928806 -534021 -471348 -726662 -708450 -740391 -820020 -545508 -790590 -918512
7179i18512J44708L5950K0184M43713J6341l70254k1543M19364m71065N1566o6160
$$ -918512 -773804 -737854 -717670 -273957 -257616 -627870 -649413 -230049 -701114 -649548 -715708
7168g15708L79148l34463K28062p3440l92027L67351k33829L43705l34168K56992
$$ -715708 -336560 -671023 -442961 -516401 -908428 -541077 -774906 -431201 -765369 -508377
7158e08377m58727K21063L01228j37669j16286J25213K4625m356J04790j3896
$$ -508377 -967104 -746041 -444813 -582482 -698768 -573555 -548930 -553286 -448496 -462392
7148d62392k20504K98207l56280o11142J042694m06348L43728q44679K21499J27215
$$ -462392 -682896 -384689 -740969 -1352111 -309417 -715765 -372037 -1216716 -995217 -868002
7138h68002J25494q8205P29066n30612m129O2396R990k20963J06627K8382K18923
$$ -868002 -742508 -830713 -101647 -632259 -636388 -573992 -564002 -784965 -678338 -649956 -431033
7127d31033m84678J80343r2137M45233k00145p8965L36156r14990K55911K87526
$$ -431033 -915711 -735368 -827505 -382272 -582417 -661382 -325226 -1240216 -984305 -696779
7117f96779m68488N55860m4645K32898L4756P3292l99480P8877k53771K61116
$$ -696779 -1165267 -609407 -654052 -421154 -386398 -313106 -712586 -633709 -887480 -626364
7107f26364J35460k31034R0309k33160L89869j47188k15102L76363K0080J52041
$$ -626364 -490904 -721938 -631629 -864789 -474920 -622108 -837210 -460847 -440767 -288726
7097b88726m52080J61923l6834J92285M842l49295K55174j76479O7151j5578K06697
$$ -288726 -740806 -578883 -615717 -423432 -418590 -767885 -512711 -689190 -622039 -637617 -430920
7086d30920j39222J6175K63863o87290M68538k5178l53980n3567M15841k30273
$$ -430920 -570142 -553967 -290104 -977394 -508856 -534034 -888014 -941581 -525740 -756013
7076g56013M38077l04934J48110n8728k11492K60791m50401q3554J40053L0786
$$ -756013 -317936 -622870 -474760 -533488 -744980 -484189 -934590 -1018144 -878091 -847305
7066h47305k57292P45970k85693O7734J97118n56713J99485Q9000J0663m2148
$$ -847305 -1104597 -358627 -644320 -576586 -379468 -936181 -736696 -647696 -637033 -679181
7056f79181O192L01185k23045Q4017j52961j59495K72487j51429P2649J40762
$$ -679181 -672989 -371804 -594849 -510832 -663793 -823288 -550801 -702230 -629581 -488819
7046d88819p05435M76423J70401k8256j78202q7379K53448J53493l57757J84079
$$ -488819 -1194254 -717831 -547430 -575686 -753888 -841267 -587819 -434326 -792083 -608004
7036f08004r8482K37726j87854l1655P3346K5837k62353L94841l56641K23018
$$ -608004 -706486 -468760 -656614 -688269 -614923 -589086 -851439 -456598 -813239 -590221
7026e90221J12760P5137o1956j06372k0861m00610O25794j14257Q212k29742P1174
$$ -590221 -477461 -402324 -464280 -570652 -591513 -992123 -366329 -480586 -472374 -702116 -630942
7015f30942k41102K27917N7236K08657m16521K35713k42218L20870m57466L30912
$$ -630942 -872044 -644127 -586891 -378234 -794755 -559042 -801260 -480390 -937856 -606944
7005f06944J92357R7169l49986k43605N12463J2699J0268j52876n0659n768N0615
$$ -606944 -414587 -317418 -667404 -911009 -398546 -385847 -375579 -528455 -579114 -584882 -534267
6994e34267j17845M25628m47728J20828n13212L42242l56987J45893M4498K38314
$$ -534267 -652112 -226484 -674212 -553384 -1066596 -724354 -1081341 -935448 -890950 -652636
6984f52636r9333k07658J59630K88976J34267n13134L19681m28669J87734M15904
$$ -652636 -751969 -959627 -799997 -511021 -376754 -889888 -570207 -998876 -811142 -395238
6974c95238l01585Q6143k9047m7542L26331m18567p204j1887k6889J63481j78541
$$ -395238 -696823 -610680 -639727 -687269 -360938 -779505 -786709 -798596 -825485 -662004 -840545
6963h40545M06223n34760J14438K73552K13049m10589L64330o3011j97210o7122
$$ -840545 -434322 -969082 -854644 -581092 -368043 -778632 -414302 -477313 -674523 -741645
6953g41645L45664m66930O75625j87076m74391M71017l69513J92320K27172j15123
$$ -741645 -395981 -862911 -187286 -374362 -848753 -377736 -747249 -554929 -327757 -442880
6943d42880P66l94679P4567J72461k45594L37771l70137J67798J5326P8660j41763
$$ -442880 -442114 -836793 -762226 -589765 -835359 -497588 -867725 -699927 -684601 -605941 -747704
6932g47704J90766q1287n8244J16004j11658J13401Q8056j87613k49246K58667
$$ -747704 -556938 -638225 -696469 -580465 -692123 -578722 -490666 -678279 -927525 -668858
6922f68858j20752K33057l74966K78659L0053K00112k10022L50598l23125r8810
$$ -668858 -789610 -556553 -931519 -652860 -622807 -422695 -632717 -282119 -605244 -704054
6912g04054m6194O3123J00203L36574o1492m07833K17876o30060Q43386l42044
$$ -704054 -750248 -687125 -586922 -250348 -311840 -719673 -501797 -1131857 -288471 -630515
6902f30515n647J15047o7370k9200k35878O54863n98481o699j76549K20683L49665
$$ -630515 -636162 -521115 -588485 -617685 -853563 -198700 -797181 -803880 -980429 -759746 -410081
6891d10081j95899K58567j09449R6652M3416j08267N8063l93296J81311L18816
$$ -410081 -605980 -347413 -456862 -360210 -316794 -425061 -366998 -760294 -578983 -260167
6881b60167m80346L79693l17762J1345J11328k08160K09889m16105N18007k03389
$$ -260167 -740513 -360820 -678582 -667237 -555909 -764069 -554180 -970285 -452278 -655667
6871f55667j36136K22592K90030k33929n04964P86853j43553j93012j5382l0169
$$ -655667 -791803 -569211 -279181 -513110 -1018074 -231221 -374774 -567786 -583168 -613337
6861f13337J37515j54616j54929J64001L23777N8365n60778J36867K59872P7994
$$ -613337 -475822 -630438 -785367 -621366 -297589 -239224 -800002 -663135 -403263 -325269
6851c25269l60307n4774J71990l74142M82955p4044k72732O91682l57171l03641
$$ -325269 -685576 -740350 -568360 -942502 -459547 -533591 -806323 -114641 -471812 -775453
6841g75453M9866N31195o65035N02324q6787k49311L96087l60736R78506l79169
$$ -775453 -725587 -194392 -859427 -357103 -443890 -693201 -297114 -657850 320656 -58513
6831e8513J61628K5899j96447m0507j37455l4665j80138O3304J50372n14433K67458
$$ -58513 103115 129014 -67433 -107940 -245395 -280060 -460198 -396894 -246522 -760955 -493497
6820d93497K406K85653j01851j51712J51567m519n8158j95970K41951j51068M04177
$$ -493497 -491091 -205438 -307289 -459001 -307434 -311953 -370111 -566081 -324130 -475198 -71021
6809g1021k36699J21372q0352K10948J96597M73481Q43499K29732m36232k96331
$$ -71021 -307720 -186348 -266700 -55752 140845 614326 1457825 1687557 1251325 954994
6799I54994j21146p82780P3675j73103m4407j85192l57545M31215j84899J19224
$$ 954994 833848 51068 124743 -48360 -92767 -277959 -635504 -204289 -389188 -269964
6789b69964k84062Q3191J4160j74266J07215K22643O7500r9513K88445j69584
$$ -269964 -554026 -470835 -456675 -630941 -523726 -301083 -233583 -333096 -44651 -214235
6779b14235M4592K62457o4746L71782R91518L44054p5728j067607k71847K35094
$$ -214235 -169643 92814 28068 399850 1391368 1735422 1659694 592087 320240 555334
6769E55334o07880O2130l29159K71528q00499N83594k21109J56692R6579k3955
$$ 555334 -52546 9584 -319575 -48047 -848546 -264952 -486061 -329369 -232790 -256745
6759b56745k72390j50158L78884o3603L76259j30824J33925j19386l63752K06655
$$ -256745 -529135 -679293 -300409 -364012 12247 -118577 15348 -104038 -467790 -261135
6749b61135L04499k90634M56838O91391m95630n07706Q0660p0959j90055J35537
$$ -261135 43364 -247270 209568 900959 405329 -102377 -21717 -92676 -282731 -147194
6739a47194l2739j74305J88427n5186N9280n50682N87336l31190K03501L67767
$$ -147194 -179933 -354238 -165811 -220997 -161717 -712399 -125063 -456253 -252752 115015
6729A15015m69424K67589N10004k83940N90937m95067J6929j05203k25435Q2758
$$ 115015 -354409 -86820 423184 139244 730181 235114 252043 146840 -78595 4163
6719D163L0781l12918j74727P0603L56280k19816j77155L6912J65888J60814O1466
$$ 4163 34944 -277974 -452701 -382098 -25818 -245634 -422789 -385877 -219989 -59175 2291
6708B291Q618m02027M91568l17615r4418q8620K65722M41165k80279L71124n17546
$$ 2291 10909 -391118 100450 -217165 -311583 -400203 -134481 306684 26405 397529 -120017
6697a20017L06890L91049K80425o29545L01524k01874k81374J4051K1907p7982
$$ -120017 186873 577922 858347 228802 530326 328452 47078 61129 83036 5054
6687E054p18049R64350p07109N59275k22057n1699l25274K39449J58134n743j19463
$$ 5054 -712995 251355 -455754 103521 -118536 -170235 -495509 -256060 -97926 -103669 -223132
6676b23132J6747q0096j00292n8407K81765m51261O61443O7960K41600J77856
$$ -223132 -206385 -286481 -386773 -445180 -163415 -614676 46767 114727 356327 534183
6666E34183r5120r1240l24857j73318J00378J45540l44163L66528P4607J49615
$$ 534183 439063 347823 22966 -150352 -49974 95566 -248597 117931 192538 342153
6656C42153k07953j66787J1536j68277j25312k83029L71943q4261l13098J04865
$$ 342153 134200 -32587 -21051 -189328 -314640 -597669 -225726 -309987 -623085 -518220
6646e18220O5153l57224O21585J45281M3851J21802l46446j57905L57347k49967
$$ -518220 -453067 -810291 -188706 -43425 426 122228 -224218 -382123 -24776 -274743
6636b74743J0048L39783j37193M87561L71845O63315L35874n85791l99008m53591
$$ -274743 -264695 75088 -62105 425456 797301 1460616 1796490 1210699 811691 358100
6626C58100j61083j48693J29992l94095o5967J13163J61383o12614M909L72304
$$ 358100 197017 48324 178316 -215779 -281746 -168583 -7200 -619814 -614905 -242601
6616b42601n37326K99676q8657K18735J43047j21562k44273K06153J03494j8067
$$ -242601 -779927 -480251 -568908 -350173 -207126 -328688 -572961 -366808 -263314 -281381
6606b81381K4466N76307O98758M00486J83642M7913l75341o72375m79025j80916
$$ -281381 -256915 319392 1018150 1418636 1602278 1650191 1274850 602475 123450 -57466
6596e7466j11033n6607j45730j81722N535k68308M21332j52956M21499l65574
$$ -57466 -168499 -225106 -370836 -552558 -547023 -815331 -393999 -546955 -125456 -491030
6586d91030J57423m38087N26710p2034o26797L95431j09824k60352L29319j06357
$$ -491030 -333607 -771694 -244984 -317018 -943815 -548384 -658208 -918560 -589241 -695598
6576f95598L94105J89557k06928K86535k40776k89644O7788K12915l32354J79904
$$ -695598 -301493 -111936 -318864 -32329 -273105 -562749 -494961 -282046 -614400 -434496
6566d34496j672j76804Q6703J91994m12263J64177p8146K30670j70147J68049
$$ -434496 -436168 -612972 -526269 -334275 -746538 -582361 -660507 -429837 -599984 -431935
6556d31935j79639k38683J82380K09940l37321L53244P7872l56967n0859k77808
$$ -431935 -611574 -850257 -667877 -457937 -795258 -442014 -364142 -721109 -771968 -1049776
6546a049776N87722l82821K32777o49064L18256J69351K35125l70718J38847J82731
$$ -1049776 -462054 -844875 -612098 -1261162 -942906 -773555 -538430 -909148 -770301 -587570
6536e87570k95843N37430R8386n04209L00477J63913o8760l16014M94764k12089
$$ -587570 -883413 -345983 -247597 -751806 -451329 -287416 -356176 -672190 -177426 -389515
6526c89515k77513k2176J10145J75823k33471k09331j2624K8716J44242j13013
$$ -389515 -667028 -689204 -579059 -403236 -636707 -846038 -858662 -829946 -685704 -798717
6516g98717J08074j09821J60829k91611K93919j45643j99725J41469Q2929J21280
$$ -798717 -690643 -800464 -639635 -931246 -637327 -782970 -982695 -841226 -758297 -637017
6506f37017Q4672m65967O79089k81459K9143Q0153K75846j74561k7537L6886k33678
$$ -637017 -552345 -1018312 -339223 -620682 -591539 -511386 -235540 -410101 -437638 -400752 -634430
6495f34430J53138l34307j77715N61103J1797m8301K2469l01199l4010J59804
$$ -634430 -481292 -815599 -993314 -432211 -420414 -468715 -446246 -747445 -781455 -621651
6485f21651N2099k00260N8540j0138K50206j62143N1273k19525K24077J48551
$$ -621651 -569552 -769812 -711272 -721410 -471204 -633347 -582074 -801599 -577522 -428971
6475d28971O9562k48214k06248j15430l67694M53501K48646L9954m96711J77088
$$ -428971 -359409 -607623 -813871 -929301 -1296995 -843494 -594848 -554894 -1051605 -874517
6465h74517M31582k18952K71570l28333m00372O62443m04526l26k4948Q941N71851
$$ -874517 -442935 -661887 -390317 -718650 -1119022 -456579 -861105 -861431 -886379 -877438 -305587
6454c05587k55742k62655J4178K78787J18747k39963j17508k7690j44853J62334
$$ -305587 -561329 -823984 -809806 -531019 -412272 -652235 -769743 -797433 -942286 -779952
6444g79952K99480k05436p18K9617j10569J07376R078l9436L59128n36312p6590
$$ -779952 -480472 -685908 -686626 -657009 -767578 -660202 -651124 -690560 -331432 -867744 -944334
6433i44334L92223l93420M98003j26998R656j51735j57955K94066p2292r8781
$$ -944334 -552111 -945531 -447528 -574526 -564870 -716605 -874560 -580494 -652786 -751567
6423g51567P0320p6916k70375O01039k02104k96389J72619R1106J08416n4480
$$ -751567 -681247 -758163 -1028538 -427499 -629603 -925992 -753373 -662267 -553851 -608331
6413f08331j18179N0304l7410n32628P44798j08956l22230J86165J03066j98551
$$ -608331 -726510 -676206 -713616 -1246244 -501446 -610402 -932632 -746467 -643401 -841952
6403h41952R5365k0161L3009K15695j58481J42177j14334J0873N1228l93009K80699
$$ -841952 -746587 -766748 -733739 -518044 -676525 -534348 -648682 -637809 -586581 -979590 -698891
6392f98891k2503P7112m80257N89452k11320N3320j47864m200L33135m05484M1014
$$ -698891 -721394 -644282 -1124539 -535087 -746407 -693087 -840951 -845151 -512016 -917500 -876486
6381h76486J42655O1809l22139j34350J51746P8044J70475M72299n33310l1682
$$ -876486 -733831 -672022 -994161 -1128511 -976765 -898721 -728246 -255947 -789257 -820939
6371h20939K66572m2695n27503K69972L40505O41l73636M57426j29505K24082
$$ -820939 -554367 -597062 -1124565 -854593 -514088 -513447 -887083 -429657 -559162 -335080
6361c35080j55054O5170j76000R9624k55112o4324J09396L06743q52764L10267
$$ -335080 -490134 -424964 -600964 -501340 -756452 -820776 -711380 -404637 -1257401 -947134
6351i47134K33016L1359R4535j00862o879J57732M3148j74399J53532l50319O75996
$$ -947134 -714118 -682759 -588224 -689086 -695965 -538233 -495085 -669484 -515952 -866271 -190275
6340a90275n42816J51844P9080O1418P6679k08148j34587L5752j7276n4831N0057
$$ -190275 -733091 -581247 -502167 -440749 -364070 -572218 -706805 -671053 -688329 -743160 -693103
6329f93103Q0778j32156k4524j98468J62363R1480K43456J6997k9114n28970J03821
$$ -693103 -612325 -744481 -769005 -967473 -805110 -713630 -470174 -453177 -482291 -1011261 -907440
6318i07440K09329J52392k91059N17637k47339k58741K06933J832M48296l96733
$$ -907440 -698111 -545719 -836778 -319141 -566480 -825221 -618288 -616456 -168160 -564893
6308e64893N1256K68895J10842J48860K44579n4150J06441k82654M5244p57646
$$ -564893 -513637 -244742 -133900 14960 259539 205389 311830 29176 74420 -683226
6298f83226J81061R0257o3622R9139j35823R3452k90195L81754j25915N75206
$$ -683226 -502165 -411908 -475530 -376391 -512214 -418762 -708957 -327203 -453118 122088
6288A22088n57753K20024j49629K02374k78779P0885K56707K98253m41571O1623
$$ 122088 -435665 -215641 -365270 -162896 -441675 -370790 -114083 184170 -257401 -195778
6278a95778R08461O49101M45824l80593l38449o24147j83123k97442L73808q32277
$$ -195778 712683 1361784 1807608 1427015 1088566 464419 281296 -16146 357662 -474615
6268d74615K89679l30000L92438N7141J18099n18962M01759m14121J07440O28447
$$ -474615 -184936 -514936 -122498 -65357 52742 -466220 -64461 -478582 -371142 257305
6258B57305n61108P1976M89884k32920j10903L95207k18259M45225L84518R01100
$$ 257305 -303803 -231827 258057 25137 -85766 309441 91182 536407 920925 1822025
6248A822025M03492o66511n02840O1378p10773m54788n2839M63309o01275L65945
$$ 1822025 2225517 1559006 1056166 1117544 406771 -48017 -100856 362453 -238822 127123
6238A27123R331j22316j05461j52444N53270r09961O51086j16989K8054P3646
$$ 127123 136454 14138 -91323 -243767 309503 -600458 50628 -66361 -38307 35339
6228C5339L2109O5889k90564J94124J18023L11450p2281J42968j17992N36149
$$ 35339 67448 133337 -157227 36897 154920 466370 394089 537057 419065 955214
6218I55214k44149j88493n24051J36005J39250O4991k61491p2566Q8575j2034
$$ 955214 711065 522572 -1479 134526 273776 338767 77276 4710 93285 81251
6208H1251M58993k28251R6799j20845Q5227j72808M80542Q1013m55250O4149p0297
$$ 81251 540244 311993 408792 287947 373174 200366 680908 761921 306671 370820 300523
6197C00523M76978l12392K90107L26682j88459M07348k10178L03307K69605l05554
$$ 300523 777501 465109 755216 1081898 893439 1300787 1090609 1393916 1663521 1357967
6187A357967L4806l62978k82333K27316K70398m04216j7252k92861K80550R0183
$$ 1357967 1392773 1029795 747462 974778 1245176 840960 823708 530847 811397 901580
6177I01580m25820K14235K18129k48817J18524K82905j01525O4961O45164o02160
$$ 901580 475760 689995 908124 659307 777831 1060736 959211 1024172 1669336 1067176
6167A067176N14006K98211m20855P13992L03773L40882K68409k01894Q9160k7692
$$ 1067176 1581182 1879393 1458538 2172530 2476303 2817185 3085594 2883700 2972860 2945168
6157B945168P8556l08756j00829m27826k23330m6766k68908M1392p2557m93716
$$ 2945168 3023724 2714968 2614139 2186313 1962983 1916217 1647309 1688701 1616144 1122428
6147A122428j56962J64495n5984J0303L62049m05896L23042q4414m22875P77396
$$ 1122428 965466 1129961 1073977 1084280 1446329 1040433 1363475 1279061 856186 1633582
6137A633582m62379Q1499M66056L19211j34295r9451J39679O40376n5776j31205
$$ 1633582 1171203 1252702 1718758 2037969 1903674 1804223 1943902 2584278 2528502 2397297
6127B397297k89761k34861M1382j85612j19077k22932K51069j46500k15087r5026
$$ 2397297 2107536 1872675 1914057 1728445 1609368 1386436 1637505 1491005 1275918 1180892
6117A180892k78398R659k9530K18478l64329L17643O4571j6483l43916K51975
$$ 1180892 902494 912153 882623 1101101 736772 1054415 1118986 1102503 758587 1010562
6107A010562p2276L32264m68256M93769j38917j08133N9100K67789q6422l73491
$$ 1010562 938286 1270550 802294 1296063 1157146 1049013 1108113 1375902 1289480 915989
6097I15989K69405R3993k51308K75523j48608l01594M14821j29159n0531j70787
$$ 915989 1185394 1279387 1028079 1303602 1154994 853400 1268221 1139062 1088531 917744
6087I17744M84253n29614N1701L96027j31060N38641j01989k89364N56460k43245
$$ 917744 1401997 872383 924084 1320111 1189051 1727692 1625703 1336339 1892799 1649554
6077A649554j78272J47414n3154N98K04453L61146n42389N10051j79985k65690
$$ 1649554 1471282 1618696 1565542 1566140 1770593 2131739 1589350 2099401 1919416 1653726
6067A653726j89985M14583k28331K88698p988K68503j94795K23447j61737J94607
$$ 1653726 1463741 1878324 1649993 1938691 1930703 2199206 2004411 2227858 2066121 2260728
6057B260728K58582j46961O9601K97513L25997k83649J63627P5998J69231J09744
$$ 2260728 2519310 2372349 2441950 2739463 3065460 2781811 2945438 3021436 3190667 3300411
6047C300411j9097k19492O16855K41060n46822K27319J19304J87436M7663L22070
$$ 3300411 3281314 3061822 3678677 3919737 3372915 3600234 3719538 3906974 3954637 4276707
6037D276707j20870l950L96884j44974L78202N787m8775L51951j38668L94457
$$ 4276707 4155837 4151887 4548771 4403797 4781999 4787786 4739011 5090962 4952294 5346751
6027E346751j71144o3894Q4832K30158m67517Q2526J05869Q7425K23195m47634
$$ 5346751 5175607 5111713 5196545 5426703 4959186 5041712 5147581 5235006 5458201 5010567
6017E010567K28816N8810J28628k2367j74759M66804m90642O63793o8142j86188
$$ 5010567 5239383 5298193 5426821 5404454 5229695 5696499 5205857 5869650 5801508 5615320
6007E615320K70652K94521K08201J91752N0229L21785L17941j66727J67067J13950
$$ 5615320 5885972 6180493 6388694 6580446 6630675 6952460 7270401 7103674 7270741 7384691
5997G384691K95061l02774N13885n65398J92117j04545k49318K92942K4013j34380
$$ 7384691 7679752 7376978 7890863 7325465 7517582 7413037 7163719 7456661 7480674 7346294
5987G346294K76846j89410L38101k22595K84950L69900J20774j12226J00755O34887
$$ 7346294 7623140 7433730 7771831 7549236 7834186 8204086 8324860 8212634 8313389 8948276
5977H948276M3211M80002P4307K02756K20976j122J73630J71691J15592P90476
$$ 8948276 8991487 9471489 9545796 9748552 9969528 9968406 10142036 10313727 10429319 11219795
5967A1219795l14097M08882J61974j05656J41995K07872K07979L65218j64429
$$ 11219795 10905698 11314580 11476554 11370898 11512893 11720765 11928744 12293962 12129533
5958A2129533L39444K49225P16174N99516L42263M23004J000152j10933J018599
$$ 12129533 12468977 12718202 13434376 14033892 14376155 14799159 15799311 15688378 16706977
5949A6706977P96278J175383R17235J113288J315076J546333J871122J865295
$$ 16706977 17503255 18678638 19595873 20709161 22024237 23570570 25441692 27306987
5941B7306987K294387K298233L385403M423852N581044O827531Q772207R857871
$$ 27306987 29601374 31899607 35285010 39708862 45289906 52117437 60889644 70747515
5933G0747515J0604241J1770229J1123688J0036145P753551N027800M60941l345219
$$ 70747515 81351756 93121985 104245673 114281818 122035369 127063169 127524110 124178891
5925A24178891n955271p509740q782882r666471q191659p591722o191162m796614
$$ 124178891 118223620 110713880 101930998 92264527 84072868 76481146 70289984 65493370
5917F5493370l091982j911300q61013j837J81522K285887K475675L816938N094632
$$ 65493370 62401388 60490088 59629075 59627238 59808760 62094647 64570322 68387260 73481892
5908G3481892O945806R430262J2562605J5227202J8149591K0914250K2055662
$$ 73481892 80427698 89857960 102420565 117647767 135797358 156711608 178767270
5901A78767270K3602845K2097514J8251675J3551558O980969K97034n802523j2126528
$$ 178767270 202370115 224467629 242719304 256270862 263251831 263548865 257746342 245619814
5893B45619814j7088783j9745849k1221080k1363156j9148415j6737743j4712366
$$ 245619814 228531031 208785182 187564102 166200946 147052531 130314788 115602422
5886A15602422j1256739q428775o764623m700220k933093j621258j43400J241308
$$ 115602422 104345683 95916908 89152285 84452065 81518972 79897714 79754314 80995622
5878H0995622J857841L068524N284648P246994Q712611J0947127J2448315J3807509
$$ 80995622 82853463 85921987 91206635 98453629 107166240 118113367 130561682 144369191
5870A44369191J4427377J4838518J2758084R748439N605389P34030l726070q026988
$$ 144369191 158796568 173635086 186393170 196141609 201746998 202481028 198754958 190727970
5862A90727970j0851526j3160892j4795000j4577284j4399666j2873082j1007059
$$ 190727970 179876444 166715552 151920552 137343268 122943602 110070520 99063461
5855I9063461j0278410p572485p265942n933694m375001l666183k899483k136708
$$ 99063461 88785051 81212566 73946624 68012930 63637929 59971746 57072263 54935555
5847E4935555k142767q40315j112676j27381k74870Q11452M09829R91918J041462
$$ 54935555 52792788 51952473 50839797 50712416 50437546 51248998 51658827 52650745 53692207
5838E3692207K128396J776369K917592K322246K747389J440834J197577L34057
$$ 53692207 55820603 57596972 60514564 62836810 65584199 67025033 68222610 68556667
5830F8556667n71363j444939k492254k415442k652989k154362j497489j738992
$$ 68556667 67985304 66540365 64048111 61632669 58979680 56825318 55327829 53588837
5822E3588837j092258p80932j5074n01163O46362M01020J637147J059848J836995
$$ 53588837 52496579 51715647 51700573 51199410 51845772 52246792 53883939 54943787 56780782
5813E6780782K548815K202391K944824L742846L042774M125695M424051M513650
$$ 56780782 59329597 61531988 64476812 68219658 71262432 75388127 79812178 84325828
5805H4325828M883334M512564M963346M515987M119207L949211M153267M149238
$$ 84325828 89209162 93721726 98685072 103201059 107320266 111269477 115422744 119571982
5797A19571982L567896L930635L712599L879899L541091L840214L996443L991378
$$ 119571982 123139878 127070513 130783112 134663011 138204102 142044316 146040759 150032137
5789A50032137M316161M782012M955395N647795O602142O472657P606182P165471
$$ 150032137 154348298 159130310 164085705 169733500 176335642 182808299 190414481 197579952
5781A97579952P007227O471048N704191M583901K875431K312109K117050J935412
$$ 197579952 204587179 211058227 216762418 221346319 224221750 226533859 228650909 230586321
5773B30586321K499562M127601N507017P220988Q500194P629137O431359L818004
$$ 230586321 233085883 237213484 242720501 249941489 258441683 266070820 272502179 276320183
5765B76320183j11708m793215r099122j1828555j3079445j2439770j1879627r575210
$$ 276320183 276208475 271415260 262316138 250487583 237408138 224968368 213088741 203513531
5757B03513531p936743n828545m491282l653485k414511k564496k028432j753772
$$ 203513531 195576788 189748243 185256961 181603476 179188965 176624469 174596037 172842265
5749A72842265j616524j102783J50379J746678M867135Q419441J1769308J5323027
$$ 172842265 171225741 170122958 170273337 172020015 176887150 185306591 197075899 212398926
5741B12398926J7068209J8257400J7571105J6147053J1445980O474743J344528
$$ 212398926 229467135 247724535 265295640 281442693 292888673 299363416 300707944
5734C00707944m832791r942165j3334705j5894696j6791203j7679321j6791587
$$ 300707944 295875153 285932988 272598283 256703587 239912384 222233063 205441476
5727B05441476j5036628j4404341j1479834j0602074q320204p640252n225781
$$ 205441476 190404848 176000507 164520673 153918599 145598395 137958143 132732362
5720A32732362m048472l675292j705813l12551M83132K790454M148400O749411
$$ 132732362 128683890 125008598 123302785 122990234 123473366 126263820 130412220 137161631
5712A37161631Q536141R992937R701086R426543Q865788O309156L113288q97609
$$ 137161631 145697772 155690709 165391795 174818338 183684126 189993282 193106570 192208961
5704A92208961n959202r389805j2338578j3587162j5033856j4947922j3918305
$$ 192208961 186249759 176859954 164521376 150934214 135900358 120952436 107034131
5697A07034131j2537692j0661958r265225p722877n750785m789830l973280l401254
$$ 107034131 94496439 83834481 74569256 66846379 61095594 56305764 52332484 48931230
5689D8931230k603097k649490k283970j757063j360888j306653j754644j523323
$$ 48931230 46328133 43678643 41394673 39637610 38276722 36970069 35215425 33692102
5681C3692102o45743j077665j066600j257983o86729n06928q69970p62858k98618
$$ 33692102 33046359 31968694 30902094 29644111 28957382 28450454 27580484 26817626 26519008
5672B6519008p29249o91987k01377o76110j24578m59568m05682l21701p15363
$$ 26519008 25789759 25097772 24896395 24220285 24095707 23636139 23230457 22908756 22193393
5663B2193393m15189j97301j42289p99946j27510n56170m13120l85224n97829
$$ 22193393 21778204 21580903 21438614 20638668 20511158 19954988 19541868 19156644 18558815
5654A8558815J85564o72938k05022k11869m8855j96579n02984l3498J821p69389
$$ 18558815 18744379 18071441 17866419 17654550 17605695 17409116 16906132 16872634 16874455 16105066
5644A6105066M71982l59072n23510P53670n10810J64718j33602l39643L80764
$$ 16105066 16577048 16217976 15694466 16448136 15937326 16102044 15968442 15628799 16009563
5635A6009563k00856L20389J10625N6817j39104r6985N9399j53267J71012M51962
$$ 16009563 15808707 16129096 16239721 16296538 16157434 16060449 16119848 15966581 16137593 16589555
5625A6589555l86079k51739N73121l07344K79531K07932m2197L82727L09431O36299
$$ 16589555 16203476 15951737 16524858 16217514 16497045 16704977 16662780 17045507 17354938 17991237
5615A7991237J71132J328977N25653M68650K43471J246021J223055J010895J327087
$$ 17991237 18162369 19491346 20016999 20485649 20729120 21975141 23198196 24209091 25536178
5606B5536178J511586K499124J677064K481844K157652K128346J597895J560399
$$ 25536178 27047764 29546888 31223952 33705796 35863448 37991794 39589689 41150088
5598D1150088J70170j32276J10469o16610j737098n76310j599487j097263q08944
$$ 41150088 41320258 41187982 41298451 40681841 38944743 38368433 36768946 35671683 34862739
5589C4862739q82407m31405R1681M58731N06435J180848M04609J244765J927092
$$ 34862739 33980332 33548927 33640608 34099339 34605774 35786622 36191231 37435996 39363088
5580C9363088J544530K503863K586124K772798L621176L671261L294407M088275
$$ 39363088 40907618 43411481 45997605 48770403 52391579 56062840 59357247 63445522
5572F3445522K952580K968491J420805J415112o1078m7933j470057j880681k122827
$$ 63445522 66398102 69366593 70787398 72202510 72141432 72093499 70623442 68742761 66619934
5563F6619934j949714j989254j699882q86971r16409p3353m9971P56409J610534
$$ 66619934 64670220 62680966 60981084 60094113 59177704 59104351 59054380 59810789 61421323
5554F1421323K284190K217840L513764M208694M674532N599290O662841O061322
$$ 61421323 63705513 65923353 69437117 73645811 78320343 83919633 90582474 96643796
5546I6643796O436095P032777N986932N034536N019230L225598K813325J639462
$$ 96643796 103079891 110112668 116099600 121134136 126153366 129378964 132192289 133831751
5538A33831751J234704P85937J38867K55488J64072Q77473R80827R66472J786424
$$ 133831751 135066455 135852392 135991259 136246747 136410819 137288292 138269119 139235591 141022015
5529A41022015K612304L571641L971430N612211O595589P143737P225118P517366
$$ 141022015 143634319 147205960 151177390 156789601 163385190 170528927 177754045 185271411
5521A85271411O994186O108583M721526J918287m774k043731m271154n373113
$$ 185271411 192265597 198374180 203095706 205013993 205009219 202965488 198694334 193321221
5513A93321221o607169o606502p038333o635650n410569n098405m239831l561705
$$ 193321221 186714052 180107550 173069217 166433567 161022998 155924593 151684762 148123057
5505A48123057l744850l530792l364732l388281l283765l192309l569698l736820
$$ 148123057 144378207 140847415 137482683 134094402 130810637 127618328 124048630 120311810
5497A20311810l870872m342063m585115m147047m812191n472378n227944n206565
$$ 120311810 116440938 112098875 107513760 103366713 98554522 93082144 87854200 82647635
5489H2647635n496715n119137n149515m204581m317490m145549l617329l183086
$$ 82647635 77150920 72031783 66882268 62677687 58360197 54214648 50597319 47414233
5481D7414233l048871k326652j888226j971136k399371j000459j856410j278443
$$ 47414233 44365362 42038710 40150484 38179348 35779977 34779518 32923108 31644665
5473C1644665j168257j082971j503758n76097q78536j181707j130455j036607
$$ 31644665 30476408 29393437 27889679 27313582 26435046 25253339 24122884 23086277
5465B3086277o18615q95761l42764j228196m21247r42551o29300k95667m21941
$$ 23086277 22467662 21571901 21229137 20000941 19579694 18637143 18007843 17712176 17290235
5456A7290235m48283m67577k68065l82528m82301q35022k46576k69288l14850
$$ 17290235 16841952 16374375 16106310 15723782 15241481 14406459 14159883 13890595 13575745
5447A3575745k60916p28464L13087r21532K77734j65792p72665k24573o8750l50407
$$ 13575745 13314829 12586365 12899452 11977920 12255654 12089862 11317197 11092624 11023874 10673467
5437A0673467l21003l12818l58616j54441l85391n87630N55544j42308l88546
$$ 10673467 10352464 10039646 9681030 9526589 9141198 8553568 9109112 8966804 8578258
5428H578258n8066l16716K4219k48493O2263k91065l15207L7282K93031p6488
$$ 8578258 8520192 8203476 8227695 7979202 8041465 7750400 7435193 7472475 7765506 7689018
5418G689018k42139M15587o1183l83004j73460K6173K05232o3816n90158N2753
$$ 7689018 7446879 7862466 7801283 7418279 7244819 7270992 7476224 7412408 6822250 6875003
5408F875003j11206j0165k79442K74516l38066j45260L75544j77616k89597J42933
$$ 6875003 6763797 6753632 6474190 6748706 6410640 6265380 6640924 6463308 6173711 6316644
5398F316644N0910j37078K0257J39415m67673J60104l41130J25586K14610K298
$$ 6316644 6367554 6230476 6250733 6390148 5922475 6082579 5741449 5867035 6081645 6083943
5388F083943J55997k67124J37779N61750r07531M83911K94338n31353K25949m55067
$$ 6083943 6239940 5972816 6110595 6672345 5764814 6248725 6543063 6011710 6237659 5782592
5378E782592J56913m31798R1907J18607l88298L87183j44064j16106L8432J64544
$$ 5782592 5939505 5507707 5599614 5718221 5329923 5717106 5573042 5456936 5495368 5659912
5368E659912M589k54498L29344j55064p43602N64283j19835L78757J72756p2752
$$ 5659912 5664501 5410003 5739347 5584283 4840681 5404964 5285129 5663886 5836642 5763890
5358E763890N99584m28840L62503O1801K95178R4892P1155R4848j90061L96366
$$ 5763890 6363474 5934634 6297137 6358938 6654116 6749008 6820163 6915011 6724950 7121316
5348G121316l00940k2578K97308j21628J86885j06235J93797J79880J33220n2019
$$ 7121316 6820376 6797798 7095106 6973478 7160363 7054128 7247925 7427805 7561025 7509006
5338G509006J63955l9064N24612l47136L12161j78631L38244O67724j88251M25368
$$ 7509006 7672961 7633897 8158509 7811373 8123534 7944903 8283147 8950871 8762620 9187988
5328I187988n9155M59578Q75286r2280Q38189N4411P89070K75939P16414N42357
$$ 9187988 9128833 9588411 10463697 10371417 11209606 11264017 12053087 12329026 13045440 13587797
5318A3587797L25974J065141Q51126O57475J223222J479893Q92634J243105K260827
$$ 13587797 13913771 14978912 15830038 16487513 17710735 19190628 20083262 21326367 23587194
5309B3587194J046995J812377J322623J695432Q33930J784910R08540J030322
$$ 23587194 24634189 26446566 27769189 29464621 30298551 32083461 32992001 34022323
5301C4022323M40027Q03992J24537R51606L02270L63848Q87884R33431J024858
$$ 34022323 34462350 35266342 35390879 36342485 36644755 37008603 37896487 38829918 39854776
5292C9854776J333224J378520J912494J518748K196635K318476K143846J974658
$$ 39854776 41188000 42566520 44479014 45997762 48194397 50512873 52656719 54631377
5284E4631377J435537J306856R87737M04986l88692j255336j238156j722042k186936
$$ 54631377 56066914 57373770 58361507 58766493 58377801 57122465 55884309 54162267 51975331
5275E1975331k740963k356125j982038j955803k015677j463607j348168l64438
$$ 51975331 49234368 46878243 44896205 42940402 40924725 39461118 38112950 37748512
5267C7748512p70893n75181O2585L85263n79381Q2092L07338r8151m19172j0658
$$ 37748512 36977619 36402438 36465023 36850286 36270905 36352997 36660335 36562184 36143012 36132354
5257C6132354p93400j117306j700004j556737j560043j562040j402584j920334
$$ 36132354 35338954 34221648 32521644 30964907 29404864 27842824 26440240 24519906
5249B4519906j771651j342967j192999q72429j261796r70982p01215q59742p66396
$$ 24519906 22748255 21405288 20212289 19339860 18078064 17107082 16405867 15546125 14779729
5240A4779729n70580o40574p29894j34354m63819n39041j77313m82465l60606
$$ 14779729 14209149 13568575 12838681 12704327 12240508 11701467 11524154 11041689 10681083
5231A0681083j6218l56215m61003j43088R2133p37285m24037L08738l90461k19377
$$ 10681083 10664865 10308650 9847647 9704559 9796692 9059407 8635370 8944108 8553647 8334270
5221H334270j24916J41738J57251m85401L22481l81137j38079J20437k3492q4739
$$ 8334270 8209354 8351092 8508343 8022942 8345423 7964286 7826207 7946644 7923152 7838413
5211G838413l28205N49458j6658l49215K39499k30732J64120q2077j98752K42773
$$ 7838413 7510208 8059666 8043008 7693793 7933292 7702560 7866680 7784603 7585851 7828624
5201G828624p4513l8863J26695j54437k63495K69578M01612j80613m49297P34564
$$ 7828624 7754111 7715248 7841943 7687506 7424011 7693589 8095201 7914588 7465291 8199855
5191H199855k26503L59103m16612j08626Q65703p8692K32859j89744L88819k60689
$$ 8199855 7973352 8332455 7915843 7807217 8672920 8594228 8827087 8637343 9026162 8765473
5181H765473P8413M88866l50448L18201O42268J24947J8751K34852K68180L94406
$$ 8765473 8843886 9332752 8982304 9300505 9942773 10067720 10086471 10321323 10589503 10983909
5171A0983909L73584L59794L67182K96371O04950N19436L85344J057683O87322
$$ 10983909 11357493 11717287 12084469 12380840 12985790 13505226 13890570 14948253 15635575
5162A5635575O17774R78010J498449J907098J759296K296229L751628N579845
$$ 15635575 16253349 17231359 18729808 20636906 22396202 24692431 28444059 34023904
5154C4023904N608257P022168N807894L363139r4566k839803m230060m631579
$$ 34023904 39632161 46654329 52462223 55825362 55730796 52890993 48660933 44029354
5146D4029354l678548l296638k118132j285296o47997L29662n97871J36299j05168
$$ 44029354 40350806 37054168 34936036 33650740 33002743 33332405 32734534 32870833 32765665
5137C2765665J07174Q75765P84181J217970J943908K326277L587746L704208N416586
$$ 32765665 32872839 33748604 34532785 35750755 37694663 40020940 43608686 47312894 52729480
5128E2729480Q035329J0654810J3479517J5046054J5294690J5140192J4021279
$$ 52729480 60764809 71419619 84899136 99945190 115239880 130380072 144401351
5121A44401351J2224634O635281k778783j0377609j5808726j5461983j3549446
$$ 144401351 156625985 163261266 160482483 150104874 134296148 118834165 105284719
5114A05284719r736132p984051o429238o000338l407944l131435k171794j160811
$$ 105284719 95548587 87564536 81135298 75134960 71727016 68595581 66423787 65262976
5106F5262976r73365Q78861N53737J977208K869446L295477N105443P726947J0712943
$$ 65262976 64289611 65168472 65722209 67699417 70568863 73864340 78969783 86696730 97409673
5097I7409673J3752160J5444745J6879078J8118298K0621808K0071109J6468076
$$ 97409673 111161833 126606578 143485656 161603954 182225762 202296871 218764947
5090B18764947R093555q45321j1912002k0816097k1852096j9980103j6359574
$$ 218764947 227858502 227013181 215101179 194285082 172432986 152452883 136093309
5083A36093309j3024179j0764155r098314o944393o301624m479878l419633k685399
$$ 136093309 123069130 112304975 103206661 96262268 89960644 85480766 82061133 79375734
5075G9375734j899733j249178P4394P69804O95463J339499K145110L245086N767737
$$ 79375734 77476001 76226823 76301217 77071021 77766484 79105983 81251093 84496179 90263916
5066I0263916Q419302J3621468J6265730J7606879J5309488R179860L167253l819579
$$ 90263916 98683218 112304686 128570416 146177295 161486783 170666643 173833896 170014317
5058A70014317j0571446j3413558j4638203j2641794j0480287r115312p780874
$$ 170014317 159442871 146029313 131391110 118749316 108269029 99153717 91372843
5051I1372843o888287o448761n681125m811633m114545k648476k354265j971361
$$ 91372843 84484556 78035795 72354670 67543037 63428492 60780016 58425751 56454390
5043E6454390j535197j508095j606054j024447j238772k48563M13969J492072
$$ 56454390 54919193 53411098 51805044 50780597 49541825 49293262 49707231 51199303
5035E1199303J761304L353250M074948M319825L769302K814042K93915k012569
$$ 51199303 52960607 56313857 60388805 64708630 68477932 71291974 71585889 69573320
5027F9573320m075180l742310m056911l980039l291932l366666k939813l416532
$$ 69573320 65498140 61755830 57698919 53718880 50426948 47060282 44120469 40703937
5019D0703937k805164k641046k325978k137879j793336j590220p68633j135045
$$ 40703937 37898773 35257727 32931749 30793870 29000534 27410314 26641681 25506636
5011B5506636j283271r18813j469169k05373r12127k92302l50330m60877m83464
$$ 25506636 24223365 23304552 21835383 21630010 20717883 20425581 20075251 19614374 19130910
5002A9130910k80630N26704M0214L9469k59773J87807k44725J54616k22650p94972
$$ 19130910 18850280 19376984 19417198 19456667 19196894 19384701 19139976 19294592 19071942 18276970
4992A8276970m07026l57667p35510q22763p53878j138724n40025n03439l48091
$$ 18276970 17869944 17512277 16776767 15954004 15200126 14061402 13521377 13017938 12669847
4983A2669847p57790q8757l21195l85166l75455J33210k42950k20336j2519m97099
$$ 12669847 11912057 11823300 11502105 11116939 10741484 10874694 10631744 10411408 10398889 9901790
4973I901790K904m29117P65141p67122k92178K81517j47050k4811k8882J22814
$$ 9901790 9904694 9475577 10240718 9473596 9181418 9462935 9315885 9291074 9262192 9385006
4963I385006l11599P9185j84652k63280P7145k82872R5713m13930K472k8697j78970
$$ 9385006 9073407 9152592 8967940 8704660 8781805 8498933 8594646 8180716 8183188 8154491 7975521
4952G975521K42902k75351L44446k33947L49217j32978j928j44139K38064j13068
$$ 7975521 8218423 7943072 8287518 8053571 8402788 8269810 8267882 8123743 8361807 8248739
4942H248739j44919R5972N8069p1120k22567O2428j61376M5358m4410L60837k98952
$$ 8248739 8103820 8199792 8257861 8186741 7964174 8026602 7865226 7910584 7866174 8227011 7928059
4931G928059k22476Q2708k8959K6795J16959r429J19751j61379K91349o3302M19884
$$ 7928059 7705583 7788291 7759332 7786127 7903086 7893657 8013408 7852029 8143378 8080076 8499960
4920H499960j27905J63470J4182J08088n6106n9560l70141O91060Q7017k47791
$$ 8499960 8372055 8535525 8549707 8657795 8601689 8542129 8171988 8863048 8950065 8702274
4910H702274O02055k48520P9477k61015L27271J84368k18764P0497J03668J01065
$$ 8702274 9304329 9055809 9135286 8874271 9201542 9385910 9167146 9237643 9341311 9442376
4900I442376j25540K57881N68876J72235J95549l96088L37913L8845j44005L40635
$$ 9442376 9316836 9574717 10143593 10315828 10511377 10115289 10453202 10492047 10348042 10688677
4890A0688677M93815J82991M29934j52453L04164K74220j84395N50236n82954
$$ 10688677 11182492 11365483 11795417 11642964 11947128 12221348 12036953 12587189 12004235
4881A2004235O80959L0147N57221P1036K22500J17638J93970L63545O3800O36173
$$ 12004235 12685194 12715341 13272562 13343598 13566098 13683736 13877706 14241251 14305051 14941224
4871A4941224M93358L99987N08844K11113M62903O60640P81496K23480R60736
$$ 14941224 15434582 15834569 16343413 16554526 17017429 17678069 18459565 18683045 19643781
4862A9643781M06532J067768J117037Q91755J119144J137908J455024J282972
$$ 19643781 20050313 21118081 22235118 23126873 24246017 25383925 26838949 28121921
4854B8121921O56545J213143J146823J235151R47522J290846J707644K029690
$$ 28121921 28778466 29991609 31138432 32373583 33321105 34611951 36319595 38349285
4846C8349285K292566K262454J320281Q87095J453290J567213J452061K230708
$$ 38349285 40641851 42904305 44224586 45111681 46564971 48132184 49584245 51814953
4838E1814953K746307L261085K081776K233846J494141K042483J362907J649089
$$ 51814953 54561260 57822345 59904121 62137967 63632108 65674591 67037498 68686587
4830F8686587K209733K808253K477335L933745M786334O102377P133874R264910
$$ 68686587 70896320 73704573 76181908 80115653 84901987 91004364 98138238 107403148
4822A07403148J1664357J4734681J6556635J7662698J4701567R456733M917364
$$ 107403148 119067505 133802186 150358821 168021519 182723086 192179819 197097183
4815A97097183K142000J985702L662994N122503P964303J1421716J5391001K0012580
$$ 197097183 199239183 201224885 204887879 210010382 217974685 229396401 244787402 264799982
4807B64799982K2440546K2002466J8708366J1309290L953237k847668o740138
$$ 264799982 287240528 309242994 327951360 339260650 343213887 340366219 333626081
4800C33626081p125477n305246j238926N754234J4822990K8443682M2974754M8872955
$$ 333626081 326500604 321195358 319956432 325710666 340533656 368977338 411952092 460825047
4792D60825047L6385259R612683j8666254l4763999l6238876l1340417k3165259
$$ 460825047 497210306 506822989 488156735 453392736 417153860 385813443 362648184
4785C62648184j5490504o951346L37826P665014J1767441J1580234O853276j66678
$$ 362648184 347157680 340206334 340544160 348209174 359976615 371556849 378410125 378243447
4777C78243447q446618j4807292j7569917j8166377j7248494j4724561j2213032
$$ 378243447 369796829 354989537 337419620 319253243 302004749 287280188 275067156
4770B75067156q935084n619336l411770k012461j809839m859079r457700j2364962
$$ 275067156 266132072 260512736 257100966 255088505 253278666 248419587 238961887 226596925
4762B26596925j4322850j4230999j2930303j0236235q520978o377630n620919
$$ 226596925 212274075 198043076 185112773 174876538 166355560 159977930 154357011
4755A54357011m833869m877606n352332m908294o214128n614394m755320n072376
$$ 154357011 149523142 144645536 139293204 134384910 128170782 122556388 117801068 112728692
4747A12728692m120381m051176l975134m219043l819189l117929k693088k385097
$$ 112728692 108608311 104557135 100582001 96362958 92543769 89425840 86732752 84347655
4739H4347655j398126k408641k729637k895160k540484k602923j933103j781137
$$ 84347655 82949529 80540888 77811251 74916091 72375607 69772684 67839581 66058444
4731F6058444k032764k590667k354035k255319k674981j991352k288070j752878
$$ 66058444 64025680 61435013 59080978 56825659 54150678 52159326 49871256 48118378
4723D8118378k071469j843306j807416j414217k121747j521476r80291r18707
$$ 48118378 46046909 44203603 42396187 40981970 38860223 37338747 36358456 35439749
4715C5439749j394549p52939j333336q89721l89442p41686o96957p94210j56233
$$ 35439749 34045200 33292261 31958925 31069204 30679762 29938076 29241119 28446909 28290676
4706B8290676r22147p80539r53349l63843r37656q75943n63194j37685j373230
$$ 28290676 27368529 26587990 25634641 25270798 24333142 23457199 22894005 22756320 21383090
4697B1383090k06147q29039o42967p20100n67612m83461n31736m81608l87428
$$ 21383090 21176943 20347904 19704937 18984837 18417225 17933764 17402028 16920420 16532992
4688A6532992n87727l12820p18619l66725m74757l98994m26534m96173o6702k84130
$$ 16532992 15945265 15632445 14913826 14547101 14072344 13673350 13246816 12750643 12683941 12399811
4678A2399811m24309n50518j75494J22613l35753k01069k59474m57613J17496
$$ 12399811 11975502 11424984 11249490 11372103 11036350 10835281 10575807 10118194 10235690
4669A0235690n3226l61230p3630l02668K4013q50731J64859p8957p06921J75527
$$ 10235690 10182464 9821234 9747604 9444936 9468949 8618218 8783077 8704120 7997199 8172726
4659H172726J58809j60168p9397n28418J14797j78375j65740j93498k41408j32465
$$ 8172726 8331535 8171367 8091970 7563552 7678349 7499974 7334234 7140736 6899328 6766863
4649F766863K7752k51598k43980M75952k91461k64741r7179P7033n53656K05298
$$ 6766863 6794615 6543017 6299037 6774989 6483528 6218787 6121608 6198641 5644985 5850283
4639E850283m840m3350K68025o37861J69172N3246k28777R1101k58637J31547
$$ 5850283 5845443 5802093 6070118 5432257 5601429 5654675 5425898 5516999 5258362 5389909
4629E389909l27729Q1231n1865k14900l77712L87917j242l76323L16771o6920
$$ 5389909 5062180 5143411 5091546 4876646 4498934 4886851 4885609 4509286 4826057 4759137
4619D759137o01977K22320P6212k69972J50925k47045K52457k40484q3817j53749
$$ 4759137 4157160 4379480 4455692 4185720 4336645 4089600 4342057 4101573 4017756 3864007
4609C864007L24827n96280J69249K92978l18631j6291l88605M31472l90958K72250
$$ 3864007 4188834 3592554 3761803 4054781 3736150 3719859 3331254 3762726 3371768 3644018
4599C644018K34007n62957P4320J47047K01144q8130m52320Q71110p18283k67199
$$ 3644018 3878025 3315068 3389388 3536435 3737579 3649449 3197129 4068239 3349956 3082757
4589C082757J20949J93298R1884j27800P6419K89978o28023M08669l55348k3324
$$ 3082757 3203706 3397004 3488888 3361088 3437507 3727485 3099462 3508131 3152783 3129459
4579C129459M53228j1162K54032k54321j02354N6090l04365J01920M42463k43223
$$ 3129459 3582687 3571525 3825557 3571236 3468882 3524972 3220607 3322527 3764990 3521767
4569C521767m22040K17032k02486K09610k59037K52800J76450o5616N2129L1810
$$ 3521767 3099727 3316759 3114273 3323883 3064846 3317646 3494096 3428480 3480609 3512419
4559C512419m7932J3378l36404P63463n54621M55587k78546K29728R4693l50092
$$ 3512419 3464487 3477865 3141461 3904924 3350303 3805890 3527344 3757072 3851765 3501673
4549C501673J83190L6456m08840m347K00586K68917l86993J09039j45489J1812
$$ 3501673 3684863 3721319 3312479 3308132 3508718 3777635 3390642 3499681 3354192 3366004
4539C366004L84264j81466p5420l40905M20232o0930k83397L03038l89373L40507
$$ 3366004 3750268 3568802 3493382 3152477 3572709 3511779 3228382 3531420 3142047 3482554
4529C482554k04474K79247l05412J25767J06145k55058M7312l46200j9263K4926
$$ 3482554 3278080 3557327 3251915 3377682 3483827 3228769 3276081 2929881 2910618 2935544
4519B935544J75611J39999j4897m9298M59882o43585M3392k04912r3737j98653
$$ 2935544 3111155 3251154 3236257 3186959 3646841 3003256 3046648 2841736 2747999 2549346
4509B549346K20920K29172j87569l87125M77323l69391L14628k58000J37218K4565
$$ 2549346 2770266 2999438 2811869 2424744 2902067 2532676 2847304 2589304 2726522 2751087
4499B751087j96878J46724M2785k98857K1897K1383K0171k11175K9298k43575
$$ 2751087 2554209 2700933 2743718 2444861 2466758 2488141 2508312 2297137 2326435 2082860
4489B082860J39068k1960j8931l39451N53882k35014Q2218l58403p2213J47064
$$ 2082860 2221928 2199968 2181037 1841586 2395468 2160454 2242672 1884269 1812056 1959120
4479A959120j53157J87567K1883q2462k22004J90340j20624p5316k6473m7076
$$ 1959120 1805963 1993530 2015413 1932951 1710947 1901287 1780663 1705347 1678874 1631798
4469A631798J27476j21117q5635O09446m22995O7150j54710L91391k34289l51752
$$ 1631798 1759274 1638157 1552522 2161968 1738973 1806123 1651413 2042804 1808515 1456763
4459A456763L09258J74048j69002q5506L5596k34877J75404L0154K28392k76698
$$ 1456763 1766021 1940069 1771067 1685561 1721157 1486280 1661684 1691838 1920230 1643532
4449A643532K0382p2812J08751J52940M00325O43262R50841L83697q34920p28824
$$ 1643532 1663914 1591102 1699853 1852793 2253118 2896380 3847221 4230918 3395998 2667174
4439B667174n13599J91810m59377q4066k5224k6917M51387n71536j2354M43890
$$ 2667174 2153575 2345385 1886008 1801942 1776718 1749801 2201188 1629652 1617298 2061188
4429B061188k82337J57774J16240j00216j02347J16706J99020J0462J51885m20023
$$ 2061188 1778851 1936625 2052865 1952649 1850302 1967008 2166028 2176490 2328375 1908352
4419A908352N51856m21316O67547J491537J593684N31804k43716j089881j246060
$$ 1908352 2460208 2038892 2706439 4197976 5791660 6323464 6079748 4989867 3743807
4410C743807q72107k90988l1730j84002J71191l86383j9909Q7649J53116N7370
$$ 3743807 2871700 2580712 2548982 2364980 2536171 2149788 2129879 2217528 2370644 2428014
4400B428014O2919j43399K96054O59058K05775R66029R4491l25839m68452l22581
$$ 2428014 2490933 2347534 2643588 3302646 3508421 4474450 4568941 4243102 3774650 3452069
4390C452069j63785R0002L17380O00953M43092k67111l53579n60285l41395j46106
$$ 3452069 3288284 3378286 3695666 4296619 4739711 4472600 4119021 3558736 3217341 3071235
4380C071235j17976J81564l50262J77192o9979l34502K8031J82038j90795J96603
$$ 3071235 2953259 3134823 2784561 2961753 2891774 2557272 2585303 2767341 2576546 2773149
4370B773149L2541J314630J209646J381730L13228l88357o19259j118726m16215
$$ 2773149 2805690 4120320 5329966 6711696 7024924 6636567 6017308 4898582 4482367
4361D482367l34895n84796k88408j41850l85773J76154K156j19336L07009J25108
$$ 4482367 4147472 3562676 3274268 3132418 2746645 2922799 2924955 2805619 3112628 3237736
4351C237736M07660k75911k20714K86196n37840j07873J98519L25264j82360j31229
$$ 3237736 3645396 3369485 3148771 3434967 2897127 2789254 2987773 3313037 3130677 2999448
4341B999448N35742O99893L78864M89074L62718o43450n43347m34376j11867M5700
$$ 2999448 3535190 4235083 4613947 5103021 5465739 4822289 4278942 3844566 3732699 3778399
4331C778399q335k53532m48401L59967J77393R77625M60165M9239J44705n67672
$$ 3778399 3770064 3516532 3068131 3428098 3605491 4583116 5043281 5092520 5237225 4669553
4321D669553m53443k99845q6719J50042m59379P14468k83020J22515J91923L64838
$$ 4669553 4216110 3916265 3829546 3979588 3520209 4234677 3951657 4074172 4266095 4630933
4311D630933L59697J28118k1359P13851K11126O90983Q00208K74260P61698l14716
$$ 4630933 4990630 5118748 5097389 5811240 6022366 6713349 7513557 7787817 8549515 8234799
4301H234799J2257n17015o54343P33225K26469o16062m15104j438560j108516
$$ 8234799 8247056 7730041 7075698 7808923 8035392 7419330 7004226 5565666 4457150
4292D457150o73489p00830J34391m28564j61237k13225l20327K75561j79991q6046
$$ 4457150 3783661 3082831 3217222 2788658 2627421 2414196 2093869 2369430 2189439 2103393
4282B103393M9505k02781k62466J64236J68546M0492J56118l27126L9155l07316
$$ 2103393 2152898 1950117 1687651 1851887 2020433 2060925 2217043 1889917 1929072 1621756
4272A621756l5729P56247N15067N38467k59780m5734p44985r32173J89676k61917
$$ 1621756 1586027 2342274 2857341 3395808 3136028 3090294 2345309 1413136 1602812 1340895
4262A340895J20068j35952j2000k35571K49535k64647J00699l64414N47957m15266
$$ 1340895 1460963 1325011 1313011 1077440 1326975 1062328 1163027 798613 1346570 931304
4252I31304M196K63945P0153m38051J20039K75870k77251Q7353m69496L22683
$$ 931304 935500 1199445 1269598 831547 951586 1227456 950205 1037558 568062 890745
4242H90745K19077k34268j42460j58317m3162N50147k15726j98795m02025N04262
$$ 890745 1109822 875554 733094 574777 531615 1081762 866036 667241 265216 769478
4232G69478J49147j51787l11692j34835M14903k4951j75933J56330n43111M53980
$$ 769478 918625 766838 455146 320311 735214 710263 534330 690660 147549 601529
4222F01529j42666J36838j18604j30242L18057n7880J57554M37656l19377l17468
$$ 601529 458863 595701 477097 346855 664912 607032 764586 1202242 882865 565397
4212E65397k3636K71897k57213K0424K20459k15417k50555K00412m57521K61073
$$ 565397 541761 813658 556445 576869 797328 581911 331356 531768 74247 335320
4202C35320J60314L13914l67747J56902k65202J42079J11605p39924P90892K49788
$$ 335320 495634 809548 441801 598703 333501 475580 587185 -152739 638153 887941
4192H87941l07060Q2956Q5465k25684J11638k05718K65826J87559k64272j32824
$$ 887941 580881 663837 749302 523618 635256 429538 695364 882923 618651 485827
4182D85827K18342j67105J51329m2213m4695l4733K11331o56837j63400N25770
$$ 485827 704169 537064 688393 646180 601485 566752 778083 121246 -42154 483616
4172D83616j35154j3022K11226n3993l13332L51311k18164J82097j63540J49692
$$ 483616 348462 335440 546666 492673 179341 530652 312488 494585 331045 480737
4162D80737k57831K04183K96402K49642m56566j32588L04771j54480O8286K46802
$$ 480737 222906 427089 723491 973133 516567 383979 688750 534270 602556 849358
4152H49358l90857K45605r6253j81544Q1267j25169o9301J12688j24336M79922
$$ 849358 458501 704106 607853 426309 507576 382407 313106 425794 301458 781380
4142G81380k75331j13445K02195m9400j28138l63724L55015N02219k26401k74160
$$ 781380 506049 392604 594799 545399 417261 53537 408552 910771 684370 410210
4132D10210j64595K68431m74649O04706j73537L68507m06706j06787K68000k10110
$$ 410210 245615 514046 39397 644103 470566 839073 432367 325580 593580 383470
4122C83470J91967K8960j56821L55142k96297k36991m9328N39727l54991N8571
$$ 383470 575437 604397 447576 802718 506421 269430 220102 759829 404838 463409
4112D63409J57922J11762l09406K71747J49362j89230l15245L51354k45009K36767
$$ 463409 621331 733093 423687 695434 844796 655566 340321 691675 446666 683433
4102F83433J62168m65370L84896m0628M33797J73592k30913k49343N82775k61251
$$ 683433 845601 380231 765127 724499 1158296 1331888 1100975 851632 1434407 1173156
4092A173156J11618J34915K44002r206o3933k23824M3707l1706p3901J46807l42077
$$ 1173156 1284774 1419689 1663691 1654485 1590552 1366728 1410435 1378729 1304828 1451635 1109558
4081A109558L16413n90132J15189J58877M011p8317J88477k75281j21115K51437
$$ 1109558 1425971 835839 951028 1109905 1113916 1035599 1224076 948795 827680 1079117
4071A079117k52979L70991l18854J79935M57538q0969M57010j7060K97442J69470
$$ 1079117 826138 1197129 878275 1058210 1515748 1434779 1891789 1874729 2172171 2341641
4061B341641J5715M70284j35838M18398o15750j14913J80347J3566K39729o70987
$$ 2341641 2357356 2827640 2691802 3110200 2494450 2379537 2559884 2573450 2813179 2142192
4051B142192k88765j09266j48283k64834M1179j97898o4203l43891L80508q3118
$$ 2142192 1853427 1744161 1595878 1331044 1372223 1174325 1110122 766231 1146739 1063621
4041A063621j53021K22749J3564L13659J75191k21219Q1384J22289n8025L98890
$$ 1063621 910600 1133349 1146913 1460572 1635763 1414544 1495928 1618217 1560192 1959082
4031A959082o5384K98413J00527Q0268n17320M71352l00752K18676l90826l0283
$$ 1959082 1893698 2192111 2292638 2372906 1855586 2326938 2026186 2244862 1854036 1823753
4021A823753k04448j86696L26448n91454j09865k85944L23370j59370J59029L56623
$$ 1823753 1619305 1432609 1759057 1167603 1057738 771794 1095164 935794 1094823 1451446
4011A451446j94410j34336L20599q0741j17277L28904k92421Q4098l76231l17353
$$ 1451446 1257036 1122700 1443299 1362558 1245281 1574185 1281764 1365862 989631 672278
4001F72278q1358K83192L71828k79083j69568m2266j45401K08542J25134n80441
$$ 672278 590920 874112 1245940 966857 797289 755023 609622 818164 943298 362857
3991C62857N8297M99538k32533K55680k68894J99211o3813J88205o6573L1883
$$ 362857 421154 920692 688159 943839 674945 874156 810343 998548 931975 963858
3981I63858K1652j73268n1140j3615J30966l06275J90095j29560N6289j68249
$$ 963858 985510 812242 761102 747487 878453 572178 762273 632713 689002 520753
3971E20753M6143O54239q64052L11651P5950o7871J17051Q2695m19497K76622
$$ 520753 566896 1221135 357083 668734 744684 676813 793864 876559 457062 733684
3961G33684q9542N4772n69363M88121j80310k03404K33029l96230K70762J74262
$$ 733684 644142 698914 129551 617672 437362 233958 466987 70757 341519 515781
3951E15781r4127o36604P98466L6419l37265N33439n05989J9833j40119k82973
$$ 515781 421654 -214950 583516 619935 282670 816109 310120 329953 189834 -93139
3941i3139N76093l14799r6324O6595Q0223q0267P536r7278M9194n0864j00509
$$ -93139 482954 168155 71831 138426 218649 138382 145918 48640 97834 46970 -53539
3930e3539L91794j57639l47017Q3202N5214j19057J01793K44415l0613R8441j28531
$$ -53539 338255 180616 -166401 -83199 -27985 -147042 -45249 199166 168553 266994 138463
3919A38463N6208r2371P1727K36198j59208k45366M8164K4588J05089p514k38108
$$ 138463 194671 102300 174027 410225 251017 5651 53815 78403 183492 175978 -62130
3908f2130m6212M53152R514k27042P4114k27462L41102l1938n50058K61707k93438
$$ -62130 -108342 344810 354324 127282 201396 -26066 315036 283098 -266960 -5253 -298691
3897b98691J28489l9999M14510j52325r224K04998l25489J50283k04665K46569
$$ -298691 -170202 -210201 204309 51984 42760 247758 -77731 72552 -132113 114456
3887A14456l49699K17618N1558j26673O6601P5947j48629N5685k07125M72862
$$ 114456 -235243 -17625 33933 -92740 -26139 49808 -98821 -43136 -250261 222601
3877B22601J21542m57665J62494L1013j36464l6660O1525l45615N35213J83452
$$ 222601 344143 -113522 48972 79985 -56479 -93139 -31614 -377229 157984 341436
3867C41436l26836K87408k81366J09014k73937N00688j93490j84921J35832j32197
$$ 341436 14600 302008 20642 129656 -144281 356407 162917 -22004 113828 -18369
3857a8369L72271m67887O0522O1405L71727k28215k68733K46171p0774o238L83803
$$ -18369 353902 -113985 -53463 7942 379669 151454 -117279 128892 58118 51880 435683
3846D35683k74237K20781k00639J86160j44401m51881K63517j98269P0780J043
$$ 435683 161446 382227 181588 367748 223347 -228534 34983 -163286 -92506 -91463
3836i1463j74047N11163q7992J76388l51173L7916k34820P57485m72172L0447
$$ -91463 -265510 245653 157661 334049 -17124 20792 -214028 543457 71285 101732
3826A01732K93698j74650j80060K65614l58741M38670l62996K90549J20000p21499
$$ 101732 395430 220780 40720 306334 -52407 386263 23267 313816 433816 -287683
3816b87683L91408K3196K5882J69304n14580J44680j15183K81690k59304L00025
$$ -287683 103725 126921 152803 322107 -192473 -47793 -162976 118714 -140590 159435
3806A59435j87588k47021O20105q4001n78125J92476L87282J01758j07783k72460
$$ 159435 -28153 -275174 344931 260930 -317195 -124719 262563 364321 256538 -15922
3796a5922J52676J03626J63958O2j54362j67548L71157l82336R6559K79584l0734
$$ -15922 136754 240380 404338 404400 250038 82490 453647 71311 167870 447454 416720
3785D16720k33996L05871O37453p40843L47388n12225M55121j90572k46143j24878
$$ 416720 182724 488595 1126048 385205 732593 220368 675489 484917 238774 113896
3775A13896L03211J331k56139l08589M41217k1116K78232l27539J87816N26255
$$ 113896 417107 418438 162299 -146290 294927 273811 552043 224504 412320 938575
3765I38575k35043m19862L11893L79626m20562Q5067j0024J09863J6232l23781
$$ 938575 703532 283670 595563 975189 554627 639694 629670 739533 755765 431984
3755D31984j3353K66443j86815O2281q721K32092m35225O4590L92067j8441m97804
$$ 431984 418631 685074 498259 560540 551819 783911 348686 413276 805343 786902 289098
3744B89098P20024o47559J40719L02341r5464k6598L25782k11076k06079k94375
$$ 289098 1009122 361563 502282 804623 709159 682561 1008343 797267 591188 296813
3734B96813J89744L99859l26892M09350J79136l47358N69122o71682J54236j79407
$$ 296813 486557 886416 559524 968874 1148010 800652 1369774 698092 852328 672921
3724F72921J61518K66511n80828n9192M86210n71413L74560j6522k27512J93578
$$ 672921 834439 1100950 520122 460930 947140 375727 750287 733765 506253 699831
3714F99831k0247p9603k03417M4330l6569J69542J32741j78440K01321j66734
$$ 699831 679584 599981 396564 440894 404325 573867 706608 528168 729489 562755
3704E62755K67959k73326j27360K59962j49010L90539k37449L81283j81882j43944
$$ 562755 830714 557388 430028 689990 540980 931519 694070 1075353 893471 749527
3694G49527l8185l09055K5645K07960J17290k63560k30168M4708j3050J82416
$$ 749527 711342 402287 427932 635892 753182 489622 259454 304162 291112 473528
3684D73528J424l21564M46284k21073m13082L90731n77273M16192m1401N0260
$$ 473528 474952 153388 599672 378599 -34483 356248 -221025 195167 153766 204026
3674B04026N3833N6851J1692l87364M46091l007j78573M04767m23337J24089K15685
$$ 204026 257859 314710 326402 -60962 385129 382122 203549 608316 184979 309068 524753
3663E24753j58462l04832Q7887N1385l7900N3806p47j21678l35582J52150O40847
$$ 524753 366291 61459 149346 200731 162831 216637 215890 94212 -241370 -89220 551627
3652E51627n70626J2647J43558p6809k51P8130o1935K22844l11486K31184L89013
$$ 551627 -18999 -6352 137206 60397 60146 138276 76341 299185 -12301 218883 607896
3641F07896q09602N28552N8792p46807J67180J11354J91494J35281J7684j98747
$$ 607896 -201706 326846 385638 -361169 -193989 -82635 108859 244140 261824 63077
3631F3077k87108Q5166J26674r8403R7665j55990k92802K95587K17866m06462
$$ 63077 -224031 -138865 -12191 -110594 -12929 -168919 -461721 -166134 51732 -354730
3621c54730m8605J60030M05252j18050r4959r6247L90960l0333j20042n8280K65997
$$ -354730 -403335 -243305 161947 43897 -51062 -147309 243651 213318 93276 34996 300993
3610C00993k66042q0322M92512k07600j66207r7732J76118K34033j78852R5541
$$ 300993 34951 -45371 447141 239541 73334 -24398 151720 385753 206901 302442
3600C02442l13110k00244J02276L23602J4234o84803L32739j81769M43238k70946
$$ 302442 -10668 -210912 -108636 214966 229200 -455603 -122864 -304633 138605 -132341
3590a32341j7517K71809j15659J02005l68961J32393J72650q1742p0950M9504
$$ -132341 -149858 121951 6292 108297 -260664 -128271 44379 -37363 -108313 -58809
3580e8809K11042N5019k51420k81394Q60671m70862j60065j4164R2807K94719
$$ -58809 152233 207252 -44168 -325562 535109 64247 -95818 -109982 -17175 277544
3570B77544l18075Q3141j7090o928L0873l35586M74179O1964n95136K44451j13914
$$ 277544 -40531 42610 25520 18592 49465 -286121 188058 250022 -345114 -100663 -214577
3559b14577J86476K84522J81811m82203k71935o0651N87359J01514m16614K39436
$$ -214577 -28101 256421 438232 -43971 -315906 -376557 210802 312316 -104298 135138
3549A35138m1824l08942J98625n7281L18124j35228J25469L5823k08315j23131
$$ 135138 93314 -215628 -17003 -74284 243840 108612 234081 269904 61589 -61542
3539f1542p6065j8048O41752l87561M9611k54636o1490m2603O11247q8663n66423
$$ -61542 -137607 -155655 486097 98536 148147 -106489 -167979 -210582 400665 312002 -254421
3528b54421O24614O2211k6436O884l5700J56157n848l84399m99030M04824K67473
$$ -254421 370193 432404 405968 412852 377152 533309 527461 143062 -355968 48856 316329
3517C16329O18902O18293J34464j68604K56427r35792k25725m31712L87459l59021
$$ 316329 935231 1553524 1687988 1519384 1775811 840019 614294 182582 570041 211020
3507B11020J58305J95403l26537L4972R5190J26801l78828J85757J79957j27289
$$ 211020 369325 564728 238191 273163 368353 495154 116326 302083 482040 354751
3497C54751N60883J4446l30765L33281j55352l74167L3487k63506N0498m570k27847
$$ 354751 915634 930080 599315 932596 777244 403077 436564 173058 223556 218986 -8861
3486h861P5752Q5205j35694J27647k14078K71344q6649j06739K60790p9136o0092
$$ -8861 66891 152096 16402 144049 -70029 201315 114666 7927 268717 189581 129489
3475A29489J10211m05416M27059J8041o6864k66944L51179m9555l72008K67696
$$ 129489 239700 -165716 261343 279384 212520 -54424 296755 247200 -124808 142888
3465A42888M8652k45247M33628j53672r9555r190K35215j56203j50812l23203
$$ 142888 191540 -53707 379921 226249 126694 117504 352719 196516 45704 -277499
3455b77499L46839j97588J5591K42997J57288J6406j58776K5885J83335j27174
$$ -277499 69340 -128248 -112657 130340 287628 304034 145258 171143 354478 227304
3445B27304k28515J46975K06400k41411M31416j91063K05983k34831P4145K27393
$$ 227304 -1211 145764 352164 110753 542169 351106 557089 322258 396403 623796
3435F23796K01138P46352J34027J13021m00279m84698l60527O4394j69143L52983
$$ 623796 824934 1571286 1705313 1818334 1418055 933357 572830 637224 468081 821064
3425H21064k88971r3526P31300k77054j37418J104J38227l7021K53544n4662P52964
$$ 821064 532093 438567 1169867 892813 755395 756499 894726 857705 1111249 1056587 1809551
3414A809551J010670L004003J698273r7962j596203j843096j155150p58235m68051
$$ 1809551 2820221 5824224 7522497 7424535 5828332 3985236 2830086 2071851 1603800
3405A603800l63422k00591l83098R8573n6611r4191m6965M18188k20003l06008
$$ 1603800 1240378 1039787 656689 755262 698651 604460 557495 975683 755680 449672
3395D49672J20608k20999L35835k42474j61553Q5L67780l82392M31039j65725
$$ 449672 570280 349281 685116 442642 281089 281174 648954 266562 697601 531876
3385E31876l28163J82321K98808o585m13251K45121l89680L17049K32454K9424
$$ 531876 203713 386034 684842 678257 265006 510127 120447 437496 669950 699374
3375F99374N0931j7011k39681M5693N22907m75318L77581k37510K12243J03439
$$ 699374 750305 733294 493613 539306 1062213 586895 964476 726966 939209 1042648
3365A042648R2207l77791L50970j24676j93725L41355o53832L20116k0780l033
$$ 1042648 1134855 757064 1108034 983358 789633 1130988 477156 797272 776492 773459
3355G73459j94559K89361K0689P7832O7573K14077m39852M6619J29121j15566
$$ 773459 578900 868261 888950 966782 1034355 1248432 808580 855199 984320 868754
3345H68754j33726J14865O0120K77020j09764o9686p8039K57727l69478k2324
$$ 868754 735028 849893 910013 1187033 1077269 1007583 929544 1187271 817793 795469
3335G95469M67851L5105L75869o31314N64264O9974J41982K76703n7178P07810
$$ 795469 1263320 1298425 1674294 1042980 1607244 1677218 1819200 2095903 2038725 2746535
3325B746535Q49273N64103L61994J31057k11225o50855P61787J98073J011784
$$ 2746535 3595808 4159911 4521905 4652962 4441737 3790882 4552669 4750742 5762526
3316E762526R00588J102925J965733Q664743K0200032K0247682K340528o892208
$$ 5762526 6663114 7766039 9731772 18396515 38596547 58844229 61184757 54292549
3308E4292549j9578957j1701659o704720m451216k697681l033700j361759q85025
$$ 54292549 34713592 23011933 16307213 11855997 9158316 6124616 4762857 3877832
3300C877832j52952J76826J19105m26846J52003r67374j92952M320k05533l35226
$$ 3877832 3724880 3901706 4020811 3593965 3745968 2778594 2585642 2589962 2384429 2049203
3290B049203j74090j8871l67132k50863N3953m1267K43734k37636j86168j33781
$$ 2049203 1875113 1856242 1489110 1238247 1292200 1250933 1494667 1257031 1070863 937082
3280I37082J06124Q7284k5589p3712r9482m8794l1681K70144k96643j76413N7525
$$ 937082 1043206 1130490 1104901 1031189 931707 882913 851232 1121376 824733 648320 705845
3269G05845J78263K62943j59367m90125m1757N52936L385j92033j11105J83864
$$ 705845 884108 1147051 987684 497559 455802 1008738 1012123 820090 708985 892849
3259H92849l27201O5323l4452j22903J31720r0032L56564q4088m63021j96979
$$ 892849 565648 630971 596519 473616 605336 515304 871868 787780 324759 127780
3249A27780q6638J96620J58485n11370K47238L04336j15648K51713m92920k9626
$$ 127780 41142 237762 396247 -115123 132115 436451 320803 572516 79596 49970
3239D9970M16638k94340r1972j67973N45458o4703o205K399k94990l5948p9035
$$ 49970 466608 172268 80296 -87677 457781 393078 386873 389272 94282 58334 -20701
3228b0701K35602k86055L72643j53086r3770J52700k53002j88169L9871L91176
$$ -20701 214901 -71154 301489 148403 54633 207333 -45669 -233838 -193967 197209
3218A97209P8808l3295K35874n06731j83926M25781m04485N23421k82401j45506
$$ 197209 276017 242722 478596 -28135 -212061 213720 -190765 332656 50255 -95251
3208i5251O0109O8177L12381m85050K59966j96647N852l97783K92818K67119j67725
$$ -95251 -35142 33035 345416 -139634 120332 -76315 -70463 -468246 -175428 91691 -76034
3197g6034J32417n72259K15844n2131J91250l56671P44913q638k71257J38314
$$ -76034 56383 -515876 -300032 -352163 -160913 -517584 227329 218691 -52566 85748
3187H5748k06405l06502L11725J4240L60992l34791m45405O63932m23102J01557
$$ 85748 -120657 -427159 -115434 -101194 259798 -74993 -520398 143534 -279568 -178011
3177a78011K48352j39176M7840K38298m08633J82762R8808K17759k54552j83322
$$ -178011 70341 -68835 -20995 217303 -191330 -8568 90240 307999 53447 -129875
3167a29875K68416k78995J86102j84216J07700k25184M3160L50414l42815K72414
$$ -129875 138541 -140454 45648 -138568 -30868 -256052 -212892 137522 -205293 67121
3157F7121L32738l65116M18054l13927j60542m6918l13681J30811K16182n6788
$$ 67121 399859 34743 452797 138870 -21672 -68590 -382271 -251460 -35278 -92066
3147i2066k3105K59755j71600P5093l40867J18387m65208L21257J61327J77006
$$ -92066 -115171 144584 -27016 48077 -292790 -174403 -639611 -318354 -157027 19979
3137A9979l39865J5112K78759K14968p13876L96113N17374n71499L6125q8047
$$ 19979 -319886 -304774 -26015 188953 -524923 -128810 388564 -182935 -146810 -234857
3127b34857Q7987k80202K80815R529j42047q0128J35353M49483q58889P02289
$$ -234857 -146870 -427072 -146257 -136728 -278775 -358903 -223550 225933 -632956 69333
3117F9333l68135R3507O4716k56902n4021J61228l04626N27388k04425K17670
$$ 69333 -298802 -205295 -140579 -397481 -451502 -290274 -594900 -67512 -271937 -54267
3107e4267j09056j31573l01707K23650K54221l87175L61383O0049m64289L74800
$$ -54267 -163323 -294896 -596603 -372953 -118732 -505907 -144524 -84475 -548764 -173964
3097a73964N7264k82178j39672K53614N5921O6699K14783m72786J10025M67990
$$ -173964 -116700 -398878 -538550 -284936 -229015 -162316 52467 -420319 -310294 157696
3087A57696l86988j1848Q2521K19302j51725k21564N8667K81465k11519K515Q5513
$$ 157696 -229292 -241140 -158619 60683 -91042 -312606 -253939 27526 -183993 -181478 -95965
3076i5965M19124L1669k17174M12248p38741j2142L06275p00711K45823L01023
$$ -95965 323159 354828 137654 549902 -188839 -200981 105294 -595417 -349594 -48571
3066d8571J1132j17344L25156n27479J21112J7957K0660L61272k38935m10140
$$ -48571 -37439 -154783 170373 -357106 -235994 -218037 -197377 163895 -75040 -485180
3056d85180m9186K03565J95813k27642j74370n9254K4816L36561r1649L2951J08160
$$ -485180 -534366 -330801 -134988 -362630 -537000 -596254 -571438 -234877 -326526 -293575 -185415
3045a85415l05911J20284K72509j34910M5943P846K90982l38608j14155K74230
$$ -185415 -491326 -371042 -98533 -233443 -187500 -179654 111328 -227280 -341435 -67205
3035f7205k60721O2901L11369r7437j50440l05585P1598L99744l59019J04794
$$ -67205 -327926 -265025 46344 -51093 -201533 -507118 -435520 -35776 -394795 -290001
3025b90001j06414K98441j51383L912J34425Q0400r2938k76024K50541j61116
$$ -290001 -396415 -97974 -249357 -245445 -111020 -30620 -123558 -399582 -149041 -310157
3015c10157J32115j61968P2065J07667k27485P2068M6445n03967M54669j60212
$$ -310157 -178042 -340010 -267945 -160278 -387763 -315695 -269250 -773217 -318548 -478760
3005d78760K09279j06695q7474o1610L65013j56654k19184N01565k34404R4502
$$ -478760 -269481 -376176 -463650 -525260 -160247 -316901 -536085 -34520 -268924 -174422
2995a74422j00735R7441m28147O51937k36537n1784j42827M12849j69661K18582
$$ -174422 -275157 -177716 -605863 46074 -190463 -242247 -385074 27775 -141886 76696
2985G6696m58454N2912J03099j95917n6866K98321J49316J18248K2893l85931
$$ 76696 -381758 -328846 -225747 -421664 -478530 -180209 -30893 87355 110248 -275683
2975b75683J22817j14675L95746j0896q2563j79067l68893K65164j6465R61P3414
$$ -275683 -152866 -267541 128205 117309 34746 -144321 -513214 -248050 -264515 -263554 -190140
2964a90140K61202m24459J48480j43108M2193j45672K44952m99797M79551j53483
$$ -190140 71062 -353397 -204917 -348025 -305832 -451504 -206552 -706349 -226798 -380281
2954c80281N33504j45600J09532k98430K46017n59192L82394k10263J01017K22734
$$ -380281 153223 7623 117155 -181275 64742 -494450 -112056 -322319 -221302 1432
2944A432j74671j31309n01054L75499K54029k48290J22842M2833J22294K7J69120
$$ 1432 -173239 -304548 -805602 -430103 -176074 -424364 -301522 -258689 -136395 -136368 32752
2933C2752q12704P22839k03169J32040m08758K82282K42218N4738o8630m60151
$$ 32752 -779952 -57113 -260282 -128242 -537000 -254718 -12500 42238 -26392 -486543
2923d86543J39039P6153M5915l26985J9598L44144J37655j49344l27415L5064
$$ -486543 -347504 -271351 -225436 -552421 -532823 -188679 -51024 -200368 -527783 -492719
2913d92719J16109M15253n88073n4257L57771l66295K14524k46567L20896J18015
$$ -492719 -376610 38643 -549430 -603687 -245916 -612211 -397687 -644254 -323358 -205343
2903b05343j66079K11165k30320j07676o7038M18308k64656K3631J58510K97163
$$ -205343 -371422 -160257 -390577 -498253 -565291 -146983 -411639 -388008 -229498 67665
2893F7665l97965L097K46372l25487K32154K3423J7090m95737M95260n0187N0186
$$ 67665 -330300 -327203 -80831 -406318 -174164 -150741 -133651 -629388 -134128 -184315 -134129
2882a34129j10362J99284N3074Q1224m36504k44449L12310K21919p4990l70866
$$ -134129 -244491 -45207 7867 89091 -347413 -591862 -279552 -57633 -132623 -503489
2872e03489L90706k84111K43506j05694K8610j79944N1548M00643k00462K19793
$$ -503489 -112783 -396894 -153388 -259082 -230472 -410416 -358868 41775 -158687 61106
2862F1106l02623m74767N54576L7140k29246K56660j44962k37169L25866j52614
$$ 61106 -241517 -716284 -161708 -124568 -353814 -97154 -242116 -479285 -153419 -306033
2852c06033j13999J03491l866k02087L11040j12323K96322k46972L1543J93071
$$ -306033 -420032 -316541 -320407 -522494 -211454 -323777 -27455 -274427 -242884 -49813
2842d9813k65796q9062K55173J27343m39258K48909J67643l91725j08892L81670
$$ -49813 -315609 -404671 -149498 -22155 -461413 -212504 -44861 -436586 -545478 -163808
2832a63808J1872o4639j71075K30164k37206j17447K83862j53361M7473M44415
$$ -163808 -151936 -216575 -387650 -157486 -394692 -512139 -228277 -381638 -334165 110250
2822A10250k23340k03955J28499J15772q1939p3839j92878K91758R9499l59659
$$ 110250 -113090 -317045 -188546 -72774 -154713 -228552 -421430 -129672 -30173 -389832
2812c89832K7487M59874n87823L2489J9191M62623k73649k6874K48727O3700k34042
$$ -389832 -362345 97529 -490294 -457805 -438614 24009 -249640 -276514 -27787 35913 -198129
2801a98129J68134p1514k36741j02868L66050Q3775o95385K05983K60446J78041
$$ -198129 -29995 -101509 -338250 -441118 -75068 8707 -686678 -480695 -220249 -42208
2791d2208k22427M6422Q3330L3536l7169m6579j37179L15260n81639J20929l7851
$$ -42208 -264635 -218213 -134883 -101347 -138516 -185095 -322274 -7014 -588653 -467724 -505575
2780e05575L13765j86353O9740Q0350m83531N42508p5967j63415L25084j77328
$$ -505575 -191810 -378163 -308423 -228073 -711604 -169096 -245063 -408478 -83394 -260722
2770b60722k62158R7731M49447m3469J58531n68564P9793J74749R0314j68232
$$ -260722 -522880 -425149 24298 -19171 139360 -429204 -349411 -174662 -84348 -252580
2760b52580M9360J22424j61704j03231L01143l75342R9172M82766p50578J38391
$$ -252580 -203220 -80796 -242500 -345731 -44588 -419930 -320758 162008 -588570 -450179
2750d50179j29975L96576j57380M53637k87485j03380K75779m47492K00848j02328
$$ -450179 -580154 -183578 -340958 112679 -174806 -278186 -2407 -449899 -249051 -351379
2740c51379j65209j2644L39659n79939M30423N4996K99067J25910n09782K1044
$$ -351379 -516588 -529232 -189573 -769512 -339089 -284093 14974 140884 -368898 -347854
2730c47854J68037j15122J00054K31151n85515M18091j00029m3479k1528k42250
$$ -347854 -179817 -294939 -194885 36266 -549249 -131158 -231187 -274666 -296194 -538444
2720e38444L58738J2998J93111l44037L01682j22585o0716K30601o53830L28234
$$ -538444 -179706 -166708 26403 -317634 -15952 -138537 -199253 31348 -622482 -294248
2710b94248M7011o9946j80092k00857K58159L10494Q1525j17795j98740n6382
$$ -294248 -247237 -317183 -497275 -698132 -439973 -129479 -47954 -165749 -364489 -420871
2700d20871R2893K69247m60432M39152o60299N65592l1209O3707p3040P5963J23312
$$ -420871 -327978 -58731 -519163 -80011 -740310 -174718 -205927 -142220 -215260 -139297 -15985
2689a5985K06997l30636q0406Q8785k27698J48422k64272R7071K24545J48989
$$ -15985 191012 -139624 -220030 -131245 -358943 -210521 -474793 -377722 -153177 -4188
2679d188k38341k8020J06822n16477L48193K36188l23184q645L04923k2392k33757
$$ -4188 -242529 -270549 -163727 -680204 -332011 -95823 -419007 -427652 -122729 -145121 -378878
2668c78878p2887L5261k02918J07939J44371l47142N95329l53909K82682m5497
$$ -378878 -451765 -416504 -619422 -511483 -367112 -714254 -118925 -472834 -190152 -235649
2658b35649r512P2685m8416j70861n0314M46839R2232k89729L1631k11765P4808
$$ -235649 -245161 -172476 -220892 -391753 -442067 4772 97004 -192725 -161094 -372859 -298051
2647b98051O2264n7838J13256l50535K17073Q0186l75210K71154K12493J87176
$$ -298051 -235787 -293625 -180369 -530904 -313831 -233645 -608855 -337701 -125208 61968
2637F1968o88494O62039l96173p8182L56102m42171J84237m9724j1725J97108
$$ 61968 -626526 35513 -360660 -438842 -82740 -524911 -340674 -390398 -402123 -205015
2627b05015M9480l47591N86863k56011n3935l20252M42024k55389J95536k39472
$$ -205015 -155535 -503126 83737 -172274 -226209 -546461 -104437 -359826 -164290 -403762
2617d03762J74825J95722j91941o2916J8527k92882L15107Q2093k2630J16512
$$ -403762 -228937 -33215 -225156 -288072 -269545 -562427 -247320 -165227 -187857 -71345
2607g1345k08091L6651k05130m4042N02917m63293L34676Q9597m71382K22461
$$ -71345 -279436 -242785 -447915 -491957 10960 -452333 -117657 -28060 -499442 -276981
2597b76981o9121o2120K34034l23701l88314J54251P71868m90314K49127O5454
$$ -276981 -346102 -408222 -174188 -497889 -886203 -731952 39916 -450398 -201271 -135817
2587a35817J58436k59699l06633P5587M83101j89454J53223m28462L13588n9236
$$ -135817 22619 -237080 -543713 -468126 14975 -174479 -21256 -449718 -136130 -195366
2577a95366K19438l19896M45421o64271K75716J01908l96854L43068P493k7279
$$ -195366 24072 -295824 149597 -514674 -238958 -137050 -533904 -190836 -183343 -210622
2567b10622L6238J42152l96971K85704l45752K6337M7763L73606m69322N30149
$$ -210622 -174384 -32232 -429203 -143499 -489251 -462914 -415151 -41545 -510867 19282
2557A9282J17195k50197m2904j48497R7613m5627l06635K58513k37896J29238
$$ 19282 136477 -113720 -156624 -305121 -207508 -253135 -559770 -301257 -539153 -409915
2547d09915l1673j03854M12493l44056j90709N18413J06114j95829J5008k37488
$$ -409915 -441588 -545442 -132949 -477005 -667714 -149301 -43187 -239016 -224008 -461496
2537d61496J15058K61838l98350L48777k37323J248M76503n83877N77835p15658
$$ -461496 -346438 -84600 -482950 -134173 -371496 -370248 106255 -477622 100213 -615445
2527f15445M26409J58107r7200j44661L9471j40236p0780J50079R0605j89274
$$ -615445 -189036 -30929 -128129 -272790 -233319 -373555 -444335 -294256 -203651 -392925
2517c92925M57528k87753l3385j99990L50513p4837J61439n55518P27843k9912
$$ -392925 64603 -223150 -256535 -456525 -106012 -180849 -19410 -574928 152915 123003
2507A23003l00885j40374j59712j00387M30667n5121J51943j93637p4469l0725
$$ 123003 -177882 -318256 -477968 -578355 -147688 -202809 -50866 -244503 -318972 -349697
2497c49697J37263R9257o0970J93536l46078j72921J41289p9836L53858m51633
$$ -349697 -212434 -113177 -174147 19389 -326689 -499610 -358321 -438157 -84299 -535932
2487e35932K37308K69603o05131K79947j55347J38287k62750M97821r7698L7834
$$ -535932 -298624 -29021 -634152 -354205 -509552 -371265 -634015 -136194 -233892 -196058
2477a96058k18902J69098o8716J19550o5790J1071j93988k7090M15154J95573
$$ -196058 -414960 -245862 -314578 -195028 -260818 -249747 -443735 -470825 -55671 139902
2467A39902p06401M159R8235l98706N80703j53319J22402p9811K3862M5007J95534
$$ 139902 -566499 -562340 -464105 -862811 -282108 -435427 -313025 -392836 -368974 -323967 -128433
2456a28433l42431L13327j57872k01545o025L07129K95253n31716j48017K93719
$$ -128433 -470864 -157537 -315409 -516954 -522979 -215850 79403 -452313 -600330 -306611
2446c06611l4525J19113K18345j34870j48085p4367m0840J74252l8006n2427n5551
$$ -306611 -341136 -222023 -3678 -138548 -286633 -361000 -401840 -227588 -265594 -318021 -373572
2435c73572j6537k80284N36773k15872j17869R146j00413K34332L01625k34699
$$ -373572 -390109 -670393 -133620 -349492 -467361 -458215 -558628 -324296 -22671 -257370
2425b57370q1774L3717j27124J47058j18176K76295l15261L6736J74260m7361
$$ -257370 -339144 -305427 -432551 -285493 -403669 -127374 -442635 -405899 -231639 -279000
2415b79000k11578L40699k21239J73556m34479N23531k01919K09881K995q9501
$$ -279000 -490578 -149879 -371118 -197562 -632041 -108510 -310429 -100548 -97553 -187054
2405a87054J1714P2689J83061r1966l75002J83167j83366O5984o1913J31100j07636
$$ -187054 -175340 -102651 80410 -11556 -386558 -203391 -386757 -320773 -382686 -251586 -359222
2394c59222J20672q4414q2251J46429o2304M3357K02792j24732L95081p18446
$$ -359222 -238550 -322964 -405215 -258786 -321090 -277733 -74941 -199673 195408 -523038
2384e23038M50434l66701j20777O03066j55842j8614K09384p74137L36172K91137
$$ -523038 -72604 -439305 -560082 42984 -112858 -131472 77912 -696225 -360053 -68916
2374f8916l06662k10191j19413N05793l22665L70353p820j90312q40r2469j6267
$$ -68916 -375578 -585769 -705182 -199389 -522054 -151701 -159521 -349833 -350673 -443142 -459409
2363d59409j26260L06930j34977Q2412J37631k43299J34498J18444l08968J31070
$$ -459409 -585669 -278739 -413716 -331304 -193673 -436972 -302474 -184030 -492998 -361928
2353c61928J59190m90997L71975n8971K1379K9403N828P4189K65278m87166K64709
$$ -361928 -202738 -693735 -321760 -380731 -359352 -329949 -324121 -249932 15346 -471820 -207111
2342b07111j26682R376q4694R9266N6036L32901m21452L03438k55101J94412m7708
$$ -207111 -333793 -324417 -409111 -309845 -253809 79092 -342360 -38922 -294023 -99611 -147319
2331a47319l76159K43668o4378j51655j87502L92349r4352P5136J60536O831n19371
$$ -147319 -523478 -279810 -344188 -495843 -683345 -290996 -385348 -310212 -149676 -142845 -662216
2320f62216M46313R1745p4990j4167o2323k88206J37914j43298J09569J38025
$$ -662216 -215903 -124158 -199148 -213315 -275638 -563844 -425930 -569228 -459659 -321634
2310c21634m16219N13935l65767L14311K75776o16688Q1333J93307J05358j81577
$$ -321634 -737853 -223918 -589685 -275374 402 -616286 -534953 -341646 -236288 -417865
2300d17865N52100j30968r8819M1923l29228Q63J70126q6901l71752L89223N8230
$$ -417865 134235 3267 -95552 -53629 -382857 -381994 -211868 -298769 -670521 -281298 -223068
2289b23068J38293j04629M7722o85733N26506j24023n0498J65055n2894K13047
$$ -223068 -84775 -189404 -141682 -827415 -300909 -424932 -475430 -310375 -363269 -150222
2279a50222o04561M43109r363M34861p11340M03240p7312j91419q9967N09202
$$ -150222 -754783 -311674 -321037 113824 -597516 -194276 -271588 -463007 -552974 -43772
2269d3772k78824l04425L72655P1417q3767J24164l43975k52447O72941l41949
$$ -43772 -322596 -627021 -254366 -182949 -266716 -142552 -486527 -738974 -66033 -407982
2259d07982J14068L11769l20683k17480J05219M475K0936j4915j44860L96203
$$ -407982 -293914 17855 -302828 -520308 -415089 -410614 -389678 -404593 -549453 -153250
2249a53250k52332k21750N36628J31995n75403M45694l61060k9741K76725n98400
$$ -153250 -405582 -627332 -90704 41291 -534112 -88418 -449478 -479219 -202494 -800894
2239h00894P8750M38128M20367m77446J09954l38681O01187p32526O0820N03465
$$ -800894 -722144 -284016 136351 -341095 -231141 -569822 31365 -701161 -640341 -136876
2229a36876l13528L32143j26679r8578J57860k98494J4251j61076O79701k64629
$$ -136876 -450404 -118261 -244940 -343518 -185658 -484152 -469901 -630977 48724 -215905
2219b15905J7998L9961k36837J47832m47410M20876J66639j91396m8891j91708
$$ -215905 -197907 -157946 -394783 -246951 -694361 -273485 -106846 -298242 -347133 -538841
2209e38841K51690J50804m11290P4373M49832m08908n8948M66867l10013K0367
$$ -538841 -287151 -136347 -547637 -473264 -23432 -432340 -491288 -24421 -334434 -314067
2199c14067j7921j223J9240l58933L99281Q0139l50411K04369l96852P26203m23097
$$ -314067 -331988 -333211 -313971 -672904 -273623 -193484 -543895 -339526 -736378 -10175 -433272
2188d33272j88328M36394j25138K85249k38162J31242k91138Q4963j55310K63215
$$ -433272 -621600 -185206 -310344 -25095 -263257 -132015 -423153 -338190 -493500 -230285
2178b30285j54574J51988j90082J6287L25082j92538J72198k04143J35272n07343
$$ -230285 -384859 -232871 -422953 -406666 -81584 -274122 -101924 -306067 -170795 -678138
2168f78138J21528J17721J41194N34146o26125J45322j82957k09522J86557K63042
$$ -678138 -556610 -438889 -297695 236451 -389674 -244352 -427309 -636831 -450274 -187232
2158a87232k74989j7502K87511l79583K56274j55744J7411L41364n31165M25854
$$ -187232 -462221 -479723 -192212 -571795 -315521 -471265 -453854 -112490 -643655 -217801
2148b17801j39372m1296R3490J19677l42755J70082J33705m4224l79219N07095
$$ -217801 -357173 -398469 -304979 -185302 -528057 -357975 -224270 -268494 -647713 -140618
2138a40618N3480m91964O0617l1743K86845K95746l07754Q392L9445k30597P2259
$$ -140618 -87138 -579102 -518485 -550228 -263383 32363 -275391 -266999 -227554 -458151 -385892
2127c85892J5883m12291R87499k15911l86315o7924J52861J50272M4072k08750
$$ -385892 -370009 -782300 205199 -10712 -397027 -464951 -312090 -161818 -117746 -326496
2117c26496J58424j27221M5008k9139L2503J4429m80550L84880K66959r1094j89039
$$ -326496 -168072 -295293 -250285 -279424 -246921 -232492 -713042 -328162 -61203 -152297 -341336
2106c41336K30491r0155n7454R7103k63359p7160J53625j91121L2416L50025r7603
$$ -341336 -110845 -201000 -258454 -161351 -424710 -501870 -348245 -539366 -506950 -156925 -254528
2095b54528l93344J98241n7760J10692l8250J17911j88349L04537m46300J21396
$$ -254528 -647872 -449631 -507391 -396699 -434949 -317038 -505387 -200850 -647150 -525754
2085e25754K42566j85476j38107K14917J59569m03301J73115Q4857J25934m19527
$$ -525754 -283188 -468664 -606771 -391854 -232285 -635586 -462471 -377614 -251680 -671207
2075f71207K33855K04207K6059l5955m6591J88450q8001j08910j2799j24332K41890
$$ -671207 -437352 -233145 -207086 -243041 -289632 -101182 -189183 -298093 -310892 -435224 -193334
2064a93334k85715J84910m94846L22031J15309k93710N01609l39219K28704N0226
$$ -193334 -479049 -294139 -788985 -466954 -351645 -645355 -143746 -482965 -254261 -204035
2054b04035n30258K96959L77100m03795q5069K22623K30338P0036l14527L62969
$$ -204035 -734293 -437334 -60234 -464029 -549098 -326475 -96137 -26101 -340628 22341
2044B2341k87457j45429L2799J71912o179j51548N9350m9867Q790J12595Q1272
$$ 22341 -265116 -410545 -377746 -205834 -212013 -363561 -304211 -354078 -345288 -232693 -151421
2033a51421k55628P8148j46241m5046k27257M39096m4081L07677l06551j5482
$$ -151421 -407049 -328901 -475142 -520188 -747445 -308349 -352430 -44753 -351304 -366786
2023c66786j58356Q6381j55030J81505J83864k55241k32377L92423l0831k91279
$$ -366786 -525142 -438761 -593791 -412286 -228422 -483663 -716040 -323617 -354448 -645727
2013f45727M44280j34902J3531j77684L13733k99142k04421N67896m36430j77390
$$ -645727 -201447 -336349 -322818 -500502 -186769 -485911 -690332 -122436 -558866 -736256
2003g36256N01473Q1589k7529L2646m3599m19074L27898j75085Q3346K52230j84845
$$ -736256 -234783 -153194 -180723 -148077 -191676 -610750 -282852 -457937 -374591 -122361 -307206
1992c07206l37304J11902O120N3658q7558q2124O57563j10992m46582p1854J54913
$$ -307206 -644510 -532608 -526488 -472830 -560388 -642512 15051 -95941 -542523 -614377 -459464
1981d59464k52739k0000M26910p1604k8683m56029N25051K91407m67814J38489
$$ -459464 -712203 -732203 -305293 -376897 -405580 -861609 -336558 -45151 -512965 -374476
1971c74476K75965l31832l9705L45831n0634J27087p0074l19770K67738k9068
$$ -374476 -98511 -430343 -470048 -124217 -174851 -47764 -117838 -437608 -169870 -198938
1961a98938J35317J55875R8551l31767m61403M73860l81158L98968k50903K79073
$$ -198938 -63621 92254 190805 -140962 -602365 -128505 -509663 -110695 -361598 -82525
1951h2525o6217r9119K97645o8528j76631m06927J63627K27370m44707L26381
$$ -82525 -148742 -247861 49784 -18744 -195375 -602302 -438675 -211305 -656012 -329631
1941c29631L27880l77717Q5097n69886O08063L71781n90039M25021j08753k6648
$$ -329631 -1751 -379468 -294371 -864257 -256194 115587 -474452 -49431 -158184 -184832
1931a84832K9490l9964p9440l87859O51349p01034N22403k49288J11650J17883
$$ -184832 -155342 -195306 -274746 -662605 -11256 -712290 -189887 -439175 -327525 -209642
1921b09642l50321K89542k2764r029K1796O9075j04680L69419j32615l66669M21677
$$ -209642 -559963 -270421 -293185 -302214 -280418 -211343 -316023 53396 -79219 -445888 -24211
1910b4211m00154L65822j52088R5664m32101K15220k216K40290R3673k25639l67351
$$ -24211 -424365 -58543 -210631 -114967 -547068 -331848 -334064 -93774 -101 -225740 -593091
1899e93091P3121K24641m32610J96256J98322j12442q2670K18894L03303m53041
$$ -593091 -519970 -295329 -727939 -531683 -333361 -445803 -528473 -309579 -6276 -459317
1889d59317M07344k15926j70967Q9382K78441l36116J60210j99513p8832M108
$$ -459317 -51973 -267899 -438866 -349484 -71043 -407159 -246949 -446462 -525294 -521186
1879e21186J58159k38468M80420m99813M35143j00639m61412K81867N08537l01605
$$ -521186 -363027 -601495 -121075 -620888 -185745 -286384 -747796 -465929 42608 -258997
1869b58997j14555q0378k6663N09436o51871L43124j02084P5015j58882K59458
$$ -258997 -373552 -453930 -480593 28843 -623028 -279904 -381988 -306973 -465855 -206397
1859b06397k00933j52281K29596K0155M4102k11554J75114n11264N88751J73587
$$ -206397 -407330 -559611 -330015 -309860 -265758 -477312 -302198 -813462 -224711 -51124
1849e1124l58139K7399M0926K65969J65267m62185l61418R6187L64295K27980
$$ -51124 -409263 -381864 -340938 -74969 90298 -371887 -733305 -637118 -272823 -44843
$$ [...]
##END NTUPLES=NMR SPECTRUM
##END=
