##TITLE=abcd
##JCAMPDX= 6.0         $$ Bruker NMR JCAMP-DX V2.0
##DATA TYPE= NMR SPECTRUM
##DATA CLASS= NTUPLES
##ORIGIN= UXNMR, Bruker Analytische Messtechnik GmbH
##OWNER= root
$$ XWIN-NMR		Version 3.5
$$ Thu Aug  6 19:04:48 2026 Russian Standard Time (UT+4h)  servis@DPX200
##.OBSERVE FREQUENCY= 200.131235884673
##.OBSERVE NUCLEUS= ^1H
##.ACQUISITION MODE= SIMULTANEOUS
##.ACQUISITION SCHEME= undefined
##.AVERAGES= 24
##.DIGITISER RES= 18
##SPECTROMETER/DATA SYSTEM= spect
##.PULSE SEQUENCE= zg
##.SOLVENT NAME= CDCl3
##.SHIFT REFERENCE= (INTERNAL, CDCl3, 0, 16.4885)
##AUDIT TRAIL= $$ (NUMBER, WHEN, WHO, WHERE, WHAT)
$$ ##TITLE= Audit trail, XWIN-NMR		Version 3.5
$$ ##JCAMPDX= 5.01
$$ ##ORIGIN= Bruker BioSpin GmbH
$$ ##OWNER= servis
$$ F:\spectra/data/av/nmr/H1/1/pdata/1/auditp.txt
$$ ##AUDIT TRAIL=  $$ (NUMBER, WHEN, WHO, WHERE, WHAT)
(   1,<2026-08-06 19:04:22.17 +0400>,<servis>,<DPX200>,
      <created by zg, POWCHK disabled, PULCHK disabled
       terminated by command 'halt'
       configuration hash MD5:
       00 E9 B6 7A A2 85 ED C7 34 08 36 98 17 FE 4E 26
       data hash MD5: 32K
       49 0C C6 8D D6 5A 6D 9F 74 62 B6 A7 FB 6A 9A 8D>)
(   2,<2026-08-06 19:04:24.04 +0400>,<servis>,<DPX200>,
      <Start of raw data processing
       efp BC_mod = 2 LB = 0.05 FT_mod = 6 PKNL = 1 PHC0 = -415.7518 PHC1 = 3.101563 SI = 16K 
       data hash MD5: 16K
       8B 9A 45 DB 28 52 D6 9E B5 E6 25 03 0E EF 91 C4>)
(   3,<2026-08-06 19:04:34.32 +0400>,<servis>,<DPX200>,
      <pk PHC0 = 1.8 PHC1 = 0 
       data hash MD5: 16K
       E4 C3 88 F1 72 85 96 83 D8 CB F7 65 31 17 5C 5A>)
$$ ##END=
$$ 
$$ hash MD5
$$ A1 CD 8F 9B BF A4 6A 82 EF 73 6C AA 89 83 D5 30
##$RELAX= 
##$RELAX= 
##$RELAX= 
##$RELAX= 
##$RELAX= 
##$RELAX= 
##$RELAX= 
##$RELAX= 
$$ Bruker specific parameters
$$ --------------------------
##$DU= <F:\spectra>
##$EXPNO= 1
##$NAME= <H1>
##$PROCNO= 1
##$TYPE= <nmr>
##$USER= <av>
##$AMP= (0..31)
100 100 100 100 100 100 100 100 100 100 100 100 100 100 100 100 100 100 
100 100 100 100 100 100 100 100 100 100 100 100 100 100 
##$AQSEQ= 0
##$AQ_mod= 1
##$AUNM= <au_zg>
##$AUTOPOS= <>
##$BF1= 200.13
##$BF2= 200.13
##$BF3= 200.13
##$BF4= 200.13
##$BF5= 500.13
##$BF6= 500.13
##$BF7= 500.13
##$BF8= 500.13
##$BYTORDA= 1
##$CFDGTYP= 0
##$CFRGTYP= 5
##$CHEMSTR= <none>
##$CNST= (0..31)
1 1 145 1 1 1 1 1 1 1 1 1 1 1 1 1 1 1 1 1 1 1 1 1 1 1 1 1 1 1 1 1 
##$CPDPRG= <>
##$CPDPRG1= <>
##$CPDPRG2= <>
##$CPDPRG3= <>
##$CPDPRG4= <mlev>
##$CPDPRG5= <mlev>
##$CPDPRG6= <mlev>
##$CPDPRG7= <mlev>
##$CPDPRG8= <mlev>
##$CPDPRGB= <>
##$CPDPRGT= <>
##$D= (0..31)
0 2 0 0 0 0 0 0 0 0.06 0 0 0 0 0 0 0.0002 0 0 0 0 0 0 0 0 0 0 0 0 0 0 
0 
##$DATE= 1786028661
##$DBL= (0..7)
120 120 120 120 120 120 120 120 
##$DBP= (0..7)
150 150 150 150 150 150 150 150 
##$DBP07= 0
##$DBPNAM0= <>
##$DBPNAM1= <>
##$DBPNAM2= <>
##$DBPNAM3= <>
##$DBPNAM4= <>
##$DBPNAM5= <>
##$DBPNAM6= <>
##$DBPNAM7= <>
##$DBPOAL= (0..7)
0.5 0.5 0.5 0.5 0.5 0.5 0.5 0.5 
##$DBPOFFS= (0..7)
0 0 0 0 0 0 0 0 
##$DE= 6
$$ [...]
##$SUBNAM4= <"">
##$SUBNAM5= <"">
##$SUBNAM6= <"">
##$SUBNAM7= <"">
##$SUBNAM8= <"">
##$SUBNAM9= <"">
##$SW= 20.6817932712277
##$SWIBOX= (0..15)
0 0 3 0 0 0 0 0 0 0 0 0 0 0 0 0 
##$SW_h= 4139.07284768212
##$TD= 32768
##$TD0= 1
##$TE= 0
##$TE2= 300
##$TE3= 300
##$TEG= 300
##$TL= (0..7)
0 120 120 120 120 120 120 120 
##$TP= (0..7)
150 150 150 150 150 150 150 150 
##$TP07= 0
##$TPNAME0= <>
##$TPNAME1= <>
##$TPNAME2= <>
##$TPNAME3= <>
##$TPNAME4= <>
##$TPNAME5= <>
##$TPNAME6= <>
##$TPNAME7= <>
##$TPOAL= (0..7)
0.5 0.5 0.5 0.5 0.5 0.5 0.5 0.5 
##$TPOFFS= (0..7)
0 0 0 0 0 0 0 0 
##$TUNHIN= 0
##$TUNHOUT= 0
##$TUNXOUT= 0
##$USERA1= <user>
##$USERA2= <user>
##$USERA3= <user>
##$USERA4= <user>
##$USERA5= <user>
##$V9= 5
##$VALIST= <valist>
##$VCLIST= <CCCCCCCCCCCCCCC>
##$VD= 0
##$VDLIST= <DDDDDDDDDDDDDDD>
##$VPLIST= <PPPPPPPPPPPPPPP>
##$VTLIST= <TTTTTTTTTTTTTTT>
##$WBST= 1024
##$WBSW= 30
##$XGAIN= (0..3)
0 0 0 0 
##$XL= 0
##$YL= 0
##$YMAX_a= 236732
##$YMIN_a= -285726
##$ZGOPTNS= <>
##$ZL1= 120
##$ZL2= 120
##$ZL3= 120
##$ZL4= 120
##$ABSF1= 0
##$ABSF2= 0
##$ABSG= 0
##$ABSL= 0
##$ALPHA= 0
##$AQORDER= 0
##$ASSFAC= 0
##$ASSFACI= 0
##$ASSFACX= 0
##$ASSWID= 0
##$AUNMP= <proc_1d>
##$AZFE= 0.1
##$AZFW= 0.1
##$BCFW= 0
##$BC_mod= 2
##$BYTORDP= 0
##$COROFFS= 0
##$CY= 18.4799938201904
##$DATMOD= 1
##$DC= 0
##$DFILT= <>
##$DTYPP= 0
##$F1P= 9.9274215381318
##$F2P= -0.165520771350173
##$FCOR= 1
##$FTSIZE= 16384
##$FT_mod= 6
##$GAMMA= 0
##$GB= 0
##$INTBC= 1
##$INTSCL= 4.127829e-11
##$ISEN= 128
##$LB= 0.05
##$LEV0= 0
##$LPBIN= 0
##$MAXI= 10000
##$MC2= 0
##$MEAN= 0
##$ME_mod= 0
##$MI= 50
##$NCOEF= 0
##$NC_proc= -4
##$NLEV= 6
##$NOISF1= 3.799351
##$NOISF2= 2.8
##$NSP= 0
##$NTH_PI= 0
##$NZP= 0
##$OFFSET= 16.48848
##$PC= 4
##$PHC0= -413.9518
##$PHC1= 3.101563
##$PH_mod= 1
##$PKNL= yes
##$PPARMOD= 0
##$PSCAL= 4
##$PSIGN= 0
##$REVERSE= no
##$SF= 200.130005582386
##$SI= 16384
##$SIGF1= 3
##$SIGF2= 2
##$SINO= 400
##$SIOLD= 16384
##$SREGLST= <1H.CDCl3>
##$SSB= 0
##$STSI= 16384
##$STSR= 0
##$SW_p= 4139.07284768211
##$SYMM= 0
##$S_DEV= 0
##$TDeff= 32768
##$TDoff= 0
##$TI= <>
##$TILT= no
##$TM1= 0
##$TM2= 0
##$TOPLEV= 0
##$USERP1= <user>
##$USERP2= <user>
##$USERP3= <user>
##$USERP4= <user>
##$USERP5= <user>
##$WDW= 1
##$XDIM= 16384
##$YMAX_p= 292530018
##$YMIN_p= -230187
$$ End of Bruker specific parameters
$$ ---------------------------------
##NTUPLES= NMR SPECTRUM
##VAR_NAME=  FREQUENCY,     SPECTRUM/REAL,   SPECTRUM/IMAG
##SYMBOL=    X,             R,               I
##VAR_TYPE=  INDEPENDENT,   DEPENDENT,       DEPENDENT
##VAR_FORM=  AFFN,          ASDF,            ASDF
##VAR_DIM=   16384,         16384,           16384
##UNITS=     HZ,            ARBITRARY UNITS, ARBITRARY UNITS
##FACTOR=    0.252644378177508, 1,           1
##FIRST=     3299.83951724647, 0,            0
##LAST=      -839.233330435636, 0,           0
##MIN=       -839.233330435636, -230187,     0
##MAX=       3299.83951724647, 292530018,    0
$$ Real data points
##PAGE= N=1
##DATA TABLE= (X++(R..R)), XYDATA
$$ [...]
7879e034J4562j1980n0012J14445k0830k0564k2489K2469m587k6171L4341m3552
7867a9402L0313k3857K3700K50r609J1434J6848l1622j1235k2837J1732J774K50755
7854B28244k16303j3297K2646n751O161n7905K859N4196J338j0906L5337j5060
7842C1559m8825O1823n112k8192k9547J9632q501j0877J9117K6906n9836N4101
7830B2248j2504k6765N8246l2718k8285O8964o6704J5452k5923M7012O3375o5397
7818A7001M702j6174q099K8084J0645l8212j4878N102J2174L619K6433k0450M0843
7805E0790o8518R683L916o553J1239j4443q26J2941n375J4465Q6j311L5075k8779
7791A2390l1046M9313m1777L6744j3197l5137L5335j3755j2130J843J753J7961
$$ plain form
7879 -5034 9528 -2452 -52464 61981 41151 20587 -1902 20567 15980 -10191 24150 -19402
7867 -19402 10911 -12946 10754 11004 1395 12829 29677 -1945 -13180 -36017 -24285 -22511 228244
7854 228244 11941 -1356 21290 15539 21700 -36205 -33346 20850 22188 11282 46619 31559
7842 31559 -17266 44557 39445 11253 -18294 1338 -7163 -18040 1077 27983 -31853 22248
7830 22248 9744 -17021 41225 8507 -19778 49186 -17518 -2066 -27989 19023 82398 17001
7818 17001 21703 5529 -2570 25514 36159 -2053 -16931 -11829 345 3964 30397 9947 50790
7805 50790 -17728 -8045 -4129 -10682 557 -13886 -14712 -1771 -7146 7319 7405 6094 41169 12390
7791 12390 -18656 30657 -11120 25624 12427 -22710 12625 -1130 -13260 -11417 -9664 8297
7779H297q087L8262n1197N6534l7026l4924Q2336k5745q182j3396q782K8562j625
7766B5027k0162k2439N0854m762j9703Q62J5121k4707J0507o793L9880K0987q2169
7753a7497K1413J0262L8367j8399r821J9026j1423k9436L4360j22j7630k9584
7741a0484j183N8021k8587J2277k3433R68N761N870j1676P1781j13593P7979m5354
7728a653M481M9187j8866l0014N0062j309o3790M0008m84M2267k2546O354j6387
7715C7310j365j1852k0738K1433J3573J801l8514M0236M063j6885p94J4294l0138
7702A2424M2946R385j5344j8872j1469J8461P441n5988Q6297o1625k1370N2516
7690D4802K5819m0881j9135M3335K991l9337N3253m7500L6262k5177j2336R587
$$ plain form
7779 8297 210 38472 -12725 43809 6783 -28141 54195 28450 20268 6872 -1910 26652 25027
7766 25027 4865 -17574 33280 28518 8815 9677 24798 91 10598 3805 43685 64672 -17497
7753 -17497 3916 14178 52545 34146 24325 43351 31928 2492 36852 36730 19100 -10484
7741 -10484 -11667 46354 17767 30044 6611 7579 13340 19210 7534 79315 -34278 43701 -1653
7728 -1653 2828 52015 33149 3135 53197 51888 -11902 28106 27622 69889 47343 53697 37310
7715 37310 35945 24093 3355 24788 38361 40162 1648 41884 45947 29062 28268 42562 12424
7702 12424 55370 64755 49411 30539 19070 37531 44972 -11016 75281 13656 -7714 44802
7690 44802 70621 29740 10605 53940 56931 17594 70847 23347 59609 34432 22096 31683
7678C1683K3054k9563M0336l6779M2611j568n8260L1486r38K202p687m379o556
7665B5642K3902J4338n448n0476M0447L2828k2981Q821m0778M2666k1228j0504
7653C7229L9337l5330J2404J4350J6648j841j8998n828J7591n521q929j7434K3038
7640F6716k3736j8014M2548m0629M4445l235J5233j7394o2992N6699K7425o9885
7628A7181M7438l2921K3622K2744k2228k9490R974L4024j5982L569q144K2204
7616G1991m4472M5315j0424L81l5552O0473l3199J1949K2097k3259q102Q383m381
7603F1200k0497K8899l7564M493N1199k799o851n435N768O967k1975o32k783L5366
7589I5356k8993K2404q072l517N8164o8735J5613Q024k435J7410k5733J9190k6794
$$ plain form
7678 31683 54737 25174 65510 28731 71342 69774 11514 43000 42062 44264 36577 32198 25642
7665 25642 49544 63882 58434 7958 48405 81233 58252 67073 26295 68961 47733 37229
7653 37229 76566 41236 53640 67990 84638 82797 63799 57971 75562 70041 61112 43678 66716
7640 66716 42980 24966 67514 26885 71330 68095 83328 65934 2942 59641 87066 17181
7628 17181 64619 31698 55320 78064 55836 26346 36320 70344 54362 57931 49787 71991
7616 71991 27519 72834 62410 62791 27239 87712 54513 66462 88559 65300 57198 65581 61200
7603 61200 40703 69602 32038 36531 87730 84931 78080 72645 78413 85380 63405 62773 59990 95356
7589 95356 66363 88767 80695 77178 135342 66607 82220 90244 87809 105219 79486 98676 71882
7576G1882K9229l7291R0355q9183N0915l1354J7481j9259q067K5389o398L522
7564I7221k5547N7778l8986l321N8240k9780l0221L7382l4437K4793J3304m9194
7552G7232M9969j9159N0328l1364m3962M9027n7590M0790p167j4029K509M1572
7540A38156p6099K8463l1172O9447n6316M6713M399j3697M7346n5785O846j927
7528A06374q95r691L9690n4965O7323k1601j1171k9626J8260J1201n866J3111
7516A22144k5957M0186l8795J9267L9876j9617k1995K9118m680j9700M6025m2274
7504A23598j1495k391q017J1973n039q004M0143M326k9682j3066k0733O8268l2050
7491A17831K7716k0769j0179k366r553J4295L2022N632l484q167j8513J7709j0348
$$ plain form
7576 71882 101111 63820 154175 64992 115907 84553 102034 82775 74708 100097 93699 97221
7564 97221 71674 129452 90466 87145 145385 115605 85384 122766 88329 113122 126426 77232
7552 77232 127201 108042 158370 127006 83044 132071 74481 115271 108104 94075 96584 138156
7540 138156 62057 90520 59348 128795 72479 119192 123591 109894 157240 101455 108301 106374
7528 106374 105479 95788 135478 80513 147836 126235 115064 85438 103698 114899 109033 122144
7516 122144 96187 136373 97578 116845 156721 137104 115109 144227 139547 119847 165872 123598
7504 123598 112103 109712 101695 113668 108629 100625 140768 145094 115412 102346 81613 149881 117831
7491 117831 145547 124778 114599 112233 102680 116975 148997 154629 151145 142978 124465 142174 131826
7478A31826J9954m9294O2618o479m7387M2078Q34j3609P719j4747J8886J6804
7466A69203l653n7788L4268l186K2825l6027L2466M979j5180J9203J1570p145
7454A71535l6449M8552m1691K6157P100j7769K8221K3430m0905K5630o3479N3392
7442A83724n771N2501l1894k7543L0087p702k1308O627J954K2094K1351m0417
7430A83703K5304J0626l9278J0569o3681J03019k5672N4227o2188k4935Q6277
7419B57971k5337N3639j1900j4237m918l136o612L9618m7354J9252r847l1889
7407B15250m717J9040l164J7754K0890L184j4707J971j0115J6450K2593p329p13
7394B76387j8391O412O8489l6536j2102J6799m2921L193P3852j4255j0356p546
$$ plain form
7478 131826 151780 102486 165104 158625 111238 153316 154150 140541 148260 133513 152399 169203
7466 169203 165550 107762 142030 138844 161669 125642 158108 163087 147907 167110 178680 171535
7454 171535 135086 183638 141947 168104 175204 157435 185656 209086 168181 193811 130332 183724
7442 183724 177953 230454 198560 171017 201104 193402 172094 178721 180675 202769 224120 183703
7430 183703 209007 219633 180355 190924 127243 230262 204590 258817 196629 171694 257971
7419 257971 232634 286273 274373 260136 255218 252082 245470 285088 237734 256986 247139 215250
7407 215250 210533 229573 226409 244163 265053 268237 253530 255501 245386 261836 284429 277100 276387
7394 276387 257996 264408 332897 296361 284259 301058 258137 261330 335182 320927 310571 303025
7382C03025L4803k6177L872J6146o463J5297q683j19N6358k1642l073o191j9069
7369C38084O4801k8260k2286P4720l5033J4677k7197M1203J5558k2445O4612q5565
7357C92869O5599L011J3462N978P77m8446N4490L0310m2743J8285J143L1542J1164
7344E37441q062L870J1336L4846j7785m795O2047j2945j9516J1606K6288k8980
7332E95351K3678K7064J372K4632k4263K340L2076j2370M5999j122K7141K7073
7320G68971j4989K3382q520M4246J7175l6659K8517M6563K5595L1683m2911Q9469
7308I72522j7673j4081P5085K5710j3222K8098M3938l2833O4959M868l7061P9462
7296A179772J3984N1016l844J5627L2938K9723K2623J8098O0722M4282L2066K8940
$$ plain form
7382 303025 337828 311651 315523 331669 325206 340503 331820 331701 388059 366417 363344 357153 338084
7369 338084 402885 374625 352339 427059 392026 406703 379506 420709 436267 413822 478434 392869
7357 392869 458468 461479 474941 480919 481696 433250 487740 518050 475307 493592 494735 526277 537441
7344 537441 529379 533249 544585 579431 561646 556851 618898 605953 586437 598043 624331 595351
7332 595351 619029 646093 647465 672097 647834 650174 682250 669880 715879 714757 741898 768971
7320 768971 753982 777364 768844 813090 830265 793606 822123 868686 894281 925964 883053 972522
7308 972522 954849 940768 1015853 1041563 1028341 1056439 1100377 1067544 1132503 1137371 1100310 1179772
7296 1179772 1193756 1244772 1240928 1256555 1289493 1319216 1341839 1359937 1420659 1464941 1497007 1525947
7284A525947N1364R702L4522J7118P1520k0688P7295O6562M3779K4261j6676O7847
7272A952553N35P5002J3976J06696K0353O7235J2860O9990N3643N1325K6869J9916
7260B470953R2957J9697R8478r085J15493J3549K1850N4410N7872J3192K3283
7249B972649Q0729L0652J18757k9080N8884J2397M3538N9285m637M2829N5038
7238C441041L5216l5339J01851l8274K5576J5645M4245J3949k613M2200l9943
7227C603554K9532l4327L265r585K3257m9702L5476l6959q204K3840j01381M77
7215C479243l3137j7272m884l9668q3537m882l7929j8456q2976k3785m8479l5801
7203C048437n9226Q686k0453j14375K7410j14455j3836o3740l0971l0531p7022
$$ plain form
7284 1525947 1577311 1587013 1621535 1638653 1710173 1689485 1766780 1833342 1877121 1901382 1884706 1952553
7272 1952553 1953088 2028090 2042066 2148762 2169115 2236350 2249210 2319200 2372843 2424168 2451037 2470953
7260 2470953 2563910 2583607 2682085 2673000 2788493 2802042 2823892 2878302 2936174 2949366 2972649
7249 2972649 3053378 3084030 3202787 3173707 3232591 3244988 3288526 3347811 3343174 3386003 3441041
7238 3441041 3476257 3440918 3542769 3504495 3530071 3545716 3589961 3603910 3601297 3643497 3603554
7227 3603554 3633086 3598759 3602024 3592439 3615696 3565994 3601470 3564511 3556307 3580147 3478766 3479243
7215 3479243 3446106 3428834 3423950 3384282 3300745 3295863 3257934 3239478 3156502 3132717 3084238 3048437
7203 3048437 2989211 2997897 2977444 2863069 2890479 2776024 2762188 2698448 2667477 2636946 2559924
7192B559924p540j05652r237r9182M3678j01903k3920p6597j2593m1896n7941
7181B067141j7069m8250q5411j3184j5418r2210K8277j34845L3054p2058j3336
7170A636691l2022l5162J3910p9189L1208n9926J1302j20014N8646o5911o763
7159A352770m1539o1220N1496n8219K6595q6557k294j3916J7949r3017O1975n8376
7147A095647L530j7643n6455L3386j4587j0335n5317o259Q71k362p8936K5204
7135I16744q998K4882p0607j1178R772n3967Q973j3410J5049p306J730m7745j0090
7122G53849J6176p3771O9193K694K8365q9095l3834r905O1610m5080p711k3591
7110F48900L5575L5267r0188J154L819j8749l5817L8390k7858j2830N4780k2119
$$ plain form
7192 2559924 2552384 2446732 2437495 2338313 2381991 2280088 2256168 2179571 2166978 2125082 2067141
7181 2067141 2050072 2001822 1916411 1903227 1887809 1795599 1823876 1689031 1722085 1650027 1636691
7170 1636691 1604669 1569507 1583417 1504228 1535436 1475510 1486812 1366798 1425444 1359533 1352770
7159 1352770 1311231 1250011 1301507 1243288 1269883 1183326 1181032 1167116 1185065 1092048 1154023 1095647
7147 1095647 1099177 1081534 1025079 1058465 1043878 1033543 978226 971967 972838 970476 891540 916744
7135 916744 907746 932628 862021 850843 860615 806648 815621 802211 817260 809954 811684 763939 753849
7122 753849 770025 696254 765447 768141 796506 707411 673577 663672 725282 680202 672491 648900
7110 648900 684475 719742 629554 630708 634527 615778 579961 618351 590493 577663 632443 610324
7098F10324J397l9080k9249J4624j5586L6503m9026l882M3215q3706M8731l6713
7086D97552J4581K8687o7213j5453j7360L4057J1593l5785K7346l7728m1449N2675
7074D51503Q850j2211m5390k7155M5103j0936K5506q0074M6598m76J6174o8767
7062C48725P611K5960j1748M571r760k1064K789q100k4720L8149j8008q888J8931
7049C44448l4543L336K4898k2663j6893J1537k1170k6300J829J5848k895K2365
7037B99797l8089K3141P346j8237J268K7002p3002M7358o8197J1368N6959k0112
7025B56602J4544j6027l5680o510N77L5467m6688R712L6694m7362L1470J833q0959
7012A53673N6090j8476K7608l0325j2235K7699l4458P3250r8128L7016l6921Q7015
$$ plain form
7098 610324 611721 572641 543392 558016 542430 578933 529907 526025 569240 485534 534265 497552
7086 497552 512133 540820 473607 458154 440794 474851 486444 450659 478005 440277 398828 451503
7074 451503 460353 448142 402752 375597 420700 409764 435270 355196 401794 401318 417492 348725
7062 348725 356336 382296 370548 375119 365359 344295 347084 338984 314264 352413 334405 325517 344448
7049 344448 309905 313241 338139 315476 298583 310120 288950 262650 264479 280327 277432 299797
7037 299797 261708 284849 292195 273958 275226 302228 229226 276584 208387 219755 276714 256602
7025 256602 271146 255119 219439 212929 213506 248973 202285 211997 248691 201329 232799 234632 153673
7012 153673 209763 191287 218895 188570 176335 204034 169576 242826 144698 181714 144793 231808
7000B31808m8842L4249o0037N6620o0607K5826P481r94k9913j1223oK9910k4751
6987A49521J5462K7493k2086j8316m2484M9567M758k5046L7807j2069L462j1115
6975A56954R170l1047K5984l7697j128O658L5408o4093K8657M0635m611k3540
6963A41350n899k69L3298j9497J2264J5589o2702M8863n5776K8226l854K5041
6951A56634l6772k5197K4880M6120m6064L5640j1645k3079j4896K2876j4322L8790
6939A52965j7392n3290K8560k0777J9287l5K0860K124K5159q7415M4219Q319k8172
6926I4412J8596O327O1525m3001r212M615J4202l5852M4216r0344N0863L730k1162
6913I8915K1329N349P191K0278l1259J2682J823J2683p938J456j2682l3817P108
$$ plain form
7000 231808 182966 217215 157178 213798 153191 179017 186498 185504 155591 144368 144362 174272 149521
6987 149521 164983 192476 170390 152074 109590 159157 163915 138869 176676 164607 168069 156954
6975 156954 166124 135077 161061 123364 122236 128894 164302 100209 128866 169501 164890 141350
6963 141350 135451 135182 168480 148983 161247 176836 114134 162997 107221 135447 131593 156634
6951 156634 119862 94665 119545 165665 119601 155241 143596 120517 105621 128497 114175 152965
6939 152965 135573 82283 110843 90066 109353 109318 130178 132302 157461 70046 114265 122584 94412
6926 94412 113008 119335 180860 137859 128647 133262 147464 111612 155828 65484 116347 120077 98915
6913 98915 120244 125593 132784 153062 121803 134485 136308 148991 141053 142509 129827 96010 103118
6900A03118K5852M462j5874L4647l615J5599r966n4013k726L3267j6015K5555
6888A40291l1282M9835o351k8208L5069p4923O7628m1347L6343k4366p496L9544
6876A54737k7841J8082m5368M8504m064r753M981L514q181l4978k2354N3019j6446
6863A13852L8688K2048o6752J3340o3803M0525K2089L7476k3163j5962m693j0414
6851A03231n0213J1719J7091r680M2387l9201J5558K3953p641N974J1840n4018
6839G1000N2744o5k9885M1622q2944R1095k9742l7465K6418N734P619m6368K1045
6826I0808J0215l1515j1475O7456m5371j8128j360K3377J0788k8786M968k2896
6814D8081L0806j2575K1966j9252Q508M603n9495K7336K6079J4875N544m6884
$$ plain form
6900 103118 128970 133432 117558 152205 148590 164189 154223 100210 97484 130751 114736 140291
6888 140291 109009 158844 152493 124285 159354 84431 152059 110712 147055 122689 115193 154737
6876 154737 126896 144978 99610 148114 144050 134297 139278 142792 134611 99633 77279 130298 113852
6863 113852 152540 174588 107836 121176 57373 97898 119987 157463 134300 118338 113645 103231
6851 103231 53018 64737 81828 72148 114535 75334 90892 114845 107204 113178 125018 71000
6839 71000 123744 123679 93794 135416 52472 143567 113825 76360 102778 108512 116131 69763 90808
6826 90808 101023 69508 58033 125489 80118 61990 60630 84007 94795 66009 70977 48081
6814 48081 78887 66312 88278 69026 77534 82137 22642 49978 76057 90932 96476 49592
6802D9592r150Q2723r9081P3859m0918K6946l9939k4770N8757j1983k1608M5037
6790H9465J916m9136M0838j7454q162N6106m1336l5696K6907l2374M3345R779
6778H4198J7473j6129l0172j4293M28J4359K66k4962L6382R775k7297L1335m4209
6765C7154J9503O28L07M2186l9469L857q845l3662O2427k6677K5602k1332J0601
6752G2280j819M242k8608j6793M6369j6612M3062l8835l3871K2191K8652j6893
6740F3365n143L8420n0282L9280n2341L1940k5130J6798j85n421N074j2125J360
6727D5610L1458l9470J1152K6713r338l06j6875N5088m4173j5085L3894m0139
6715C8529L5267j110L6999m2576k1017m4711N3398l612O4264n2971J4917k2470
$$ plain form
6802 49592 40442 123165 24084 97943 57025 83971 44032 19262 78019 66036 44428 89465
6790 89465 91381 42245 83083 65629 57467 113573 72237 36541 63448 31074 74419 84198
6778 84198 101671 85542 55370 41077 41505 55864 56130 31168 67550 77325 50028 81363 37154
6765 37154 56657 57285 57592 99778 60309 64166 55321 21659 84086 57409 83011 61679 72280
6752 72280 70461 74703 46095 29302 75671 59059 102121 63286 29415 51606 80258 63365
6740 63365 58222 96642 46360 85640 33299 65239 40109 56907 56722 51301 56375 44250 45610
6727 45610 77068 37598 48750 75463 66125 65819 48944 104032 59859 44774 78668 38529
6715 38529 73796 72686 109685 67109 46092 1381 54779 51167 115431 62460 77377 54907
6703E4907L0523j2403m060R507K8162P027k4567L1086k6823l020J7662l280o906
6690I7815J2225j9878K3283L487k7346L3198L3114m4298j8003M9822n621l835
6678A33963m1642L9761K2660j9712O7292m8080J4344p2544P1572j2622j3238l2037
6666A09717M8954M881k4509k3551K6477L2103q1467K0371M6687l7176J3528l3110
6654A02905l2446L090N1906k2409J1191o0403O9479o65q157j7741k6749P708J6249
6641I3958J8507n1128M297o388J6038j2361J1510r23R861L8943p0839L8453k9816
6628F0112k793k2892J4594J198K0679n1884L9145M925M1064o6138M449P116k2407
6615B7168N8103k4541M7525m5808L5455k8395m2068J5628M2517n5008N1311k1995
$$ plain form
6703 54907 85430 73027 68967 78474 106636 113663 89096 120182 93359 90339 108001 104721 97815
6690 97815 110040 90162 113445 116932 89586 122784 155898 111600 93597 143419 137798 133963
6678 133963 92321 132082 154742 135030 202322 154242 168586 96042 167614 154992 141754 109717
6666 109717 158671 163552 139043 115492 141969 174072 92605 112976 159663 122487 136015 102905
6654 102905 70459 73549 125455 103046 114237 53834 123313 122648 114491 96750 70001 77709 93958
6641 93958 112465 61337 65634 59246 75284 62923 74433 73510 83371 122314 51475 89928 60112
6628 60112 57319 34427 49021 50219 70898 19014 58159 63084 104148 38010 42459 49575 27168
6615 27168 85271 60730 108255 62447 97902 69507 27439 43067 85584 30576 81887 59892
6603E9892l8051K8372l7455M1986o978j6848o740M3285k6686k0621J5815O0161
6591I6132o4314J2789o130p084P425N9540p5059O2381k1732L114k9903K4624N5590
6578A17373k0478n4162L3714j0296J3226j6207J1608o221L1765n6052K8464P281
6566H0015m0435L1636j74L4761l0109k0628N9739j8610l8383K3781m6187M5023
6554H0429J5852k7928n814R03J4763j4346k2588k7365O3404m6624K4143K7427
6542H2256k2479l35j8860J9169Q355l5904J7439J768M564K5935q659r206o674
6529E7369J7447k2185m3752J32626j05251L2111m1359P5430j6471j8183O915j3679
6517F1018j2221l6580L7311m451N0804p4964J7628L3291O399m2575j8507M7958
$$ plain form
6603 59892 21841 50213 12758 54744 47766 30918 24178 67463 40777 20156 35971 96132
6591 96132 31818 44607 38477 31393 38818 98358 23299 85680 63948 67062 37159 61783 117373
6578 117373 96895 42733 76447 66151 79377 63170 74778 68557 100322 44270 72734 80015
6566 80015 39580 71216 71042 105803 75694 55066 114805 96195 57812 81593 35406 80429
6554 80429 96281 68353 62539 63442 78205 63859 41271 13906 77310 30686 54829 82256
6542 82256 59777 59442 40582 59751 68106 32202 49641 51409 55973 81908 73249 64043 57369
6529 57369 74816 52631 8879 141505 36254 68365 27006 102436 85965 67782 74697 61018
6517 61018 48797 12217 49528 45077 95881 20917 38545 71836 78235 35660 17153 65111
6505F5111l1441M3094m6933N9403l2549J0065k6915L2248q1432P4912o8725O9618
6493F6456J3323o9473K1580L540K2172k8965j11j8275J5097K8630k3718K728j52
6480C2832O0789p6481J0714J0001k0386k0401N7542k6850Q8203n9675l7897P2362
6468I0753o916k0637n3220L0755J563J6038m5168O4328l6056J3692j4569k2280
6456A8283M3577n0934J3545m93K9940n238n131l4657N8633o401N0029l2280J1317
6443I0190j6464K8509m912m9051M1384j5042k0322O2861m5483R90K1145L92j6413
6430G7784M1277n3536J0681j2782O1926n3077L5524q9451N2501L7388m5120N0701
6418A13816n4922L7112j3408J4018Q715O099k0381L4038m5739o003K5568n7501
$$ plain form
6505 65111 33670 76764 29831 89234 56685 66750 39835 72083 -9349 65563 -3162 66456
6493 66456 79779 10306 31886 35426 57598 28633 28522 10247 25344 53974 30256 32984 32832
6480 32832 93621 17140 27854 37855 17469 -2932 54610 27760 115963 56288 18391 90753
6468 90753 83837 63200 9980 40735 42298 58336 13168 77496 41440 55132 40563 18283
6456 18283 61860 10926 24471 23978 53918 48680 43549 8892 67525 61124 111153 78873 90190
6443 90190 73726 102235 97323 48272 89656 74614 54292 117153 71670 72660 93805 94197 77784
6430 77784 119061 65525 76206 63424 125350 72273 107797 18346 70847 108235 63115 113816
6418 113816 58894 96006 82598 96616 105331 111430 91049 125087 79348 73345 98913 41412
6406D1412O8073r4602Q6296l2572K5397l1044N2603r1700M2853O003r659J546
6394F4606m9514N3339O108j178j856N65n41L3098o0818M4019j9693k5030M1758
6381H4863m7655L4943j4212N16k1500N4739n3634J3821J7789k8293J9526k6750
6369C4153J4965K5019q909L5707k6173K8162j0534l4350L1494k8640L3369j1396
6357H2867l3287L9757Q825j5733l4143L2154r890n163k741M9827m7947L3153L3703
6344A31382l0291K8861l41n2627N402L6193m2726K4274k3314N0192j8987l0171
6332G7847j3605L0527l4055L6643k7662M9699l4910l1727N1526K93n789k2869
6320G5918j2824N2734k0918j239J4521m1580J9463L1654J1958K0753j7446P027
$$ plain form
6406 41412 109485 14883 101179 68607 94004 62960 115563 23863 66716 72719 63060 64606
6394 64606 15092 68431 74539 73361 71505 72070 71529 104627 43809 87828 68135 43105 84863
6381 84863 37208 72151 57939 58455 36955 91694 38060 51881 69670 41377 60903 34153
6369 34153 49118 74137 65228 100935 74762 102924 92390 58040 89534 60894 94263 82867
6357 82867 49580 89337 98162 82429 48286 80440 70550 65387 62646 112473 64526 97679 131382
6344 131382 101091 129952 129611 76984 82386 118579 75853 100127 76813 127005 108018 77847
6332 77847 64242 94769 60714 97357 69695 119394 84484 52757 104283 104576 98787 75918
6320 75918 63094 115828 94910 93671 108192 66612 86075 117729 129687 150440 132994 140021
6308A40021m854O307l1315N9068l3782K1606j6164N230O727k9419P769k6930K6804
6295A31068k6270q795M5619j3315L0446j2847p7924O7659J0880m885m081k752
6283A34803P1512j3687L3558m1539J9603j0952K0928r999l5926l114J0330l5705
6271A39812k2868K8887j5261J6949k2920L4644J0673l5183L3843m3750k9377J0959
6259A06408K3503J9540M2838l8901P2161K5720k4821j435K1078O4999o4540l6182
6247B10368L2327l2043j1187M697n0256L6385k2288L4921l82k0781L2887n4799
6235A59849Q575J2377J2807K2082m6392l0830N3349j9958M4773K683K6320J3285
6223B58920n277j8823R504m11m6877M9711j9823j7728P2002N724K0797q785L9478
$$ plain form
6308 140021 135167 141474 110159 169227 135445 157051 140887 146117 152844 123425 131194 104264 131068
6295 131068 104798 96003 141622 128307 158753 145906 67982 135641 146521 141636 137555 134803
6283 134803 206315 192628 226186 184647 204250 193298 214226 204227 168301 165187 175517 139812
6271 139812 116944 145831 130570 147519 124599 159243 169916 134733 168576 124826 95449 106408
6259 106408 129911 149451 192289 153388 225549 251269 226448 225013 246091 311090 246550 210368
6247 210368 242695 210652 199465 204162 153906 190291 168003 202924 202542 181761 214648 159849
6235 159849 168424 180801 193608 215690 169298 138468 191817 171859 216632 219315 245635 258920
6223 258920 253643 234820 244324 243913 197036 246747 226924 209196 281198 286922 307719 298934 338412
6210C38412J798M310q3471N3829n4568K3689l5388k8448J6117K5646p6897M2234
6198B27263r710M153n5134J9818O0661q2530j2046M3546m8363P9819m9035P269
6186A85711L7331K1967n4087j2315K5322K0293l7699L5839j2676J2454k5658m1767
6174A54715M9475k0424J5340l5662M9908k7852K1q074M1063l8852N5281m3337
6162A91602M1804k0482m083L2208o3763O0773K8651m8062J5206J1873j8454M876
6150B32149j2452K5508J0532k1153M5314j9532N0175o870j9556L4079J0179o3473
6138B64900P4778j6641K8358r545K5723J3287n2739P2320m9052K1118M4504n3766
6126C63245K2389J510K0509j0888l6632R934L7244l1315j3811K3992J9078l8756
$$ plain form
6210 338412 340210 344520 261049 314878 260310 283999 248611 220163 236280 261926 185029 227263
6198 227263 217553 221706 166572 186390 247051 164521 152475 196021 147658 227477 178442 185711
6186 185711 223042 245009 190922 178607 203929 224222 186523 222362 209686 222140 196482 154715
6174 154715 204190 183766 199106 163444 213352 185500 185521 177447 218510 179658 234939 191602
6162 191602 233406 212924 208841 241049 177286 238059 266710 218648 233854 245727 227273 232149
6150 232149 219697 245205 255737 234584 279898 260366 310541 303671 284115 318194 328373 264900
6138 264900 339678 323037 351395 341850 367573 380860 328121 400441 351389 372507 417011 363245
6126 363245 385634 387144 407653 396765 360133 370067 407311 375996 362185 386177 405255 366499
6114C66499k7272n66J6350J0045j3219q737J9759K9299J7504j3783J1358M2524
6102D49761n5939K5584L25r688K9140m4152P6691p4955M567n9937Q3767m5346
6090C79818M9582q4534M8081L6264n7215N057J691J4128J4715j0299K352J9557
6078D19197p535N7591k5119m4504K19N6946K1094k6163L0925n3023L2252J2268
6066D74148j3580O09n676P1073R064m832o4712P7334j2130m551o1312P8626j5738
6053E28323M4712N975P997j6533J5092Q0130k3758j8948M5431M4435j7577M6243
6041G41522m2320K6655l5646l8257M6556j6542J7939j7286M3990l1806K4005k1031
6029F97779K8697K8651j9936k563L3842O4451k3759l8350K9089J03571m7162L6487
$$ plain form
6114 366499 339227 338661 355011 365056 351837 343100 362859 392158 409662 395879 407237 449761
6102 449761 393822 419406 419731 410043 439183 395031 471722 396767 401334 341397 425164 379818
6090 379818 429400 344866 392947 429211 371996 377053 378744 392872 407587 397288 399640 419197
6078 419197 411662 469253 444134 399630 399849 456795 477889 451726 482651 429628 461880 474148
6066 474148 460568 461177 455501 526574 535638 530806 466094 543428 531298 526747 465435 544061 528323
6053 528323 573035 579010 587007 570474 585566 665696 641938 622990 668421 712856 695279 741522
6041 741522 699202 725857 690211 651954 698510 681968 699907 682621 726611 694805 718810 697779
6029 697779 726476 755127 735191 732628 766470 830921 807162 768812 797901 901472 854310 890797
6017H90797m0997M4605j553l4405l740m1110o016m124l3921l0708N1290p6550
6005G13568P9997n7902K1359N5563l9915L7264K0693K6000l6731K9670j3925L527
5993H39168j4218M8042r6579M8274o7322n1969Q2420k7475m8446K8424J2580k2122
5981G30777k1072M1409M7658k5504k2255j4144M0609J1989K9834K1746r237O3017
5969H94827l0380O7753m7116N4394o2383q564M4962N234j2484l660Q6917k3559
5957I65941m4649L0240K6386N4250n0355R5995n5256K4732M9129J2666K7384M2359
5945A178822L0410L6727J1563j6946n7331j016L9876k2458J6546m323k726n830
5933A203314N4222k8668K7219q517L4980p765P312J0191K5406Q9119k8120M9838
$$ plain form
6017 890797 849800 894405 892852 858447 854707 813597 807581 803457 769536 738828 790118 713568
6005 713568 793565 735663 757022 812585 772670 809934 830627 856627 819896 849566 835641 839168
5993 839168 824950 872992 776413 824687 757365 705396 787816 760341 711895 740319 752899 730777
5981 730777 709705 751114 798772 773268 751013 736869 777478 789467 819301 841047 831810 894827
5969 894827 864447 932200 885084 939478 877095 868531 913493 918727 906243 902583 989500 965941
5957 965941 921292 951532 977918 1032168 981813 1077808 1022552 1047284 1096413 1109079 1136463 1178822
5945 1178822 1209232 1245959 1257522 1240576 1183245 1182229 1222105 1199647 1216193 1211870 1209144 1203314
5933 1203314 1257536 1228868 1256087 1247570 1282550 1274785 1282097 1292288 1317694 1406813 1378693 1428531
5921A428531k1106Q3077J9083J0357N8146J1595M6338J7383k1575O2008n4110
5910A639727j6090q260Q983k705J8525k3243O643N6113R6879m2278O2003M7688
5898A843985J12228j0193N1707O3543Q8414L5961N1348J77016N3733J35746J52218
5887B755706J20531K39975K61027K31697L90019M23830N64071N20861N62754N25091
5877F595562L73304K61591K9989P7706j46189k15325k74161j86345j64747j32955
5867F218430r7304J19510J37154K16418M24936N89859O90349Q94215J114060J282946
5857A1590573J445836J323976J282355R96299O53199K01924j31990m72745p08123
5848A6181304r10580j039970q89486q99356p72648o19089m35871k35078n0978
$$ plain form
5921 1428531 1407425 1490502 1509585 1519942 1578088 1589683 1636021 1653404 1631829 1693837 1639727
5910 1639727 1623637 1615377 1624360 1621655 1640180 1616937 1623580 1679693 1776572 1734294 1796297 1843985
5898 1843985 1956213 1946020 1997727 2061270 2149684 2185645 2236993 2414009 2467742 2603488 2755706
5887 2755706 2876237 3116212 3377239 3608936 3998955 4422785 4986856 5507717 6070471 6595562
5877 6595562 6968866 7230457 7260446 7338152 7191963 6976638 6702477 6516132 6351385 6218430
5867 6218430 6121126 6240636 6377790 6594208 7019144 7609003 8299352 9193567 10307627 11590573
5857 11590573 13036409 14360385 15642740 16639039 17292238 17494162 17362172 16889427 16181304
5848 16181304 15270724 14230754 13341268 12441912 11669264 11050175 10614304 10379226 10328248
5839A0328248J10730M01048N83480Q40765J092023J290924J435938J298009J015869
5830A8397034P45776K12080j45307n57463r10737j098135j293023j308912j174020
5821A2867293j131943r60270q78531o70246n20582m81559k66986j67939k9879
5812G759358R9446K21471L34848L76837L43723K13913O7785p2155l39521m82064
5802H523641n28293o67258o37135o61396n38700n21363m40062l91682l47511k04055
5792C586186k68326k18284k24421j47636j73997r9601j58472q3938j18573q7071
5782B005867m6564o0966j15078o2766o8470K9990j16442o4025l0949p7959L4439
5771A427077o6729n5757l4356J5135r9158j5291k3959l6198n0124j8748K9017
$$ plain form
5839 10328248 10438978 10840026 11423506 12264271 13356294 14647218 16083156 17381165 18397034
5830 18397034 19142810 19354890 19209583 18652120 17741383 16643248 15350225 14041313 12867293
5821 12867293 11735350 10775080 9896549 9226303 8705721 8224162 7957176 7789237 7759358
5812 7759358 7858804 8080275 8415123 8791960 9135683 9349596 9417381 9345226 9005705 8523641
5802 8523641 7995348 7328090 6690955 6029559 5490859 4969496 4529434 4137752 3790241 3586186
5792 3586186 3317860 3099576 2875155 2727519 2553522 2453921 2295449 2211511 2092938 2005867
5782 2005867 1959303 1898337 1783259 1720493 1652023 1682013 1565571 1501546 1470597 1392638 1427077
5771 1427077 1360348 1304591 1270235 1285370 1186212 1170921 1146962 1110764 1060640 1041892 1070909
5760A070909j03079L0820j4374P971r3425J402m389l6093K7179p5214J4708m4619
5748G81796o17P320l9464m5653O9370p3347K0937l2813j9089J1006o1818R4174
5736G11802r7420K0511r739J3755n4131L6739o3255mK0791l3110K1313j3328O508
5723E60432m2200P205j7447K3636j0574o435k132M2159j12446K1449N5775o5303
5711D54119l276k5066K9691J3880k0430j3754l2710O0979l6700M9431q6143N9639
5699D49660o7729Q8042p4935L5520J3937j2397m6121K3816K1777l5664J8616k4719
5687C89803N5234p1920N1858j8925K9936J9992l2267J7183J6974J0450j9478j7214
5675D31626j0294R399m258K2719J3795L4719m6528n829K9199K5620n681n6866
$$ plain form
5760 1070909 967830 998650 984276 992247 898822 900224 895835 859742 886921 811707 826415 781796
5748 781796 781179 788499 749035 703382 772752 699405 720342 687529 668440 679446 617628 711802
5736 711802 614382 634893 625154 638909 584778 621517 558262 558258 579049 545939 567252 553924 560432
5723 560432 518232 525437 507990 531626 521052 514617 512485 554644 442198 463647 519422 454119
5711 454119 450843 425777 455468 469348 448918 435164 402454 463433 426733 476164 390021 449660
5699 449660 381931 469973 395038 430558 444495 432098 385977 409793 431570 395906 414522 389803
5687 389803 445037 373117 424975 406050 435986 455978 423711 440894 457868 468318 448840 431626
5675 431626 421332 430731 426473 449192 462987 497706 451178 445349 474548 500168 494487 437621
5663D37621L5264k288J0821j2596N1784r3365J15213n2222O837r796N1978k4701
5651E14550R818M0593p782l0249K9707p96M6916n0701K4502o458L8831m5876L9432
5638F02487k2032J2997R339N0964K2484m7811K891K3024P098j5406N7186k9984
5626F73237N6212K4148l0947p97N1427j4466N2206k2425J8830K8505j0539K1931
5614H47322K561J2814P4288m3961M7332K8466J8706M8529K0582K1777J9220K19
5602A097855N5330J7298j4611N6310o405J05689k7691Q2914J9342O7166l691N2350
5590A501856P9830N4578L2977J14121P5930M3756J11057P8784J40288J34941J79074
5579B547192J83060K23217K79862K58748M07070N11050O97248R38318J405737
$$ plain form
5663 437621 472885 470597 481418 468822 520606 427241 542454 490232 497069 487273 539251 514550
5651 514550 524368 564961 557179 526930 556637 555841 602757 552056 576558 570100 608931 563055 602487
5638 602487 580455 593452 602791 653755 676239 628428 631319 654343 661441 646035 703221 673237
5626 673237 729449 753597 722650 721853 773280 758814 811020 788595 807425 835930 825391 847322
5614 847322 849883 862697 936985 893024 940356 968822 987528 1036057 1056639 1078416 1097636 1097855
5602 1097855 1153185 1170483 1155872 1212182 1205777 1311466 1283775 1366689 1386031 1453197 1449506 1501856
5590 1501856 1581686 1636264 1669241 1783362 1859292 1903048 2014105 2092889 2233177 2368118 2547192
5579 2547192 2730252 2953469 3233331 3492079 3899149 4410199 5107447 6045765 7451502
5570G451502K053515K605287K694613K304416J472369P36860j1379q55134j394967
5561A7057082j799309j809473j641799j416743j090991p50242l99521o7656K28673
5552H310021N28954P54588R94618J441414J755731K049347K401355K935474L188603
5543B4360105K495791J343102L43565l90472j290443k295541k835358k718356
5535A9012393k657217k465774k038998j598836j248428p77517o02558l35005j77658
5526G110402m120L95358Q12179J257390J527436J617799J329323O86186J54813
5517A4886766m21480q69227j337387j464599j537784j320279j221173r80013p63404
5508D971420o16962m23529l79025k88073l09519k21542k25754j46079k06811m4145
$$ plain form
5570 7451502 9505017 12110304 14804917 17109333 18581702 19318562 19307183 18452049 17057082
5561 17057082 15257773 13448300 11806501 10389758 9298767 8548525 8149004 8081348 8310021
5552 8310021 8838975 9593563 10588181 12029595 13785326 15834673 18236028 21171502 24360105
5543 24360105 26855896 28198998 28542563 28152091 26861648 24566107 21730749 19012393
5535 19012393 16355176 13889402 11850404 10251568 9003140 8225623 7623065 7288060 7110402
5526 7110402 7106282 7501640 8313819 9571209 11098645 12716444 14045767 14731953 14886766
5517 14886766 14465286 13596059 12258672 10794073 9256289 7936010 6714837 5734824 4971420
5508 4971420 4354458 3930929 3551904 3263831 2954312 2732770 2507016 2360937 2154126 2109981
5498B109981j54830q6870o7466j08757K716j08414p036p3543p230q5211J7469
5487A430809q0648J2581o3336k0193k7852J6525r4557m0012k6692k8804o7775
5476A010046m051K223o0528l6950J5417j8972n0420q066k6123n2099N6877l0182
5464G97172J3488p8901K7972K0184o173j0249m1200l8978J0361k1315m4215q744
5452F19402k4843J6877o5921L896j8683k3423J1479m5822N966N9904q855q4890
5440D45087L9258l1616K5554M024m0303J9618K0528l7676j928k7540n8988J79
5428C56197m53L5400p6043L5321O303o205n9600R514j3520K295k861j0814M2262
5415C17796n1992J5948j692J5843Q07n4021J1458k475l4711N4025j0187n5389
$$ plain form
5498 2109981 1955151 1868281 1800815 1692058 1694774 1586360 1579324 1505781 1498551 1413340 1430809
5487 1430809 1350161 1362742 1299406 1279213 1251361 1267886 1173329 1133317 1106625 1077821 1010046
5476 1010046 1005995 1008218 947690 910740 926157 907185 856765 848699 822576 770477 827354 797172
5464 797172 810660 731759 759731 779915 773742 763493 722293 683315 693676 672361 628146 619402
5452 619402 594559 611436 545515 549411 530728 507305 518784 472962 478928 538832 529977 445087
5440 445087 484345 452729 478283 482307 442004 461622 482150 444474 442546 415006 356018 356197
5428 356197 355744 391144 315101 350422 356725 350520 290920 300434 286914 289209 286348 275534 317796
5415 317796 265804 281752 280060 295903 296710 242689 254147 251672 216961 270986 260799 205410
5403B05410Q7234r6219M8649k8742l9952N8031k3574j8576l8589O5229O867m1183
5391A84585K863M1150k3246j6667k4814n0433J14302m2615m301j901K2823m4008
5379A57738O0481l5669k2180J8937j143k0667o185K5506j6492k4301k7982N3399
5367A61442m5318M1035k6794M1935j7282N433q749N8115q3144J3906k5359L758
5355A18978K4193l933L775j4829L1924m8009O1567o5344p423K6835N186j3181
5343A19739l2313K9290K329J6654j1286m0614O3289j5454o2423K0994l0484J4197
5331G3918N0225m3497K1168m2267K4579l72o733N382O1483l2459k1873o744M93
5318H3303J9652l0234K7972j2001m4446M0176L462P147m474m0215K8646m828K9492
$$ plain form
5403 205410 292644 196425 245074 216332 176380 234411 210837 192261 153672 218901 225768 184585
5391 184585 187448 228598 205352 188685 163871 113438 227740 185125 180824 178923 201746 157738
5379 157738 218219 182550 160370 179307 178164 157497 151312 176818 160326 136025 108043 161442
5367 161442 116124 157159 130365 172300 155018 160451 151702 209817 126673 140579 115220 118978
5355 118978 143171 139238 143013 128184 160108 112099 173666 108322 100899 127734 132920 119739
5343 119739 87426 116716 119045 135699 124413 83799 147088 131634 69211 90205 59721 73918
5331 73918 124143 80646 101814 59547 84126 83754 77021 82403 143886 111427 89554 82810 83303
5318 83303 102955 72721 100693 88692 44246 84422 87884 95031 90557 50342 78988 74160 103652
5305A03652r236j661j377L2922n5526P6698K6394m9573K3428M870P43M2645k1208
5292A72771o5657M2556j0933n3466O143m7735Q8028o5227L5312m622M0758l406
5280A34522J7151j3611O6415L088o8345Q6259n6449K9674k0401L3292K279R18
5268B14792o8896l07J8177k9550J9460n6935N650q376L0683l0938O5568l3906
5256A25422k7142L0870K6369n8852L0352J2621K4982M5637j25755Q7710q3697
5245H8517O8851p2682N5988k6378K3513k5882j7739J2879n056P143p8760P3528
5233A03922l3093K5876m8389N7940k2952j2736J0946K130Q1356r5132k526l7567
5221B9775O2633L220P313n0478M6612k065m2342R207L9044O474j2226p681K6785
$$ plain form
5305 103652 94416 92755 91378 124300 68774 145472 171866 122293 145721 150591 151334 193979 172771
5292 172771 107114 149670 138737 85271 91414 43679 131707 66480 101792 97170 137928 134522
5280 134522 151673 138062 204477 207565 139220 225479 169030 198704 178303 211595 213874 214792
5268 214792 145896 145589 163766 134216 153676 96741 102391 94015 124698 93760 159328 125422
5256 125422 98280 129150 155519 96667 127019 139640 164622 210259 84504 172214 88517
5245 88517 157368 84686 140674 114296 137809 111927 94188 107067 102011 109154 30394 103922
5233 103922 70829 96705 48316 106256 83304 70568 81514 83644 165000 69868 67342 29775
5221 29775 92408 95628 102941 52463 99075 97010 54668 63875 102919 109393 97167 89486 116271
5208A16271o9142L7282M351j5329K6513k6092L454M2309n3452K4278o863K6262
5196A09842j4085L7919m9603L864Q527J7956R039o4576N6334o3244q935N794K3406
5183G2238J5482r420r49N2205m4830j6429Q167q416Q9657j09415L9320J5575K092
5170A05277j8943m5614K9104M8580j7403k0609q337K492M3422l8000k4398j9398
5158C6173M0005k9266L8005L3002n2672J0482j1618L4356m0569M0864m7612O7986
5146A19136n4270l9551L2503L7720q5238N8877k2441j758K7777j3338j2825r022
5134C7570R062O38M8562l3954j5028o122L6732J2427l7625R425J225j3030N315
5121E5197j7064Q153k207J8422J6569l6113K7868Q314r874J1907l6704M874J4122
$$ plain form
5208 116271 47129 84411 88762 73433 99946 73854 77308 119617 66165 90443 83580 109842
5196 109842 95757 133676 84073 87937 96464 114420 123459 58883 115217 51973 43038 48832 72238
5183 72238 87720 78300 77351 129556 84726 68297 76464 68048 157705 48290 87610 103185 105277
5170 105277 86334 40720 69824 118404 101001 80392 72055 74547 117969 79969 55571 36173
5158 36173 76178 46912 84917 117919 65247 75729 64111 98467 57898 98762 51150 119136
5146 119136 64866 25315 57818 95538 10300 69177 46736 44978 72755 59417 46592 37570
5134 37570 46632 47270 95832 61878 46850 40728 77460 89887 52262 61687 62912 49882 55197
5121 55197 38133 46286 44079 62501 79070 42957 70825 79139 69265 81172 44468 49342 63464
5108F3464O211m8264J7532R954k077J8951k3690J9701J2094j5986k212K2809l2873
5095D5614N2488m4000J1694l0496K6147k1416p250K5430l443o691k3693K5479
5083D9863K4107j7698k9030K8363K3354n5765M0724m82k2184K8107k1895Q829
5071E6293r679p233L1643l5315M1061k4965n7388N6394J9396k0542j7090M7340
5059G9915m1033J1540l8664N4846L007N6710n9461j1761M1135M5118K9426k7500
5047A43278K6220p286L4756p0295j2717J9512m7984k9253L6479m0482J3761R543
5035G5532m8435N5703m0869K7558K814j6401M0492l8797K7946p480P342l5526
5023D9879J782k4671N5185j0717m6992L1647M446K140k8365l159Q638J1135j7141
$$ plain form
5108 63464 69675 21411 38943 48897 46820 65771 42081 61782 73876 57890 55678 78487 45614
5095 45614 98102 54102 65796 35300 61447 40031 32781 58211 54768 48077 24384 49863
5083 49863 73970 56272 27242 55605 78959 23194 63918 63436 41252 69359 47464 56293
5071 56293 46614 39381 71024 35709 76770 51805 -5583 50811 70207 49665 32575 79915
5059 79915 38882 50422 11758 66604 69611 126321 66860 55099 96234 141352 170778 143278
5047 143278 169498 162212 196968 126673 113956 133468 85484 56231 92710 52228 65989 75532
5035 75532 27097 82800 41931 69489 72303 55902 96394 57597 85543 78063 85405 49879
5023 49879 51661 26990 82175 71458 24466 56113 60559 62699 34334 31175 39813 50948 33807
5010C3807J2413j3215L9410m9464L8805M8966o3747l401Q440J7128k5632M0229
4998H3739l5941K6379j0035K9265l9339J0065k0789L4274l9731K0400K2398K20
4986H0905n0381O367N2124P671k3283m917j6056n234M6387l2642K2152l4134L5429
4973H4388J2187j0325j4558J8287l0979K4696j4262L3499J876k9079j7160L103
4961F1673L8912j8146J3955m8418M1244j3571L0243m7581K9272j9080M6651k1766
4949I3388N6934n5245M7932k8051J2448K199k2292L135n7272N6322K6266l7019
4937I8745K2755J0743n9680M3124P061R169M9016j10191P5258n7072L1871j7204
4925A03595q29L1228p645Q725k0515J37K3872j9467o0422O6202R068k98o4234
$$ plain form
5010 33807 46220 33005 72415 22951 61756 110722 46975 43574 52014 69142 43510 83739
4998 83739 47798 74177 64142 93407 54068 64133 43344 77618 37887 58287 80685 80905
4986 80905 30524 36891 89015 96686 73403 68486 52430 47196 93583 60941 83093 48959 84388
4973 84388 96575 86250 71692 89979 59000 83696 69434 102933 104809 75730 58570 61673
4961 61673 100585 82439 96394 47976 89220 75649 105892 58311 87583 68503 115154 93388
4949 93388 150322 95077 143009 114958 127406 129605 107313 110448 53176 109498 135764 98745
4937 98745 121500 132243 72563 115687 122748 131917 180933 70742 146000 88928 120799 103595
4925 103595 102766 133994 126349 135074 114559 114696 138568 119101 58679 124881 133949 133651 69417
4912F9417L7665L6628n3165J2325J9194J5029m4849M317P962M1502j6840J6936
4900A46121J2714k9975q278m9047O6003N20K2070m9226M5517K1197m9967K1991
4888A49640j4794K7265k9579j3395K3934J2115m0081N6222l849l9597K6138n2849
4876A01170O2477j4615j5324j8023Q568k2805M4527k5713K3568L1667p314j7520
4864A50663l6378K8214J8253K7545p6200L4504J6255K2902l5074m7671P5325k9890
4852A48448L8886n3993N9399p437n297j5843M557P821k4899K1032j1535M0602
4840B01741j6859Q22J6887L0653p7802L5204l0974M6741J0249q5855P0372k1674
4828A79505L6153l4475L9898l9387J9093L2058l4868O0267j3182L274p0040M9019
$$ plain form
4912 69417 107082 143710 90545 102870 122064 137093 92244 96561 104523 146025 129185 146121
4900 146121 158835 128860 120582 71535 137538 138058 160128 110902 156419 177616 127649 149640
4888 149640 134846 162111 132532 119137 143071 155186 115105 171327 167478 127881 154019 101170
4876 101170 163647 149032 133708 115685 124253 101448 145975 120262 143830 175497 168183 150663
4864 150663 114285 142499 160752 188297 112097 146601 162856 185758 150684 103013 178338 148448
4852 148448 187334 133341 192740 185303 180006 164163 168720 176541 151642 172674 161139 201741
4840 201741 184882 185704 202591 233244 155442 190646 159672 206413 216662 130807 201179 179505
4828 179505 215658 181183 221081 181694 200787 232845 197977 258244 245062 248336 178296 227315
4816B27315k980j9472J9916L0318R153o9502J2519j0496R3879p4508L0330m4321
4804B02151Q1950p0566L1330J9245k4409L9050J5647k8950j7705L8703j0094M0481
4792C16833j4061P043k1865J7637J0546k3153K2977n089O0399p6768N1990q139
4780C38350k4736p122K9761M3914l4832K0905k928K3661n0279K6498k0442K4471
4768C67221r344k8481J1443O08K2503k1238M2462n887L6843n2101O7142p6429
4756C54742Q1304o4066L1238N7132k2008J6054j74p187J7794K3524l1255P9219
4744E36317m0623L7663L511J3078L7102o182j363K7440J9314l3125N3900K6371
4732F73403J2143J4623L7436O8818M8184K7031Q1032J72643O3502J83008J18577
$$ plain form
4816 227315 224335 204863 224779 255097 264250 194748 207267 196771 290650 216142 246472 202151
4804 202151 284101 213535 244865 264110 239701 278751 294398 265448 247743 286446 276352 316833
4792 316833 302772 309815 287950 305587 316133 292980 315957 310868 371267 294499 346489 338350
4780 338350 313614 306492 336253 380167 345335 366240 363312 386973 336694 363192 342750 367221
4768 367221 357877 329396 340839 341447 363950 342712 385174 379287 416130 364029 431171 354742
4756 354742 436046 371980 403218 460350 438342 454396 454222 447035 464829 488353 457098 536317
4744 536317 495694 533357 536868 549946 587048 580866 579503 606943 626257 593132 647032 673403
4732 673403 685546 700169 737605 806423 854607 881638 962670 1135313 1198815 1381823 1500400
4721A500400J66833J86764Q0354L9865M512l2206k2692q6661j19997r4893j81308
4710A440971q0629j10698j5986r2557o1703p392l2261k5094Q364n4390k050q99
4698I65676k7613K8487J4225J3219L8688m0671P1532l4175K2301k268L4592k907
4686A081086L0221k1010M8912K7051J5617k8915M5036K6707k6168p294K0162N4046
4674A265451r064N9400m9054Q3202q2602L1787K0182J2729O4363J1892J0932l6673
4662A382545M9086J8651O9793L371R6541j5439k4617Q3562k0000O0471O0159m2068
4650A722055J7688N8324k4892M6357L3765N0442J5422K8747L0440N4473K1253
4639B054074P5351j6048N8305K2088K8054P0469m4449J06539L2241J7256L9032
$$ plain form
4721 1500400 1667233 1853997 1934351 1974216 1978728 1946522 1923830 1837169 1717172 1622279 1440971
4710 1440971 1360342 1249644 1233658 1141101 1079398 1072006 1039745 1014651 1023015 968625 966575 965676
4698 965676 938063 966550 980775 993994 1032682 992011 1063543 1029368 1051669 1049401 1083993 1081086
4686 1081086 1111307 1090297 1139209 1166260 1181877 1152962 1197998 1224705 1198537 1191243 1211405 1265451
4674 1265451 1256387 1315787 1266733 1349935 1267333 1299120 1319302 1332031 1396394 1408286 1419218 1382545
4662 1382545 1431631 1450282 1520075 1523446 1619987 1604548 1579931 1663493 1643493 1703964 1764123 1722055
4650 1722055 1739743 1798067 1773175 1819532 1853297 1903739 1919161 1947908 1978348 2032821 2054074
4639 2054074 2129425 2113377 2171682 2193770 2221824 2292293 2247844 2354383 2386624 2403880 2442912
4628B442912L7930Q4388J0065K6176O5724R1727Q0025O3284Q6036O575J05280
4617C100122R7782J41199M1615J28047R9313J58807R5022J04068J22361J81111
4607D269447J52127Q8748J21471J24826J57605J08867K06044J49072K15450J19575
4597E713232K26367K31674J69713K49889K10083K20194L18005K38892K65366L09162
4587H152577K67758L71909K20583L77975M54836L72816M93791M51692O22582N96625
4577A2383144O72920P24174R06074R07638J094916J133290J422272J420987J556034
4568B2221449J685044J623021J702525J613594J494754J336642J274471R82311
4560C3933811R55453J147749J322763J496719J578035J419888R91275L29873l59615
$$ plain form
4628 2442912 2480842 2565230 2575295 2601471 2667195 2758922 2838947 2902231 2988267 2994842 3100122
4617 3100122 3197904 3339103 3380718 3508765 3608078 3766885 3861907 3965975 4088336 4269447
4607 4269447 4421574 4510322 4631793 4756619 4914224 5023091 5229135 5378207 5593657 5713232
4597 5713232 5939599 6171273 6340986 6590875 6800958 7021152 7339157 7578049 7843415 8152577
4587 8152577 8420335 8792244 9012827 9390802 9845638 10218454 10712245 11163937 11786519 12383144
4577 12383144 13056064 13780238 14686312 15593950 16688866 17822156 19244428 20665415 22221449
4568 22221449 23906493 25529514 27232039 28845633 30340387 31677029 32951500 33933811
4560 33933811 34889264 36037013 37359776 38856495 40434530 41854418 42845693 43175566 42815951
4551D2815951j071844j792087k235612k693597k754631k769827k654975k488736
4543B4354642k102413j904178j558281j367885j130193r73414q40335p27023n58119
4534A3192801m83475m41665m16032l45495l32771k72268k44131k09219j78987
4525A0268758j54569j45092o7878o5753p6226K1253q687L4176J3013N3033K5338
4514I897366K0325P8488N6844P3412J21681K02330J19780K10676K66509K97002
4504A1344413K81906L48648K34847L64713K97311M10058M67568N14824O32246
4495A4896534N34973P16980P53354Q00468R76290J199559J436040J521005J517171
4486B4352374J670080K026069K226532K600749L187296L944184M970155O284393
$$ plain form
4551 42815951 41744107 39952020 37716408 35022811 32268180 29498353 26843378 24354642
4543 24354642 22252229 20348051 18789770 17421885 16291692 15318278 14477943 13750920 13192801
4534 13192801 12709326 12267661 11851629 11506134 11173363 10901095 10656964 10447745 10268758
4525 10268758 10114189 9969097 9901219 9835466 9759240 9780493 9771806 9805982 9818995 9872028 9897366
4514 9897366 9917691 9996179 10053023 10126435 10248116 10450446 10570226 10780902 11047411 11344413
4504 11344413 11626319 11974967 12209814 12574527 12871838 13281896 13749464 14264288 14896534
4495 14896534 15431507 16148487 16901841 17702309 18678599 19878158 21314198 22835203 24352374
4486 24352374 26022454 28048523 30275055 32875804 36063100 40007284 44977439 51261832
4478E1261832P951311R719772J2190663J7225592K6801102L9526439M6698615
4471B11375326M0733593K5483531J1859648L077920r070197k3870642l1378719
4464B28210460l2264025l0058205k7629552k3906820j9190256j4320585j0837029
4457G0003988q540690p261687o330828n667873m897104m163809l527867k906151
4449B6707979k324294j851112j620081j287567j207275j044744r12090p73776
4441A5687040p25575p12066o24855n53108n15084n29884m76605m54693l83826
4432A0711344l70016l67828l73552l43058l50405l41533l19196l00830k61111
4423G683815k57287k57898k36645k05572j45314k66571j21976j45237j51537j54515
$$ plain form
4478 51261832 59213143 68932915 81123578 98349170 125150272 164676711 211375326
4471 211375326 252108919 277592450 289452098 292530018 283459821 259589179 228210460
4464 228210460 195946435 165888230 138258678 114351858 95161602 80841017 70003988
4457 70003988 61463298 54201611 47870783 42202910 37305806 33141997 29614130 26707979
4449 26707979 24383685 22532573 20912492 19624925 18417650 17372906 16460816 15687040
4441 15687040 14961465 14249399 13624544 13071436 12556352 12026468 11549863 11095170 10711344
4432 10711344 10341328 9973500 9599948 9256890 8906485 8564952 8245756 7944926 7683815
4423 7683815 7426528 7168630 6931985 6726413 6581099 6314528 6192552 6047315 5895778 5741263
4413E741263j36495j38484j57802j60839j32548j33563j09375j45276j06001j53270
4403D367610p2157j37631q2821r7786q0319j14993j17674o8484q3992j08084n5760
4392C347909r0825l6311j08172m2857o0539n6994n5659o4968n0169m7507m8609
4381B685299o8915j1578j03612k0118n5779j8370p4138k5048p1187j3554p5314
4370B147686O0780j10618m0585k6064Q630p2060l977l7998m6447n4407j445q1220
4358A742275K5009l204m3892k9546p6100J6600l6334j07647n8645J2943p6277
4347A365182j1891p1150j682P4804m1653M1898N205K0553j8793P646P7164P6171
4335A523454J57766J90581K11610R5552j0718L3702K9443j33233j17003j76079
$$ plain form
4413 5741263 5604768 5466284 5308482 5147643 5015095 4881532 4772157 4626881 4520880 4367610
4403 4367610 4295453 4157822 4075001 3977215 3896896 3781903 3664229 3595745 3511753 3403669 3347909
4392 3347909 3257084 3220773 3112601 3069744 3009205 2952211 2896552 2831584 2781415 2733908 2685299
4381 2685299 2616384 2604806 2501194 2481076 2425297 2406927 2332789 2307741 2236554 2223000 2147686
4370 2147686 2208466 2097848 2057263 2031199 2039829 1967769 1963792 1925794 1879347 1824940 1823495 1742275
4358 1742275 1767284 1764080 1720188 1690642 1614542 1631142 1594808 1487161 1428516 1441459 1365182
4347 1365182 1353291 1282141 1280459 1355263 1313610 1355508 1360713 1381266 1362473 1370119 1447283 1523454
4335 1523454 1681220 1871801 2083411 2178963 2168245 2201947 2231390 2098157 1981154 1805075
4325A805075l1925j08509j6781l4981M5960k3963Q8695O3674J10227N6446k3772
4314A930146L5205o2636j6579r1121r1479r0666j8182l6405j38206m5597r3808
4303A280672q1280l6497j05239j19060j7279r0112m8122j3980o2726N5557q3869
4292F78065k7658K0486j5473o9212O583j128k9496j6066K4334K2144l7604K8167
4280E83142l6227J809K948O162j6953R603j9359j4453J3933p0001J9430o9555
4268D10479M8548k8639K3732m3994j3460J046k6526n459m5336J4992m7967L4704
4256C22120K6655j6644Q449n2808l323K5057j0261k4354J9795j2734N855q069
4244B79738J3702k518n231Q149m000j3319J2689K0621k4308M072k1245R782M4518
$$ plain form
4325 1805075 1773150 1664641 1647860 1612879 1658839 1634876 1723571 1787245 1897472 1953918 1930146
4314 1930146 1965351 1902715 1886136 1795015 1703536 1612870 1594688 1558283 1420077 1374480 1280672
4303 1280672 1199392 1162895 1057656 938596 921317 831205 783083 769103 706377 761934 678065
4292 678065 650407 670893 655420 586208 592791 591663 562167 546101 570435 592579 554975 583142
4280 583142 546915 548724 551672 557834 540881 550484 531125 516672 530605 460604 480034 410479
4268 410479 459027 430388 454120 410126 396666 397712 371186 365727 320391 335383 287416 322120
4256 322120 348775 332131 340580 287772 284449 309506 299245 274891 294686 281952 287807 279738
4244 279738 293440 290922 285691 293840 289840 276521 289210 309831 285523 289595 268350 278132 322650
4231C22650K8629j0289q004J00539O7299l178N1291J11133J36014J15990J36460
4220A048534J75761J38868O0473N7276N7105m4376j09058j16474n9522j21748
4210A086839j73516j00890j41601p9074k3034j04716m2378k2684o4379J4653m3222
4199C05998K877p5465j6l999j493j5674O249l7931n9879M0617R383K389J9261
4186A92317l9543j7397Q811K913q995k5555L3306q483k9823K4621J4014l7426
4174A08760M6575l5237L2373l7883J9352k028m0601j2006M3971J8990p7673O4881
4162A29474m0901P9454q9022N5392o8k5881J8727j85l2469O212k0160O916N059
4149I2548o3835P9205p1875N38R025J0095K6831k2992j7326j239P573K2342j3566
$$ plain form
4231 322650 351279 340990 332986 433525 500824 497646 548937 660070 796084 912074 1048534
4220 1048534 1224295 1363163 1423636 1480912 1538017 1493641 1384583 1268109 1208587 1086839
4210 1086839 913323 812433 670832 591758 568724 464008 421630 398946 334567 349220 305998
4199 305998 308875 233410 233394 229395 227902 212228 218477 180546 120667 161284 170667 173056 192317
4186 192317 152774 135377 144188 147101 138106 112551 145857 137374 107551 132172 146186 108760
4174 108760 155335 120098 152471 114588 133940 131912 91311 79305 123276 142266 64593 129474
4162 129474 88573 168027 79005 134397 134329 108448 127175 126990 94521 100733 80573 87489 92548
4149 92548 28713 107918 36043 36581 45606 55701 82532 59540 42214 40975 48548 70890 57324
4136E7324N549L797K9426l4729K224k4089R8658o4463l242L06J3846J908L0233
4123A16748j01614P4731m7153L5982k3481K4084m7486L3082j5038j4083K339r000
4111B9111j0747K6353K8011n180l7611K8778j5766J4545j8400K5925P883k2983
4099D9919J7397Q68J0030l0579L6164l5926O8792o2496J1363J1976J5508k6028
4087F6988j7518N7902p2107Q1770n2482q605k7672J02127o8071k1080o462M167
4075C8957K7790m1473N7752m6283L4902l0300L2626k8463P8078o9455N9314k7822
4063H5623K2755K3630m7669L8330j3278m0203K2448k2474M180K984k5456J987
4051E2857k0454M3461k34l3302K2486l1632N6517J7948r402j3824k2220N4948
$$ plain form
4136 57324 62873 66670 96096 61367 63591 39502 138160 73697 70455 70761 84607 86515 116748
4123 116748 15134 89865 42712 78694 55213 79297 31811 64893 49855 35772 38111 29111
4111 29111 18364 44717 72728 67548 29937 58715 42949 57494 39094 65019 72902 49919
4099 49919 67316 68184 78214 47635 83799 47873 116665 54169 65532 77508 93016 66988
4087 66988 49470 107372 35265 117035 64553 55948 28276 130403 62332 41252 34790 38957
4075 38957 66747 25274 83026 36743 71645 41345 73971 45508 123586 54131 113445 85623
4063 85623 108378 132008 84339 122669 109391 69188 91636 69162 73342 76326 50870 52857
4051 52857 32403 75864 75630 42328 64814 33182 89699 107647 98245 84421 62201 117149
4039A17149J1612j0474k7782p279N0136j9709K0328k114K6386k4804j6658Q49
4027A17640J5098n9837K1523J5690L4458k0212m6785M3899M4250K375k8941K9185
4015A68343m7804L9093k4162k3637j1944j9481M5486o8602L5853k0387J9362P252
4003I9372O993q929M133j443M5566n6556q8K1477k8527J6810L630J3455l1969
3990H3924J9814k1594L3985l7383j9529J4651j2406L9706k1156K2927k0718k7174
3978E5047j877M2720n4867L7238J8955k4838P162l625j8176J9404l3086Q501p441
3965D5117K8047J6276K0464o2273l3023M8472m2436M271K2269m163l100k1320
3953A8601K3269k2400M447N0914q2917J4721M4999Q941k6462j581J5508k1353
$$ plain form
4039 117149 128761 118287 90505 83226 133362 113653 133981 131867 158253 133449 116791 117640
4027 117640 132738 72901 94424 110114 144572 124360 77575 121474 165724 168099 139158 168343
4015 168343 120539 159632 135470 111833 99889 80408 125894 57292 93145 72758 92120 99372
4003 99372 106365 97436 101569 100126 145692 89136 89048 110525 81998 98808 102438 115893 83924
3990 83924 103738 82144 116129 78746 59217 73868 61462 101168 80012 102939 82221 55047
3978 55047 53170 95890 41023 78261 97216 72378 79540 75915 57739 77143 44057 52558 45117
3965 45117 73164 89440 109904 47631 14608 63080 20644 24915 47184 43021 39921 18601
3953 18601 41870 19470 23917 74831 -8086 6635 51634 60575 34113 32532 48040 26687
3941B6687k750n1864O5664k9560J2925m554k3103L2971j5991J354q855K7878l6729
3928e927M7696n4099J8431J6777k2868N8518l1875j2133k2027J3981L8290O223
3916E0987m7173R457K2409j3500l3959q670L9764j4304M3895n2166K7784n0468
3904b5944N1731m1125l454P756M6848l5431L4992j1457j8582N619o669J7472m7656
3891b5900K5354J687L054R866m4201M7996K8155l5316l3202K9928J0755K201k7203
3878f826q681L3394j2501m167p053O0069q0633j2647N7682K4926n1494K9928j4596
3865G401j7648J2557l6851P8067m7895K1053N935K7095m6598P884j3554M011K3551
3852B5008l5176K6578m4489N3548k1200j605m4355M0194J8104l3449k1715M7294
$$ plain form
3941 26687 23937 -27927 37737 8177 21102 16548 -6555 26416 10425 11779 2924 30802 -5927
3928 -5927 41769 -12330 6101 22878 10 58528 26653 14520 -7507 6474 44764 50987
3916 50987 3814 13271 35680 22180 -11779 -20449 19315 5011 48906 -3260 24524 -25944
3904 -25944 25787 -15338 -18792 -11036 35812 381 35373 23916 5334 10953 4284 21756 -25900
3891 -25900 -546 1141 4195 14061 -30140 17856 46011 10695 -22507 7421 18176 20377 -6826
3878 -6826 -15507 17887 5386 1219 -5834 54235 -26398 -39045 18637 43563 -7931 21997 7401
3865 7401 -10247 2310 -34541 43526 -4369 16684 22619 49714 3116 11000 -2554 1457 25008
3852 25008 -10168 16410 -28079 25469 4269 2664 -41691 -1497 16607 -16842 -38557 8737
3840H737j2530l9619P2729m4461L6239k5129P55l2106P4178k8501j6425j3206
3828a9339L1623n877m7964M0071j1336p749o798J5509r136M5753l2174Q880J0164
3815A1627l3648P227Q941L0072k1144J9423j1997k6731K0778k8649N4320q1645
3803e1426N5686m1757L0594P820L266J2876j9744J9272J0217m5172m6118K8877
3791c5609K3585L8289l6021K4172J6861j7873j2041R216l7708k9182J5607L3872
3779f832K5274l929m8101L1972N764j7586r430P03N2242m0200L3806k4955k5473
3766b6745M4739p8964N2171J1568j0257J6014k6137J0271j832R309R346K437p150
3753D770O469j738n0627Q2631l7598L3013m1193j6044M6233k6646l4074K6029
$$ plain form
3840 8737 -3793 -43412 29317 -15144 21095 -4034 -3279 -35385 38793 10292 -6133 -19339
3828 -19339 12284 6407 -41557 -1486 -12822 -20571 -27369 -11860 -20996 24757 -7417 1463 11627
3815 11627 -22021 -14794 -5853 24219 3075 22498 10501 -16230 4548 -24101 30219 -51426
3803 -51426 4260 -37497 -6903 917 4183 17059 -2685 16587 26804 -18368 -64486 -35609
3791 -35609 -12024 26265 -9756 14416 31277 13404 1363 10579 -27129 -56311 -40704 -6832
3779 -6832 18442 14513 -33588 -1616 4148 -13438 -22868 -22165 30077 -10123 23683 -1272 -26745
3766 -26745 17994 -60970 -8799 2769 -7488 8526 -17611 -7340 -9172 137 9483 11920 4770
3753 4770 11239 9501 -41126 41505 3907 36920 -4273 -20317 25916 -730 -34804 -8775
3741h775K7885O369j0936m322l9783R77N3963k7982j2950L5541k1622J7393k8996
3728a3238j0638K2141J4700k213j8921L8479n3558O355M401M6452p4646L4983
3716e703l9470J2525K3135j4328J0216L0085m7700k0471P213K6526k95l8392P8278
3703B1619m2764Q8430q7828K0600M3395p0382K1578l8319O3723n4926L1364k2036
3691b5546P957J47O1510q6874o886K7019L826m884J3642K6068m6849N2349j3935
3678G544J0818m5566J7312o4522N7057n395J0023p659k3708O5800j6894l6871
3666c2061j706M3513j73k7109M7854l3651K6146n1273K9418J544Q925j00459J09561
3653B0529Q971j8962J8286n1101J3371j2904O348p143j8186P1070l5634P67p72
$$ plain form
3741 -8775 19110 25479 14543 10221 -29562 -28585 25378 -2604 -15554 19987 -1635 15758 -13238
3728 -13238 -23876 -1735 12965 10752 -8169 30310 -23248 -16893 -12492 33960 -40686 -5703
3716 -5703 -45173 -32648 -9513 -23841 -13625 16460 -31240 -51711 -44498 -17972 -18267 -56659 21619
3703 21619 -21145 67285 -20543 57 43452 -26930 -5352 -43671 20052 -34874 -3510 -25546
3691 -25546 -17589 -17442 44068 -42806 -49692 -22673 -18847 -23731 -10089 15979 -30870 21479 7544
3678 7544 18362 -27204 -9892 -74414 -17357 -22752 -12729 -20388 -44096 21704 4810 -32061
3666 -32061 -33767 9746 9573 -17536 30318 -3333 22813 -28460 958 2502 11427 -89032 20529
3653 20529 29500 10538 28824 -22277 -8906 -21810 -15462 -22605 -40791 30279 -5355 -4588 -5360
3640e360k5146k7403K4873J6018N1687k9485j2013j3822O659j64J4115n2976K5763
3627b7254R023j261L5783n4675J8673l4182N8441J2368k6141K0117m5623M4770
3615A0039k6610j284M9838n4997K0207J5620o6199L8753K5510l5855L5478k3813
3603a3313L8846j6401p593J7337o8205M8359q042J6800j9974j6476L5880P430
3591A4648n8086Q3971q9076L7125M379j1359R8J3539m119m89K5058r816l5852
3578b9979J7249m6332o795Q9109o0334M1127j5782p983K6889o2837P0731n2667
3566c7604J3645l083K4769J7901o7915L7899q227K1558J9504J0872r7509O5748
3554b442j4171J345J1015m2949L6019Q584k4616k0980N4274j9607J4149n833L2748
$$ plain form
3640 -5360 -30506 -57909 -33036 -17018 34669 5184 -6829 -20651 -13992 -14156 -41 -53017 -27254
3627 -27254 -18231 -19492 16291 -38384 -19711 -53893 4548 16916 -9225 10892 -34731 10039
3615 10039 -16571 -17855 31983 -23014 -2807 12813 -53386 -14633 10877 -24978 10500 -13313
3603 -13313 25533 9132 1539 18876 -49329 -970 -9012 7788 -12186 -28662 7218 14648
3591 14648 -43438 40533 -48543 -11418 -7039 -18398 -18300 -4761 -8880 -9369 15689 5873 -29979
3578 -29979 -12730 -59062 -65857 23252 -37082 4045 -11737 -19720 7169 -55668 15063 -37604
3566 -37604 -23959 -27042 -2273 15628 -52287 -14388 -22615 -1057 18447 29319 -68190 -2442
3554 -2442 -16613 -15268 -4253 -47202 -11183 -2599 -27215 -48195 6079 -13528 621 -5212 27536
3541B7536o6935M2743j2864m4308N8137p358M9484o3990j337j5781J4744j0992
3529c0921K2191o212L0800o633j4994N794j0981K5212j9220K3594n0062L4792
3517C360l5154K5273Q495j8687K4720p734L039J0581J216j2733J4737m8625P9780
3504D8268m5754J1304R471m6098K3830m713J1230n6727L1949N8840p1634L4387
3492D353r326K928L7659l2064l770j9810N3749j5518m384l1556m9267O8291j1308
3479a0023J7912J321m4989N546M1065l2684Q481J9623j1446r856P086l6864m76
3466d5304R0683m2697l0191j2784N5460J2895m1282M2369O22R224j0157r148M085
3453B3775q861j6277M1692j6969j6014J0318p3893N6343J7572j7956j2626j3990
$$ plain form
3541 27536 -39399 3344 -9520 -53828 4309 -3049 46435 -17555 -18892 -34673 -19929 -30921
3529 -30921 -8730 -14942 15858 9225 -5769 25 -10956 14256 -4964 18630 -31432 3360
3517 3360 -31794 -6521 1974 -16713 8007 273 3312 13893 15109 2376 17113 -31512 48268
3504 48268 2514 13818 23289 -22809 1021 -3692 7538 -49189 -17240 41600 -30034 4353
3492 4353 -4973 -2045 35614 3550 -220 -20030 33719 18201 13817 -17739 -67006 1285 -10023
3479 -10023 7889 9210 -35779 -30233 10832 -21852 -13371 6252 -5194 -15050 -7964 -44828 -45304
3466 -45304 45379 2682 -27509 -40293 15167 28062 -13220 29149 29771 38995 28838 19690 23775
3453 23775 14914 -1363 40329 23360 7346 17664 -56229 114 17686 -270 -12896 -26886
3441b6886N9376o6671O2056m3037L6979j761L659o6472P3840m5708K9096J2755
3429B7226o390J2833l1116J3396J2242L1098n5715q464K200K555N1279l7147K1476
3416C5473K1401j6434J3322n7252N1029j7744m9854J1679j6144J5393M2464j9326
3404A4007L4884K6042m4578K0430N7840o5565L4823k232P67L5827j0957L6975
3392A38263l1496M0677m111L7753J2999l7920Q549O6672q6115R0526R5612J56755
3380D88164K27415K28314J95026N6005j5997o812j33233j31846j69132j46418
3370E91486j46482k7860j01847r8528n1800K5643l9683j1515J9015n3076m0357
3359F4996M2479k4403p6397L8992q382J726N0921L74m3083k4757k3873r315M3234
$$ plain form
3441 -26886 32490 -34181 27875 -15162 21817 20056 23715 -42757 31083 -14625 14471 27226
3429 27226 20836 33669 2553 15949 28191 59289 3574 -4890 -2690 -135 51144 13997 35473
3416 35473 56874 40440 53762 -3490 47539 29795 -20059 -8380 -24524 -9131 33333 14007
3404 14007 48891 74933 30355 50785 108625 43060 77883 75651 76418 112245 101288 138263
3392 138263 106767 147444 143333 181086 194085 156165 164714 231386 145271 235797 331409 488164
3380 488164 715579 943893 1138919 1194924 1178927 1172115 1038882 907036 737904 591486
3370 591486 445004 417144 315297 216769 164969 190612 150929 139414 158429 105353 64996
3359 64996 107475 83072 6675 45667 37285 39011 89932 90306 47223 22466 -1407 -10722 32512
3346C2512k5950N746Q965K3068k4758k4550O4092j9703l803K8491J8773n6254
3334B6629j4107j4734R9110p1769N8134j5540K6373r417j2690J66247J20682R6563
3322D55481m032j4170K5837L0387j00808r2723m7456l1478r8328K1114l0556j71
3310A13097m9339k8402O1437j7137l0803q8547N8591O1842j9042n5101j664M7669
3298E2601m6983K303K5j9736Q0009p9828K5654J9073j2870L399o2465N0105Q065
3285A9352K501l1243J8502J4976k5636k7543L6727K8121k8053l9043L6206k0360
3273a5493Q453l7515L0116J7908J4180n7534Q9249l2517j7443n1233P7952K679
3261B8802j0159J6300q9137O0278P969j7555k9650M6602K27l9408j5214Q186M0959
$$ plain form
3346 32512 6562 12308 21273 44341 19583 -4967 59125 39422 35619 64110 82883 26629
3334 26629 12522 -2212 96898 25129 83263 67723 94096 84679 71989 238236 358918 455481
3322 455481 451449 437279 463116 493503 392695 299972 252516 221038 122710 143824 113268 113097
3310 113097 63758 35356 96793 79656 48853 -39694 18897 80739 61697 6596 4932 52601
3298 52601 5618 7921 7946 -11790 68219 -11609 14045 33118 20248 23647 -38818 11287 19352
3285 19352 21853 -9390 9112 24088 -1548 -29091 7636 35757 7704 -31339 4867 -15493
3273 -15493 -7040 -44555 -14439 3469 17649 -39885 49364 16847 -596 -51829 26123 28802
3261 28802 18643 34943 -54194 6084 14053 -3502 -33152 13450 13677 -25731 -40945 -32759 8200
3248H200p0336K4558L7365j1318J5043k1638j1242K6644m1386N3722j7875k736
3236a0999N8524p6473l342K6262L1744o4228K7109Q133j4472l7321R4123q1578
3224d2518J4762K8515j3402R512N2507q8058M8466j4501j9847L8161m2566O940
3212b2029r479K8403p418M3883k0410J5503m5185m725M6039l4018n8249M1455
3200b6230L4921n0110M2655J2500o0304J6177K0638K6257m8739j1647L4338j4948
3188b4492J1344N468J4411k2552j311k566p597J2186k5773R405O3392j9113l3397
3175b0595m578L1243J5820k6624m8517M4478M942K7219l5672j4569L4688j9107
3163a1272J2269j6111Q09K4540p891o76j7704Q455m4952L5469p085O0456p1424
$$ plain form
3248 8200 -62136 -37578 -213 -11531 3512 -18126 -29368 -2724 -44110 9612 -8263 -10999
3236 -10999 47525 -28948 -32290 -6028 25716 -38512 -11403 -3270 -17742 -55063 39060 -42518
3224 -42518 -27756 759 -12643 -3131 49376 -38682 9784 -4717 -24564 13597 -28969 -22029
3212 -22029 -31508 -3105 -10523 33360 12950 28453 -16732 -21457 24582 -9436 -67685 -26230
3200 -26230 8691 -41419 1236 13736 -46568 -30391 -9753 16504 -32235 -43882 -9544 -24492
3188 -24492 -13148 -7680 6731 -15821 -17132 -19698 -27295 -15109 -40882 -31477 31915 12802 -20595
3175 -20595 -25173 6070 21890 -4734 -53251 -8773 -3831 23388 -12284 -26853 7835 -11272
3163 -11272 997 -15114 -14305 10235 2344 1668 -16036 -7581 -52533 -17064 -24149 36307 -35117
3150c5117J5035j8867N1129m8042k5473M3944N258k725n253J5465K4762j7427
3138B689j8348M7909p2492Q3722n1841m713L7978m4612K6413k0254L0389l4409
3126a7569r4171Q4446Q4585p1389Q624k9881O615K2743n9057Q7476l4436M092
3114g922R210l7249M1540j8591k3400L8581k7762j4434K9710k0787M010j4244
3102d1338P2392m6423K3854k0849j217k2052J8454L7770n1935K0363j1943L3842
3090A0918l7081L0621l4632M2449k8586R285J1882j6509K0169l8796L6148k2659
3078a6791M373p3600R3238n2866L3006O292L046K1529l5805j5141J4729L5044
3066A7054n4052M0855m748k084J7397J8961l2052o3373P9628p3700Q3704k9397
$$ plain form
3150 -35117 -20082 -38949 12180 -35862 -61335 -17391 -12133 -14858 -20111 -4646 20116 2689
3138 2689 -15659 32250 -40242 43480 -8361 -13074 24904 -19708 6705 -13549 16840 -17569
3126 -17569 -111740 -27294 57291 -14098 -5474 -35355 -28740 -5997 -65054 22422 -12014 -7922
3114 -7922 1288 -35961 5579 -13012 -36412 2169 -25593 -40027 -10317 -31104 -27094 -41338
3102 -41338 31054 -15369 8485 -12364 -13581 -35633 -17179 20591 -31344 -10981 -22924 10918
3090 10918 -26163 4458 -30174 12275 -16311 -7026 4856 -11653 8516 -30280 5868 -16791
3078 -16791 -12418 -86018 7220 -45646 -12640 -6348 -3302 18227 -17578 -32719 -17990 17054
3066 17054 -36998 3857 -891 -2975 14422 33383 1331 -62042 17586 -56114 27590 -1807
3054a807M345K1309n1430P089J6533k6464Q127J0621n4498M2711J5626J1345k9833
3041b6326m678J991K5420l9226K8175O465l1369N0614n7482M8644k2105K8799
3029H922o4387L1379R665L1387m1274l4638L7328K575Q40o0910P4052k6565L7996
3016F370l2101N139J2641L168k7817M5370j4826r9720Q0809k4003P1147p2314
3004d6137O3386m050l6402k0962L0347N2694p3478J3896O411N3014l3506l3133
2992b7920j5342N7569n1194J4635M0878k7856r525k3434N1028l4744K2569k5076
2980b8412K5426k3272N396j5149J5620R6051o3140J951l8894K2730m2343K4426
2968a9610M7088J9272m5801l1625r596J5490N7501n9778j4617M583N0438p0726
$$ plain form
3054 -1807 2538 23847 -27583 -20494 -3961 -30425 -22298 -11677 -66175 -23464 -7838 3507 -26326
3041 -26326 -31004 -29013 -3593 -42819 -14644 -8179 -39548 11066 -46416 2228 -19877 8922
3029 8922 -55465 -24086 -14421 16966 -24308 -58946 -21618 -19043 -18203 -79113 -5061 -31626 6370
3016 6370 -25731 -20592 -7951 -4783 -32600 12770 -2056 -101776 -20967 -44970 26177 -46137
3004 -46137 17249 13199 -23203 -44165 -13818 38876 -34602 -20706 -14295 38719 5213 -27920
2992 -27920 -43262 14307 -36887 -22252 18626 -9230 -18755 -42189 8839 -25905 -3336 -28412
2980 -28412 -2986 -26258 -20862 -36011 -20391 75660 12520 14471 -24423 -1693 -44036 -19610
2968 -19610 27478 46750 949 -30676 -40272 -24782 32719 -27059 -41676 -37093 13345 -57381
2956e7381M9255J4105M3560p1498J7554j1004l3320M2902n391J3741j929m1432
2944d0838p069L2149N7886q2113k0453K9973M4033m8008J9961j107J5128k8013
2932b8471j4320L1894r230o0910M7639K6095l7011K9452m9212N2810J2403n1760
2920e0621N1301N010k0745j821P1639r3678M9287j6843m439O664M021j2153N597
2907f781j8002M083p656J4976j192L2896l2842j822M088j1184K3630l6275k1364
2894e7445M2544J0469M422k6641k449M279k178J4190J0893q874l8894P9163o1962
2881c2483K3638k5420P16K9678k4440L9647m9207P4417q7230Q3205o5167J3144
2869a9502M3396p5906J369j4336O4029j0715J5125l0770M702k3613J2004l496
$$ plain form
2956 -57381 -8126 5979 49539 -21959 -4405 -15409 -48729 -5827 -11218 2523 594 -40838
2944 -40838 -47907 -15758 42128 -39985 -60438 -30465 13568 -34440 -14479 -15586 -458 -28471
2932 -28471 -42791 -10897 -20127 -81037 -33398 -7303 -44314 -14862 -64074 -11264 1139 -50621
2920 -50621 680 5690 -15055 -16876 54763 -38915 10372 -6471 -10910 -4246 -225 -12378 -6781
2907 -6781 -24783 -20700 -28356 -13380 -14572 18324 -14518 -16340 -12252 -23436 194 -36081 -57445
2894 -57445 -14901 -4432 -10 -26651 -29100 -24821 -26999 -12809 -1916 -10790 -49684 29479 -32483
2881 -32483 -8845 -34265 -33549 -3871 -28311 11336 -37871 36546 -50684 32521 -32646 -19502
2869 -19502 23894 -52012 -50643 -64979 -950 -11665 3460 -27310 -22608 -46221 -34217 -37713
2857c7713O7823m4466q579J2758O200n611n1022Q2418o1452J8990j9872O215L7520
2844C209m9481L8342l5130P2388k5587L4201q8395K9553k1882M3911k7137J9545
2832f463J2838m4982K1848j8818M1016o4721O6382m6424N2435l8814p691K7361
2820f033M771j6101k6489l920M371L5809l443L1602j1813l5919L4677j3448P354
2807A418Q701n7801J3791J2309K712L1917l5787J8695k2188j0662K3412l0441
2795d3924L6873j8490o64k8374N1895r0m772l4440O5001m0638k4272L7339l7041
2782d1597N0570o4838P4629j5113j0723m3114J6395M658K6676j5205k990L9037
2770A8385m8693Q631J7724J8666k3601J2517m2860K7569k1285J6705K9065l3617
$$ plain form
2857 -37713 30110 -14356 -22935 -10177 -3977 -9588 -60610 21808 -39644 -20654 -40526 -34311 3209
2844 3209 -46272 -7930 -43060 29328 3741 37942 -50453 -20900 -42782 1129 -26008 -6463
2832 -6463 6375 -38607 -16759 -35577 5439 -59282 7100 -39324 13111 -25703 -33394 -6033
2820 -6033 -1262 -17363 -43852 -47772 -43401 -7592 -11035 20567 8754 -27165 7512 -5936 1418
2807 1418 10119 -47682 -33891 -21582 -18870 13047 -22740 -4045 -26233 -36895 -13483 -43924
2795 -43924 -7051 -25541 -26205 -54579 -2684 -2774 -7546 -41986 23015 -17623 -41895 -4556 -41597
2782 -41597 8973 -55865 18764 3651 -7072 -50186 -33791 -29133 -2457 -17662 -20652 18385
2770 18385 -30308 -21677 -3953 14713 -8888 3629 -39231 -11662 -32947 -16242 12823 -20794
2758b0794n171L841q910M011K6830k1225N09J7035j176k1507l0848N1578k6156
2745c1983L6466n7468N2173L512k1067M412j2700J5808P382j968k2170P6339j06360
2732e7624M8800j2537k3902J4590j8790M4728j8105K4384j2144k157O0P1331p9339
2719b0705J2170L4402n6717K7690j4834m656M5082p6356M5247n9997J8203K6374
2707b4097j0743J4360J0070R539L5936o5772L6797l3318L9656J0311n6013l646
2695c6920m201Q4829j8293q8996P1447j3312K550K3947l9640j206r049j4212M1980
2682a076m1465O0921l4909j7469L1026j9596k3459r555K6054K800q982L9423J910
2669E623k7758J6420P58p1183P0996l4581j7659j0398K1135J6124n119O8224n4631
$$ plain form
2758 -20794 -25965 -22124 -31034 -27023 -193 -21418 -20909 -3874 -5050 -26557 -57405 -5827 -31983
2745 -31983 4483 -52985 -812 2700 -18367 -13955 -26655 -10847 -3465 -5433 -27603 48736 -57624
2732 -57624 -8824 -21361 -45263 -30673 -49463 -4735 -22840 1544 -10600 -12757 -12697 58634 -20705
2719 -20705 -8535 25867 -30850 -3160 -17994 -22650 22432 -53924 -8677 -68674 -50471 -24097
2707 -24097 -34840 -20480 -10410 -871 35065 -30707 6090 -27228 12428 22739 -33274 -36920
2695 -36920 -41121 43708 25415 -63581 7866 -5446 -2896 21051 -18589 -19795 -28844 -43056 -1076
2682 -1076 -42541 18380 -16529 -33998 -2972 -22568 -46027 -55582 -29528 -26728 -35710 3713 5623
2669 5623 -22135 -5715 -4957 -76140 -5144 -39725 -57384 -67782 -46647 -30523 -35642 32582 -22049
2656b2049K0634k8541J305K1597j3750M9205n5214K769K7376m9480N8359j6076
2644c865K1921Q752k7939r140J6262k6628K4465j6656j5646L0779j5754J5861
2632B412l6498k619N528j3882O8087k0223m1704N895J0839k0784J7453k0678N9683
2619A3509q4091O6526q714m6248M0809j5290N0223l2782J0231k5003L0482m7076
2607d7424K5077k9264L2078j1053j8012K7787k964J8713J5749l5389J1724J0414
2595b564N351n8002M5440K549L0835q0950O3323L396l0426M3957j4819l2017j7075
2582d1002J1517R670m9569M2065j5968K470K0775m361K0128J2517m7968J1726
2570b8000J8695K0044P077m117n909n2062O6133j0980k0114j7083J522l0558O3637
$$ plain form
2656 -22049 -1415 -29956 -28651 -7054 -20804 28401 -26813 -24044 3332 -46148 12211 -3865
2644 -3865 18056 26808 -1131 -10271 5991 -20637 3828 -12828 -28474 2305 -13449 2412
2632 2412 -34086 -36705 -31177 -45059 23028 2805 -38899 -33004 -22165 -42949 -25496 -46174 13509
2619 13509 -70582 -4056 -12770 -59018 -18209 -33499 16724 -16058 -5827 -30830 -348 -47424
2607 -47424 -22347 -51611 -19533 -30586 -48598 -20811 -23775 -5062 10687 -24702 -12978 -2564
2595 -2564 2787 -55215 -9775 -7226 23609 -57341 5982 9378 -21048 22909 8090 -23927 -41002
2582 -41002 -29485 -19815 -69384 -27319 -43287 -40817 -20042 -24403 -4275 8242 -39726 -28000
2570 -28000 -9305 10739 17816 13699 7790 -44272 21861 10881 -9233 -26316 -24794 -55352 8285
2557H285l5616K1233k6015K2208k2765J2909j5222L6368l4102O0165n3558K4124
2545a986l5572R230M3106k8363K4477p2846N2101j8325J2771j0289j2691l604
2533d1991j8630M6187q852L2718k2616K9184m2005M7649l8098k1664L5848m0650
2521d2920L1987N175k4224L5403m8126J2966L0614j7553O8391n9343k0530m74
2509b8634j8813M2942P485J0216l9437n4643Q6494j1724m8989K9853K3247r724
2497a1727j8998J6697M184L38n328J3425m1673O6438l5745K1661j5437j8456k314
2484b6935N1781o2934L0650n152J1707m386j3102L2348l258p544m650k5254J293
2471b5436P063M0779m0742J0604k87j7106J3247j9685J1305L0644o4109L4146
$$ plain form
2557 8285 -27331 -6098 -32113 -9905 -32670 -19761 -34983 1385 -32717 27448 -26110 -1986
2545 -1986 -37558 -28328 14778 -13585 10892 -61954 -9853 -28178 -15407 -25696 -38387 -41991
2533 -41991 -60621 -14434 -23286 9432 -13184 16000 -26005 21644 -16454 -38118 -2270 -42920
2521 -42920 -10933 -5758 -29982 5421 -42705 -29739 875 -16678 51713 -7630 -28160 -28634
2509 -28634 -47447 -4505 2980 13196 -26241 -80884 5610 -6114 -55103 -25250 -2003 -11727
2497 -11727 -30725 -14028 -9844 -9506 -14834 -1409 -43082 23356 -12389 9272 -6165 -24621 -26935
2484 -26935 24846 -38088 -7438 -12590 -883 -5269 -18371 13977 10719 3175 -1475 -26729 -25436
2471 -25436 -18373 22406 -18336 -7732 -8019 -25125 -11878 -31563 -20258 10386 -53723 -19577
2459a9577J0410n7497Q8152o0352K6413N577n6686L7954M8933n0626K4657R336
2447F694l1936p720j1131J9634J0167K1746m5543P6054j4153j8039m0274M3625
2435I124k684J5439m0635M4441m3722N328j3670P426K1277O526j5199k8587L0221
2422d715k0599l5771N9238m418K9707l4717l8184O9612r393n73k2163m7241K9689
2409b9528J5857m3145L7385k1005M8733k0996l1299O9017n4317n607p728M0211
2397b422K1880l5812l3745O1703j7845J0077k2173K7073l0232K7532o8134P9372
2385A7274l4040j1174K0668J8974R524l4239l7947J2024L3159j1690j2976Q424
2373b2019J7294o19n7674M5391l2642Q172L0047k9326M1125k3218j745o35m161
$$ plain form
2459 -19577 -9167 -66664 21488 -38864 -12451 -6874 -63560 -25606 23327 -27299 -2642 6694
2447 6694 -25242 -32962 -44093 -24459 -14292 7454 -38089 37965 23812 5773 -34501 9124
2435 9124 6440 21879 -18756 25685 -18037 -12709 -26379 -18953 2324 8850 -6349 -34936 -4715
2422 -4715 -25314 -61085 -1847 -6265 23442 -11275 -49459 20153 10760 10187 -11976 -59217 -29528
2409 -29528 -13671 -56816 -19431 -40436 8297 -12699 -43998 25019 -29298 -34905 -42633 -2422
2397 -2422 19458 -16354 -50099 11604 -6241 3836 -18337 8736 -21496 6036 -62098 17274
2385 17274 -16766 -27940 -7272 11702 21226 -13013 -50960 -38936 -5777 -17467 -30443 -22019
2373 -22019 -4725 -5344 -63018 -17627 -50269 -42097 -12050 -41376 -251 -23469 -25214 -25849 -30010
2360c0010J1024n934k8816Q9074o3796K9784O990l9070O2087j08133P0164p262
2348a3898l3755J326K2255K5313l071m0116J7348K7860O591m2774r547J7648k3148
2335d7968L6471m1127P209J0718L1657k6756K4111J0766m5780M989n497O3883
2323B2676o0863K5409k8991K0439J7518l9535k0855N8041k36k3025R13m805N9174
2310B5860p0736M5406k4926K9019m9348j118Q5217o4411J7159k2230L3211l2569
2298b9466k6126r035O9180k5827n356m8602P9755j0573m364J2915k2349k6916
2286d6764q54J3717Q806k0734K3983j5245N4197n0903O9010q7236N7327j3379
2274h075k1358l693K3019M7028o9618P978J22p942l4765N3520q35M4414q2689
$$ plain form
2360 -30010 -18986 -24920 -53736 35338 -28458 1326 8316 -30754 31333 -76800 -6636 -13898
2348 -13898 -47653 -46327 -24072 1241 -1830 -41946 -24598 3262 9853 -32921 -42468 -24820 -47968
2335 -47968 -11497 -52624 -45415 -34697 -3040 -29796 -5685 5081 -40699 -35710 -41207 22676
2323 22676 -38187 -12778 -41769 -21330 -3812 -43347 -64202 -6161 -6397 -29422 -28509 -33314 25860
2310 25860 -44876 530 -24396 4623 -44725 -45843 39374 -25037 -7878 -30108 3103 -29466
2298 -29466 -55592 -64627 4553 -21274 -26630 -75232 4523 -6050 -10414 2501 -19848 -46764
2286 -46764 -47618 -33901 -25095 -45829 -21846 -37091 17106 -33797 35213 -52023 5304 -8075
2274 -8075 -29433 -33126 -10107 36921 -32697 -24719 -24597 -32539 -67304 -13784 -14619 29795 -52894
2261e2894O2394k1766n6738P7173M118k0950K149r952q747o869J1582j6002n217
2248d1719O3478m1292j741n100M475K8352n2975n91K9473k6088O1402J8688j06276
2235f9914P1927k3724M752r285l3304N8003k3324K4501o9775J13388p6450m679
2223c7884N0433o706j9694j8186J492J4520M118P501K0822n2378L4685k5648m932
2210c1857m596M1353l9529n816M3089j0108p0713O8665k2856o967K6461p92j9373
2197c3039L6152l4507M6140n0394O4750J080m5421N9573n6353J28L4397k5300
2185b794M946k9521l4819K9800j7393J7989J8928l5343O8658l8828n881J1376
2173a2882j5992Q4935m9875q8746O1262N390J1533l1017L2137q074j0370k3054
$$ plain form
2261 -52894 9500 -12266 -69004 8169 12287 -8663 -6514 -16466 -25213 -32082 -20500 -36502 -41719
2248 -41719 21759 -19533 -21274 -26374 -21899 6453 -46522 -47113 -17640 -43728 17674 36362 -69914
2235 -69914 2013 -21711 -16959 -26244 -59548 -1545 -24869 -368 -70143 43245 -33205 -37884
2223 -37884 12549 5843 -13851 -32037 -30545 -16025 -11907 -4406 16416 -35962 -1277 -26925 -31857
2210 -31857 -36453 4900 -34629 -40445 2644 -7464 -78177 -9512 -32368 -39335 -12874 -13666 -33039
2197 -33039 3113 -31394 14746 -35648 29102 30182 -15239 44334 -12019 -11891 22506 -2794
2185 -2794 2152 -27369 -62188 -32388 -49781 -31792 -12864 -48207 20451 -18377 -24258 -12882
2173 -12882 -28874 56061 6186 -82560 -21298 -15908 -4375 -35392 -3255 -11329 -21699 -44753
2161d4753M0326l6554J4248k1665J9208K4286J1467k3146j3599M0727l0000n995
2149b5450J0583L7428k8692j7666q798J7184j904m6543O7598n3283K4425k4313
2137d9431N6694m777J2164o4378P48M6367j9349l4263J5448K2176J2650k9975
2125c5926J2968L0289m2056k998J8314j3080o365L5923m4823L9843j1199k4505
2113d3615M0173l1093J0890J9744m7302O2474l7795m1470M4276n995j4924L7666
2101f971j6441J2252J1405j2681j904J9452N673o8603O0525o5299J7373M3465
2089a754J1560k9028M645j546j1191M614k956p764J0576l33l5125L1684j5531
2076d2149J0181J7296n5140M8345M015j079j1102J0126N140k24j6246J2728L415
$$ plain form
2161 -44753 -4427 -40981 -26733 -48398 -29190 -4904 6563 -16583 -30182 10545 -19455 -25450
2149 -25450 -14867 22561 -6131 -23797 -32595 -15411 -17315 -63858 3740 -49543 -25118 -49431
2137 -49431 7263 2486 14650 -49728 -48980 -2613 -21962 -56225 -40777 -18601 -5951 -35926
2125 -35926 -22958 7331 -34725 -37723 -19409 -32489 -38854 -2931 -47754 -7911 -19110 -43615
2113 -43615 -3442 -34535 -23645 -3901 -51203 11271 -26524 -67994 -23718 -29713 -44637 -6971
2101 -6971 -23412 -11160 245 -12436 -14340 5112 10785 -57818 2707 -62592 -45219 -1754
2089 -1754 9806 -19222 -14577 -16123 -27314 -22700 -25656 -33420 -22844 -23177 -58302 -26618 -42149
2076 -42149 -31968 -14672 -69812 -21467 -17452 -18531 -29633 -19507 -14367 -14591 -30837 -18109 -14694
2063a4694j7420j8505M9790j1602l6656M6623m5129n123N8961m3877K1298p982
2051b4316l0389M8954m0278k3393O0192j3358n696j340o264J754N741k1536N8770
2038H841k4803L9949k7823m7077P7004l0103j9946j4085j856L2133J7494l0392
2026b0664J2269J2801l4656L0689n4623k71L2685R234j2657k7190L3760J3309
2014e314k0241j6005M7656m0642J9912j7545J7116l0397K37J46K3062L2162m6240
2001c6093M4179M948j9312K5033q660r542j9021j379j3510m720K0558k7910J3871
1988c1558R895j2484M2573o7504P9433m3699m3787N9100O672l314l4528J2768
1976b6433J6977j2223l2566M5320m0669M2006m4695K9951m1477N7994Q73m7792
$$ plain form
2063 -14694 -32114 -50619 -829 -12431 -49087 -2464 -47593 -52716 6245 -37632 -16334 -24316
2051 -24316 -54705 -5751 -46029 -69422 -9230 -22588 -28284 -29624 -35888 -34134 -28393 -49929 8841
2038 8841 -15962 23987 -3836 -50913 26091 -4012 -23958 -38043 -39899 -7766 9728 -20664
2026 -20664 -8395 4406 -30250 439 -54184 -54455 -21770 -12536 -25193 -52383 -18623 -5314
2014 -5314 -25555 -41560 6096 -34546 -14634 -32179 -15063 -45460 -45223 -45077 -22015 10147 -36093
2001 -36093 8086 13034 -6278 18755 10095 553 -18468 -19847 -33357 -38077 -17519 -45429 -31558
1988 -31558 -21663 -34147 8426 -59078 20355 -23344 -67131 -8031 -1359 -4673 -39201 -26433
1976 -26433 -9456 -21679 -54245 -8925 -49594 -7588 -52283 -22332 -63809 -5815 -4942 -52734
1964e2734J2768N4121j1355j2400L8732p4276M8167j9379k7894R685K3813K6353
1952A5601l3597K2772k3813M9626m0075m196L554n829k7477N2878k9635j3486
1940c3677L0481M349m0390k3636L6244M5896l0084L0820l8675L3312l9115r571
1928c4046K8501l9095L2693J0332k1130R037L7083l5391L1492q9251N9451J5813
1916E489k0482n9418Q2039l9147n454K9243K2396j1477k5208K4346j4154m7192
1904e9019K300K5247N0078l3873m705J1807l2932K343l8217P6804J0231o8016
1892e7952L6532K0915N4031q9089Q406j3209J6342K4667l4932n679K7050m4569
1880e7487N9037n751p3561Q5760n9905L1602r954M986J5125m8343L4992K8102
$$ plain form
1964 -52734 -39966 14155 2800 -9600 29132 -45144 3023 -16356 -44250 -34565 -10752 15601
1952 15601 -17996 4776 -19037 30589 -9486 -13682 -10128 -15957 -43434 9444 -20191 -33677
1940 -33677 -3196 1153 -39237 -62873 -26629 19267 -10817 20003 -18672 14640 -24475 -34046
1928 -34046 -5545 -44640 -11947 -1615 -22745 -13708 23375 -12016 19476 -69775 -10324 5489
1916 5489 -14993 -74411 7628 -31519 -36973 -7730 14666 3189 -22019 2327 -11827 -59019
1904 -59019 -56719 -31472 18606 -15267 -19972 -8165 -41097 -38754 -76971 -167 10064 -57952
1892 -57952 -21420 -505 53526 -35563 -27157 -40366 -24024 643 -34289 -39968 -12918 -57487
1880 -57487 1550 -4201 -77762 7998 -51907 -20305 -30259 -25273 -10148 -58491 -23499 4603
1868D603k2152L0737q12l5729q991p510L1026n0547m291K0319Q415J4930J4102
1855e900l1602J5092M156l471K7200j1251M2730k8266o2748L0263m2557M1964
1843b4390j9084M6830m7100K0641k224r712L4584m6932K8055l377j3673M71o808
1830d2719J3260o693K0248J3279O962k6404L6858k3702M189n2939R167M4366j9407
1817b3535j1748R583j2808N8987j3223j6596J0378j3348m078k0661K8384k5488
1805c4153K4125m0804K2852P778K6191k3297k0972O0818o1736M2925o4044P7589
1793A7272m6744l587Q420J0089l633n366j909J7154K6158m7906l787K5447k999
1780a1391r639J5366q566M5389o7572J3677N6704k4566l9714k5167K3796N246
$$ plain form
1868 4603 -17549 13188 12376 -23353 -32344 -39854 -8828 -59375 -63666 -43347 -34932 -20002 -5900
1855 -5900 -37502 -22410 -18254 -21725 5475 -5776 36954 8688 -54060 -23797 -66354 -24390
1843 -24390 -43474 3356 -43744 -23103 -25327 -35039 -455 -47387 -19332 -22709 -36382 -35911 -42719
1830 -42719 -29459 -36152 -15904 -2625 4337 -22067 14791 -8911 -4722 -57661 -48494 -4128 -23535
1817 -23535 -35283 -25700 -38508 20479 7256 -9340 1038 -12310 -16388 -37049 -8665 -34153
1805 -34153 -10028 -50832 -27980 -20202 5989 -17308 -38280 22538 -39198 3727 -60317 17272
1793 17272 -29472 -33059 -24639 -14550 -18183 -23549 -25458 -8304 17854 -30052 -33839 -8392 -11391
1780 -11391 -21030 -5664 -14230 31159 -36413 -22736 33968 9402 -30312 -55479 -31683 -26437
1768b6437N7271r2439N0124M666l6444L5816m6552Q1736r7531N4609j2209J6058
1756a1332P221k7046K1161L9497j1894n6294L9906j2289L2603p9241N3607j9086
1744b3187O419j2028m6330Q7650l8395j4417L1291Q994l9359k586J6877j400K1718
1731d753k8865m5746N385P5039l5293j0670O3588K6938n7783L525l1181M0122
1719C06k7579k7797M2342K1815K7265p1065P196M0088m5949L7305l9106R829q872
1706c4222l3851M4143M5165r165m4317j37K4464j5575l7438L4110O527k4737K3960
1693b1073J8360J5023n5074l2151N6698k9523O3433j3256n3198M5951N788j6823
1681a5845K8452n1125Q1274o3759L391n190J5851m223j7088N2560j70l2607j9361
$$ plain form
1768 -26437 30834 -61605 -11481 -6815 -43259 -7443 -53995 27741 -69790 -15181 -27390 -11332
1756 -11332 -4111 -31157 -9996 29501 17607 -38687 1219 -11070 21533 -57708 -4101 -23187
1744 -23187 -16768 -28796 -75126 12524 -25871 -40288 -8997 -3 -39362 -41948 -25071 -26471 -4753
1731 -4753 -33618 -79364 -73979 1060 -34233 -44903 18685 45623 -12160 -8635 -39816 306
1719 306 -27273 -55070 -12728 9087 36352 -34713 -27517 12571 -33378 3927 -35179 -25350 -34222
1706 -34222 -68073 -23930 21235 12070 -32247 -32384 -7920 -23495 -60933 -26823 -20296 -45033 -21073
1693 -21073 -2713 12310 -42764 -74915 -18217 -47740 15693 2437 -50761 -4810 978 -15845
1681 -15845 12607 -38518 42756 -21003 -17612 -22802 -6951 -11174 -28262 24298 24128 -8479 -27840
1668b7840p335M2440P151l5833j5317J0729K9262Q801n5332K8457m043l46k5829
1655d5035O4918j9036m7386K6672l149j2288P404L995L7477j2170m7300K4810
1643b1088J4827j2134n1473P1417j4098M5129o9875k1606N2981K9007o2809N1059
1631A1337q098n080k022l0792N5043l3881q274m9961K8637J3627K8193n5534K3413
1618c3392j1091L9895J381l6801J9641Q700k8644L3790l8998P0009q3273q88L3050
1605b6621L2727o2913N8512J871O580l2416L8979o8367M7094o3579M9513L6393
1593A7773r96k7006l2378L3052k3220J0996K502J6902K4574o8981k4930P2419
1581G07l1890P013L0389m0435K7222k1504N596j9377M5066J4978k9908p183J6457
$$ plain form
1668 -27840 -35175 7265 14416 -21417 -36734 -26005 3257 12058 -43274 -14817 -18860 -19206 -45035
1655 -45035 19883 847 -46539 -19867 -23016 -35304 -27900 -23905 13572 1402 -45898 -21088
1643 -21088 -6261 -18395 -69868 1549 -12549 32580 -37295 -58901 -5920 23087 -39722 11337
1631 11337 3239 -1841 -3863 -34655 20388 -13493 -21767 -71728 -43091 -29464 -1271 -56805 -33392
1618 -33392 -44483 -4588 -3207 -40008 -20367 -11667 -40311 -6521 -45519 24490 -58783 -59671 -26621
1605 -26621 6106 -56807 1705 3576 10156 -22260 16719 -51648 -4554 -68133 -18620 17773
1593 17773 16777 -10229 -42607 -9555 -32775 -21779 -19277 -2375 22199 -46782 -71712 707
1581 707 -31183 -24170 6219 -34216 -6994 -28498 -22902 -42279 2787 17765 -12143 -19326 -2869
1568b869q555k625j300R015l9168M7002k1595Q570M4261n1100l6431J9727R883
1555b5185m581j630j1273M590J4162J802L3521j6312j7586Q602K0970n2185P4673
1542B9568n3052L9213r646j6625j0972j7372r221K4966m3910M1992J1487l5479
1530d9051k1687P2846l1520K8289N888k2435l9302M8458o5556K9274P110M6879
1518I193j005l9055M0028n8692K1717k1694P9435n6105K5924r243q636k6570L3160
1505a1543K3772l4458L5211l2576j9416J3325k4849J9755K8250m155N522j9906
1493b1068K3430o4509L4087N621M039n845M4918k9841j5799l6256J4571J0761
1481c5891K7551r130K4869n831k1146l5598J4537J691J0630l1525N5642p2208
$$ plain form
1568 -2869 -11424 -14049 -15349 -6334 -45502 1500 -20095 -11525 32736 -18364 -54795 -35068 -25185
1555 -25185 -29766 -31396 -42669 -38079 -23917 -22115 11406 -4906 -22492 -13890 7080 -45105 29568
1542 29568 -23484 15729 6083 -10542 -21514 -38886 -48107 -23141 -67051 -25059 -13572 -49051
1530 -49051 -70738 2108 -29412 -1123 4765 -17670 -56972 -8514 -74070 -44796 -37686 9193
1518 9193 8188 -30867 9161 -49531 -27814 -49508 29927 -26178 -254 -9497 -18133 -44703 -11543
1505 -11543 12229 -22229 12982 -19594 -39010 -25685 -50534 -30779 -2529 -6684 -1162 -21068
1493 -21068 2362 -62147 -28060 -22439 -18400 -24245 20673 -9168 -24967 -61223 -46652 -35891
1481 -35891 -8340 -17470 7399 1568 -19578 -55176 -40639 -38948 -28318 -59843 -4201 -76409
1469g6409O1374K0601l4190J7246j5856J4339J32J0460k1887k7854K7977l5650
1457e9717K7664M239o263K2453J0365L052m2692K6652k0528L1594M462k0884o050
1444b5653k8408M0525J9640l7149J1543M9896p2813L6048O71K216j4923J9371
1432I64l3078O299R665j4804R435j7995J4571J2818l8849Q5089p8134M032K4395
1419a5592M611l8165p64J5420j6689L5108k342J821m3189O2013k9306p230J4108
1406b0196p651L9131k1302k1864L883j3895Q116K9202m8327J3355M4159j3526
1394h915k8574l5268J02029j6058l3274J9458J727j8702J5797k8734J6528k42
1382a4228k6254L3309k8944K8999k7455J2973J242M5478k2464k5744L1315M3522
$$ plain form
1469 -76409 -15035 5566 -28624 -11378 -27234 -12895 -12763 -2303 -24190 -52044 -24067 -59717
1457 -59717 -32053 -27814 -34077 -11624 -1259 1793 -40899 -14247 -34775 -3181 1281 -19603 -25653
1444 -25653 -54061 -13536 6104 -31045 -19502 30394 -42419 -6371 -5700 -3484 -18407 964
1432 964 -32114 -25815 -16150 -30954 -21519 -39514 -24943 -12125 -50974 34115 -44019 -39987 -15592
1419 -15592 -10981 -49146 -49910 -34490 -51179 -16071 -18413 -16592 -59781 2232 -27074 -34304 -20196
1406 -20196 -27847 11284 -10018 -31882 -27999 -41894 -33778 -4576 -52903 -39548 4611 -8915
1394 -8915 -37489 -72757 29272 13214 -20060 -602 1125 -17577 -1780 -30514 -13986 -14228
1382 -14228 -40482 -7173 -36117 -7118 -34573 -21600 -20358 25120 2656 -23088 8227 51749
1370E1749n8535p4375K3069K2896K1673k2300j1714K3785L7861o0278P700M1437
1358B968j4178l9995r95O1823J5934q6364M7797L0016k9449n1670K9105P6319
1346D1311n2802j1478m2190l307R6992q6622L0409O547o2920M1445n511K268L4385
1333a1473J4632n2680L3652M505J822J978J1571P126Q541o4418j0593P9246m4205
1320b0296l376J3151K0781k3110L9091m8834K8226L849m2372k239J5118L923k9168
1307d5256J3487O892l0682j3877L9287M8851k2064p4746N9345O438j4625m844
1295c1794j3776L3219l7394M8817j3460N795K3667n5446L2010K6593o1282l5692
1283g8743Q5717j2100L9244q1160K1534K2554l4203K7531j9973m875K9695o122
$$ plain form
1370 51749 -6786 -81161 -58092 -35196 -13523 -35823 -47537 -23752 14109 -46169 -38469 2968
1358 2968 -11210 -51205 -52200 9623 25557 -60807 -13010 17006 -12443 -64113 -35008 41311
1346 41311 -11491 -22969 -65159 -68466 28526 -58096 -27687 -21140 -84060 -42615 -48126 -45858 -11473
1333 -11473 3159 -49521 -15869 -11364 -9542 -7564 4007 11133 19674 -44744 -55337 23909 -20296
1320 -20296 -23672 -10521 10260 -12850 26241 -22593 5633 9482 -32890 -35129 -20011 -16088 -45256
1307 -45256 -31769 -24877 -55559 -69436 -30149 18702 -3362 -78108 -18763 -12325 -26950 -31794
1295 -31794 -45570 -12351 -49745 -928 -14388 -8593 15074 -40372 -8362 18231 -43051 -78743
1283 -78743 6974 -5126 34118 -47042 -25508 -2954 -37157 -9626 -29599 -34474 -4779 -10901
1271a0901J7247m5678N0496K412k1577j8926J7735k0126N996J238J6912m4843
1259e0015J9953K9981k0651k115o213K7195J6326o283n7138K1080m5116M4812
1247b8184L469J5915k9015K0960K1594j9020r001M17l135j6761N4909l8584P360
1234a9076m9578L6318M2325n5825J2898n1992P4696m3507P2809l5718K8062n2429
1222d1017L7351m0358L6229N699k9753L9028l9489N375k1873O5737n4904K8156
1210i819k6387J772n653P766M2946m6387K4583l4260K0531j1281L4817n9182Q0167
1197A9613J2519n6902k8928M9174K0144k2538L086k3045K5371l0806N6592q0941
1185e6661M5466o37k3300M1478o7070N4014k0316K9620k3183M6755r242k1105
$$ plain form
1271 -10901 6346 -39332 11164 13576 -8001 -26927 -9192 -29318 -23322 -22084 -5172 -50015
1259 -50015 -30062 -81 -20732 -22847 -29060 -1865 14461 8178 -48960 -27880 -72996 -28184
1247 -28184 -24715 -8800 -37815 -16855 4739 -14281 -23282 -22865 -26000 -42761 12148 -26436 -19076
1234 -19076 -68654 -32336 9989 -45836 -32938 -84930 -10234 -53741 19068 -16650 11412 -41017
1222 -41017 -3666 -44024 -7795 -2096 -31849 7179 -32310 -26935 -48808 16929 -37975 -9819
1210 -9819 -36206 -34434 -40087 -32321 10625 -35762 -11179 -45439 -24908 -36189 -1372 -60554 19613
1197 19613 32132 -24770 -53698 -4524 15620 -6918 -3832 -26877 -1506 -32312 24280 -56661
1185 -56661 -11195 -11832 -35132 6346 -60724 -6710 -27026 2594 -20589 26166 16924 -4181
1173d181p476L188o495J9565k1420J5367l6740J4290J3202M276p358L854m7652
1160e7580L9510p338N4919l8080J2149o965j2973r523j9455K0112J7118k5840
1148c3946j640L2605n1176J9313l4127R5932o3474M4516m5948L5659l5261J997
1136c5550J8538n1004M0645n2975N4053j3896K7945j6399J3542J9931L093k6988
1124a9065K128J1801j9248K0860k2330L557J0866j1853J6953k5132L0654j5148
1112a5957O197o505K0148k7567n7579Q4353k9557K8287Q738n1706M7790k8131
1100b1489J3272K8468l3595J1153l9362L4645Q268q711n4217L125K8684K3453
1088f306p235p2457P3352k3512J982p68k402L3906j7932j9604L9607j2621l9869
$$ plain form
1173 -4181 -11657 -8469 -14964 4601 -16819 -1452 -38192 -23902 -10700 -6424 -13782 -9928 -57580
1160 -57580 -18070 -25408 29511 -8569 3580 -3385 -16358 -25881 -45336 -25224 -8106 -33946
1148 -33946 -35586 -2981 -54157 -34844 -68971 26961 -36513 8003 -37945 -2286 -37547 -35550
1136 -35550 -17012 -68016 -27371 -80346 -26293 -40189 -12244 -28643 -15101 4830 7923 -19065
1124 -19065 -16937 -5136 -24384 -3524 -25854 -22297 -11431 -23284 -6331 -31463 -809 -15957
1112 -15957 -9760 -16265 3883 -23684 -81263 3090 -26467 1820 10558 -41148 6642 -21489
1100 -21489 -8217 20251 -13344 -2191 -41553 -6908 1360 -7351 -61568 -58443 -29759 -6306
1088 -6306 -13541 -85998 -12646 -36158 -34176 -34944 -37346 -3440 -21372 -40976 -1369 -13990 -53859
1075e3859J8350m7541Q8001l7246n08K3902J3090j3940k2107K2535r916j4592
1063c3831k5880L9480L1781j9948K6307o9211J7824K4112J093M49j317m1291K9128
1050b1304j0207L7446l4001k1780J892M2612j1982j8444j977O089M65j9530M4654
1037f067J0472k2082n9344K5843N5057k197j6985l0939K7171j9853r344K7006
1025b1262L074J2156j7592l8283L0113N715J2847j102k840k8021Q246J8073J2487
1012f389l33k2648J6943n987k4606k0331K0751J195m378n003L7130M0986j5775
999A1555m1853L4865k5470k1018j9032M1303L4367m6342k2849L5228l177n217
987b7640J4284J4871M5882n0615k8977L040Q812K7462j7407k8278M1405l2920
$$ plain form
1075 -53859 -35509 -83050 4951 -32295 -32803 -8901 4189 -9751 -31858 -9323 -19239 -33831
1063 -33831 -59711 -20231 11550 -8398 17909 -51302 -33478 -9366 -8273 -7824 -9141 -50432 -21304
1050 -21304 -31511 5935 -28066 -49846 -47954 -5342 -17324 -35768 -37745 -31656 -31191 -50721 -6067
1037 -6067 4405 -17677 -77021 -51178 3879 1682 -15303 -46242 -19071 -38924 -48268 -21262
1025 -21262 -18188 -6032 -23624 -61907 -31794 -26079 -13232 -14334 -17174 -45195 -36949 -18876 -6389
1012 -6389 -6722 -29370 -12427 -18414 -43020 -63351 -42600 -41405 -45783 -50786 -13656 27330 11555
999 11555 -30298 4567 -20903 -41921 -60953 -19650 14717 -31625 -54474 -19246 -22423 -27640
987 -27640 -13356 1515 47397 -3218 -32195 -29155 -20343 7119 -10288 -38566 2839 -30081
975c0081R059R22L9604K240n9466J8337m0914P9023o7473k40L3732P334k5084
962c3007m06O8468o4357L8194o1447L5285K2357m4538m545J6544l1383P1522p8734
949f6047P6042o858m7171j6621K3297K5145J2042l7349K7091K9401l2499k3279
937c6806L0904l1877O5306q0849L4874J3811L350k2057K4441l6512N119k4457
925e4753J5470k865K7376k925r514J4510k3665j1296J2002J5496J1647rn2516
912f1042O5433l5615m7289K3712N408M5847k1474J7249J884l1029J3990j8960
$$ plain form
975 -30081 -21022 -20100 19504 21744 -37722 -19385 -60299 18724 -48749 -48989 -15257 -7923 -33007
962 -33007 -33413 35055 -29302 8892 -52555 -17270 5087 -39451 -43996 -27452 -58835 12687 -66047
949 -66047 9995 3137 -44034 -60655 -37358 -12213 -171 -37520 -10429 18972 -13527 -36806
937 -36806 -5902 -37779 27527 -53322 -18448 -4637 -1287 -23344 1097 -35415 -30296 -54753
925 -54753 -39283 -42148 -14772 -17697 -27211 -12701 -36366 -47662 -35660 -20164 -8517 -8526 -61042
912 -61042 4391 -31224 -78513 -54801 -49393 -3546 -25020 -7771 -5887 -36916 -22926 -41886
$$ [...]
##END NTUPLES=NMR SPECTRUM
##END=
