##TITLE=abcd
##JCAMPDX= 6.0         $$ Bruker NMR JCAMP-DX V2.0
##DATA TYPE= NMR SPECTRUM
##DATA CLASS= NTUPLES
##ORIGIN= UXNMR, Bruker Analytische Messtechnik GmbH
##OWNER= root
$$ XWIN-NMR		Version 3.5
$$ Thu Aug  6 20:00:24 2026 Russian Standard Time (UT+4h)  servis@DPX200
##.OBSERVE FREQUENCY= 200.131235884673
##.OBSERVE NUCLEUS= ^1H
##.ACQUISITION MODE= SIMULTANEOUS
##.ACQUISITION SCHEME= undefined
##.AVERAGES= 32
##.DIGITISER RES= 18
##SPECTROMETER/DATA SYSTEM= spect
##.PULSE SEQUENCE= zg
##.SOLVENT NAME= CDCl3
##.SHIFT REFERENCE= (INTERNAL, CDCl3, 0, 16.4885)
##AUDIT TRAIL= $$ (NUMBER, WHEN, WHO, WHERE, WHAT)
$$ ##TITLE= Audit trail, XWIN-NMR		Version 3.5
$$ ##JCAMPDX= 5.01
$$ ##ORIGIN= Bruker BioSpin GmbH
$$ ##OWNER= servis
$$ F:\spectra/data/av/nmr/H1/1/pdata/1/auditp.txt
$$ ##AUDIT TRAIL=  $$ (NUMBER, WHEN, WHO, WHERE, WHAT)
(   1,<2026-08-06 19:57:53.87 +0400>,<servis>,<DPX200>,
      <created by zg, POWCHK disabled, PULCHK disabled
       configuration hash MD5:
       00 E9 B6 7A A2 85 ED C7 34 08 36 98 17 FE 4E 26
       data hash MD5: 32K
       F0 FE DF 28 62 90 B4 18 F4 52 CB 09 27 A4 00 A8>)
(   2,<2026-08-06 20:00:01.70 +0400>,<servis>,<DPX200>,
      <Start of raw data processing
       efp BC_mod = 2 LB = 0.05 FT_mod = 6 PKNL = 1 PHC0 = -413.9518 PHC1 = 3.101563 SI = 16K 
       data hash MD5: 16K
       E2 2A AE 26 51 04 1F 56 18 8E 27 1C DD B0 11 B0>)
$$ ##END=
$$ 
$$ hash MD5
$$ 61 AF F9 DE 79 9F 98 7B 4C E0 54 A1 AD 75 B2 B3
##$RELAX= 
##$RELAX= 
##$RELAX= 
##$RELAX= 
##$RELAX= 
##$RELAX= 
##$RELAX= 
##$RELAX= 
$$ Bruker specific parameters
$$ --------------------------
##$DU= <F:\spectra>
##$EXPNO= 1
##$NAME= <H1>
##$PROCNO= 1
##$TYPE= <nmr>
##$USER= <av>
##$AMP= (0..31)
100 100 100 100 100 100 100 100 100 100 100 100 100 100 100 100 100 100 
100 100 100 100 100 100 100 100 100 100 100 100 100 100 
##$AQSEQ= 0
##$AQ_mod= 1
##$AUNM= <au_zg>
##$AUTOPOS= <>
##$BF1= 200.13
##$BF2= 200.13
##$BF3= 200.13
##$BF4= 200.13
##$BF5= 500.13
##$BF6= 500.13
##$BF7= 500.13
##$BF8= 500.13
##$BYTORDA= 1
##$CFDGTYP= 0
##$CFRGTYP= 5
##$CHEMSTR= <none>
##$CNST= (0..31)
1 1 145 1 1 1 1 1 1 1 1 1 1 1 1 1 1 1 1 1 1 1 1 1 1 1 1 1 1 1 1 1 
##$CPDPRG= <>
##$CPDPRG1= <>
##$CPDPRG2= <>
##$CPDPRG3= <>
##$CPDPRG4= <mlev>
##$CPDPRG5= <mlev>
##$CPDPRG6= <mlev>
##$CPDPRG7= <mlev>
##$CPDPRG8= <mlev>
##$CPDPRGB= <>
##$CPDPRGT= <>
##$D= (0..31)
0 2 0 0 0 0 0 0 0 0.06 0 0 0 0 0 0 0.0002 0 0 0 0 0 0 0 0 0 0 0 0 0 0 
0 
##$DATE= 1786031873
##$DBL= (0..7)
120 120 120 120 120 120 120 120 
##$DBP= (0..7)
150 150 150 150 150 150 150 150 
##$DBP07= 0
##$DBPNAM0= <>
##$DBPNAM1= <>
##$DBPNAM2= <>
##$DBPNAM3= <>
##$DBPNAM4= <>
##$DBPNAM5= <>
##$DBPNAM6= <>
##$DBPNAM7= <>
##$DBPOAL= (0..7)
0.5 0.5 0.5 0.5 0.5 0.5 0.5 0.5 
##$DBPOFFS= (0..7)
0 0 0 0 0 0 0 0 
##$DE= 6
##$DECBNUC= <off>
##$DECIM= 32
##$DECNUC= <off>
##$DECSTAT= 4
##$DIGMOD= 1
##$DIGTYP= 9
##$DL= (0..7)
0 120 120 120 120 120 120 120 
##$DP= (0..7)
150 150 150 150 150 150 150 150 
##$DP07= 0
##$DPNAME0= <>
$$ [...]
##$SUBNAM4= <"">
##$SUBNAM5= <"">
##$SUBNAM6= <"">
##$SUBNAM7= <"">
##$SUBNAM8= <"">
##$SUBNAM9= <"">
##$SW= 20.6817932712277
##$SWIBOX= (0..15)
0 0 3 0 0 0 0 0 0 0 0 0 0 0 0 0 
##$SW_h= 4139.07284768212
##$TD= 32768
##$TD0= 1
##$TE= 0
##$TE2= 300
##$TE3= 300
##$TEG= 300
##$TL= (0..7)
0 120 120 120 120 120 120 120 
##$TP= (0..7)
150 150 150 150 150 150 150 150 
##$TP07= 0
##$TPNAME0= <>
##$TPNAME1= <>
##$TPNAME2= <>
##$TPNAME3= <>
##$TPNAME4= <>
##$TPNAME5= <>
##$TPNAME6= <>
##$TPNAME7= <>
##$TPOAL= (0..7)
0.5 0.5 0.5 0.5 0.5 0.5 0.5 0.5 
##$TPOFFS= (0..7)
0 0 0 0 0 0 0 0 
##$TUNHIN= 0
##$TUNHOUT= 0
##$TUNXOUT= 0
##$USERA1= <user>
##$USERA2= <user>
##$USERA3= <user>
##$USERA4= <user>
##$USERA5= <user>
##$V9= 5
##$VALIST= <valist>
##$VCLIST= <CCCCCCCCCCCCCCC>
##$VD= 0
##$VDLIST= <DDDDDDDDDDDDDDD>
##$VPLIST= <PPPPPPPPPPPPPPP>
##$VTLIST= <TTTTTTTTTTTTTTT>
##$WBST= 1024
##$WBSW= 30
##$XGAIN= (0..3)
0 0 0 0 
##$XL= 0
##$YL= 0
##$YMAX_a= 449534
##$YMIN_a= -581193
##$ZGOPTNS= <>
##$ZL1= 120
##$ZL2= 120
##$ZL3= 120
##$ZL4= 120
##$ABSF1= 0
##$ABSF2= 0
##$ABSG= 0
##$ABSL= 0
##$ALPHA= 0
##$AQORDER= 0
##$ASSFAC= 0
##$ASSFACI= 0
##$ASSFACX= 0
##$ASSWID= 0
##$AUNMP= <proc_1d>
##$AZFE= 0.1
##$AZFW= 0.1
##$BCFW= 0
##$BC_mod= 2
##$BYTORDP= 0
##$COROFFS= 0
##$CY= 18.4799938201904
##$DATMOD= 1
##$DC= 0
##$DFILT= <>
##$DTYPP= 0
##$F1P= 9.9274215381318
##$F2P= -0.165520771350173
##$FCOR= 1
##$FTSIZE= 16384
##$FT_mod= 6
##$GAMMA= 0
##$GB= 0
##$INTBC= 1
##$INTSCL= 4.127829e-11
##$ISEN= 128
##$LB= 0.05
##$LEV0= 0
##$LPBIN= 0
##$MAXI= 10000
##$MC2= 0
##$MEAN= 0
##$ME_mod= 0
##$MI= 50
##$NCOEF= 0
##$NC_proc= -3
##$NLEV= 6
##$NOISF1= 3.799351
##$NOISF2= 2.8
##$NSP= 0
##$NTH_PI= 0
##$NZP= 0
##$OFFSET= 16.48848
##$PC= 4
##$PHC0= -413.9518
##$PHC1= 3.101563
##$PH_mod= 1
##$PKNL= yes
##$PPARMOD= 0
##$PSCAL= 4
##$PSIGN= 0
##$REVERSE= no
##$SF= 200.130005582386
##$SI= 16384
##$SIGF1= 3
##$SIGF2= 2
##$SINO= 400
##$SIOLD= 16384
##$SREGLST= <1H.CDCl3>
##$SSB= 0
##$STSI= 16384
##$STSR= 0
##$SW_p= 4139.07284768211
##$SYMM= 0
##$S_DEV= 0
##$TDeff= 32768
##$TDoff= 0
##$TI= <>
##$TILT= no
##$TM1= 0
##$TM2= 0
##$TOPLEV= 0
##$USERP1= <user>
##$USERP2= <user>
##$USERP3= <user>
##$USERP4= <user>
##$USERP5= <user>
##$WDW= 1
##$XDIM= 16384
##$YMAX_p= 295758347
##$YMIN_p= -507192
$$ End of Bruker specific parameters
$$ ---------------------------------
##NTUPLES= NMR SPECTRUM
##VAR_NAME=  FREQUENCY,     SPECTRUM/REAL,   SPECTRUM/IMAG
##SYMBOL=    X,             R,               I
##VAR_TYPE=  INDEPENDENT,   DEPENDENT,       DEPENDENT
##VAR_FORM=  AFFN,          ASDF,            ASDF
##VAR_DIM=   16384,         16384,           16384
##UNITS=     HZ,            ARBITRARY UNITS, ARBITRARY UNITS
##FACTOR=    0.252644378177508, 1,           1
##FIRST=     3299.83951724647, 0,            0
##LAST=      -839.233330435636, 0,           0
##MIN=       -839.233330435636, -507192,     0
##MAX=       3299.83951724647, 295758347,    0
$$ Real data points
##PAGE= N=1
##DATA TABLE= (X++(R..R)), XYDATA
$$ [...]
7722e1067n279L3030k3391J1734p699L1486n3774J3336k2027L2947N8057q2555
$$ -51067 -56346 -23316 -46707 -34973 -42672 -11186 -64960 -51624 -73651 -40704 17353 -65202
7710f5202m597R082K6715j6954K1465l2540J3148K4309n6563O7038l3226L167
$$ -65202 -69799 -60717 -34002 -50956 -29491 -62031 -48883 -24574 -81137 -14099 -47325 -44158
7698d4158l0431N9067P685n8638J4329j0843L9862r276j9086K1906j5141K4978
$$ -44158 -74589 -15522 -7837 -66475 -52146 -62989 -23127 -32403 -51489 -29583 -44724 -19746
7686a9746k2304J6256Q548k9896J2477j7450N753P721L460J359j5238R464j5023
$$ -19746 -42050 -25794 -17246 -47142 -34665 -52115 -46362 -38641 -35181 -33822 -49060 -39596 -54619
7673e4619N858j0422J5006J4358Q617N494l0289j9706M6461k5671J1493j0562
$$ -54619 -48761 -59183 -44177 -29819 -21202 -15708 -45997 -65703 -19242 -44913 -33420 -43982
7661d3982Q858K0185L256J459l1018O975K1394k6522L2720l4827K324J5956P457
$$ -43982 -35124 -14939 -11683 -10224 -41242 -34267 -12873 -39395 -6675 -41502 -39178 -23222 -15765
7648a5765j0900j9702K6091k3671r518N0413j8606L348j3118J3429k8806K5515
$$ -15765 -26665 -46367 -20276 -43947 -53465 -3052 -21658 -18310 -31428 -17999 -46805 -21290
7636b1290r647P442J9757m7096K5468J5847k7564n268J7088K2171K152K0627k9937
$$ -21290 -30937 -23495 -3738 -50834 -25366 -9519 -37083 -42351 -25263 -3092 -940 19687 -10250
7623a0250Q247k608k8890K3136K9314R416k965L3767j9725O874j6600j9836M1418
$$ -10250 -2003 -4611 -33501 -10365 18949 28365 25400 59167 39442 46316 29716 9880 51298
7610E1298O424j7344q176K8584L3063j247K6816M4469N8959l8969k614n224n9624
$$ 51298 57722 40378 32202 60786 93849 92602 119418 163887 222846 183877 181263 176039 116415
7597A16415J8629j8488l2150k4637J4338p6341M3589M239l3389j2098P829J8519
$$ 116415 135044 116556 84406 59769 74107 -2234 41355 45594 12205 107 7936 26455
7585B6455j6992j6304K0572q383L4151K2470m6896J533K130J9876K5970K1104
$$ 26455 9463 -6841 13731 5348 39499 61969 15073 16606 18736 38612 64582 85686
7573H5686L4444K2097k9031L9559l0556J2556n175k0633p814m7845k3131r434
$$ 85686 120130 142227 113196 152755 122199 134755 129580 108947 101133 53288 30157 20723
7561B0723J5127o4339M8232k8924k6012L9086n1197K6168O477q288K0011k8711
$$ 20723 35850 -28489 19743 -9181 -35193 3893 -47304 -21136 -14659 -22947 -2936 -31647
7549c1647P559j9399N2461n5389J5682N656J7267j2686l3508k3502L3503N1178
$$ -31647 -24088 -43487 8974 -46415 -30733 -25077 -7810 -20496 -54004 -77506 -44003 7175
7537G175m2312R197K8520m6718O2976n8605k0639L8065r78m260j8216L3749n7050
$$ 7175 -35137 -25940 2580 -44138 18838 -39767 -60406 -22341 -23319 -27579 -45795 -12046 -69096
7524f9096O1903k4162N388O000j8788J3841K529J8597m3167K2738k7816p388M4310
$$ -69096 -7193 -31355 -25967 -19967 -38755 -24914 -22385 -3788 -46955 -24217 -52033 -59421 -15111
7511a5111o7304O2801n558Q085k2268P221K1433l5625L9776k0610k4277Q435J2504
$$ -15111 -82415 -19614 -25172 -17087 -39355 -32134 -10701 -46326 -6550 -27160 -51437 -43002 -30498
7498c0498k5849R432L4062m4199L8862l0016J5234K0692k4946J3824q543O370
$$ -30498 -56347 -46915 -12853 -57052 -18190 -48206 -32972 -12280 -37226 -23402 -31945 -25575
7486b5575k2621K3655l4043L235J1999R908R830j2096M017k0809L0427j8327j088
$$ -25575 -48196 -24541 -58584 -55349 -43350 -33442 -23612 -35708 -31691 -52500 -22073 -40400 -41488
7473d1488L3731k8507K854k6909O970J0164Q132k1303q358K9590p017K6743J281
$$ -41488 -7757 -36264 -33410 -60319 -53349 -43185 -35053 -56356 -64714 -35124 -42141 -15398 -14117
7460a4117k1939j801J8575j964j5656J5461j5486m705k2896M0542K1923l3796
$$ -14117 -36056 -37857 -19282 -21246 -36902 -21441 -36927 -41632 -64528 -23986 -2063 -35859
7448c5859P537k2687L3551L3212l9478j3950R274J2817n961K2678l6900L490K0756
$$ -35859 -28322 -51009 -17458 15754 -23724 -37674 -28400 -15583 -21544 1134 -35766 -32276 -11520
7435a1520k447M890j5954M3660n0452K3837m6168K1923j0862M2525k6248J4862
$$ -11520 -13967 -9077 -25031 18629 -31823 -7986 -54154 -32231 -43093 -568 -26816 -11954
7423a1954N018k7351K2554j5529K1912j3988P765J9570m0209L5911l5721L242
$$ -11954 -6936 -34287 -11733 -27262 -5350 -19338 -11573 7997 -32212 3699 -32022 -28780
7411b8780n988K9969j4683Q457m658l6689L7250k708K9796J540J1868L3624l0263
$$ -28780 -34768 -4799 -19482 -11025 -15683 -52372 -15122 -17830 11966 13506 25374 58998 28735
7398B8735K7426n3688K5211N295j9837j7025j1552j0831k447K0634j0413L0870
$$ 28735 56161 2473 27684 32979 13142 -3883 -15435 -26266 -28713 -8079 -18492 12378
7386A2378k9258l451j8229R550J8541l6349n646K0795L528J2707l5306J7168J520
$$ 12378 -16880 -20331 -38560 -29010 -10469 -46818 -52464 -31669 -28141 -15434 -50740 -33572 -32052
7373c2052M6492K496m8814K160l1955L2408k931L0465k7430m272j4922L647N743
$$ -32052 14440 16936 -31878 -29718 -61673 -29265 -32196 -1731 -29161 -33433 -48355 -44708 -38965
7360c8965J0690J1142M1019l537j4538k4891k0751M0194k8025l1977L4357p729
$$ -38965 -28275 -17133 23886 20349 5811 -19080 -39831 363 -27662 -59639 -25282 -33011
7348c3011J7190p491K0513K38l156l281J7714L7965o9181M0660m0628L7209m3721
$$ -33011 -15821 -23312 -2799 -2561 -5717 -8998 8716 46681 -22500 18160 -22468 14741 -28980
7335b8980q580K2083J5272O298J843r862j075k3113O0724M470J1559m996L390
$$ -28980 -37560 -15477 -205 6093 7936 -1926 -3001 -26114 34610 39080 50639 45643 49033
7322D9033J6889K9588N4035L6850N2038J1508L4393M384k5731m3061l1730l128
$$ 49033 65922 95510 149545 186395 238433 249941 284334 288718 262987 219926 188196 185068
7310A85068m7749l3729j6730m6717n126K1528k0923m1932L0170l2847K9195J162
$$ 185068 137319 103590 86860 40143 35017 56545 35622 -6310 23860 -8987 20208 21370
7298B1370p484J3335l6216K6998k4727K051j5191J5644O591j1912K142j5322L2343
$$ 21370 13886 27221 -8995 18003 -6724 -4673 -19864 -4220 2371 -9541 -7399 -22721 9622
7285I622L321o0201M3675L2370l5450J8468o382n1141J9308L7843j6706K3474
$$ 9622 12943 -47258 -3583 28787 -6663 11805 5423 -45718 -26410 11433 -5273 18201
7273A8201J2065m5045K2858K3622q148N3007m3887J2980Q157Q587k6408k2192
$$ 18201 30266 -14779 8079 31701 23553 76560 32673 45653 53810 62397 35989 13797
7261A3797K5698m222N897m7082K4527O8167n0505k6498J9038L8860L0774j2295
$$ 13797 39495 35273 41170 -5912 18615 86782 36277 9779 28817 67677 98451 86156
7249H6156k9360L5098K4312n3860L4811k1548N022r737j2581m1461L6427k1492
$$ 86156 56796 91894 116206 62346 97157 75609 80631 70894 58313 16852 53279 31787
7237C1787J4082R522J0984k7238j148l2989L6956n971K9177K3339j6370M260Q143
$$ 31787 45869 55391 66375 39137 37989 5000 41956 35985 65162 88501 72131 76391 84534
7224H4534n186R059N0142m9969n7675J3765j6953K8071O4o1048L0393J986n866
$$ 84534 79348 88407 138549 88580 30905 44670 27717 55788 55852 -5196 25197 27183 21317
7211B1317l9004M6609j0306l180Q684j0776L8160o555k9715k9671J4246N7874
$$ 21317 -17687 28922 18616 15436 24120 13344 51504 44949 15234 -14437 -191 57683
7199E7683m5457J7538n933J2184R858o644j1599M5971m370k0903K4103M7019L75
$$ 57683 12226 29764 23831 36015 45873 39229 27630 73601 69231 48328 72431 119450 119825
7186A19825k6953L9985l0492M3195n5376l6733k013M9804j0264p0522M2856K1248
$$ 119825 92872 132857 102365 145560 90184 53451 51438 101242 90978 20456 63312 84560
7174H4560Q178n9053M225J5322M6006J5340o639N4256N0111k726k543K7196K6435
$$ 84560 92738 33685 37910 53232 99238 114578 107939 162195 212306 209580 207037 234233 260668
7161B60668k8048n3608K2654o4381k876n5953j2828N7955l1341J0907p8516K8835
$$ 260668 232620 179012 201666 137285 134409 78456 65628 123583 92242 103149 24633 53468
7149E3468J1216Q774k7730j711M8107j7464Q898m0373J1419L6388j796P195J5520
$$ 53468 64684 73458 45728 44017 92124 74660 83558 43185 54604 90992 89196 96391 111911
7136A11911L7888m4373j4909L6759J9759l59p068j4196K9161L6846p1806M3373
$$ 111911 149799 105426 90517 127276 147035 146676 139608 125412 154573 191419 119613 162986
7124A62986J531K2857j3790P987k210K5820j055k6495L5653k8914K2512k3856
$$ 162986 164517 187374 173584 181571 179361 205181 204126 177631 213284 184370 206882 183026
7112A83026l611L053k2691k643k2474J0371j2311j2244N1529l9558j5160M0560
$$ 183026 179415 182468 159777 157134 134660 145031 132720 120476 172005 132447 117287 157847
7100A57847L358j8051K0727Q634l0344J0511R113j3685K1788N360j4257J8125
$$ 157847 161205 143154 163881 172515 142171 152682 161795 148110 169898 175258 161001 179126
7088A79126j8653k3803K3135L3778l2179j5862n692O955N0758m8475N509O448
$$ 179126 160473 136670 159805 193583 161404 145542 139850 146805 197563 149088 154597 161045
7076A61045J2152L8150q738m4632K4421K6023j0478j5206L2667n396N4881o4937
$$ 161045 173197 211347 202609 157977 182398 208421 197943 182737 215404 210008 264889 199952
7064A99952j0709L6171k7446L2272Q048L4748j7343K3429k4924K1045J817k3998
$$ 199952 189243 225414 197968 230240 238288 273036 255693 279122 254198 275243 277060 253062
7052B53062O7455l6592R28K4667k963n0199M8347J4020j5396M3457P185p897n541
$$ 253062 320517 283925 284853 309520 306557 256358 304705 318725 303329 346786 353971 346074 340533
7039C40533l590J3346M2723Q348O987k7396j1095Q435L7813j3092L4398R245J4668
$$ 340533 336943 350289 393012 401360 408347 380951 369856 378291 416104 403012 437410 446655 461323
7026D61323j6851K7961j833K6516N6415p7392P7690J1015j4331L5092j1870j149
$$ 461323 444472 472433 470600 497116 553531 476139 553829 564844 550513 585605 573735 572586
7014E72586R17Q1223m0973O4213k3334K0769L1991J2447M8060K03M5255K2268
$$ 572586 573503 654726 613753 677966 654632 675401 707392 719839 767899 768102 813357 835625
7002H35625J3344K2184n637P0636K5437Q8079k687j7904P2313J4566O0983L7727
$$ 835625 848969 871153 865516 936152 961589 1049668 1046981 1029077 1101390 1115956 1176939 1214666
6990A214666Q5176P5417J19297O8472P9035J41134J55656J71515K35346K13965
$$ 1214666 1299842 1375259 1494556 1563028 1642063 1783197 1938853 2110368 2345714 2559679
6980B559679M04595M01868O61331J002223J571914K018679J922284J330437O31306
$$ 2559679 2964274 3366142 4027473 5029696 6601610 8620289 10542573 11873010 12504316
6971A2504316j17976p63600j114912j109554j019828p48871o83207m70383l70929
$$ 12504316 12386340 11622740 10507828 9398274 8378446 7629575 6946368 6475985 6105056
6962F105056k03124K423J41743M82110P70110J392816K017219K436155K588040
$$ 6105056 5901932 5904355 6046098 6528208 7298318 8691134 10708353 13144508 15732548
6953A5732548K224863J713003Q25755j54208j116570j783829k050524k115802
$$ 15732548 17957411 19670414 20496169 20341961 19225391 17441562 15391038 13275236
6945A3275236k044932j757136j275042r88854o00510l12312k04371K4654J60787
$$ 13275236 11230304 9473168 8198126 7209272 6608762 6296450 6092079 6116733 6277520
6936F277520L20408P15064J272142J761382J729503J151891L88514m40221j025168
$$ 6277520 6597928 7312992 8585134 10346516 12076019 13227910 13616424 13176203 12151035
6927A2151035j580477j578795j481252j303466j108148q75049o54752n21446l70315
$$ 12151035 10570558 8991763 7510511 6207045 5098897 4223848 3569096 3047650 2677335
6918B677335l19570j62682j99330k00601n6885j08253m0157o9703o4602n0769
$$ 2677335 2357765 2195083 1995753 1795152 1738267 1630014 1589857 1520154 1455552 1404783
6908A404783k8722l7678n7381j094n2102R731n0268p8432K3688m1281m1749n5586
$$ 1404783 1376061 1338383 1281002 1279908 1227806 1237537 1187269 1108837 1132525 1091244 1049495 993909
6896I93909K5896n9337j2662m503r7000L648m9127j4695k0459J9681l4568P741
$$ 993909 1019805 960468 947806 943303 846303 849951 800824 786129 765670 785351 750783 758524
6884G58524j4141J2789L300J7895q506L101o763p618m758l7238j439j6290l9073
$$ 758524 744383 757172 760472 778367 769861 772962 766199 758581 753823 716585 715146 698856 659783
6871F59783k5228K769J4154m6594L7635M1246L5269k9189n268k4901O738k7913
$$ 659783 634555 637324 651478 604884 642519 683765 719034 689845 684577 659676 666414 638501
6859F38501l0675k1372R443k2106l364m5592L5455k3229n5147o944m0506j4021
$$ 638501 607826 586454 595897 573791 570427 524835 560290 537061 481914 474970 434464 420443
6847D20443m0880o106R557j8782L3484r5799N9344r978m3320L1326j1053M734
$$ 420443 379563 373457 383014 364232 397716 301917 361261 351283 307963 339289 328236 332970
6835C32970L632j401j5476M144K000l7382L0198k2643j2200n3830K1371M835K4762
$$ 332970 336602 335201 319725 323869 325869 288487 318685 296042 283842 230012 251383 256218 280980
6822B80980l4933L5790q649l4764J6203P957l0691M1264m804l0036j2493J0284
$$ 280980 246047 281837 273188 238424 254627 262584 231893 273157 268353 238317 225824 236108
6810B36108l0938M0906k0900p3632M4209k7540l6912O1032l0539j2551o034K1708
$$ 236108 205170 246076 225176 151544 195753 168213 131301 192333 161794 149243 143209 164917
6798A64917r697O391k0352o896J3828n863j0893J1597l4753J6686k2069k3427
$$ 164917 155220 161611 141259 134363 148191 142328 131435 143032 108279 124965 102896 79469
6786G9469L7243K0723o9754N1040k0734R385J9197P092l0241J9740l263k3485
$$ 79469 116712 137435 67681 118721 97987 107372 126569 133661 103420 123160 119897 96412
6774I6412J9735m070j2326l656K6780m9677K1774K176m5135L2538J7475j2623
$$ 96412 116147 112077 99751 96095 122875 73198 94972 97148 52013 84551 102026 89403
6762H9403L063L0544k1491N4406J0590k6255K68K066k9229j6759P373j4110J458
$$ 89403 92466 123010 101519 155925 166515 140260 140528 142594 113365 96606 103979 89869 91327
6749I1327N353l291o211J4087j5917o37J1345r385J1512m0904J9151M360j6746
$$ 91327 96680 93389 87178 101265 85348 84711 96056 86671 98183 57279 76430 80790 64044
6736F4044R487l457k109p101L2950l0406K2049o556k6382p049L3760K566J479
$$ 64044 73531 70074 67965 60864 93814 63408 85457 78901 52519 45470 79230 81796 83275
6723H3275n1646L340M0543J9480l3789J0267J9591j6383k4738m371L2189O064
$$ 83275 31629 34969 75512 94992 61203 71470 91061 74678 49940 45569 77758 83822
6711H3822k8820M6678j7795r407k0505J5533k752N4393j0671m5833P0338p0043
$$ 83822 55002 101680 83885 74478 53973 69506 66754 121147 110476 64643 134981 64938
6699F4938J3460q685l153J9262Q622J8449q3102N9655M216J871M345J3534J9529
$$ 64938 78398 69713 66560 85822 94444 112893 29791 89446 93662 95533 99878 113412 132941
6686A32941k4654O472l4986L3715J7886l7044O4395l1991j9608j3310K5824n036
$$ 132941 108287 114759 79773 113488 131374 94330 158725 126734 107126 93816 119640 114604
6674A14604N0405J0662m1095N6213l103m1160J5956m7481L1564n262J7738l9931
$$ 114604 165009 175671 134576 190789 187686 146526 162482 115001 146565 141303 159041 119110
6662A19110M2714m6528M1456K731k3810K8764L2271l803j6482L7513p764K3442
$$ 119110 161824 115296 156752 159483 135673 164437 196708 192905 176423 213936 206172 229614
6650B29614J3574l6152N5251k0682L9151K4253J05769M1925J141L6900p7910J1147
$$ 229614 243188 207036 262287 241605 280756 305009 410778 452703 453844 490744 412834 423981
6638D23981j09059l5333K4570k4713m8315L9246k107k7424P571O62M0618o57m9916
$$ 423981 314922 279589 304159 279446 231131 270377 268270 240846 248417 249079 289697 289040 239124
6625B39124M3397m9116M5130l7722K3037M4546K4952O1457J23394K09810J32660
$$ 239124 282521 233405 278535 240813 263850 308396 333348 394805 518199 728009 860669
6614H60669J23247J3856J1383j08505j18663j15760j33673K0572j00215K020K3100
$$ 860669 983916 997772 1009155 900650 781987 666227 532554 553126 452911 454931 478031
6603D78031k0500K8433j1573m6139l739m7944J3882j2988l0962n1280M9106j4218
$$ 478031 457531 485964 474391 428252 424513 376569 390451 377463 346501 295221 344327 330109
6591C30109J1605N9055J63654J04046K13405J23196M488L160p2632j29865q0483
$$ 330109 341714 400769 564423 668469 881874 1005070 1009558 1012718 940086 810221 729738
6580G29738j38380r2340n0864n0387o3910N3051m0787M6084K9068L5313J29170
$$ 729738 591358 499018 448154 397767 333857 386908 346121 392205 421273 456586 585756
6569E85756J06041J43733O8252P9482p4886q452q4490j43061M677j5030l1260
$$ 585756 691797 835530 903782 983264 908378 899926 815436 672375 677052 662022 630762
6558F30762Q118P273p8235l2851k6342o6524j932p5879k1214j7117l6888M3112
$$ 630762 638880 646153 567918 535067 508725 442201 440269 364390 343176 326059 289171 332283
6546C32283Q315P021J9939L4553k8005K7913K7864q418P767j0751k170L1209N9675
$$ 332283 340598 347619 367558 402111 374106 402019 429883 421465 429232 418481 416311 447520 507195
6533E07195N2131P3637O0427J7564K8197J2153m4163m4278n0229J3676m7387R957
$$ 507195 559326 632963 693390 710954 739151 751304 707141 662863 612634 626310 578923 588880
6521E88880q164L5860m3874J0820O9671n2365K4135q302l6192J7701m4113m7461
$$ 588880 580716 616576 572702 583522 653193 600828 624963 616661 580469 598170 554057 506596
6509E06596k5972j1198l2605l8316k9777l142p681m9858o471K9058l6772L4686
$$ 506596 480624 469426 436821 398505 368728 365586 357905 308047 301576 330634 293862 328548
6497C28548k7756J7569J7927n720L4746K8062L4752J9194j9453j3151k4677K8889
$$ 328548 300792 318361 336288 330568 365314 393376 428128 447322 427869 414718 390041 418930
6485D18930l2944j3784k1472m1016K0542L261l5314n615O5539k8861m0478L9322
$$ 418930 385986 372202 350730 309714 330256 333517 298203 292588 358127 329266 288788 328110
6473C28110K1358Q734K6582l5355M7985K9954p1807O3303l311L0877n6045k4160
$$ 328110 349468 358202 384784 349429 397414 427368 355561 418864 415553 446430 390385 366225
6461C66225O8522L4536j6972k0154M3891J1914J9279J7182o312N0886J0964L4274
$$ 366225 434747 469283 452311 432157 476048 487962 507241 524423 518111 568997 579961 614235
6449F14235L1021L4131J4834M2914J0372j9735J27770j6278J4459l465K8881k6327
$$ 614235 645256 679387 694221 737135 747507 727772 855542 839264 853723 850258 879139 852812
6437H52812J0850n8928K235J3725o2015k081J1244m8179K6519l75k156k0427k1921
$$ 852812 863662 804734 806969 820694 758679 756598 767842 719663 746182 745807 743651 723224 701303
6424G01303K8861K0423l566n427K5425K8063j0138K1664l289L7896L4202k096
$$ 701303 730164 750587 747021 741594 767019 795082 784944 806608 803319 841215 875417 873321
6412H73321J5951O0517j5486P4312N9379M4201J8588K5276N2336L3739l72k8875
$$ 873321 889272 949789 934303 1008615 1067994 1112195 1130783 1156059 1208395 1242134 1241762 1212887
6400A212887N0480M9039m641K2915N2517Q6671K5730J13627Q7004J07273Q2784
$$ 1212887 1263367 1312406 1307765 1330680 1383197 1469868 1495598 1609225 1696229 1803502 1886286
6389A886286N0462Q6023m949L1293q8207J1239K4191j4447j5247L6091P1194M2002
$$ 1886286 1936748 2022771 2017822 2049115 1960908 1972147 1996338 1981891 1966644 2002735 2073929 2115931
6377B115931M7829J6189R9339M6770J29726O9592J49505K09282L22519M01136
$$ 2115931 2163760 2179949 2279288 2326058 2455784 2525376 2674881 2884163 3206682 3607818
6367C607818N16028M60254M92807M07683K73836J53045L994q7694q3069p6007
$$ 3607818 4123846 4584100 5076907 5484590 5758426 5911471 5915465 5827771 5744702 5668695
6357E668695q4555m647M6716J38702K31611L72596L65174N76765O94366Q24920
$$ 5668695 5584140 5579493 5626209 5764911 5996522 6369118 6734292 7311057 8005423 8830343
6347H830343J006638J319094J962548L108236M398279N762336O583896O331907
$$ 8830343 9836981 11156075 13118623 16226859 20625138 26387474 32971370 39303277
6339C9303277M848184K531333k14744k680564m437327n278730n311694m914049
$$ 39303277 44151461 46682794 46468050 43787486 39350159 34071429 28759735 23845686
6331B3845686m117420l379053k663040k097433j599411j284943j035868q17884
$$ 23845686 19728266 16349213 13686173 11588740 9989329 8704386 7668518 6850634
6323F850634p13397n28396m38852l68884l02384k58839k45981k32268j66070j56109
$$ 6850634 6137237 5608841 5169989 4801105 4498721 4239882 3993901 3761633 3595563 3439454
6313C439454j64830j39776j66877q1441j21678j04882j23145p6774p8450o5541
$$ 3439454 3274624 3134848 2967971 2886530 2764852 2659970 2536825 2460051 2381601 2316060
6303B316060j05309m4604m1061l1687m2327n036q4567k2231k713q8071R222o3106
$$ 2316060 2210751 2166147 2125086 2093399 2051072 2046036 1961469 1939238 1936525 1848454 1857676 1794570
6291A794570r928n1065j5516l3705k5180r020o2570J4218J8681m2414j8360K4705
$$ 1794570 1784642 1733577 1718061 1684356 1659176 1650156 1587586 1601804 1620485 1578071 1559711 1584416
6279A584416L9528J1043K75J1243L6599P554J3832K2371P1704M4574M2773N8481
$$ 1584416 1623944 1634987 1635262 1646505 1683104 1690658 1704490 1726861 1798565 1843139 1885912 1944393
6267A944393Q6630P9796N5815P3759O4606R9057P3815J35778J07811J50041J55561
$$ 1944393 2031023 2110819 2166634 2240393 2304999 2404056 2477871 2613649 2721460 2871501 3027062
6256C027062J09051J02495R3503P2467o890r525j8930K4014L359k3972K8763k1363
$$ 3027062 3136113 3238608 3332111 3404578 3397688 3388163 3369233 3393247 3396606 3372634 3401397 3380034
6244C380034O7074m152M4611M5855J6065m992l3070M3213K8006n0271m8136k3213
$$ 3380034 3447108 3442956 3487567 3533422 3549487 3544495 3511425 3554638 3582644 3532373 3484237 3461024
6232C461024J12l8245l1752j4380k0740j3780o6183J0224q5754j3508o8689p5610
$$ 3461024 3461136 3422891 3391139 3376759 3356019 3342239 3276056 3286280 3200526 3187018 3118329 3042719
6220C042719N4850p3745o1725m566r6020k2181j04771M2077n7863l205p0361k1410
$$ 3042719 3097569 3023824 2962099 2957533 2861513 2839332 2734561 2776638 2718775 2715570 2645209 2623799
6208B623799j9878n1374o4856o4900j35284p3627j22048j36467j05012j30870
$$ 2623799 2603921 2552547 2487691 2422791 2287507 2213880 2091832 1955365 1850353 1719483
6198A719483q6750j38132q2628o8905m9132o6190j6870o0368l1857J3091j0635
$$ 1719483 1632733 1494601 1411973 1343068 1293936 1227746 1210876 1150508 1118651 1131742 1121107
6187A121107k2682O0109N5268L0089M710l1156n9575K106l7659p5688k6215p2460
$$ 1121107 1098425 1158534 1213802 1243891 1248601 1217445 1157870 1159976 1122317 1046629 1020414 947954
6175I47954j8076k7015l9648o805j1989n866n0776k9743m1826l846Q535m3910
$$ 947954 929878 902863 863215 856410 844421 838555 787779 758036 716210 712364 720899 676989
6163F76989M5907k3866l3929O052m1873r299l3604j008m311j141j1339r293J6189
$$ 676989 722896 699030 665101 671153 629280 619981 586377 585369 581058 579917 568578 559285 575474
6150E75474L008n6601J6593L950o362j4575q452K2848k11n6414M1134K4100m773
$$ 575474 578482 521881 538474 542424 536062 521487 513035 535883 535672 479258 520392 544492 539719
6137E39719l8011N480P859k8996k6843M764l0023j0789j1827m55K5887m0193k7224
$$ 539719 501708 507188 515047 486051 459208 463972 433949 423160 411333 410878 436765 396572 369348
6124C69348n601R708L779n1033J6028r226k9309R341k3857J5386J6795l0214o413
$$ 369348 363747 373455 377234 326201 342229 333003 303694 313035 289178 304564 321359 291145 284732
6111B84732j9075J3533l254j409J5165m206K0556N019l6259N7977R006l3449L0845
$$ 284732 265657 279190 275936 274527 289692 285486 306042 311061 274802 332779 341785 308336 339181
6098C39181k4635J0081j9738l1255j4845o87n974J0470J1000m2243M4999j9743
$$ 339181 314546 324627 304889 273634 258789 258102 252128 262598 273598 231355 276354 256611
6086B56611J2585M298K1734k8322L2087k713Q060l70J4537R78N571O9965r263
$$ 256611 269196 273494 295228 266906 298993 296280 304340 303970 318507 319485 325056 395021 385758
6073C85758L3246q582K1362K3559j9365j7464P973l5312n3376m3493l2672k380
$$ 385758 419004 410422 431784 455343 435978 418514 426487 391175 337799 294306 261634 259254
6061B59254R087m5815J9230j08k3338j9928N914M8472m3043l3603K1835L4693
$$ 259254 268341 222526 241756 241648 218310 198382 204296 252768 209725 176122 197957 232650
6049B32650L1371m4201j3892L0876m160m067n649K5605J4058j11600K9814N7051
$$ 232650 264021 219820 205928 236804 232644 228577 222928 248533 262591 150991 180805 237856
6037B37856j9693K9277j260m151N1028m758m662N7797l7160n822m325j0840m0649
$$ 237856 218163 247440 246180 242029 293057 288299 283637 341434 304274 298452 294127 283287 242638
6024B42638k7327k2636K8024l2561K0950J4809l7703k234J2979k1227k7511K1073
$$ 242638 215311 192675 220699 188138 209088 223897 186194 183960 196939 175712 148201 169274
6012A69274P540j7385j6193n380j0608M8428k0683j2573J8066K1937M213l5875
$$ 169274 176814 159429 143236 137856 127248 175676 154993 142420 160486 182423 186636 150761
6000A50761j4910M4130L5378j517l2017M8542J3478p012j577J3294k8810j530
$$ 150761 135851 179981 215359 213842 181825 230367 243845 236833 235256 248550 219740 218210
5988B18210k9601n310M2843n5760K9188J754M5340M5671l4338N7195J8260k4753
$$ 218210 188609 183299 226142 170382 199570 201324 246664 292335 257997 315192 333452 308699
5976C08699P332l7970l2179K0795J2779r4476N4126N807j3250P64k6114J3467
$$ 308699 316031 278061 245882 266677 279456 184980 239106 244913 231663 232427 206313 219780
5964B19780j6559k812J2999K0117k9028L290L3507R605j9330M560n823J7054R22
$$ 219780 203221 200409 213408 233525 204497 207787 241294 250899 231569 236129 230306 247360 248282
5951B48282k3392k2171J5344j6311m5362M0326l6694K0823j6990l1947J9736j524
$$ 248282 224890 202719 218063 201752 156390 196716 160022 180845 163855 131908 151644 150120
5939A50120J2646j7868J5351j79N956k571M863J0625l19n761j8166l867N303J8810
$$ 150120 162766 144898 160249 160070 166026 163455 168318 178943 178624 172863 154697 150830 156133 174943
5925A74943j4925l0496J4330j9626J3593N252m5861O5835n6154J5697J573J587
$$ 174943 160018 129522 143852 124226 137819 143071 97210 163045 106891 122588 124161 125748
5913A25748K9166l8380L6091l4699O5885n8109K5970L452j3417p712k5451k09
$$ 125748 154914 116534 152625 117926 183811 125702 151672 155124 141707 133995 108544 108335
5901A08335Q776Q066J0877m693N378k5583M1849m0145j2746O0153l4768M348J2018
$$ 108335 117111 125177 136054 131361 136739 111156 153005 112860 100114 160267 125499 129847 141865
5888A41865J0111J8078R263k2658N7610L289m0782L1303k237L85j9229k4680j845
$$ 141865 151976 170054 179317 156659 214269 217558 176776 208079 205842 206227 186998 162318 160473
5875A60473L1508J5593l0023R741o204J8836m4257L6471J1740N6448k0792l5286
$$ 160473 191981 207574 177551 187292 181088 199924 155667 192138 203878 260326 239534 204248
5863B04248Q317J5252J9432n0020M4487n539m5030j2865J07j4263M3691J0472
$$ 204248 212565 227817 247249 197229 241716 236177 191147 178282 178389 164126 207817 218289
5851B18289M847L5440K908o559N103o698K3522R637j9130m2883r904M4103o7709
$$ 218289 223136 258576 261484 254925 260028 253330 276852 286489 267359 224476 214572 258675 190966
5838A90966O3092k8479J9521j6347J1439q378J2959K6054n5970L4209j6675o619
$$ 190966 254058 225579 245100 228753 240192 231814 244773 270827 214857 249066 232391 225772
5826B25772J7978k5337M6671J0674J5096m6935L0936j4880l345m3222L8327Q087
$$ 225772 243750 218413 265084 275758 290854 243919 274855 259975 256630 213408 251735 259822
5814B59822l3766L2109R98o541Q562j1762J0104N128J9823k4301q893M3404j6630
$$ 259822 226056 258165 259163 252622 261184 249422 259526 264654 284477 260176 251283 294687 278057
5801B78057J9884j4156K1462j2692L1545l9892L0908p954L6845P528J4307l842
$$ 278057 297941 283785 305247 292555 324100 284208 315116 307162 344007 351535 365842 362000
5789C62000l456m0631N1519J967j2676M5399J5300r958j7802P650m4743O9981
$$ 362000 358544 317913 369432 371399 358723 404122 419422 409464 391662 399312 354569 424550
5777D24550j275k4182L6568K475l1082K5583k740J5211K8916m488j9431K7775
$$ 424550 423275 399093 435661 438136 407054 432637 429897 445108 474024 469536 450105 477880
5765D77880J0208K2137P29L5773K9402l2621j6923O0141J286K0434Q876J6138
$$ 477880 488088 510225 510954 546727 576129 543508 526585 586726 588012 608446 617322 633460
5753F33460K4105O886L664P124L6328N2223m1507N5166K1285K5289j0580O7653
$$ 633460 657565 664451 668115 675239 711567 763790 722283 777449 798734 824023 813443 881096
5741H81096r698K9969j158L3473Q7788L004P6376K940N3967O2391P879O1279K3529
$$ 881096 871398 901367 900209 933682 1021470 1024474 1100850 1103790 1157757 1220148 1228027 1289306 1312835
5728A312835J15368J14709L3415J29332J78217J22794J29291J70759K13069K29104
$$ 1312835 1428203 1542912 1576327 1705659 1883876 2006670 2135961 2306720 2519789 2748893
5718B748893L20097M25197O16922J184301J921922K384061K094756J358011M22165
$$ 2748893 3068990 3494187 4111109 5295410 7217332 9601393 11696149 13054160 13476325
5709A3476325l28526j017237j277549j053816q50196o96790o36778n10250m48432
$$ 13476325 13147799 12130562 10853013 9799197 8949001 8252211 7615433 7105183 6656751
5700F656751l48147j31912N9606L15601Q45704J390597J912329K422149K656827
$$ 6656751 6308604 6176692 6236298 6551899 7397603 8788200 10700529 13122678 15779505
5691A5779505K585874J884492Q41248l34381j270587j887191k155822k083072
$$ 15779505 18365379 20249871 21091119 20756738 19486151 17598960 15443138 13360066
5683A3360066j934104j516006j217761r25875o33108m37391k34632j77667l4091
$$ 13360066 11425962 9909956 8692195 7766320 7133212 6695821 6461189 6283522 6249431
5674F249431J19038O27385J337047J908799J769164J017856K55151m98511j210950
$$ 6249431 6368469 6995854 8332901 10241700 12010864 13028720 13283871 12785360 11574410
5665A1574410j497385j388253j280262j062359r17314q12391o78252m87089m56778
$$ 11574410 10077025 8688772 7408510 6346151 5428837 4616446 3938194 3451105 2994327
5656B994327k90521k69093k22389j32243j19432p7640j21520q4272n7333k1950
$$ 2994327 2703806 2434713 2212324 2080081 1960649 1883009 1761489 1677217 1619884 1597934
5646A597934n1824m5520o1840n5026m4511O98n4419J5070j3504k3600k502j2591
$$ 1597934 1546110 1500590 1438750 1383724 1339213 1339911 1285492 1300562 1287058 1263458 1260956 1248365
5634A248365P337R263R364l534J8799m366J3937k8597p0369k3396L5413k8613
$$ 1248365 1255702 1264965 1274329 1270795 1289594 1285228 1299165 1270568 1200199 1176803 1212216 1183603
5622A183603j2291j4323M792l1740K7276J1882L3730O2944m9013P348j3870j5861
$$ 1183603 1171312 1156989 1161781 1130041 1157317 1169199 1202929 1265873 1216860 1224208 1210338 1194477
5610A194477L8676L2289J3240K2741M877K8366L0669K9350P1189Q568R3657N2543
$$ 1194477 1233153 1265442 1278682 1301423 1306300 1334666 1365335 1394685 1465874 1474442 1568099 1620642
5598A620642L7882J11802K6581P7934J15870K0561R6691J19679M9051Q5482N6318
$$ 1620642 1658524 1770326 1796907 1874841 1990711 2011272 2107963 2227642 2276693 2362175 2418493
5587B418493R3918O2535R6820Q9920N2832K2833P0018M1943M1195L8231M6065
$$ 2418493 2512411 2574946 2671766 2761686 2814518 2837351 2907369 2949312 2990507 3028738 3074803
5576C074803M7457M5864O0167K9152k0591O4593L8406m6177J459l3763m1310n0868
$$ 3074803 3122260 3168124 3228291 3257443 3236852 3301445 3339851 3293674 3295133 3261370 3220060 3169192
5564C169192n8270m7094j8895q4408l7838k6003l0087r7267m3680k0016r7658
$$ 3169192 3110922 3063828 3044933 2960525 2922687 2896684 2866597 2769330 2725650 2705634 2607976
5553B607976p2047q0358l9952m3848j05921j31526o2881r4427j01910o0696j50718
$$ 2607976 2535929 2455571 2415619 2371771 2265850 2134324 2071443 1977016 1875106 1814410 1663692
5542A663692m4658n1621r0265j00052l7615l8521k4279p5412n0183J1748o2192
$$ 1663692 1619034 1567413 1477148 1377096 1339481 1300960 1276681 1201269 1151086 1162834 1100642
5531A100642n5820l9619r66m6791n8075n3089r109l5470p0218l4445M6208k7492
$$ 1100642 1044822 1005203 1004237 957446 899371 846282 837173 801703 731485 697040 743248 715756
5519G15756o6352k9300n183L153k9632n6544l917L410j3901j1585n3782J2478
$$ 715756 649404 620104 614921 618074 588442 531898 527981 531391 517490 505905 452123 464601
5507D64601L2696k7634L2365k0240k0610k090r575l4713K8613R411n7423k0532
$$ 464601 497297 469663 502028 481788 461178 459088 449513 414800 443413 452824 395401 374869
5495C74869M4052l170j3637K5450n25N111M2209p2332K0100M0568k9197m320k0284
$$ 374869 418921 415751 402114 427564 427039 432150 474359 402027 422127 462695 433498 429178 408894
5482D08894K7254j2022j682l2795K6692j625k3136K138k7996J9500j8433J8345
$$ 408894 436148 424126 422444 389649 416341 414716 391580 393718 365722 385222 366789 385134
5470C85134m7881J1319j84J8651K5166j7799k4143J2950j4893l708Q6215m7931
$$ 385134 337253 348572 348388 367039 392205 374406 350263 363213 348320 344612 430827 382896
5458C82896j4722K3865m428m4612N097q932L1040L8760m4540m1500M2226q444
$$ 382896 368174 392039 387611 342999 348096 339164 370204 408964 364424 322924 365150 356706
5446C56706O362j9305J8622j6292L9397j5501o086o731k1585k3978N349J3277
$$ 356706 363068 343763 362385 346093 385490 369989 363903 357172 335587 311609 316958 330235
5434C30235n909Q444p6050J3360L852j4033J2966N338m280K7328p402L62M7073
$$ 330235 324326 332770 256720 270080 273932 259899 272865 278203 273923 301251 293849 294211 341284
5421C41284L6694l0860K9392n6914K5073k89k7937l5267J1067J6382m7732k1496
$$ 341284 377978 347118 376510 319596 344669 344380 316443 281176 292243 308625 260893 239397
5409B39397n502K6676N033m3626j0488L8311q389L3969m6214L0286J3750k1166
$$ 239397 233895 260571 265604 221978 211490 249801 241412 275381 229167 259453 273203 252037
5397B52037J5591L0842l2865l1165j7309M5960k4l8m0929K8507Q57k578l5996
$$ 252037 267628 298470 265605 234440 217131 263091 263067 263029 222100 250607 251464 248886 212890
5384B12890K3554l6131K6020J0377n3739L679J3955J4314l2187n143j3296K9325
$$ 212890 236444 200313 226333 236710 182971 186650 200605 214919 182732 177589 164293 193618
5372A93618m7593R588L6959m092j6223k522K1473l0451J3113P944m5937K8520
$$ 193618 146025 155613 192572 188480 172257 169735 191208 160757 173870 181814 135877 164397
5360A64397j7019O713j90L6011l9290j0269l3939J5171L3539l4670r368p873K5662
$$ 164397 147378 154091 153901 189912 150622 140353 106414 121585 155124 120454 111086 103213 128875
5347A28875l0561Q791N323l2380K3942q746K8596l4912K3369j6997O048K2260
$$ 128875 98314 107105 112428 80048 103990 95244 123840 88928 112297 95300 101348 123608
5335A23608L127K10m9200N854J4744R000N43k347J1738k4151J0665m4807L9987
$$ 123608 126735 126945 77745 83599 98343 107343 107886 105539 117277 93126 103791 58984 98971
5322I8971K8136k6567K1087p604k066j2427j1762J0622l2677P6760m1829K1794
$$ 98971 127107 100540 121627 114023 111957 99530 87768 98390 65713 142473 100644 122438
5310A22438l3521m139K5736j8180K2710k1103M6551l6011j2210J2761L354j0592
$$ 122438 88917 84778 110514 92334 115044 93941 140492 104481 92271 105032 108386 97794
5298I7794R430K5350j7162K8444l6195J6857k614q017L3652r14M1637o3506j5781
$$ 97794 107224 132574 115412 143856 107661 124518 121904 113887 147539 146625 188262 124756 108975
5285A08975j3983J3232o020j0473J4935j8894J4832k587j4918M4259k3214L31
$$ 108975 94992 108224 102204 91731 106666 87772 102604 100017 85099 129358 106144 106475
5273A06475K0322k4349k8175N498N329J7035J1183k9319j6366K5812l961J0338
$$ 106475 126797 102448 74273 79771 85100 102135 113318 83999 67633 93445 89484 99822
5261I9822r707j8512K2558K0387k4046r783L1916l8663J2481L1081m6489Q607
$$ 99822 90115 71603 94161 114548 90502 80719 112635 73972 86453 117534 71045 79652
5249G9652K1785k7857K3547j2844K06J1162n928K825l5096N6250l6046M1239k7560
$$ 79652 101437 73580 97127 84283 84489 95651 89723 92548 57452 113702 77656 118895 91335
5236I1335J832j041l618J114j0320M2641l9764L9680j6281j7833J8625L059o979
$$ 91335 93167 92126 88508 89622 79302 121943 82179 121859 105578 87745 106370 109429 102450
5223A02450k9068K1682j9740J7740j0773L0642j475j7358M0564k3768L092K5054
$$ 102450 73382 95064 75324 93064 82291 112933 111458 94100 134664 110896 113988 139042
5211A39042j9337K4510M33k6058J9593Q034n650M0630P836K3471J6110J9558O567
$$ 139042 119705 144215 144648 118590 138183 146217 140567 181197 189033 212504 228614 248172 254739
5198B54739R458J8920M697N918K4198j6445j1952L9479M732l1494K5628l2172
$$ 254739 264197 283117 287814 293732 317930 301485 289533 329012 333744 302250 327878 295706
5186B95706M9672m4722K2895o836k1578m1301l0564M95o848j9038j7469p49J7402
$$ 295706 345378 300656 323551 316715 295137 253836 223272 223767 216919 197881 180412 179663 197065
5173A97065J1131K480k3471J0939j2890j7180L1134k4371L3700J1186j5663j3241
$$ 197065 208196 210676 187205 198144 185254 168074 199208 174837 208537 219723 204060 190819
5161A90819O3014J58N8013Q942K1966j0472M4151p382N717P735k0673k8998j180
$$ 190819 253833 253991 312004 320946 342912 332440 376591 369209 374926 382661 361988 332990 331810
5148C31810l1396M4289l1455o918K0295o136k1121K1362l004K6527j7600p0919
$$ 331810 300414 344703 313248 306330 326625 320489 299368 320730 317726 344253 326653 255734
5136B55734J4895k3528O968J2666m5752q515j4988O3053j00824J0617M7837l130
$$ 255734 270629 247101 254069 266735 220983 212468 197480 260533 159709 170326 218163 215033
5124B15033j3873j2645M0156k4033n6842L3609M180K0512k8231J8949q839L0480
$$ 215033 201160 188515 228671 204638 147796 181405 185585 206097 177866 196815 187976 218456
5112B18456m8665j7865M8602L9368l681m4052J4019J7549J5538O324o052J9250
$$ 218456 169791 151926 200528 239896 236215 192163 206182 223731 239269 245593 239541 258791
5100B58791k3555j1297j6269J2900R616j370k8092j203M0197k2702j853P187k6698
$$ 258791 235236 223939 207670 220570 230186 228816 200724 199521 239718 217016 215163 222350 195652
5087A95652l719M963J7613k506j0119k9638K4569J3500K0415J2487Q761j6481
$$ 195652 191933 196896 214509 212003 201884 172246 196815 210315 230730 243217 251978 235497
5075B35497m2362M0595k0150k09O462j5290M1568k1660L7985k4150P485J4307
$$ 235497 193135 233730 213580 213371 219833 204543 246111 224451 262436 238286 245771 260078
5063B60078L2038k3376J702L4904N0954l1291K9854K6342n1955J1760O865l5169
$$ 260078 292116 268740 270442 305346 356300 325009 354863 381205 329250 341010 347875 312706
5051C12706r61k227k2375K9705K839k8538R424K8595K4573m8633O3739k5056j3845
$$ 312706 311745 309518 287143 316848 319687 291149 300573 329168 353741 305108 368847 343791 329946
5038C29946L4682j4082m1376M3005l73m179N556k8609M9421l0843N3829O024m0157
$$ 329946 364628 350546 309170 352175 351802 347623 353179 324570 373991 343148 396977 403001 362844
5025C62844K2673j1169J3728L4194k0779K982n397L8963P459J0460k127l270P73
$$ 362844 385517 374348 388076 422270 401491 404473 399076 438039 445498 455958 453831 450561 451334
5012D51334K2650k8027K1652N1118j7251p534j609p05L2583j9868K8106j5685
$$ 451334 473984 445957 467609 518727 501476 493942 492333 491628 524211 504343 532449 516764
5000E16764n289R433J6021r159K0870j679K5521J6060J6259k7176L8947o136J5133
$$ 516764 511475 520908 536929 527770 548640 546961 572482 588542 604801 577625 616572 610436 625569
4987F25569J8774k917j3315K5800M6851M239L0546o360j4440J6076O5778k7335
$$ 625569 644343 641426 628111 653911 700762 705001 735547 729187 714747 730823 796601 769266
4975G69266K2991K0491N081N0714q176O2831J4394O5362J1956M4280O1091N0475
$$ 769266 792257 812748 817829 868543 860367 923198 937592 1002954 1014910 1059190 1120281 1170756
4963A170756J49762P8438L95528P54170R29174P37205L63364J5192k76017n12500
$$ 1170756 1320518 1398956 1794484 2548654 3477828 4215033 4578397 4593589 4317572 3805072
4953C805072o27912n39579l43551l41202k31665k06132j49840l1449n3429k4139
$$ 3805072 3177160 2637581 2294030 1952828 1721163 1515031 1365191 1333742 1280313 1256174
4943A256174k756L1327o4057n268J135m068n17J5817K3087K990M4934n5031K3665
$$ 1256174 1253418 1284745 1220688 1215420 1216555 1212487 1211970 1227787 1250874 1253864 1298798 1243767 1267432
4930A267432L2660N62L5535o190L9828R122L562O0377j6931N2086L1852R426L2873
$$ 1267432 1300092 1300654 1336189 1329999 1369827 1378949 1382511 1442888 1425957 1478043 1509895 1519321 1552194
4917A552194l884J8558N7085K1522K3408L8385L55M8391K3589O1728K8403Q976
$$ 1552194 1548310 1566868 1623953 1645475 1668883 1707268 1707623 1756014 1779603 1841331 1869734 1878710
4905A878710Q2850k7578L8996N0663L969Q3533O7748J0924P3389k0119O1117M8738
$$ 1878710 1961560 1933982 1972978 2023641 2027610 2111143 2178891 2189815 2263204 2243085 2304202 2352940
4893B352940M7727L6923Q6515N5848L7150M2637N5540R9528P9154K6862Q2836
$$ 2352940 2400667 2437590 2524105 2579953 2617103 2659740 2715280 2814808 2893962 2920824 3003660
4882C003660O2432N8089P1031Q3009O7699R7396N8353P1864R6098O8269R7285
$$ 3003660 3066092 3124181 3195212 3278221 3345920 3443316 3501669 3573533 3669631 3737900 3835185
4871C835185J01358J07965R9896P6782J00624J20032J01979Q1341J47598P9980
$$ 3835185 3936543 4044508 4144404 4221186 4321810 4441842 4543821 4625162 4772760 4852740
4861D852740J25110J46180N8611J52350J06540J22073J05871J52239O7333J21360
$$ 4852740 4977850 5124030 5182641 5334991 5441531 5563604 5669475 5821714 5889047 6010407
4851F010407J16832J27269R6523J29629N6650R7339J11669m78J20145N9259O9484
$$ 6010407 6127239 6254508 6351031 6480660 6537310 6634649 6746318 6745840 6865985 6925244 6994728
4840F994728O5061O5733l0225N2934K2696M606j0120K627l8951n572m9929l6449
$$ 6994728 7059789 7125522 7095297 7148231 7170927 7175533 7165413 7168040 7129089 7123517 7073588 7037139
4828G037139o9222o2231r2564k5150r5830p3387o7953j39572o4916j34064j35384
$$ 7037139 6967917 6905686 6813122 6787972 6692142 6618755 6550802 6411230 6346314 6212250 6076866
4817F076866p1401j08200j20761q7594j38830j06519r6631r9127j54035o9404
$$ 6076866 6005465 5897265 5776504 5688910 5550080 5443561 5346930 5247803 5093768 5024364
4807E024364j49915o8442r4921j45594p1455j21238p6889j50515m5495q3325j05611
$$ 5024364 4874449 4806007 4711086 4565492 4494037 4372799 4295910 4145395 4099900 4016575 3910964
4796C910964j07202o1228n1736p3264r4985n7792j12008n1217q2824p6529l4759
$$ 3910964 3803762 3742534 3690798 3617534 3522549 3464757 3352749 3301532 3218708 3142179 3107420
4785C107420n5948k8207j00008p5046p1616l2630l5754j10050n5424M702p0726
$$ 3107420 3051472 3023265 2923257 2848211 2776595 2743965 2708211 2598161 2542737 2547439 2476713
4774B476713m7140n4032n7765l2035o1232m1727k8320m7782o0593m8053k6143
$$ 2476713 2429573 2375541 2317776 2285741 2224509 2182782 2154462 2106680 2046087 1998034 1971891
4763A971891j1964q0670k5968m7385m3220m5261l0284k3427m032o1590n1836j4564
$$ 1971891 1959927 1879257 1853289 1805904 1762684 1717423 1687139 1663712 1659680 1598090 1546254 1531690
4751A531690m8143o878k9361J808m5071l726k7622k8512l0659m156p0142O033
$$ 1531690 1483547 1476669 1447308 1449116 1404045 1400319 1372697 1344185 1313526 1309370 1239228 1245261
4739A245261q551l2630K2332o4807j771k3993J2903l4353k0505o0329J6504k0317
$$ 1245261 1236710 1204080 1226412 1161605 1159834 1135841 1148744 1114391 1093886 1033557 1050061 1029744
4727A029744l4315L3613m6383J9307m0650m5925K1548J1470R45p6577M5884l1803
$$ 1029744 995429 1029042 982659 1001966 961316 915391 936939 948409 949354 872777 918661 886858
4715H86858k2990K95l2355j2641J9928j7600k4295J9709l1040R809j31j145l2408
$$ 886858 863868 864163 831808 819167 839095 821495 797200 816909 785869 795678 795547 794402 761994
4702G61994L274k7369L6907j5642J8214o3160K573K8409J5706j7927n846Q899
$$ 761994 765268 737899 774806 759164 777378 714218 716791 745200 760906 742979 737133 746032
4690G46032l658N72j057l3764K8651k2584l7204k1245K4656n7335L2609k1816
$$ 746032 742374 742946 741889 708125 736776 714192 676988 655743 680399 623064 655673 633857
4678F33857J9982l704l0033J67j2937j966J9537J474j1859J8889m9291k5960j0918
$$ 633857 653839 650135 620102 620269 607332 605366 624903 626377 614518 633407 584116 558156 547238
4665E47238K9864L8469k9570k6211J8754P054k100l0437K339K4940n97L70J893
$$ 547238 577102 615571 586001 559790 578544 585598 583498 553061 555400 580340 579743 580113 582006
4652E82006j2285J2495j9965K4020J1734l2610K5573k0123J040o667J2412R580
$$ 582006 569721 582216 562251 586271 598005 565395 590968 570845 571885 565218 577630 587210
4640E87210l7249L7277K962M780Q296M7351K2735r125O5168N8478J48200J15669
$$ 587210 549961 587238 590200 594980 603276 650627 673362 664237 729405 787883 936083 1051752
4628A051752J42244K20715J69825J71090N9657j5040p9349j19159j90370j59642
$$ 1051752 1193996 1414711 1584536 1755626 1815283 1800243 1720894 1601735 1411365 1251723
4618A251723j07437j12009j22492q6379k8334l9380l651m6040o7248P011J9912
$$ 1251723 1144286 1032277 909785 823406 795072 755692 752041 706001 638753 645764 665676
4607F65676l9994j1908J63j3873p476R658K0858J5627q0372L3790K1323O705k8331
$$ 665676 625682 613774 613937 600064 592588 602246 623104 638731 558359 592149 613472 620177 591846
4594E91846n0378J8697K0699J3750m2841k5546K6592j1791K3938k279J1227j6211
$$ 591846 541468 560165 580864 594614 551773 526227 552819 541028 564966 562687 573914 557703
4582E57703J8075k3686L4877j5925l997J2722k8875K9865K8038L893m3052J7416
$$ 557703 575778 552092 586969 571044 567047 579769 550894 580759 608797 612690 569638 587054
4570E87054J0548j432K8281M5672k8070P815k0332l296L0809K7482j0381n851
$$ 587054 597602 596170 624451 670123 642053 649868 629536 626240 657049 684531 674150 668299
4558F68299j6534p17L6705K1222j8097K6278L3843K2106j9721L1816n37L2714
$$ 668299 651765 651048 687753 708975 690878 717156 750999 773105 753384 785200 784663 817377
4546H17377j7426o220K6801l2206J5830k8082L6587K457N7475j5445J1889K4968
$$ 817377 799951 793731 820532 788326 804156 776074 812661 815118 872593 857148 869037 894005
4534H94005j2929K4173l4847M4759l4061k3851K2182O1400J7824m7984N0306P046
$$ 894005 881076 905249 870402 915161 881100 857249 879431 940831 958655 910671 960977 968023
4522I68023J3255J6581Q185k5010j7148J8108l782M9748N491K3742P065L2326
$$ 968023 981278 997859 1006044 981034 963886 981994 978212 1027960 1033451 1057193 1064258 1096584
4510A096584J9341P1149P302L9252M1255J7521L2960j2038K5712M8066J2954q64
$$ 1096584 1115925 1187074 1194376 1233628 1274883 1292404 1325364 1313326 1339038 1387104 1400058 1399194
4498A399194P1795M7802p181L6759O0552p196N8654M1486j0497O0904L6987J2031
$$ 1399194 1470989 1518791 1511610 1548369 1608921 1601725 1660379 1701865 1691368 1752272 1789259 1801290
4486A801290K7037P4220J1219L7318M591N1015M4150K3654P459M5729M2479Q9722
$$ 1801290 1828327 1902547 1913766 1951084 1955675 2006690 2050840 2074494 2081953 2127682 2170161 2259883
4474B259883M7764l0211Q1316L8415M3632J03573K9916P0866K1054P9481J24443
$$ 2259883 2307647 2277436 2358752 2397167 2440799 2544372 2574288 2645154 2666208 2745689 2870132
4463B870132R9464J01638M6358J50218R0977J37151J15806J37127J67700K40453
$$ 2870132 2969596 3071234 3117592 3267810 3358787 3495938 3611744 3748871 3916571 4157024
4453D157024K98520M28035O34685O04314N56597N08749M53893O26117J027097
$$ 4157024 4455544 4883579 5518264 6122578 6679175 7187924 7641817 8267934 9295031
4444I295031K460555L957295M052288K783606J345006l47274j606915k696907
$$ 9295031 11755586 15712881 19765169 22548775 23893781 23546507 21939592 19242685
4436A9242685k914056k340587j820265j506273j154590p45570l94359k06344j71766
$$ 19242685 16328629 13988042 12167777 10661504 9506914 8761344 8366985 8160641 7988875
4427G988875j84334j58995o0486q0767k2084M5005J74641J87592K56045K43564
$$ 7988875 7804541 7645546 7585060 7504293 7482209 7527214 7701855 7889447 8145492 8389056
4417H389056L12852K84822L02893M07919M47716L93989K45118K22535J85573L97459
$$ 8389056 8701908 8986730 9289623 9697542 10145258 10539247 10784365 11006900 11192473 11589932
4407A1589932P70090Q23874P93120N22908L13140J02956j43914r7011P4116K93310
$$ 11589932 12360022 13183896 13977016 14499924 14813064 14916020 14772106 14675095 14749211 15042521
4397A5042521L49710O45248P77665J035624J245499J555596J900500K307404K954262
$$ 15042521 15392231 16037479 16815144 17850768 19096267 20651863 22552363 24859767 27814029
4388B7814029L697754M340805M762377N415298O695800R583674J8029611L9139553
$$ 27814029 31511783 35852588 40614965 46030263 52726063 62309737 80339348 119478901
4380A19478901N7049739N7564159M0385576K1279972m569210k2512569l8838569
$$ 119478901 176528640 234092799 274478375 295758347 291189137 268676568 229837999
4373B29837999m0819884l5539478k8853219k4621827j9938367j5587221j0983631
$$ 229837999 189018115 153478637 124625418 100003591 80065224 64478003 53494372
4366E3494372q170532o421398m977175l767021k976906k444928k108031j783418
$$ 53494372 45323840 38902442 33925267 30158246 27181340 24736412 22628381 20844963
4358B0844963j605398j362581j295635j025223q92635q50614p04031o46646n45509
$$ 20844963 19239565 17876984 16581349 15556126 14663491 13812877 13108846 12462200 11916691
4349A1916691n10371m75488m21025l51272l72922l26671l21485k40985k44830
$$ 11916691 11406320 10930832 10509807 10158535 9785613 9458942 9137457 8896472 8651642
4340H651642k49460j47720j66486j948K00280K58947K65870P8793j01021k36289
$$ 8651642 8402182 8254462 8087976 8086028 8286308 8545255 8811125 8889918 8788897 8552608
4330H552608l78576m37344m22900m95926m11237k96292l52832k57078k68255k10582
$$ 8552608 8174032 7736688 7313788 6817862 6406625 6110333 5757501 5500423 5232168 5021586
4320E021586j95133j77653j63130j45666q3918j39411p8680q0397j03097j09692
$$ 5021586 4826453 4648800 4485670 4340004 4256086 4116675 4037995 3957598 3854501 3744809
4310C744809o1216k3639L8149J22005Q2468O0759n839q0581j71586k04224j73089
$$ 3744809 3683593 3659954 3698103 3820108 3902576 3963335 3957496 3876915 3705329 3501105 3328016
4299C328016j70626j74155j29578j37333n1905j17717r6000l1281m8073n9861
$$ 3328016 3157390 2983235 2853657 2716324 2664419 2546702 2450702 2419421 2371348 2311487
4289B311487m5789l9604l7055m4513r2238K0275r2408j3138q174q5985k011p9332
$$ 2311487 2265698 2226094 2189039 2144526 2052288 2072563 1980155 1967017 1958843 1872858 1870847 1791515
4277A791515j5595m3751P309m3618k8515p5893J1291n0294o5592k5930m1867L192
$$ 1791515 1775920 1732169 1739478 1695860 1667345 1591452 1602743 1552449 1486857 1460927 1419060 1422252
4265A422252j7879o373l8295k8895l2519m5128o278j4690k8526Q409n5831p2554
$$ 1422252 1404373 1398000 1359705 1330810 1298291 1253163 1246885 1232195 1203669 1212078 1156247 1083693
4253A083693K4464l5803r067k3979n3842k1436n308k4817J9628J9572l8632L2371
$$ 1083693 1108157 1072354 1063287 1039308 985466 964030 958722 933905 953533 973105 934473 966844
4241I66844k3765J2782m5984n842K2775j5732k6116n2492j5903l0216P191o9147
$$ 966844 943079 955861 909877 904035 926810 911078 884962 832470 816567 786351 793542 724395
4229G24395j5866L5289k5492N370m8356K8304l0740k1506K32m3758J801O523l6856
$$ 724395 708529 743818 718326 723696 675340 703644 672904 651398 651630 607872 609673 616196 579340
4216E79340K9101o262l5006K7336o0693k9564L1011n6866R485M7901k4225n9420
$$ 579340 608441 602179 567173 594509 533816 504252 535263 478397 487882 535783 511558 452138
4204D52138M676J4150R730K745r910M4608J5387k0143l3393L7132m1599l33L8222
$$ 452138 456814 470964 480694 483439 473529 518137 533524 513381 479988 517120 475521 475188 513410
4191E13410k1662J1179J6087m7134k4J5617K804r955K7507m8222j5493m1480m5935
$$ 513410 491748 502927 519014 471880 471856 487473 490277 480322 507829 459607 444114 402634 356699
4178C56699M0276M7537m571m0660J9408N4724p7365j3141J2288L6050j4928l4745
$$ 356699 396975 444512 439941 399281 418689 473413 396048 382907 395195 431245 416317 381572
4166C81572r535Q080j9663K092r000J0974L6874l2107J8248j3150P720l735r105
$$ 381572 372037 380117 360454 362546 353546 364520 401394 369287 387535 374385 382105 378370 369265
4153C69265K8636k831o11N359J7162r980Q569l6946L7771L2674J9653l5966p170
$$ 369265 397901 395070 394459 399818 416980 407000 415569 378623 416394 449068 468721 432755 425585
4140D25585l465L8229L6122R190R077M8292P4078R5940J52983J31949K16443K17596
$$ 425585 422120 460349 496471 505661 514738 563030 637108 733048 886031 1017980 1234423 1452019
4128A452019J58388P3693j9456n4390j23015j19345j99988j52358j61793q8716
$$ 1452019 1610407 1684100 1664644 1610254 1487239 1367894 1167906 1015548 853755 765039
4118G65039p2259r1423j2693m6242j2251k9154q3462L680K2616n93m2509j4192
$$ 765039 692780 601357 588664 542422 530171 501017 417555 421235 443851 443258 400749 386557
4106C86557m6412J5867O689j3482M823j3217L0687k8804R614J0001O687n548K65
$$ 386557 340145 356012 362701 349219 354042 340825 371512 342708 352322 362323 369010 363462 363727
4093C63727j3683K9079m3010K7122J2925l9854N2396j7191l5120O445j1176k175
$$ 363727 350044 379123 336113 363235 376160 336306 388702 371511 336391 342836 331660 329485
4081C29485Q784K2916l2779L3141k4584r062M9095l0551m0338J3546J6850J1937
$$ 329485 338269 361185 328406 361547 336963 327901 376996 346445 306107 319653 336503 348440
4069C48440K3120j6039K214K8964l9200k265L6270k386K6853J085R0419j2514
$$ 348440 371560 355521 357735 386699 347499 345234 381504 379118 405971 407056 497475 484961
4057D84961j5175j9788n221j5669Q715j6283p6950O7369m9372p180p655J000L1820
$$ 484961 469786 449998 444777 429108 437823 421540 344590 411959 362587 355407 347752 348752 380572
4044C80572N50q222J8542L321q344l3021M1618o175J2087l378k1285K3461l301
$$ 380572 381122 372900 391442 394763 386419 353398 395016 388841 400928 397550 376265 399726 396425
4031C96425l2552N190n111k4317j3244q379k3794O1990m1068j0469o287K725R22
$$ 396425 363873 369063 363952 339635 326391 318012 294218 356208 315140 304671 298384 301109 302031
4018C02031R149J5219J7532P116m6182L4883l840q896L443L6706L2727m4476j4565
$$ 302031 311180 326399 343931 351047 304865 339748 335908 327012 330455 367161 399888 355412 340847
4005C40847N068l3990J085J2998K5143l1704l7174O25L008R136J7121J0441L3835
$$ 340847 345915 311925 313010 326008 351151 319447 282273 282898 285906 295042 312163 322604 356439
3992C56439K6124k120j241j7941L6821k8590K533n2613J9483l1052o4343m190
$$ 356439 382563 380443 379202 361261 398082 369492 372025 319412 338895 307843 243500 239310
3980B39310n009J045j4642o981j7511R368J2534n4985K0052k7693p60p24J4502
$$ 239310 234301 235346 220704 213723 196212 205580 218114 163129 183181 155488 154728 154004 168506
3967A68506k5236J2061J081l9010K1552J2318j1974N110o6561K5602Q420L872
$$ 168506 143270 155331 156412 117402 138954 151272 139298 144408 77847 103449 111869 115741
3955A15741k7400l177L9805m1405J3577k0103K7605O61k0682L4512j4369K4564
$$ 115741 88341 85164 124969 83564 97141 77038 104643 105304 84622 119134 104765 129329
3943A29329j01486M4087L0316l6362J6657m6187M8653K5935j8775J9299n2241
$$ 129329 27843 71930 102246 65884 82541 36354 85007 110942 92167 111466 59225
3932E9225K9081k2626l2061J2502K5943K424k7426J3647j7495L1135l6334k2335
$$ 59225 88306 65680 33619 46121 72064 74488 47062 60709 43214 74349 38015 15680
3920A5680M0803K171O190l9370L5167j1988o863J3087j1257J1585k1050J1025
$$ 15680 56483 58654 64844 25474 60641 48653 41790 54877 43620 55205 34155 45180
3908D5180K0855n0511M2021j5330q673K8742J9503m2514J9435J0066O650l3141
$$ 45180 66035 15524 57545 42215 33542 62284 81787 39273 58708 68774 75424 42283
3896D2283j5221O003J9066J3737m2260K5233O956J0231k7616M5328o5549j0844
$$ 42283 27062 33065 52131 65868 23608 48841 55797 66028 38412 83740 18191 7347
3884G347O3921k6717K3411l7369k255N387l9731O6817j7448J1650J2900k2417
$$ 7347 71268 44551 67962 30593 28338 33725 -6006 60811 43363 55013 67913 45496
3872D5496o297l5013O4249m8247Q832O813N333j0793j3543J2474r655K8602j1451
$$ 45496 39199 4186 68435 20188 29020 35833 41166 30373 16830 29304 19649 48251 36800
3859C6800j3604M2591m4721Q90j9358M9756J0755k1164m0570N589L2152j2926
$$ 36800 23196 65787 21066 21956 2598 52354 63109 41945 1375 6964 39116 26190
3847B6190K0362j0331M1110l8075K5803l1706l360M304l4101N5636m0228J3656
$$ 26190 46552 36221 77331 39256 65059 33353 29993 34297 196 55832 15604 29260
3835B9260J4686l6733m373L192K1974P681R41l1311J7315k3792J5741L008J5877
$$ 29260 43946 7213 2840 6032 28006 35687 36628 5317 22632 -1160 14581 17589 33466
3822C3466j4184j9514q204K4718j2172j0484k2645M5817J1819K4057l7210j6161
$$ 33466 19282 -232 -8436 16282 4110 -6374 -29019 16798 28617 52674 15464 -697
3810f97K9783N056k6197o616R037O778K403k2727k1613N3409l8855q241P2769
$$ -697 29086 34142 7945 1329 10366 17144 19547 -3180 -24793 28616 -10239 -18480 54289
3797E4289r564j0996l3570m144o995R147r189M1052K0145k9619k4194j7553M9605
$$ 54289 44725 33729 159 -3985 -10980 -1833 -11022 30030 50175 20556 -3638 -21191 28414
3784B8414M5724l1688r624m4062K7053j5163J7282J040n349J0795L6028m5475
$$ 28414 74138 42450 32826 -11236 15817 654 17936 18976 13627 24422 60450 14975
3772A4975j6543k3345K8368K074J3241o049p055q865Q533L3033k0956j728N223
$$ 14975 -1568 -24913 3455 5529 18770 12721 5666 -3199 5334 38367 17411 15683 20906
3759B0906n120j7573P13L6421L292J0202n6979N036J9969Q165L5751l7456K827
$$ 20906 15786 -1787 -1074 35347 38639 48841 -8138 -3102 16867 25032 60783 23327 26154
3746B6154n248k8049K3067K8815k0365k5177L4032j5862J3917k3452J0215p893
$$ 26154 20906 -7143 15924 44739 24374 -803 33229 17367 31284 7832 18047 10154
3734A0154J9110k2216k1918J1289j3895M5210k9696M6927p402j7716m1340O071
$$ 10154 29264 7048 -14870 -3581 -17476 27734 -1962 44965 37563 19847 -21493 -15422
3722a5422M0514k3437J2465j7777J2444R479j4140Q126k227J6571m5534L5849
$$ -15422 25092 1655 14120 -3657 8787 18266 4126 12252 10025 26596 -18938 16911
3710A6911j3285k076p773K3671m951K8707O573p6561J0193n054M470J2463K1117
$$ 16911 3626 1550 -6223 17448 12497 41204 47777 -28784 -18591 -23645 -19175 -6712 14405
3697A4405k6730L0574l574m9085K6696R380O301k482m6098K5943K2129J7514l7382
$$ 14405 -12325 18249 14675 -34410 -7714 1666 7967 5485 -40613 -14670 7459 24973 -12409
3684a2409j3535O0094p1874K7527L624M8070K056l8581j3413k1460N6696m4624
$$ -12409 -25944 34150 -37724 -10197 -6573 41497 43553 4972 -8441 -29901 26795 -17829
3672a7829K8608j2139J699J4364p1615O4033l1595K8912M188L036k6945q393m770
$$ -17829 10779 -1360 339 14703 -56912 7121 -24474 4438 8626 11662 -15283 -23676 -28446
3659b8446m66L8719j6094M630P94j574O102j1706J5094J2471M8932o8174j584
$$ -28446 -28912 9807 -6287 -1657 -863 -2437 3665 -8041 7053 19524 68456 282 -1302
3646a302J1682k6930L2280j8043j3911O3362m8245j8889L2633m3258J8886M8034
$$ -1302 10380 -16550 15730 -2313 -16224 47138 -1107 -19996 12637 -30621 -11735 36299
3634C6299l5337K642Q956N717m9751J3255N148L4837q149k6199O026K3227o0093
$$ 36299 962 3604 12560 18277 -31474 -18219 -13071 21766 13617 -12582 -6556 16671 -43422
3621d3422L3729P2342p5778K5026J3926k6240J1648l1142k800N0456o860j3744
$$ -43422 -9693 62649 -13129 11897 25823 -417 11231 -19911 -22711 27745 20885 7141
3609G141J0573k4166j4937K7974j5082R730k01K0832j8563k6764K4756m9317N7687
$$ 7141 17714 -6452 -21389 6585 -8497 1233 1032 21864 3301 -23463 1293 -48024 9663
3596I663K322j0181k5287k93K9672j3285J789J9769m666K6104p5578L773L543
$$ 9663 11985 1804 -23483 -23776 5896 -7389 -5600 14169 9503 35607 -39971 -36198 -32655
3583c2655L2722k7754L8370k1608r224Q994k5285K7577O695m3491O4584l768m065
$$ -32655 67 -27687 10683 -10925 -20149 -11155 -36440 -8863 -2168 -45659 18925 15157 11092
3570A1092J5686l8047o41j9035M3080l1050K7946k9321m62M445O65J7930L948
$$ 11092 26778 -11269 -11910 -30945 12135 -18915 9031 -20290 -20752 -16307 -15642 2288 6236
3557F236m8587L9183k6050M4975l7951K6503k8341N8015l3274m6095P7682o5398
$$ 6236 -42351 -3168 -29218 15757 -22194 4309 -24032 33983 709 -45386 32296 -33102
3545c3102K6833J766j8411N1151l0454L849m6021O6007k6907M769J9908l3882
$$ -33102 -6269 -4503 -22914 28237 -2217 1632 -44389 21618 -5289 -520 19388 -14494
3533a4494K7635j5966k3930K3039N272J1144m8469P1679m8883m746N651j5777
$$ -14494 13141 -2825 -26755 -3716 1556 12700 -35769 35910 -12973 -17719 -12068 -27845
3521b7845P5551o0127J6493j8152K2930m9852L7557J8854n6925L5539l7395N4982
$$ -27845 47706 -12421 4072 -14080 8850 -41002 -3445 15409 -41516 -5977 -43372 11610
3509A1610k6314m135J0814N800K9135k3095o287j9681k433J2342m378L261K3767
$$ 11610 -14704 -18839 -8025 -2225 26910 3815 -2472 -22153 -24586 -12244 -16622 -13361 10406
3496A0406o789q391j7015j1876M7242J7007k2071j6402N60l2871M6684L1261o2871
$$ 10406 3617 -4774 -21789 -33665 13577 30584 8513 -7889 -7329 -40200 6484 37745 -25126
3483b5126p65K7357l5016M8796j8452l0920K4415m531M7208o189l4311m5653O5882
$$ -25126 -25891 1466 -33550 15246 -3206 -34126 -9711 -14242 32966 26777 -7534 -53187 12695
3470A2695m4027J6228J1277r368j9905L8263k3442k57J2549j0070K1847k4991
$$ 12695 -31332 -15104 -3827 -13195 -33100 5163 -18279 -18536 -5987 -16057 5790 -19201
3458a9201j4203K8918M417m1022L1268p2j7595K0713k999k7501K4938k7643M1798
$$ -19201 -33404 -4486 -69 -41091 -9823 -9895 -27490 -6777 -9776 -37277 -12339 -39982 1816
3445A816R04k8199j6543M613K6962q385L7221n8559M2192j8408j1663M3140q143
$$ 1816 2720 -25479 -42022 -37409 -10447 -18832 18389 -40170 2022 -16386 -28049 15091 6948
3432F948j5824m56K0579m6246L8854k4298J6422J8203r328j1101r058J6880l2354
$$ 6948 -8876 -9332 11247 -34999 3855 -20443 -4021 14182 4854 -6247 -15305 1575 -30779
3419c0779j5361O9307o88j8611k2219J7865J11m4515K4494O0129j3927j0937l7030
$$ -30779 -46140 23167 22479 3868 -18351 -486 -375 -44890 -20396 39733 25806 14869 -22161
3406b2161J6559J5557P682n3067M8550M5555m2044r710J0184j3494R115K7057
$$ -22161 -5602 9955 17637 -35430 13120 58675 16631 6921 17105 3611 12726 39783
3394C9783k5641K0425L3410k8769j6481J4920m241l6031N801j1P611o038o140
$$ 39783 14142 34567 67977 39208 22727 37647 33406 -2625 3176 3165 10776 4738 -1402
3381a402k3204L6330K0660l4185K387J7990k365j1871l6624r112M4243Q892m3441
$$ -1402 -24606 11724 32384 -1801 586 18576 16211 4340 -32284 -41396 2847 11739 -31702
3368c1702J3380j2555J4905r341o846J7115M5125j6965p746o438J716n343l315
$$ -31702 -18322 -30877 -15972 -25313 -32159 -15044 30081 13116 5370 -1068 648 -4695 -8010
3355h010N390P858K0613n0663j226M5676l4848J7787P589M421K1980N312l8966
$$ -8010 -2620 5238 25851 -24812 -26038 19638 -15210 2577 10166 14587 36567 41879 2913
3342B913L8890k7484M7012L5604M5077O1243P2517M193m8695K8114l8816m6708
$$ 2913 41803 14319 61331 96935 142012 203255 275772 279965 231270 259384 220568 173860
3330A73860m9033k4298k4974m3009J2872k7728K8782k9852j7690R644K3201l3494
$$ 173860 124827 100529 75555 32546 45418 17690 46472 16620 -1070 8574 31775 -1719
3318a719O145j0374K7586L494j5479J9318k3471j0704K3797k2110j9652M6989
$$ -1719 4426 -5948 21638 25132 9653 28971 5500 -5204 18593 -3517 -23169 23820
3306B3820m3685P988l890L466J6803j1955J2952r0r93J1821l5724L1511m9836
$$ 23820 -19865 -11877 -15767 -12301 4502 -7453 5499 5409 4416 16237 -19487 12024 -37812
3293c7812R918J8839K0776L71L295q997p162R861l0185J5117M000q875K8577l5037
$$ -37812 -27894 -9055 11721 12092 15387 6390 -772 9089 -21096 -5979 -1979 -10854 17723 -17314
3279a7314k204N697R121m5961N9643j3929m2598L7484q344J4319O171j6400K4641
$$ -17314 -19518 -13821 -4700 -50661 8982 -4947 -47545 -10061 -18405 -4086 2085 -14315 10326
3266A0326J8839l8980k9535O3382n4492j2049J0754K454J7074L9778m0190K4882
$$ 10326 29165 -9815 -39350 24032 -30460 -42509 -31755 -29301 -12227 27551 -12639 12243
3254A2243j5868p041J4120j5881p686q938K7256l8543K1592L8895n0252K4589
$$ 12243 -3625 -10666 3454 -12427 -20113 -29051 -1795 -40338 -18746 20149 -30103 -5514
3242e514j1164K2226k3402O544l7201K4340K9081m7162J8792p868L707R403j1710
$$ -5514 -16678 5548 -17854 -11310 -48511 -24171 4910 -42252 -23460 -31328 -27621 -18218 -29928
3229b9928O489J0342J3607l0690L832r720K6107J7228m3328J7824j1460J816L288
$$ -29928 -23439 -13097 510 -30180 -26348 -36068 -9961 7267 -36061 -18237 -29697 -27881 -24593
3216b4593P213j3312J9037o047O165J9909j6648n4837L4377M968J0935n227J3360
$$ -24593 -17380 -30692 -11655 -17702 -11537 8372 -8276 -63113 -28736 -23768 -12833 -18060 -4700
3203d700l5037j1209K6820J3721K0409k242p441j3517j7737J2152O16n236j9752
$$ -4700 -39737 -50946 -24126 -10405 10004 7762 321 -13196 -30933 -18781 -18165 -23401 -43153
3190d3153N3321j1672m687j8528J5060J2596k0628L3451m2563K6917j1008j0580
$$ -43153 10168 -1504 -6191 -24719 -9659 2937 -17691 15760 -26803 114 -10894 -21474
3178b1474J6070j8647N1908m6605M255j7261J1159N01K8493k9131q891K7097L778
$$ -21474 -5404 -24051 27857 -18748 -14493 -31754 -20595 -20094 8399 -20732 -29623 -2526 1252
3165A252K4133j1949m081l8417r373O730L1029k0592L8560k2266k4035L3057l8542
$$ 1252 25385 13436 9355 -29062 -38435 -31705 -676 -21268 17292 -4974 -29009 4048 -34494
3152c4494K5937K9425k7794o122J2068k6232j3136O775J3275k3554L9617k9542
$$ -34494 -8557 20868 -6926 -13048 -980 -27212 -40348 -33573 -20298 -43852 -4235 -33777
3140c3777r255O9961o3268L2182Q519j3503O373k4426m1119O4535j2434l311p707
$$ -33777 -43032 26929 -36339 -4157 4362 -9141 -2768 -27194 -68313 -3778 -16212 -19523 -27230
3127b7230k7018N7301j6875L17L458l679N125k5802M9282l8105r591M923k0300
$$ -27230 -54248 3053 -13822 -13505 -10047 -13726 -8601 -34403 14879 -23226 -32817 -27894 -48194
3114d8194J2399N0047m2294m6709J01520m9245K4449k5287r161M6785j7961l8250
$$ -48194 -35795 14252 -28042 -74751 26769 -22476 1973 -23314 -32475 14310 -3651 -41901
3102d1901K7099J1418j1068r079j9594L5730j2320r482J5834J4807L0107k1197
$$ -41901 -14802 -3384 -14452 -23531 -43125 -7395 -19715 -29197 -13363 1444 31551 10354
3090A0354M202k6654l911j0664k1934J2500R3139n3541l5296q396K3046k412J5219
$$ 10354 14556 -12098 -16009 -26673 -48607 -36107 57032 3491 -31805 -40201 -17155 -19567 -4348
3077d348k2658K0562N507m6296K9191J4158k39j5368J2969m0831K2359K1472j1618
$$ -4348 -27006 -6444 -937 -47233 -18042 -3884 -4123 -19491 -6522 -47353 -24994 -3522 -15140
3064a5140J9900p846J9583j5538j6705l7599K9417J0329j4008P605k500L1081
$$ -15140 4760 -3086 16497 959 -15746 -53345 -23928 -13599 -27607 -20002 -22502 8579
3052H579l7731k8845O5462j0898L3162p4064L5892j000K7783j8386o583J5033
$$ 8579 -29152 -57997 7465 -3433 29729 -44335 -8443 -9443 18340 -46 -6629 8404
3040H404R741n4640j1938M0483n5021M2332n340k689N0813l9231k8246J5443J4410
$$ 8404 18145 -36495 -48433 -7950 -62971 -20639 -25979 -28668 22145 -17086 -45332 -29889 -15479
3027a5479J9715j1654l6785j693L8658M661k6525q59J9254j357J5977k538k3370
$$ -15479 4236 -7418 -44203 -45896 -7238 -2577 -29102 -29961 -10707 -12064 3913 1375 -21995
3014b1995j516k74j7972L6373k0744J9590k9929k279j8593L3222J2358K0182l1940
$$ -21995 -23511 -23785 -41757 -5384 -26128 -6538 -36467 -38746 -57339 -24117 -11759 8423 -23517
3001b3517K2820l3m3505K9947N788j7708l573r865Q648q719K5436j7116p059j3984
$$ -23517 -697 -730 -44235 -14288 -8500 -26208 -29781 -39646 -30998 -39717 -14281 -31397 -38456 -52440
2987e2440L4446j1397P246j571L7465l5047m965p963K4999l6792L5345k6611K5904
$$ -52440 -17994 -29391 -22145 -23716 13749 -21298 -26263 -34226 -9227 -46019 -10674 -37285 -11381
2974a1381k3683N210J5018N184j7146J3753k3280l749J1381J1971j7331J6626
$$ -11381 -35064 -29854 -14836 -9652 -26798 -13045 -36325 -40074 -28693 -16722 -34053 -17427
2962a7427J6282Q595m3255J0336K4374j2392J0268k6369J1595j0860k1972O391
$$ -17427 -1145 7450 -35805 -25469 -1095 -13487 -3219 -29588 -17993 -28853 -50825 -44434
2950d4434L4666O909j6937j6360L3309j8029K9041j163k7182R667L07l3585K4492
$$ -44434 -9768 -2859 -19796 -36156 -2847 -20876 8165 7002 -20180 -10513 -10206 -43791 -19299
2937a9299n318j794J5476j2990k6423L9352l0169K3484L277J5832j1602J024m086
$$ -19299 -24617 -26411 -10935 -23925 -50348 -10996 -41165 -17681 -14404 1428 -10174 -9150 -13236
2924a3236r579J1916L917O121R861l7772K3618j6491j9110K192N3790l3371P262
$$ -13236 -22815 -10899 -6982 -861 9000 -28772 -5154 -21645 -40755 -38563 15227 -18144 -10882
2911a0882Q490m398j9308o95j2677L729O1947o4823J1736R69J7608j8661L815
$$ -10882 -2392 -6790 -26098 -26793 -39470 -35741 26206 -38617 -26881 -25912 -8304 -26965 -23150
2898b3150K8952k462J7164r3530M5396J5658j7714j6438L0270R003l7218O7849
$$ -23150 5802 3340 20504 -73026 -27630 -11972 -29686 -46124 -15854 -6851 -44069 23780
2886B3780o2687M8552m3413J4121q495J8365J4280k8671j8693m690M3752j2640
$$ 23780 -38907 9645 -33768 -19647 -28142 -9777 4503 -24168 -42861 -47551 -3799 -16439
2874a6439j1099P491k3464K8040n129K4262r516k0873N869l5421P6766m0977k0722
$$ -16439 -27538 -20047 -43511 -15471 -20600 3662 -5854 -26727 -20858 -56279 20487 -20490 -41212
2861d1212j3786J6671J4937M5668k9369J653k4177l0193K7234J2084O093J7838
$$ -41212 -54998 -38327 -23390 22278 -7091 -5438 -29615 -59808 -32574 -20490 -14397 3441
2849C441j9796j2692k523p999m93K0653J4033l8517N2541m9498K807Q804J5480
$$ 3441 -16355 -29047 -31570 -39569 -40062 -19409 -5376 -43893 8648 -40850 -38043 -29239 -13759
2836a3759K9414o5972M2293j5828K754j0695J1963K9591l9987N9427n6352P758
$$ -13759 15655 -50317 -8024 -23852 -21098 -31793 -19830 9761 -30226 29201 -27151 -19393
2824a9393J6552l201l7469L9159O439n5716L7908K5546m7298K4327k3246K7978
$$ -19393 -2841 -6042 -43511 -4352 2087 -53629 -15721 9825 -37473 -13146 -36392 -8414
2812h414J9923n7906K4774j9590K8474j7938M5969m1377j9803K6393M173o726
$$ -8414 11509 -46397 -21623 -41213 -12739 -30677 15292 -26085 -45888 -19495 -15322 -22048
2800b2048N680o476L053j2057p936L3940j5710k0953M0545L938n8036J2857K1415
$$ -22048 -16368 -22844 -19791 -31848 -39784 -5844 -21554 -42507 -1962 1976 -56060 -43203 -21788
2787b1788p103J2822m7614J2186J2274J4774j438j8544k65L9245j1535o885j0276
$$ -21788 -28891 -16069 -63683 -51497 -39223 -24449 -25887 -44431 -44696 -5451 -16986 -23871 -34147
2774c4147O933M1775n1499K763J9301j8727o739J7927L3302n6966J7707J1098
$$ -34147 -27214 14561 -36938 -34175 -14874 -33601 -40340 -22413 10889 -46077 -28370 -17272
2762a7272j0628M2442m2015p602K9113l5114N876L1873m9365j6521O2426k9440
$$ -17272 -27900 14542 -27473 -35075 -5962 -41076 -35200 -3327 -52692 -69213 -6787 -36227
2750c6227K0933K0825k6451J3819j8630O79K1110k4055l0075M0329K8542j1792
$$ -36227 -15294 5531 -20920 -7101 -25731 -25052 -3942 -27997 -58072 -17743 10799 -993
2738i93j8783J8379J1905l5052M750K3166j4058k27k7563J1658l2384K3892L1464
$$ -993 -19776 -1397 10508 -24544 -19794 3372 -10686 -10913 -38476 -26818 -59202 -35310 -3846
2725c846l3884J0569L7481n8678K8290L369K945K0224k0286k9928L7710l1454
$$ -3846 -37730 -27161 10320 -48358 -20068 -16699 -13754 6470 -13816 -43744 -6034 -37488
2713c7488K5779J7874m9172M9829m2503q312L0182M560n502K2042k9149p568K2409
$$ -37488 -11709 6165 -43007 6822 -35681 -43993 -13811 -9251 -14753 7289 -21860 -29428 -7019
2700g019P974n2128O0656j0447l9730R468R854r251K6592m0619L2626K2369m5315
$$ -7019 955 -51173 9483 -964 -40694 -31226 -21372 -30623 -4031 -44650 -12024 10345 -34970
2687c4970J3079K4037l3298R362L0283m0862K3868l1338K3906j7259M569M0285
$$ -34970 -21891 2146 -31152 -21790 8493 -32369 -8501 -39839 -15933 -33192 -28623 11662
2675A1662n8241J4281J7940r247r908L9798k5122J4079l8971o757J5876J7300
$$ 11662 -46579 -32298 -14358 -23605 -33513 6285 -18837 -4758 -43729 -50486 -34610 -17310
2663a7310n511l2486L6859K9008j8459j5402J6403j3401k201l6064K7884K9388
$$ -17310 -22821 -55307 -18448 10560 -7899 -23301 -6898 -20299 -22500 -58564 -30680 -1292
2651a292l3515n494K2566R647k452m3843L51O1202k1123k7214K2968l5147L9696
$$ -1292 -34807 -40301 -17735 -8088 -10540 -54383 -54032 7170 -13953 -41167 -18199 -53346 -13650
2638a3650J7733l5776J3151j0567l184K154j8513L7617K920k3223o608j3836M9213
$$ -13650 4083 -31693 -18542 -29109 -32293 -30139 -48652 -11035 -8115 -31338 -37946 -51782 -2569
2625b569l4884J795J5502j8756K4557k6965M2162n0053j392J8756k0827J1648
$$ -2569 -37453 -35658 -20156 -38912 -14355 -41320 842 -49211 -50603 -31847 -52674 -41026
2613d1026L3779O050l8037O2474l5867j2299K5177r7976R4155p184o615j6646
$$ -41026 -7247 -1197 -39234 23240 -12627 -24926 251 -97725 -3570 -10754 -17369 -34015
2601c4015J9347K724j0584K0250k0320L8020k8114m0316J7535J7671j53k452J7701
$$ -34015 -14668 -11944 -22528 -2278 -22598 15422 -12692 -53008 -35473 -17802 -17955 -20407 -2706
2588b706m6358M4505r663n0321P5211n5609K9388L4392l1868K8712k7068l2297
$$ -2706 -49064 -4559 -14222 -64543 10668 -44941 -15553 18839 -13029 15683 -11385 -43682
2576d3682J8878J4327l6116K3468l625o432O830R414k1436J7933M972k1107J2991
$$ -43682 -24804 -10477 -46593 -23125 -26750 -33182 -26352 -16938 -38374 -20441 -15469 -36576 -23585
2563b3585J7228l6382J6146P026P912N151k4457p911J9974k1292O5068m7745p808
$$ -23585 -6357 -42739 -26593 -19567 -11655 -6504 -30961 -38872 -18898 -40190 24878 -22867 -30675
2550c0675j2364J8591n148K00K103R132k222k9693J9584K5004p532k1783N198
$$ -30675 -43039 -24448 -29596 -29396 -27293 -18161 -20383 -50076 -30492 -5488 -13020 -34803 -29605
2537b9605J3298k5324J9540p668m339J6316n7460P5761l5920j8924J2657K7347
$$ -29605 -16307 -41631 -22091 -29759 -34098 -17782 -75242 519 -35401 -54325 -41668 -14321
2525a4321J6257m3423K1655j2146j2096L3154K8420l2788m960K0776n4495J1391
$$ -14321 1936 -41487 -19832 -31978 -44074 -10920 17500 -15288 -20248 528 -53967 -42576
2513d2576J8665l7351O9204k7804M686P904k8664J3078m2031O7490j5165m022
$$ -42576 -23911 -61262 7942 -19862 -15176 -7272 -35936 -22858 -64889 2601 -12564 -16586
2501a6586l2025L9002P216l5552k218m207N8940n3886Q451l967K2843K7314o0640
$$ -16586 -48611 -9609 -2393 -37945 -40163 -44370 14570 -39316 -30865 -34832 -11989 15325 -45315
2488d5315L2661k2558R068K8301k8449k938K9710m8612j7743N2657K7866j5163
$$ -45315 -12654 -35212 -26144 2157 -26292 -29230 480 -48132 -65875 -13218 14648 -515
2476e15j9376J4336K4552l1177m5840P673J6899L560k0842L3055j441j2825K7199
$$ -515 -19891 -5555 18997 -12180 -58020 -50347 -33448 -29888 -50730 -17675 -19116 -31941 -4742
2463d742P59K3997k3503K3178l4956o8303N6467J7497m6221N317J7439o133N434
$$ -4742 -3983 20014 -3489 19689 -15267 -83570 -27103 -9606 -55827 -50510 -33071 -39204 -33770
2450c3770m931L5294R056j9462n0202K8473N4826n7736J6803K8623j9856j9748
$$ -33770 -38701 -3407 5649 -13813 -64015 -35542 19284 -38452 -21649 6974 -12882 -32630
2438c2630k1984n540K7111o763K9372j0989q526L956j8211K4347j2582j6064Q421
$$ -32630 -54614 -60154 -33043 -39806 -10434 -21423 -29949 -25993 -44204 -19857 -32439 -48503 -40082
2425d0082M589n1946O0953J2541j6317j8429M1217J9915K310k3266J0319K6155
$$ -40082 -35493 -87439 -26486 -13945 -30262 -48691 -7474 12441 14751 -8515 1804 27959
2413B7959j2006j0492j0949j5830k095l9072o911K8015L9928j8774l4092M1323
$$ 27959 15953 5461 -5488 -21318 -23413 -62485 -69396 -41381 -1453 -20227 -54319 -12996
2401a2996k8547N0887l2313p406L6170m4692M565j588K2866j7883L2569o3457
$$ -12996 -41543 9344 -22969 -30375 5795 -38897 -34332 -35920 -13054 -30937 1632 -61825
2389f1825J0924J8457J726l4351M941J9726K6392k9470J6511l719J3310o196j0287
$$ -61825 -50901 -32444 -30718 -65069 -60128 -40402 -14010 -43480 -26969 -30688 -17378 -23574 -33861
2376c3861L0333k4975K4858m0253J0944J223L2022o71j8288K6466k8672r621j1742
$$ -33861 -3528 -28503 -3645 -43898 -32954 -31731 291 -380 -18668 7798 -20874 -30495 -42237
2363d2237K2592K6518o4760O6216j5219J628j6035k6254J6285Q996L2564o6817
$$ -42237 -19645 6873 -57887 8329 -6890 -5262 -21297 -47551 -31266 -22270 10294 -56523
2351e6523K6821j9160K2200J3106l4226Q805M0585j7101J569k7229L3957l1370
$$ -56523 -29702 -48862 -26662 -13556 -47782 -38977 1608 -15493 -13924 -41153 -7196 -38566
2339c8566L2095k7024R259k3048j2252J5098L8766N153k1345m392k133L792O580
$$ -38566 -6471 -33495 -24236 -47284 -59536 -44438 -5672 -519 -21864 -26256 -28389 -24597 -18017
2326a8017l3025L0059q515k2028K9168J6649Q474m8588K0527m1412O0822q421
$$ -18017 -51042 -20983 -29498 -51526 -22358 -5709 2765 -45823 -25296 -66708 -5886 -14307
2314a4307k669R027j2443l2817L7721J787j9858J1331m799L196R419j1634m892
$$ -14307 -16976 -7949 -20392 -53209 -15488 -13701 -33559 -22228 -27027 -23831 -14412 -26046 -30938
2301c0938j2523K9444l3678J4905J0338r319J621K8547k5788l781K4507k2812
$$ -30938 -43461 -14017 -47695 -32790 -22452 -31771 -30150 -1603 -27391 -31172 -6665 -29477
2289b9477p560L1799j5484R383J6108j3231k6638J1947M2095m0721L5331j2509
$$ -29477 -37037 -5238 -20722 -11339 4769 -8462 -35100 -23153 18942 -21779 13552 1043
2277A043n8804N6999J6388k304n2281K0347r046L7715k1820k6707k1795N7733
$$ 1043 -57761 -762 15626 13322 -38959 -18612 -27658 10057 -11763 -38470 -60265 -2532
2265b532r169k7195j9823N0033o3729j924K0067K4783L2540n677j3163k1987j0097
$$ -2532 -11701 -38896 -58719 -8686 -72415 -74339 -54272 -29489 3051 -2626 -15789 -37776 -47873
2252d7873m997K7621K2925l0524O635k2454K7270N900l5368M3479J0939j7882
$$ -47873 -52870 -25249 -2324 -32848 -26213 -48667 -21397 -15497 -50865 -7386 3553 -14329
2240a4329J3207m7879q445K8187M0388j7499j4540j4846j337K5434l4016J5400
$$ -14329 -1122 -49001 -57446 -29259 11129 -6370 -20910 -35756 -37093 -11659 -45675 -30275
2228c0275K8503l3513l947Q495j1726K0500M0374m4552j6036L1309j9271j2495
$$ -30275 -1772 -35285 -39232 -30737 -42463 -21963 18411 -26141 -42177 -10868 -30139 -42634
2216d2634K9727J0651j1787k3873j6072J3496L7038l7805M0965l1200J3226J9471
$$ -42634 -12907 -2256 -14043 -37916 -53988 -40492 -3454 -41259 -294 -31494 -18268 1203
2204A203p5401Q197L9994P372j8279K1609l2639L0190k8503Q463L8727o815k5357
$$ 1203 -74198 -66001 -26007 -18635 -36914 -15305 -47944 -17754 -46257 -37794 933 -5882 -31239
2191c1239J8754j843O284r723l9305j4156O2216l8709J9404L173L4750j9916k2048
$$ -31239 -12485 -14328 -8044 -17767 -57072 -71228 -9012 -47721 -28317 -25144 9606 -10310 -32358
2178c2358k2983K6652J4253j8127j8989K7654k593p915J7531k3518L6016j3373
$$ -32358 -55341 -28689 -14436 -32563 -51552 -23898 -26491 -34406 -16875 -40393 -4377 -17750
2166a7750k8043K1393l7980L5828N450j5809J370K5127n1451j5272L6304J3709
$$ -17750 -45793 -24400 -62380 -26552 -21102 -36911 -35541 -10414 -61865 -77137 -40833 -27124
2154b7124J7753p450p140L268J5868j8809j4124L563L459L3828k6442r954J7057
$$ -27124 -9371 -16821 -23961 -20693 -4825 -23634 -37758 -34195 -30736 3092 -23350 -33304 -16247
2141a6247o713p046m998K5811J1522k5106Q767j7975R173j7300J8318n769Q99
$$ -16247 -22960 -30006 -35004 -9193 2329 -22777 -14010 -31985 -22812 -40112 -21794 -27563 -26664
2128b6664k5996j004J6480J3890j9205J6684P136k0773R065J0814j8620L572R900
$$ -26664 -52660 -53664 -37184 -23294 -42499 -25815 -18679 -39452 -30387 -19573 -38193 -34621 -24721
2115b4721j6577J1217K9705O260m6381J0919J3635j1116R795k309m758J9115m3343
$$ -24721 -41298 -30081 -376 5884 -40497 -29578 -15943 -27059 -17264 -19573 -24331 -5216 -48559
2102d8559K1099j6476J4908M208j1062J6249J0794J718l9124K7587K4581k5453
$$ -48559 -27460 -43936 -29028 -24820 -35882 -19633 -8839 -7121 -46245 -18658 5923 -19530
2090a9530l2383L7231j0271O130j4967J7441K7969l6920j5983K3867J2932l2453
$$ -19530 -51913 -14682 -24953 -18823 -33790 -16349 11620 -25300 -41283 -17416 -4484 -36937
2078c6937R309K3554o49j6557j3401j0418M3529k5298J5689m7639M6917k3609
$$ -36937 -27628 -4074 -4723 -21280 -34681 -45099 -1570 -26868 -11179 -58818 -11901 -35510
2066c5510l5760L9642p870M6581j4526L337j2948m0441P5320n3357M5926m2079
$$ -35510 -71270 -31628 -39498 7083 -7443 -4106 -17054 -57495 17825 -35532 10394 -31685
2054c1685j9391J352J6189L1581j1519K3263o0294J0823k334M01J5076k1708L9602
$$ -31685 -51076 -49724 -33535 -1954 -13473 9790 -50504 -39681 -42015 -41614 -26538 -48246 -8644
2041h644l1523N492k9828J0826L1280m151L830j4603L3144k7951k8943L0955L7517
$$ -8644 -40167 -34675 -64503 -53677 -22397 -26548 -22718 -37321 -4177 -32128 -61071 -30116 7401
2028G401j7253l0053K0853N843k2406M889o207L862J2744K320j5782M5562m5759
$$ 7401 -9852 -39905 -19052 -13209 -35615 -30726 -36933 -33071 -20327 -18007 -33789 11773 -33986
2015c3986k12J1786m3040N7318O882m5282k8630L1519L4924k6762J4761k1951
$$ -33986 -34198 -22412 -65452 -8134 -1252 -46534 -75164 -43645 -8721 -35483 -20722 -42673
2003d2673J9129Q467n7370M1556Q765j48L170k303o0637Q0215k1439J507N882
$$ -42673 -23544 -15077 -72447 -30891 -22126 -22274 -19104 -21407 -82044 -1829 -23268 -21761 -15879
1990a5879N992p514j3006K3744j3094L4981n0210j2476O1859n9162k2866J5981
$$ -15879 -9887 -17401 -30407 -6663 -19757 15224 -34986 -47462 14397 -44765 -67631 -51650
1978e1650M1792j1569o321P376k8504N5081m1606k61q784L0220j5149n925j434
$$ -51650 -9858 -21427 -27748 -20372 -48876 6205 -35401 -35662 -44446 -14226 -29375 -35300 -36734
1965c6734k606J8816j4144o967J2152J0222j3532P994n932J0131k9584J990K736
$$ -36734 -39340 -20524 -34668 -41635 -29483 -19261 -32793 -24799 -30731 -20600 -50184 -48194 -45458
1952d5458K4243J3835k5741k4041K0829j7013K1828J6076K7965j3487j4730k1821
$$ -45458 -21215 -7380 -33121 -57162 -36333 -53346 -31518 -15442 12523 -964 -15694 -37515
1940c7515n756J7340P352k4963M0590l2327k0708K7215j484K3M348P481m782M782
$$ -37515 -43271 -25931 -18579 -43542 -2952 -35279 -55987 -28772 -30256 -30233 -25885 -18404 -23186 -18404
1926a8404k4628K4802l8206J117K0899j143p241N841K6919j4012j8766q015J6920
$$ -18404 -43032 -18230 -56436 -55319 -34420 -35563 -42804 -36963 -10044 -24056 -42822 -50837 -33917
1913c3917K3244l209J2554k5420p63J8150K6165n7464J4157O145K214O099j4735
$$ -33917 -10673 -13882 -1328 -26748 -27511 -9361 16804 -40660 -26503 -20358 -18144 -12045 -26780
1900b6780J0969k5112K1372J0535k8444q630K958J4663j6024L229J0516K8209
$$ -26780 -15811 -40923 -19551 -9016 -37460 -46090 -43132 -28469 -44493 -41264 -30748 -2539
1888b539K525l0628j702Q757M911L0543l7846P571l0976J939J4243k6508K0175
$$ -2539 -14 -30642 -32344 -23587 -18676 11867 -25979 -18408 -49384 -47445 -33202 -59710 -39535
1875c9535J775J5563m12K596k0316L4550J6807n2425M6420l8782K4009j5576l3459
$$ -39535 -37760 -22197 -22609 -20013 -40329 -5779 11028 -41397 5023 -33759 -9750 -25326 -58785
1862e8785j2643L82N8802j8419M2110m2922J121l952n89J1277Q371l5713J3273
$$ -58785 -71428 -71046 -12244 -30663 11447 -31475 -30354 -34306 -34895 -23618 -15247 -50960 -37687
1849c7687j4476o402N1105k6683l846J6447j7144K9039k0009o146k5793M3633
$$ -37687 -52163 -58565 -7460 -34143 -37989 -21542 -38686 -9647 -29656 -35802 -61595 -17962
1837a7962k3122J4480P337k3214J9417k9468J4034J7893P743j7350m25K6799m2751
$$ -17962 -41084 -26604 -19267 -42481 -23064 -52532 -38498 -20605 -12862 -30212 -30637 -3838 -46589
1824d6589L5111j3827n733K3848l2657K739j083J2159k6495M3733k0874k001J0623
$$ -46589 -11478 -25305 -31038 -7190 -39847 -37108 -38191 -26032 -52527 -8794 -29668 -31669 -21046
1811b1046l8499N0226l0313p393L6875k6094M290j9890K9861k0002R813J9337
$$ -21046 -59545 -9319 -39632 -47025 -10150 -36244 -31954 -51844 -21983 -41985 -32172 -12835
1799a2835j8261M2769o9757L5972l5183L8508l3770K9501K1234n6205O0456n0205
$$ -12835 -31096 11673 -58084 -22112 -57295 -18787 -52557 -23056 -1822 -58027 2429 -47776
1787d7776L7193j5625K4139Q769k7085L4355l3988j095l0875L7310j2937j0879
$$ -47776 -10583 -26208 -2069 6700 -20385 13970 -20018 -21113 -51988 -14678 -27615 -38494
1775c8494J1961R863k6968k896K2204J5192J3122m2153j4453N4338k9450k8876
$$ -38494 -26533 -16670 -43638 -46534 -24330 -9138 3984 -38169 -52622 1716 -27734 -56610
1763e6610R172N994K1197j3113N993J5384l5935L3632m1522N6251k6767p796J2900
$$ -56610 -47438 -41444 -20247 -33360 -27367 -11983 -47918 -14286 -55808 443 -26324 -34120 -21220
1750b1220Q837k0967P64N018k9642L0664j8403k1803J9569J9040q417O584K39
$$ -21220 -12383 -33350 -32586 -27568 -57210 -26546 -44949 -66752 -47183 -28143 -36560 -29976 -29737
1737b9737K4045j7574k2039n827M2813m2772P489l05Q481L1928O774p8443N7365
$$ -29737 -5692 -23266 -45305 -51132 -8319 -51091 -43602 -43907 -35426 -3498 3276 -75167 -17802
1724a7802k31l2854N61K5458J9099l0361j9088o448L6016m16m4046L3704J6748
$$ -17802 -18033 -50887 -50326 -24868 -5769 -36130 -55218 -61666 -25650 -26066 -70112 -36408 -19660
1711a9660J1505l5027J3231r798K793l4277M0693k4833J9681J4500m091j0715
$$ -19660 -8155 -43182 -29951 -39749 -36956 -71233 -30540 -55373 -35692 -21192 -25283 -35998
1699c5998j2193K2461n584M0780j4409m316M4l4031K9447j1630l811L7869l5756
$$ -35998 -48191 -25730 -31314 9466 -4943 -9259 -9215 -43246 -13799 -25429 -29240 8629 -27127
1686b7127j0548K4155n2807K2429M871K2189J8871k6798j2393K0305k3998j2192
$$ -27127 -37675 -13520 -66327 -43898 -39027 -16838 2033 -24765 -37158 -16853 -40851 -53043
1674e3043K2353J9426l8184J6371K6170l8972O093o802K4844J8878m303j4439
$$ -53043 -30690 -11264 -49448 -33077 -6907 -45879 -39786 -46588 -21744 -2866 -7169 -21608
1662b1608J015P746k0712Q229k3118o56K001J0249q498K0305M165j4397P676K5386
$$ -21608 -20593 -12847 -33559 -25330 -48448 -49104 -47103 -36854 -45352 -25047 -20882 -35279 -27603 -2217
1648b217l9679R490n3619O1954K0643m5172K1303l0291N9679n3160O776J7330
$$ -2217 -41896 -32406 -86025 -24071 -3428 -48600 -27297 -57588 2091 -51069 -44293 -26963
1636b6963J6451p370j3555L9297n0370L7526k4806l2004K0489K9644j609l1812
$$ -26963 -10512 -17882 -31437 7860 -42510 -4984 -29790 -61794 -41305 -11661 -13270 -45082
1624d5082o060Q253l954L2490m275J0821j8629m0274L2475j2686J1267J004J5789
$$ -45082 -51142 -42889 -46843 -14353 -18628 -7807 -26436 -66710 -34235 -46921 -35654 -34650 -18861
1611a8861k8138M3682m9622p916L6322O426k5498L9816n6414L8648J6868n9228
$$ -18861 -46999 -3317 -52939 -60855 -24533 -18107 -43605 -3789 -60203 -21555 -4687 -63915
1599f3915J0173M5286p387r547k7046L9116k2391K4032l1058K5547J9062k8422
$$ -63915 -53742 -8456 -15843 -25390 -52436 -13320 -35711 -11679 -42737 -17190 1872 -26550
1587b6550k3318J3435q929O996j8349J0374J3178q661J0077J3810j7402J9231
$$ -26550 -49868 -36433 -45362 -38366 -56715 -46341 -33163 -41824 -31747 -17937 -35339 -16108
1575a6108k480q004J2065m9877N0657k9243p506J6160K9062l3137K6690r278j7265
$$ -16108 -18588 -26592 -14527 -64404 -13747 -42990 -50496 -34336 -5274 -38411 -11721 -20999 -38264
1562c8264J6203P68L872j4801K6351J8069n3236L4849o5629N0715l1419K2830
$$ -38264 -22061 -21293 -17421 -32222 -5871 12198 -41038 -6189 -71818 -21103 -52522 -29692
1550b9692L0642j0738l9126L7229j1207k0071O669N3552n6058K5009l9306K7499
$$ -29692 950 -9788 -48914 -11685 -22892 -42963 -36294 17258 -38800 -13791 -53097 -25598
1538b5598j4620J7040J222K1287l0309L3031j8021q336l5306N3653J4036k264
$$ -25598 -40218 -23178 -21956 -669 -30978 2053 -15968 -24304 -59610 -5957 8079 5815
1526E815l1875l1365K966J3300K4349j2000l178J3585j7431K569J0111j5638k937
$$ 5815 -26060 -57425 -54459 -41159 -16810 -28810 -31988 -18403 -35834 -33265 -23154 -38792 -41729
1513d1729K8352k407l3245J3621N060l8070O1285l5901K4884O051O307j6661J6782
$$ -41729 -13377 -15784 -49029 -35408 -30348 -68418 -7133 -43034 -18150 -12099 -5792 -22453 -5671
1500e671l8589L920M374J5013l5446J2694l5758L5375K0485j8923J9748K0745
$$ -5671 -44260 -40340 -35966 -20953 -56399 -43705 -79463 -44088 -23603 -42526 -22778 -2033
1488b033k0019L225j644k1607K0602J2670j4960j1352k842l7053M8599k6576N5202
$$ -2033 -22052 -18827 -20471 -42078 -21476 -8806 -23766 -35118 -37960 -75013 -26414 -52990 2212
1475B212j7430j131q58j1512o590J085J1242J774P38K6257k1956k8851P451L3434
$$ 2212 -15218 -16349 -17207 -28719 -35309 -34224 -22982 -21208 -20470 5787 -16169 -45020 -37569 -4135
1461d135l2426K5277L797j816m328m6069K723O4282k6966k3722k0362L0901L231
$$ -4135 -36561 -11284 -7487 -9303 -13631 -59700 -56977 7305 -19661 -43383 -63745 -32844 -29613
1448b9613K3941k7967K4886p067j7103J6387J8013l4572n658J533K0075k920k537
$$ -29613 -5672 -33639 -8753 -15820 -32923 -16536 1477 -33095 -38753 -37220 -17145 -20065 -22602
1435b2602j454l208k454j0848J9036p019q210M0606l3647o231r220M9444m0276
$$ -22602 -24056 -27264 -29718 -40566 -21530 -28549 -36759 3847 -29800 -36031 -45251 4193 -36083
1422c6083P671r842K2847o967m1113M2872j4462R785J7030l2988K5998j6071Q043
$$ -36083 -28412 -38254 -15407 -22374 -63487 -20615 -35077 -25292 -8262 -41250 -15252 -31323 -23280
1409b3280l7957N6054k157l2771K5669m6578L5582l358M117k66O628J7180n6821
$$ -23280 -61237 -5183 -7340 -40111 -14442 -61020 -25438 -28796 -24679 -24945 -18317 -1137 -57958
1396e7958M2021j5903j8633q865L171M9831l847J0107l8190m0374N3896J587j562
$$ -57958 -15937 -31840 -50473 -59338 -56167 -6336 -10183 -76 -38266 -78640 -24744 -23157 -24719
1383b4719l1871L5469j7398k0919j8271L3471J4774L4957j7520m8263L0284K0479
$$ -24719 -56590 -21121 -38519 -59438 -77709 -44238 -29464 5493 -12027 -60290 -30006 -9527
1371i527n7516Q1545k2007l6695L6437j5954l4577R135r035K2597J1473o363o874
$$ -9527 -67043 14502 -7505 -44200 -7763 -23717 -58294 -49159 -58194 -35597 -24124 -30487 -37361
1358c7361k7191M6188J3846l0854p908K1316O277j9455J7679k3241K4947k5512
$$ -37361 -64552 -18364 -4518 -35372 -43280 -21964 -15687 -35142 -17463 -40704 -15757 -41269
1346d1269Q356M684j1733N702k4199M0918j1645k8156M2551n2158N461L5698o695
$$ -41269 -32913 -28229 -39962 -34260 -58459 -17541 -29186 -57342 -14791 -66949 -61488 -25790 -32485
1333c2485o694J9375J2884l9018M8108n7336P254J6283Q051k6046J0473N636R099
$$ -32485 -39179 -19804 -6920 -45938 2170 -55166 -47912 -31629 -23578 -49624 -39151 -33515 -24416
1320b4416K025P24j7780J6106j0521P7O261k541R932m9031N8483P705n1351J2133
$$ -24416 -22391 -21667 -39447 -23341 -33862 -33785 -27524 -30065 -20133 -69164 -10681 -2976 -54327 -42194
1306d2194K1578n2760N4656J1323n5405P4173m4265N517O721k6351n395K5181
$$ -42194 -20616 -73376 -18720 -7397 -62802 11371 -32894 -27377 -20656 -47007 -52402 -27221
1294b7221K6918m0090N18J1283j6847n86L7135p040j53j0442l1633K8793q087
$$ -27221 -303 -40393 -39875 -28592 -45439 -46025 -8890 -15930 -16083 -26525 -58158 -29365 -37452
1281c7452k4652N0477m3291K5961j1764m3919N0595j9808M2824J57k0109r680
$$ -37452 -62104 -11627 -54918 -28957 -40721 -84640 -34045 -53853 -11029 -10872 -30981 -40661
1269d0661l027L0782l9018M040J8152l136J8051j8324K8327m2120N0820l3321
$$ -40661 -43688 -12906 -51924 -47884 -29732 -32868 -14817 -33141 -4814 -46934 3886 -29435
1257b9435j4556N8597m8475J0183k9994L0806m0520K2026L0348m5697K9300j483
$$ -29435 -43991 14606 -33869 -23686 -53680 -22874 -63394 -41368 -11020 -56717 -27417 -28900
1245b8900j3065K4421K0848m1872M1284l1433K4039k4836j6514Q019j195l2986
$$ -28900 -41965 -17544 3304 -38568 2716 -28717 -4678 -29514 -46028 -38009 -39204 -72190
1233g2190K9728L8259k9585M380p188J3718j4447K7852m1801L3770j6267N745
$$ -72190 -42462 -4203 -33788 -29408 -36596 -22878 -37325 -9473 -51274 -17504 -33771 -28026
1221b8026j3231j2096Q704J6444K5760l5652q140m555J8728J5123k7918N4869
$$ -28026 -41257 -53353 -44649 -28205 -2445 -38097 -46237 -50792 -32064 -16941 -44859 10010
1209A0010l8732j9755O411K225K0255k275j0392l244J9793m4879M0377L0135m3213
$$ 10010 -28722 -48477 -42066 -39841 -19586 -21861 -32253 -35497 -15704 -60583 -20206 9929 -33284
1196c3284J1979j2926K0423j8407j3131l361o529J2780J2003j3659P750j9859
$$ -33284 -21305 -34231 -13808 -32215 -45346 -48707 -55236 -42456 -30453 -44112 -36362 -56221
1184e6221K9901J6800m5580O6752l5060j8753j1215O592J8463J0496l348m0572
$$ -56221 -26320 -9520 -55100 11652 -23408 -42161 -53376 -46784 -28321 -17825 -21173 -61745
1172f1745K2711J7035o734j6034L8890m6339L6001m928k5933L5710J09k1068k043
$$ -61745 -39034 -21999 -28733 -44767 -5877 -52216 -16215 -21143 -47076 -11366 -11257 -32325 -34368
1159c4368K6756o0292K8907J4761j0680J4369j7918K913P747J3964n7922N3727
$$ -34368 -7612 -67904 -38997 -24236 -34916 -20547 -38465 -35552 -27805 -13841 -71763 -18036
1147a8036K329k0543K2620l3409L455L1688j5660l8529M6055k1524M3948J2307
$$ -18036 -15707 -36250 -13630 -47039 -43584 -11896 -27556 -66085 -20030 -41554 2394 14701
1135A4701m0432K953m082k6238j1631N2214l3185L5473l9063j0704M7519k1470
$$ 14701 -25731 -22778 -26860 -53098 -64729 -12515 -45700 -10227 -49290 -59994 -12475 -33945
1123c3945K1557m210O841j4454K163q157N855K0461o0802L5628J5136j7939o450
$$ -33945 -12388 -16598 -9757 -24211 -22048 -30205 -24350 -3889 -64691 -29063 -13927 -31866 -38316
1110c8316k9116N7903n13k5608k7073L4700J356j8791M136P386P37P365k9135
$$ -38316 -67432 -9529 -10042 -35650 -62723 -28023 -26667 -45458 -41322 -33936 -33199 -25834 -54969
1097e4969K0189R204l7763K1206L1757o0258M2982K5241m8875j0813N6022k8337
$$ -54969 -34780 -25576 -63339 -42133 -10376 -70634 -27652 -2411 -51286 -62099 -6077 -34414
1085c4414j2581L4028k6515p616K7591m6158O3963k698j2220k402L557k076k5768
$$ -34414 -46995 -12967 -39482 -47098 -19507 -65665 -1702 -4400 -16620 -19022 -15465 -17541 -43309
1072d3309j4616K2436J6309o211J047l0445R060M1561m8676K3969j5662o10K3469
$$ -43309 -57925 -35489 -19180 -25391 -24344 -54789 -45729 -4168 -52844 -28875 -44537 -45147 -21678
1059b1678L535J9526r461l8538J0684N093k8175J1559K8927K305l6678R691J3770
$$ -21678 -18143 1383 -8078 -46616 -35932 -30839 -59014 -47455 -18528 -16223 -52901 -43210 -29440
1046b9440J6684J3987k6873l216l2278K3712P658J9845m786j4229K2069n2326
$$ -29440 -12756 1231 -25642 -28858 -61136 -37424 -29766 -9921 -14707 -28936 -6867 -59193
1034e9193k074J8070L466L4610n4690N709K2731q045j2895j1805K9561k1585L5786
$$ -59193 -61267 -43197 -39731 -5121 -59811 -54102 -31371 -39416 -52311 -64116 -34555 -56140 -20354
1021b0354j4161q81L3424j0523l6395n901K1654J1280l680j1106j0723J6270o08
$$ -20354 -34515 -35396 -1972 -12495 -48890 -54791 -33137 -21857 -25537 -36643 -47366 -31096 -31704
1008c1704L2322j8673L727K810l0893N947q204L8748J2362l7357J14p894K3335
$$ -31704 618 -18055 -14328 -11518 -42411 -36464 -44668 -5920 6442 -30915 -30801 -38695 -15360
995a5360m4408K4466O531o993J97m727P26j5964K6054j4390L9570J5908l6627
$$ -15360 -59768 -35302 -28771 -35764 -35567 -40294 -39568 -55532 -29478 -43868 -4298 11610 -25017
982b5017k300m184J565L8716l5471J2338J3949k9431k6868K8389J4457q577O985
$$ -25017 -27317 -31501 -29936 8780 -26691 -14353 -404 -29835 -56703 -28314 -13857 -22434 -15449
969a5449l9298L7540k0587k6503K8041J2977k4070J3118L565r906L5610k4238
$$ -15449 -54747 -17207 -37794 -64297 -36256 -23279 -47349 -34231 -30666 -40572 -4962 -29200
957b9200m0617M4204j9903K5248j735k0026J5664j8314J6451m1093K7430J910
$$ -29200 -69817 -25613 -45516 -20268 -22003 -42029 -26365 -44679 -28228 -69321 -41891 -39981
945c9981K2805R677k2328Q957l9651L1940k868J5406j3261N018L6897l3819o557
$$ -39981 -17176 -7499 -29827 -20870 -60521 -28581 -31449 -16043 -29304 -24286 12611 -21208 -27765
932b7765q66k6069L7246K113o910k8877P5417m5786j1953j248N632K8319r445
$$ -27765 -28631 -54700 -17454 -15341 -22251 -51128 24289 -21497 -33450 -34698 -29066 -747 -10192
919a0192l8109M623K722N238k251o738j207m385j427Q197k327K8636p3r305j1512
$$ -10192 -48301 -43678 -40956 -35718 -37969 -44707 -45914 -50299 -51726 -43529 -45856 -17220 -17293 -26598 -38110
904c8110N55J7381l4188J5660K57L0651l1507j9887L0642N899J1967l0199K0575
$$ -38110 -37555 -20174 -54362 -38702 -38445 -7794 -39301 -59188 -28546 -22647 -10680 -40879 -20304
891b0304p06k288R400j1767K0341L4053o6658k2527N0657k4303n266Q696o203
$$ -20304 -21010 -23298 -13898 -25665 -5324 28729 -37929 -60456 -9799 -34102 -39368 -30672 -36875
878c6875R425r8k0920L9565m366l2482J9365o866l110J2066j7623Q368j6069J6711
$$ -36875 -27450 -27548 -48468 -8903 -13269 -45751 -26386 -33252 -36362 -24296 -41919 -33551 -49620 -32909
864c2909J1491p488k5467m261O880L80M4806k2435o516P850n0108M4494P612L4452
$$ -32909 -21418 -28906 -54373 -58634 -51754 -51374 -6568 -29003 -35519 -27669 -77777 -33283 -25671 8781
850H781m1151O23J5774M122l1994J2281L091p041j550R666r633J3614J6072R397
$$ 8781 -32370 -31747 -15973 -11851 -43845 -31564 -28473 -35514 -37064 -27398 -37031 -23417 -7345 2052
836B052r537l1573m350L1323m1917L0341j4320j210r993J0635l540M5303l7640
$$ 2052 -7485 -39058 -43408 -12085 -54002 -23661 -37981 -39191 -49184 -38549 -42089 3214 -34426
823c4426J0292J8606m8107P989k2891L0308j76L202J9088l0192L5948j7998j2160
$$ -34426 -24134 -5528 -53635 -45646 -68537 -38229 -38405 -35203 -16115 -46307 -10359 -28357 -40517
$$ [...]
##END NTUPLES=NMR SPECTRUM
##END=
